<svg width="132" height="135" viewBox="0 0 132 135" fill="none" xmlns="http://www.w3.org/2000/svg">
<g filter="url(#filter0_d_1679_9820)">
<path d="M66 48.569C55.668 48.569 47.25 57.0971 47.25 67.5644C47.25 78.0316 55.668 86.5597 66 86.5597C76.332 86.5597 84.75 78.0316 84.75 67.5644C84.75 57.0971 76.332 48.569 66 48.569ZM114.125 64.4974L95.6289 55.1383L102.172 35.2723C103.051 32.5813 100.531 30.0288 97.8945 30.939L78.2852 37.5676L69.0273 18.8097C67.7773 16.277 64.2227 16.277 62.9727 18.8097L53.7344 37.5478L34.1055 30.9192C31.4492 30.0288 28.9297 32.5813 29.8281 35.2525L36.3711 55.1185L17.875 64.4974C15.375 65.7638 15.375 69.365 17.875 70.6313L36.3711 79.9905L29.8281 99.8762C28.9492 102.567 31.4687 105.12 34.1055 104.21L53.7148 97.5809L62.9531 116.319C64.2031 118.852 67.7578 118.852 69.0078 116.319L78.2461 97.5809L97.8555 104.21C100.512 105.1 103.031 102.547 102.133 99.8762L95.5898 80.0103L114.086 70.6511C116.625 69.365 116.625 65.7638 114.125 64.4974ZM83.6758 85.4714C73.9297 95.345 58.0703 95.345 48.3242 85.4714C38.5781 75.5978 38.5781 59.5309 48.3242 49.6573C58.0703 39.7837 73.9297 39.7837 83.6758 49.6573C93.4219 59.5309 93.4219 75.5978 83.6758 85.4714Z" fill="white" fill-opacity="0.05" shape-rendering="crispEdges"/>
</g>
<defs>
<filter id="filter0_d_1679_9820" x="0" y="0.910156" width="131.995" height="133.309" filterUnits="userSpaceOnUse" color-interpolation-filters="sRGB">
<feFlood flood-opacity="0" result="BackgroundImageFix"/>
<feColorMatrix in="SourceAlpha" type="matrix" values="0 0 0 0 0 0 0 0 0 0 0 0 0 0 0 0 0 0 127 0" result="hardAlpha"/>
<feOffset/>
<feGaussianBlur stdDeviation="8"/>
<feComposite in2="hardAlpha" operator="out"/>
<feColorMatrix type="matrix" values="0 0 0 0 0.241882 0 0 0 0 0.086493 0 0 0 0 0.441667 0 0 0 0.1 0"/>
<feBlend mode="normal" in2="BackgroundImageFix" result="effect1_dropShadow_1679_9820"/>
<feBlend mode="normal" in="SourceGraphic" in2="effect1_dropShadow_1679_9820" result="shape"/>
</filter>
</defs>
</svg>
