<svg width="14" height="32" viewBox="0 0 14 32" fill="none" xmlns="http://www.w3.org/2000/svg">
<path d="M1.392 2.432C1.392 2.096 1.2 1.728 0.576 1.728C0.56 1.728 0.544 1.728 0.528 1.728V1.456C1.312 1.44 1.76 0.752 1.76 0H2.032C2.032 0.8 2.608 1.456 3.376 1.456V1.728C2.72 1.728 2.464 2.08 2.464 2.432C2.464 3.424 2.256 5.168 2.256 7.024C2.256 8.752 2.752 9.616 3.44 9.616H3.456C3.76 9.616 5.376 6.672 6.928 4.256C8.192 2.32 8.88 1.76 9.84 1.76C11.872 1.76 12.848 3.968 12.848 6.304C12.848 6.88 13.056 7.152 13.76 7.152V7.456C13.072 7.456 12.48 8.336 12.48 9.216H12.176C12.176 8.384 11.696 7.456 10.88 7.456V7.152C11.52 7.152 11.76 6.8 11.76 6.4C11.76 4.272 10.8 2.256 9.536 2.256C8.768 2.256 8.144 2.992 7.12 4.48C6.16 5.984 4.112 9.536 3.616 11.088C2.24 10.672 1.184 9.776 1.184 7.056C1.184 5.072 1.392 3.232 1.392 2.432Z" fill="url(#paint0_linear_2514_7)"/>
<path d="M11.568 24.48C11.568 24.496 11.568 24.496 11.568 24.512C11.568 24.96 11.904 25.616 12.736 25.84C12.544 29.856 9.472 31.904 7.248 31.904C4.688 31.904 3.328 30.768 3.328 27.744V26H2.368C1.792 26 1.504 26.544 1.504 27.104H1.232C1.232 26.464 0.672 25.984 0 25.984V25.696C0.672 25.696 1.232 25.168 1.232 24.592H1.504C1.504 25.12 1.792 25.68 2.368 25.68H3.328V22.32H2.368C1.792 22.32 1.504 22.848 1.504 23.408H1.232C1.232 22.8 0.672 22.32 0 22.32V22.032C0.672 22.032 1.232 21.504 1.232 20.912H1.504C1.504 21.424 1.792 22.016 2.368 22.016H3.328V20.24C3.328 19.968 3.168 19.6 2.496 19.6C2.48 19.6 2.464 19.6 2.448 19.6V19.312C3.232 19.312 3.648 18.64 3.648 17.904H3.952C3.952 18.656 4.4 19.312 5.184 19.312V19.6C4.48 19.6 4.32 19.936 4.32 20.224V22.016H11.776V22.32H4.32V25.68H8.176V26H4.32V27.728C4.32 30.48 5.52 31.488 7.264 31.488C9.392 31.488 11.728 28.88 11.728 25.952C11.728 25.68 11.6 25.52 11.408 25.52C11.392 25.52 11.376 25.52 11.36 25.52C10.912 25.616 10.624 25.664 10.336 25.664C10.32 25.664 10.304 25.664 10.288 25.664C9.424 25.664 8.832 25.216 8.832 24.528C8.832 24.512 8.832 24.48 8.832 24.448C8.832 24.128 8.928 23.632 9.104 23.28L9.344 23.408C9.28 23.552 9.248 23.728 9.248 23.888C9.248 24.384 9.584 24.768 10.256 24.768C10.656 24.768 11.088 24.64 11.376 24.368L11.568 24.48Z" fill="url(#paint1_linear_2514_7)"/>
<defs>
<linearGradient id="paint0_linear_2514_7" x1="6.592" y1="-4.992" x2="6.592" y2="35.008" gradientUnits="userSpaceOnUse">
<stop stop-color="#7086D9"/>
<stop offset="1" stop-color="#E8BEC0"/>
</linearGradient>
<linearGradient id="paint1_linear_2514_7" x1="6.592" y1="-4.992" x2="6.592" y2="35.008" gradientUnits="userSpaceOnUse">
<stop stop-color="#7086D9"/>
<stop offset="1" stop-color="#E8BEC0"/>
</linearGradient>
</defs>
</svg>
