<svg width="15" height="15" viewBox="0 0 15 15" fill="none" xmlns="http://www.w3.org/2000/svg">
<path d="M7.5 0L8.147 6.853L15 7.5L8.147 8.147L7.5 15L6.853 8.147L0 7.5L6.853 6.853L7.5 0Z" fill="#EB9F8A"/>
</svg>
