<svg width="253" height="46" viewBox="0 0 253 46" fill="none" xmlns="http://www.w3.org/2000/svg">
<path d="M16.3944 0.642188C7.07236 3.66899 1.683 7.41152 1.43946 11.6934C0.636289 25.8143 56.1025 40.4534 125.327 44.3907C194.551 48.3281 251.319 40.0727 252.123 25.9517C252.33 22.3021 248.779 18.6179 242.203 15.0927" stroke="white" stroke-linecap="round"/>
</svg>
