<?xml version="1.0" encoding="utf-8"?>
<!-- Generator: Adobe Illustrator 26.5.0, SVG Export Plug-In . SVG Version: 6.00 Build 0)  -->
<svg version="1.1" id="Calque_1" xmlns="http://www.w3.org/2000/svg" xmlns:xlink="http://www.w3.org/1999/xlink" x="0px" y="0px"
	 viewBox="0 0 1600 198" style="enable-background:new 0 0 1600 198;" xml:space="preserve">
<style type="text/css">
	.st0{fill-rule:evenodd;clip-rule:evenodd;fill:url(#SVGID_1_);}
</style>
<linearGradient id="SVGID_1_" gradientUnits="userSpaceOnUse" x1="226.6413" y1="350.7988" x2="226.6413" y2="349.7677" gradientTransform="matrix(-1600 0 0 -198.0004 363426 69452.1406)">
	<stop  offset="3.436861e-04" style="stop-color:#E6CF95;stop-opacity:0.25"/>
	<stop  offset="1" style="stop-color:#E6CF95"/>
</linearGradient>
<path class="st0" d="M1600,36c-311,0-410.9-22.2-812-22C388,14,289,36,0,36v162h1600C1600,198,1600,65,1600,36z"/>
</svg>
