<svg width="266" height="90" viewBox="0 0 266 90" fill="none" xmlns="http://www.w3.org/2000/svg">
<g opacity="0.2">
<path d="M208.131 0.0101031L255.846 0.010108C260.949 0.0101085 265.086 4.40035 265.086 9.81658C265.086 15.2328 260.949 19.623 255.846 19.623L208.131 19.623C203.028 19.623 198.892 15.2328 198.892 9.81657C198.892 4.40035 203.028 0.0101026 208.131 0.0101031Z" fill="url(#paint0_linear_2465_211)"/>
<path d="M9.72872 19.6129L105.968 19.6129C110.026 19.6129 113.308 23.0965 113.308 27.4032C113.308 31.71 110.026 35.1935 105.968 35.1935L53.3073 35.1935C48.4853 35.1935 44.169 38.9395 43.7194 44.0337C43.1911 49.8794 47.5074 54.8065 52.9139 54.8065L155.122 54.8065C159.18 54.8065 162.462 58.29 162.462 62.5968C162.462 66.9035 159.18 70.3871 155.122 70.3871L26.7915 70.387C21.9694 70.387 17.6531 74.1331 17.2035 79.2272C16.6752 85.0729 20.9915 90 26.3981 90L202.208 90C207.03 90 211.346 86.254 211.796 81.1599C212.324 75.3142 208.008 70.3871 202.601 70.3871L184.841 70.3871C180.784 70.3871 177.501 66.9035 177.501 62.5968C177.501 58.29 180.784 54.8065 184.841 54.8065L245.314 54.8065C250.136 54.8065 254.452 51.0605 254.902 45.9663C255.43 40.1206 251.114 35.1935 245.708 35.1935L133.968 35.1935C129.91 35.1935 126.628 31.71 126.628 27.4032C126.628 23.0965 129.91 19.6129 133.968 19.6129L164.305 19.6129C169.127 19.6129 173.444 15.8669 173.893 10.7728C174.422 4.9271 170.105 -1.18803e-06 164.699 -1.74994e-06L9.32407 -1.78979e-05C3.91749 -1.84598e-05 -0.398782 4.91515 0.129507 10.7728C0.590368 15.8669 4.89539 19.6129 9.71749 19.6129L9.72872 19.6129Z" fill="url(#paint1_linear_2465_211)"/>
</g>
<defs>
<linearGradient id="paint0_linear_2465_211" x1="231.989" y1="19.623" x2="231.989" y2="0.0101055" gradientUnits="userSpaceOnUse">
<stop stop-color="#7086D9"/>
<stop offset="1" stop-color="#E5BDC1"/>
</linearGradient>
<linearGradient id="paint1_linear_2465_211" x1="127.516" y1="90" x2="127.516" y2="-5.61433e-06" gradientUnits="userSpaceOnUse">
<stop stop-color="#7086D9"/>
<stop offset="1" stop-color="#E5BDC1"/>
</linearGradient>
</defs>
</svg>
