<svg width="97" height="44" viewBox="0 0 97 44" fill="none" xmlns="http://www.w3.org/2000/svg">
<path fill-rule="evenodd" clip-rule="evenodd" d="M4.05125 0L4.96082 2.79934H7.90422L5.52295 4.52943L6.43252 7.32878L4.05125 5.59869L1.66999 7.32878L2.57955 4.52943L0.198288 2.79934H3.14169L4.05125 0ZM68.4836 13.9957L68.1906 12.836L68 12.0818L67.8094 12.836L67.5164 13.9957L66.427 13.5018L65.7185 13.1805L66.1893 13.7998L66.9133 14.752L65.8479 15.2957L65.155 15.6494L65.9327 15.6673L67.1285 15.695L66.8894 16.867L66.7339 17.6292L67.2328 17.0324L68 16.1146L68.7672 17.0324L69.2662 17.6292L69.1106 16.867L68.8715 15.695L70.0673 15.6673L70.845 15.6494L70.1521 15.2957L69.0867 14.752L69.8107 13.7998L70.2815 13.1805L69.5731 13.5018L68.4836 13.9957ZM71.5556 11.5049L73.4728 10.6356L72.1987 12.3113L71.2217 13.5962L70.6067 14.405L71.5118 14.8669L72.9495 15.6007L74.8245 16.5576L72.72 16.6063L71.1063 16.6436L70.0904 16.6671L70.2936 17.6626L70.6163 19.2442L71.0372 21.3068L69.687 19.6917L68.6517 18.4533L68 17.6738L67.3483 18.4533L66.313 19.6917L64.9628 21.3068L65.3837 19.2442L65.7064 17.6626L65.9096 16.6671L64.8938 16.6436L63.28 16.6063L61.1755 16.5576L63.0505 15.6007L64.4883 14.8669L65.3933 14.405L64.7783 13.5962L63.8013 12.3113L62.5272 10.6356L64.4444 11.5049L65.9145 12.1714L66.8399 12.591L67.0888 11.6059L67.4843 10.0409L68 8L68.5157 10.0409L68.9112 11.6059L69.1601 12.591L70.0855 12.1714L71.5556 11.5049ZM90.3072 40.8662L89.7008 39L89.0945 40.8662H87.1322L88.7197 42.0196L88.1133 43.8858L89.7008 42.7325L91.2883 43.8858L90.682 42.0196L92.2695 40.8662H90.3072ZM89.7521 22L90.3346 28.1696L96.5042 28.7521L90.3346 29.3346L89.7521 35.5042L89.1696 29.3346L83 28.7521L89.1696 28.1696L89.7521 22ZM23.9003 5.80055C24.3975 5.80055 24.8006 5.39749 24.8006 4.90028C24.8006 4.40307 24.3975 4 23.9003 4C23.4031 4 23 4.40307 23 4.90028C23 5.39749 23.4031 5.80055 23.9003 5.80055Z" fill="white"/>
</svg>
