<svg width="12" height="19" viewBox="0 0 12 19" fill="none" xmlns="http://www.w3.org/2000/svg">
<path d="M10.9105 7.38191C8.55544 6.02614 6.85968 3.49766 6.51066 0.957475C6.51771 0.728449 6.26652 0.593877 6.05852 0.652387C5.85228 0.593877 5.59932 0.727613 5.60814 0.957475C5.25823 3.49683 3.5616 6.02614 1.20746 7.38191C-0.337588 8.27127 1.3 8.75774 1.76977 9.11131C4.04106 10.8516 4.89071 13.1193 5.32258 15.9671C5.42041 16.2345 5.36311 17.2618 5.5905 17.7525C5.59756 17.7608 5.61078 17.76 5.61959 17.7675C5.62312 17.9664 5.64516 18.162 5.73418 18.3442C5.95011 18.7129 6.40842 18.5348 6.48246 18.2481C6.48246 18.2481 6.48422 18.2506 6.48598 18.2506C6.48775 18.2465 6.48598 18.2423 6.48598 18.2373C6.49039 18.2231 6.48774 18.2088 6.48951 18.1955C6.51242 18.0567 6.49743 17.918 6.47188 17.7809C6.4895 17.7692 6.51154 17.7683 6.5274 17.7533C6.7548 17.2626 6.69575 16.2354 6.79447 15.9679C7.2281 13.1201 8.07685 10.8524 10.3473 9.11215C10.817 8.75691 12.4537 8.27127 10.9105 7.38191ZM9.75234 8.60896C7.18755 10.4545 6.32998 13.4127 6.05852 16.3282C5.78617 13.4127 4.9286 10.4545 2.36557 8.60896C2.16021 8.43009 1.84468 8.2044 1.60759 8.05061C1.63492 8.03472 1.64814 8.02469 1.68075 8.00797C3.29542 7.1345 4.57694 5.77372 5.36224 4.18056C5.61696 3.63976 5.87608 3.08642 6.0594 2.51302C6.24273 3.08642 6.50185 3.6406 6.75744 4.18056C7.54275 5.77372 8.82425 7.1345 10.438 8.00797C10.4707 8.02553 10.4839 8.03556 10.5112 8.05061C10.2724 8.2044 9.95681 8.42925 9.75234 8.60896Z" fill="url(#paint0_linear_2465_160)"/>
<path d="M8.35568 7.34868C8.29716 8.41139 8.19617 9.47939 8.20183 10.5447C8.11312 9.34434 7.9555 8.14748 7.90265 6.94443C7.90454 7.1086 7.7894 8.54114 7.7809 9.74595C7.62329 8.24545 7.32977 6.55607 7.326 6.34865C7.41 7.71056 7.34299 9.07778 7.34015 10.4415C7.20708 8.80063 6.98623 7.16244 6.97585 5.5172C6.84938 6.94619 6.80503 8.38137 6.79559 9.81567C6.67479 8.0442 6.50868 6.27362 6.45205 4.49863C6.3001 6.27627 6.27556 8.05922 6.24253 9.84127C6.16231 7.93388 6.06604 6.02737 5.94712 4.12086C5.86595 5.37686 5.8046 6.63374 5.74892 7.88974C5.69512 6.46781 5.6536 5.04587 5.64416 3.62305C5.44408 5.88438 5.33554 8.14924 5.27986 10.4167C5.16944 8.72561 5.08732 7.03358 5.03258 5.33891C4.95047 7.27366 4.80513 9.21988 4.77588 11.1599C4.6513 9.45643 4.5522 7.75205 4.51728 6.04413C4.53332 6.24096 4.34551 8.40698 4.2936 10.3091C4.20394 9.10338 4.13221 7.89504 4.11428 6.68494C4.09068 6.85529 3.94533 8.59851 3.91419 10.1723C3.84529 9.14222 3.72166 8.10864 3.69146 7.08124C3.58953 8.59233 3.51308 10.1096 3.58953 11.6233C3.58386 11.7963 3.82831 11.8608 3.9359 11.7345C3.98498 12.4768 4.10766 12.9226 4.35777 12.6763C4.43233 13.1653 4.56541 13.3807 4.79381 13.1106C4.82401 13.8988 4.88063 14.687 4.98634 15.4725C5.05051 15.6067 5.15716 15.6632 5.27041 15.6711C5.30911 16.2572 5.37706 16.8389 5.52901 17.3967C5.83763 17.7718 6.4209 17.4214 6.30009 16.9898C6.27461 16.6667 6.25385 16.3437 6.22931 16.0198C6.26046 16.0039 6.29255 15.9968 6.32747 15.9747C6.53699 15.7541 6.43599 15.4302 6.43788 15.161C6.43128 14.935 6.41996 14.7108 6.41241 14.4848C6.85788 14.6022 6.93526 13.9676 6.93432 13.3215C7.12024 13.4583 7.46946 13.3321 7.42982 13.0232C7.43925 12.686 7.43736 12.348 7.42887 12.0108C7.77146 12.3639 7.88284 11.9393 7.87717 11.1952C7.94607 11.4636 8.05932 11.5359 8.23675 11.2747C8.28772 11.3753 8.44816 11.4071 8.52083 11.3073C8.65391 10.0081 8.39437 8.66029 8.35568 7.34868Z" fill="url(#paint1_linear_2465_160)"/>
<path d="M2.55847 7.60547C2.87641 8.25594 2.4014 8.93493 2.91086 9.57384C3.13303 9.62163 3.56974 9.58618 3.55825 9.5199C3.38971 8.87945 3.10624 8.23667 2.55847 7.60547Z" fill="url(#paint2_linear_2465_160)"/>
<path d="M1.55847 7.60547C1.8389 7.88957 1.95907 8.40931 2.55733 8.60067C2.59205 8.29818 1.82822 7.9255 1.55847 7.60547Z" fill="url(#paint3_linear_2465_160)"/>
<path d="M8.84547 7.60547C8.6205 8.24848 8.37004 8.90272 8.76904 9.54333C8.87091 9.59946 9.2954 9.61389 9.51188 9.57059C9.76657 8.93319 8.89641 8.2565 8.84547 7.60547Z" fill="url(#paint4_linear_2465_160)"/>
<defs>
<linearGradient id="paint0_linear_2465_160" x1="6.05847" y1="0.638672" x2="6.05847" y2="18.5522" gradientUnits="userSpaceOnUse">
<stop stop-color="#7086D9"/>
<stop offset="0.0001" stop-color="#E8BEC0"/>
<stop offset="1" stop-color="#7086D9"/>
</linearGradient>
<linearGradient id="paint1_linear_2465_160" x1="6.05847" y1="3.62305" x2="6.05847" y2="17.5558" gradientUnits="userSpaceOnUse">
<stop stop-color="#7086D9"/>
<stop offset="0.0001" stop-color="#E8BEC0"/>
<stop offset="1" stop-color="#7086D9"/>
</linearGradient>
<linearGradient id="paint2_linear_2465_160" x1="3.05847" y1="7.60547" x2="3.05847" y2="9.59586" gradientUnits="userSpaceOnUse">
<stop stop-color="#7086D9"/>
<stop offset="0.0001" stop-color="#E8BEC0"/>
<stop offset="1" stop-color="#7086D9"/>
</linearGradient>
<linearGradient id="paint3_linear_2465_160" x1="2.05847" y1="7.60547" x2="2.05847" y2="8.60067" gradientUnits="userSpaceOnUse">
<stop stop-color="#7086D9"/>
<stop offset="0.0001" stop-color="#E8BEC0"/>
<stop offset="1" stop-color="#7086D9"/>
</linearGradient>
<linearGradient id="paint4_linear_2465_160" x1="9.05847" y1="7.60547" x2="9.05847" y2="9.59586" gradientUnits="userSpaceOnUse">
<stop stop-color="#7086D9"/>
<stop offset="0.0001" stop-color="#E8BEC0"/>
<stop offset="1" stop-color="#7086D9"/>
</linearGradient>
</defs>
</svg>
