<svg width="13" height="22" viewBox="0 0 13 22" fill="none" xmlns="http://www.w3.org/2000/svg">
<path d="M11.831 8.57974C9.15903 6.96272 7.23503 3.94701 6.83903 0.917345C6.84703 0.644186 6.56203 0.483683 6.32603 0.553468C6.09203 0.483683 5.80502 0.643189 5.81502 0.917345C5.41802 3.94602 3.49303 6.96272 0.822028 8.57974C-0.930972 9.64047 0.927028 10.2207 1.46003 10.6424C4.03703 12.718 5.00103 15.4227 5.49103 18.8192C5.60203 19.1382 5.53702 20.3634 5.79502 20.9486C5.80302 20.9586 5.81802 20.9576 5.82802 20.9666C5.83202 21.2039 5.85703 21.4371 5.95803 21.6545C6.20303 22.0941 6.72303 21.8818 6.80703 21.5398C6.80703 21.5398 6.80903 21.5428 6.81103 21.5428C6.81303 21.5378 6.81103 21.5328 6.81103 21.5269C6.81603 21.5099 6.81302 21.493 6.81502 21.477C6.84102 21.3115 6.82402 21.146 6.79502 20.9825C6.81502 20.9686 6.84002 20.9676 6.85802 20.9496C7.11602 20.3644 7.04903 19.1392 7.16103 18.8202C7.65303 15.4237 8.61602 12.719 11.192 10.6434C11.725 10.2197 13.582 9.64047 11.831 8.57974ZM10.517 10.0432C7.60702 12.2445 6.63403 15.7726 6.32603 19.2499C6.01703 15.7726 5.04402 12.2445 2.13602 10.0432C1.90302 9.82989 1.54502 9.56072 1.27602 9.37729C1.30702 9.35834 1.32203 9.34638 1.35903 9.32644C3.19103 8.28465 4.64503 6.66165 5.53603 4.76151C5.82503 4.11649 6.11903 3.45652 6.32703 2.77263C6.53503 3.45652 6.82902 4.11749 7.11902 4.76151C8.01002 6.66165 9.46402 8.28465 11.295 9.32644C11.332 9.34738 11.347 9.35934 11.378 9.37729C11.107 9.56072 10.749 9.82889 10.517 10.0432Z" fill="url(#paint0_linear_2465_244)"/>
<path d="M8.98006 8.15726C8.91806 9.35756 8.81105 10.5638 8.81705 11.7671C8.72305 10.4113 8.55605 9.05948 8.50005 7.70066C8.50205 7.88609 8.38005 9.50411 8.37106 10.8649C8.20406 9.17014 7.89306 7.26201 7.88906 7.02773C7.97806 8.566 7.90706 10.1102 7.90406 11.6505C7.76306 9.7972 7.52906 7.9469 7.51806 6.08863C7.38406 7.70265 7.33706 9.32366 7.32706 10.9437C7.19906 8.94284 7.02307 6.94299 6.96307 4.93817C6.80207 6.94598 6.77607 8.95979 6.74107 10.9726C6.65607 8.81823 6.55406 6.66486 6.42806 4.51149C6.34206 5.93012 6.27706 7.34974 6.21806 8.76837C6.16106 7.16232 6.11706 5.55627 6.10706 3.94922C5.89506 6.50335 5.78006 9.06147 5.72106 11.6226C5.60406 9.71247 5.51705 7.80135 5.45905 5.88725C5.37205 8.07252 5.21806 10.2707 5.18706 12.462C5.05506 10.5379 4.95006 8.61285 4.91306 6.68379C4.93006 6.90611 4.73106 9.35258 4.67606 11.501C4.58106 10.1392 4.50506 8.77436 4.48606 7.40757C4.46106 7.59998 4.30706 9.56891 4.27406 11.3464C4.20106 10.183 4.07006 9.01561 4.03806 7.85519C3.93006 9.56193 3.84906 11.2757 3.93006 12.9854C3.92406 13.1808 4.18307 13.2536 4.29707 13.111C4.34907 13.9494 4.47906 14.4529 4.74406 14.1747C4.82306 14.727 4.96406 14.9703 5.20606 14.6652C5.23806 15.5555 5.29806 16.4457 5.41006 17.333C5.47806 17.4845 5.59105 17.5483 5.71105 17.5573C5.75205 18.2193 5.82405 18.8762 5.98505 19.5063C6.31205 19.93 6.93006 19.5342 6.80206 19.0467C6.77506 18.6818 6.75306 18.317 6.72706 17.9511C6.76006 17.9332 6.79406 17.9252 6.83106 17.9002C7.05306 17.651 6.94605 17.2851 6.94805 16.9811C6.94105 16.7259 6.92906 16.4726 6.92106 16.2174C7.39306 16.35 7.47505 15.6332 7.47405 14.9035C7.67105 15.058 8.04106 14.9154 7.99906 14.5665C8.00906 14.1857 8.00705 13.8039 7.99805 13.423C8.36105 13.8218 8.47906 13.3423 8.47306 12.5019C8.54606 12.8049 8.66606 12.8867 8.85406 12.5916C8.90806 12.7052 9.07805 12.7411 9.15505 12.6285C9.29605 11.161 9.02106 9.63869 8.98006 8.15726Z" fill="url(#paint1_linear_2465_244)"/>
<path d="M3.50302 8.27734C3.45202 9.59329 3.35201 10.9282 3.52801 12.2381C3.55901 12.3618 3.73902 12.3847 3.80102 12.273C3.82102 10.9501 3.56702 9.60725 3.50302 8.27734Z" fill="url(#paint2_linear_2465_244)"/>
<path d="M3.20403 8.49219C3.15303 9.62171 3.06203 10.7692 3.19203 11.8937C3.21903 11.9735 3.33503 11.9934 3.39303 11.9326C3.47703 10.81 3.22403 9.63267 3.20403 8.49219Z" fill="url(#paint3_linear_2465_244)"/>
<path d="M2.77704 8.66211C2.86004 9.50352 2.73603 10.3818 2.86903 11.2083C2.92703 11.2701 3.04104 11.2242 3.03804 11.1385C2.99404 10.31 2.92004 9.47859 2.77704 8.66211Z" fill="url(#paint4_linear_2465_244)"/>
<path d="M2.47903 8.93795C2.51403 9.22806 2.51004 9.53611 2.51204 9.84117C2.43704 9.41947 2.34904 8.99677 2.32904 8.72461C2.36304 9.4753 2.32204 10.2389 2.47104 10.9777C2.47904 11.0215 2.51204 11.0674 2.56104 11.0584C2.58604 10.9986 2.60003 10.9199 2.60603 10.8311C2.61903 10.88 2.62104 10.9318 2.63504 10.9797C2.68604 11.0056 2.75003 10.9607 2.74803 10.9059C2.69303 10.2459 2.60803 9.58695 2.47903 8.93795Z" fill="url(#paint5_linear_2465_244)"/>
<path d="M2.02905 9.02344C2.12405 9.58271 2.04605 10.2736 2.27705 10.7671C2.31205 10.7741 2.34706 10.7481 2.35706 10.7152C2.28906 10.147 2.15805 9.58271 2.02905 9.02344Z" fill="url(#paint6_linear_2465_244)"/>
<path d="M1.60303 9.15234C1.70803 9.4913 1.75302 10.1114 1.97702 10.3397C1.99002 9.9788 1.70403 9.53417 1.60303 9.15234Z" fill="url(#paint7_linear_2465_244)"/>
<path d="M9.43702 8.61328C9.34702 9.77969 9.22301 10.968 9.34201 12.1344C9.36601 12.2301 9.49701 12.264 9.56402 12.1923C9.73202 11.0259 9.44902 9.79763 9.43702 8.61328Z" fill="url(#paint8_linear_2465_244)"/>
<path d="M9.82903 8.76562C9.77603 9.56516 9.71702 10.3787 9.81102 11.1752C9.83502 11.245 9.93502 11.2629 9.98602 11.2091C10.046 10.4165 9.84103 9.57513 9.82903 8.76562Z" fill="url(#paint9_linear_2465_244)"/>
<path d="M10.178 9.17773C10.142 9.68717 10.157 10.2086 10.251 10.712C10.26 10.7449 10.301 10.7658 10.331 10.7499C10.42 10.2644 10.182 9.69215 10.178 9.17773Z" fill="url(#paint10_linear_2465_244)"/>
<path d="M10.549 9.13477C10.54 9.61329 10.555 10.1078 10.674 10.5713C10.689 10.5953 10.722 10.5983 10.746 10.5863C10.781 10.1267 10.568 9.61628 10.549 9.13477Z" fill="url(#paint11_linear_2465_244)"/>
<path d="M10.963 9.32812C11.001 9.5315 10.98 9.78572 11.07 9.96417C11.154 9.87444 10.981 9.48165 10.963 9.32812Z" fill="url(#paint12_linear_2465_244)"/>
<defs>
<linearGradient id="paint0_linear_2465_244" x1="6.32597" y1="0.537109" x2="6.32597" y2="21.9025" gradientUnits="userSpaceOnUse">
<stop stop-color="#E8BEC0"/>
<stop offset="1" stop-color="#7086D9"/>
</linearGradient>
<linearGradient id="paint1_linear_2465_244" x1="6.54605" y1="3.94922" x2="6.54605" y2="19.686" gradientUnits="userSpaceOnUse">
<stop stop-color="#E8BEC0"/>
<stop offset="1" stop-color="#7086D9"/>
</linearGradient>
<linearGradient id="paint2_linear_2465_244" x1="3.61518" y1="8.27734" x2="3.61518" y2="12.3451" gradientUnits="userSpaceOnUse">
<stop stop-color="#E8BEC0"/>
<stop offset="1" stop-color="#7086D9"/>
</linearGradient>
<linearGradient id="paint3_linear_2465_244" x1="3.26765" y1="8.49219" x2="3.26765" y2="11.9681" gradientUnits="userSpaceOnUse">
<stop stop-color="#E8BEC0"/>
<stop offset="1" stop-color="#7086D9"/>
</linearGradient>
<linearGradient id="paint4_linear_2465_244" x1="2.90757" y1="8.66211" x2="2.90757" y2="11.2368" gradientUnits="userSpaceOnUse">
<stop stop-color="#E8BEC0"/>
<stop offset="1" stop-color="#7086D9"/>
</linearGradient>
<linearGradient id="paint5_linear_2465_244" x1="2.53856" y1="8.72461" x2="2.53856" y2="11.0596" gradientUnits="userSpaceOnUse">
<stop stop-color="#E8BEC0"/>
<stop offset="1" stop-color="#7086D9"/>
</linearGradient>
<linearGradient id="paint6_linear_2465_244" x1="2.19305" y1="9.02344" x2="2.19305" y2="10.7682" gradientUnits="userSpaceOnUse">
<stop stop-color="#E8BEC0"/>
<stop offset="1" stop-color="#7086D9"/>
</linearGradient>
<linearGradient id="paint7_linear_2465_244" x1="1.79024" y1="9.15234" x2="1.79024" y2="10.3397" gradientUnits="userSpaceOnUse">
<stop stop-color="#E8BEC0"/>
<stop offset="1" stop-color="#7086D9"/>
</linearGradient>
<linearGradient id="paint8_linear_2465_244" x1="9.45509" y1="8.61328" x2="9.45509" y2="12.2308" gradientUnits="userSpaceOnUse">
<stop stop-color="#E8BEC0"/>
<stop offset="1" stop-color="#7086D9"/>
</linearGradient>
<linearGradient id="paint9_linear_2465_244" x1="9.87921" y1="8.76562" x2="9.87921" y2="11.2405" gradientUnits="userSpaceOnUse">
<stop stop-color="#E8BEC0"/>
<stop offset="1" stop-color="#7086D9"/>
</linearGradient>
<linearGradient id="paint10_linear_2465_244" x1="10.2555" y1="9.17773" x2="10.2555" y2="10.7554" gradientUnits="userSpaceOnUse">
<stop stop-color="#E8BEC0"/>
<stop offset="1" stop-color="#7086D9"/>
</linearGradient>
<linearGradient id="paint11_linear_2465_244" x1="10.6484" y1="9.13477" x2="10.6484" y2="10.5931" gradientUnits="userSpaceOnUse">
<stop stop-color="#E8BEC0"/>
<stop offset="1" stop-color="#7086D9"/>
</linearGradient>
<linearGradient id="paint12_linear_2465_244" x1="11.0279" y1="9.32812" x2="11.0279" y2="9.96417" gradientUnits="userSpaceOnUse">
<stop stop-color="#E8BEC0"/>
<stop offset="1" stop-color="#7086D9"/>
</linearGradient>
</defs>
</svg>
