<svg width="1600" height="198" viewBox="0 0 1600 198" fill="none" xmlns="http://www.w3.org/2000/svg">
<path fill-rule="evenodd" clip-rule="evenodd" d="M1600 36.0004C1289 36.0004 1189.1 13.8004 788 14.0004C388 14.0004 289 36.0004 0 36.0004V198H1600C1600 198 1600 65.0004 1600 36.0004Z" fill="url(#paint0_linear_1818_8857)"/>
<defs>
<linearGradient id="paint0_linear_1818_8857" x1="799.92" y1="-6.16175" x2="799.92" y2="197.996" gradientUnits="userSpaceOnUse">
<stop offset="0.000343686" stop-color="#17191A" stop-opacity="0.25"/>
<stop offset="1" stop-color="#17191A"/>
</linearGradient>
</defs>
</svg>
