<svg width="36" height="36" viewBox="0 0 36 36" fill="none" xmlns="http://www.w3.org/2000/svg">
<path d="M20.417 22.732C20.207 22.645 18.641 22 17.708 22C15.708 22 13.028 18 11.375 18C8.70801 18 6.75501 23.225 5.00001 24.042C3.55501 24.715 2.97401 26.728 2.74001 28.238C2.58301 29.254 2.58301 30.042 2.58301 30.042L20.417 30V22.732Z" fill="#FFAC33"/>
<path d="M8.25 12C11.0114 12 13.25 9.76142 13.25 7C13.25 4.23858 11.0114 2 8.25 2C5.48858 2 3.25 4.23858 3.25 7C3.25 9.76142 5.48858 12 8.25 12Z" fill="#FFCC4D"/>
<path d="M8.25 11C10.4591 11 12.25 9.20914 12.25 7C12.25 4.79086 10.4591 3 8.25 3C6.04086 3 4.25 4.79086 4.25 7C4.25 9.20914 6.04086 11 8.25 11Z" fill="#FFAC33"/>
<path d="M18 25.1802C3.438 25.1802 0 29.8442 0 32.0002C0 34.1562 1.791 36.0002 4 36.0002H32C34.209 36.0002 36 34.1492 36 32.0002C36 29.8512 32.562 25.1802 18 25.1802Z" fill="#FFE8B6"/>
<path d="M10.063 22.403C9.54705 23.81 10.618 24.746 10.618 24.746C10.618 24.746 10.676 24.05 10.731 23.143C10.787 22.212 11.61 21.58 11.639 21.247C11.734 20.135 10.785 19.316 10.834 19.706C10.938 20.52 10.477 21.274 10.063 22.403ZM6.38205 24.971C6.00705 25.708 6.06105 27.467 6.06105 27.467C6.06105 27.467 6.96105 26.938 7.00105 26.393C7.04105 25.848 7.01505 25.559 7.13905 25.243C7.49105 24.343 8.26305 24.401 8.73405 23.155C8.90105 22.715 8.54005 21.952 8.43405 22.201C8.02405 23.16 6.75805 24.234 6.38205 24.971ZM12.427 24.634C12.311 24.312 12.551 22.256 12.755 22.534C12.959 22.812 12.749 23.695 13.419 24.42C14.256 25.325 14.14 26.401 13.91 25.918C13.679 25.434 12.543 24.956 12.427 24.634Z" fill="#F4900C"/>
<path d="M20.4169 27.895V25.303C18.1539 24.92 8.89288 23.705 2.74088 28.239C2.56788 28.367 2.55688 28.642 2.55688 28.73C2.55688 29.842 6.31988 28.388 10.8669 28.908C13.0519 29.158 15.4799 29.335 16.1249 28.856C16.3429 28.694 15.7969 28.129 14.7729 27.62C15.2859 27.488 15.8179 27.37 16.4269 27.377C18.4099 27.395 19.7269 27.689 20.4169 27.895Z" fill="#FFAC33"/>
<path d="M16.5349 12.1742C17.9329 12.1742 19.0349 13.3092 19.0349 14.7092V20.4912C19.0349 21.1792 20.0349 21.7322 20.0349 22.0422V11.4412C20.0349 9.34116 21.9349 7.63916 24.0349 7.63916C26.1349 7.63916 28.0349 9.34116 28.0349 11.4412V24.6122C29.0349 24.3112 29.0349 23.7432 29.0349 23.0252V19.7782C29.0349 18.3782 30.1359 17.2432 31.5349 17.2432C32.9339 17.2432 34.0349 18.3782 34.0349 19.7782V24.2132C34.0349 25.6122 33.0949 26.6682 32.0639 27.2622C31.2769 27.7172 29.0349 28.2762 28.0349 28.3092V31.3332C28.0349 33.3332 20.0349 33.3332 20.0349 31.3332V25.7662C19.0349 25.6912 16.8499 25.1622 16.0979 24.7282C15.0679 24.1342 14.0339 23.0792 14.0339 21.6782V14.7082C14.0349 13.3092 15.1339 12.1742 16.5349 12.1742Z" fill="#77B255"/>
<path d="M32.5 27.3823C32.8501 27.3823 33.134 27.0984 33.134 26.7483C33.134 26.3981 32.8501 26.1143 32.5 26.1143C32.1498 26.1143 31.866 26.3981 31.866 26.7483C31.866 27.0984 32.1498 27.3823 32.5 27.3823Z" fill="#3E721D"/>
<path d="M29.966 22.9462C30.3162 22.9462 30.6 22.6624 30.6 22.3122C30.6 21.9621 30.3162 21.6782 29.966 21.6782C29.6159 21.6782 29.332 21.9621 29.332 22.3122C29.332 22.6624 29.6159 22.9462 29.966 22.9462Z" fill="#3E721D"/>
<path d="M34.4008 21.6791C34.751 21.6791 35.0348 21.3953 35.0348 21.0451C35.0348 20.695 34.751 20.4111 34.4008 20.4111C34.0507 20.4111 33.7668 20.695 33.7668 21.0451C33.7668 21.3953 34.0507 21.6791 34.4008 21.6791Z" fill="#3E721D"/>
<path d="M17.2929 25.4814C17.6431 25.4814 17.9269 25.1975 17.9269 24.8474C17.9269 24.4972 17.6431 24.2134 17.2929 24.2134C16.9428 24.2134 16.6589 24.4972 16.6589 24.8474C16.6589 25.1975 16.9428 25.4814 17.2929 25.4814Z" fill="#3E721D"/>
<path d="M15.3921 20.412C15.7422 20.412 16.0261 20.1282 16.0261 19.778C16.0261 19.4279 15.7422 19.144 15.3921 19.144C15.0419 19.144 14.7581 19.4279 14.7581 19.778C14.7581 20.1282 15.0419 20.412 15.3921 20.412Z" fill="#3E721D"/>
<path d="M17.927 17.2441C18.2771 17.2441 18.561 16.9602 18.561 16.6101C18.561 16.2599 18.2771 15.9761 17.927 15.9761C17.5768 15.9761 17.293 16.2599 17.293 16.6101C17.293 16.9602 17.5768 17.2441 17.927 17.2441Z" fill="#3E721D"/>
<path d="M14.125 15.3432C14.4751 15.3432 14.759 15.0593 14.759 14.7092C14.759 14.359 14.4751 14.0752 14.125 14.0752C13.7748 14.0752 13.491 14.359 13.491 14.7092C13.491 15.0593 13.7748 15.3432 14.125 15.3432Z" fill="#3E721D"/>
<path d="M21.728 30.2831C22.0781 30.2831 22.362 29.9993 22.362 29.6491C22.362 29.299 22.0781 29.0151 21.728 29.0151C21.3778 29.0151 21.094 29.299 21.094 29.6491C21.094 29.9993 21.3778 30.2831 21.728 30.2831Z" fill="#3E721D"/>
<path d="M27.4299 26.7485C27.78 26.7485 28.0639 26.4646 28.0639 26.1145C28.0639 25.7643 27.78 25.4805 27.4299 25.4805C27.0798 25.4805 26.7959 25.7643 26.7959 26.1145C26.7959 26.4646 27.0798 26.7485 27.4299 26.7485Z" fill="#3E721D"/>
<path d="M22.9961 22.9462C23.3462 22.9462 23.6301 22.6624 23.6301 22.3122C23.6301 21.9621 23.3462 21.6782 22.9961 21.6782C22.6459 21.6782 22.3621 21.9621 22.3621 22.3122C22.3621 22.6624 22.6459 22.9462 22.9961 22.9462Z" fill="#3E721D"/>
<path d="M26.7981 20.412C27.1482 20.412 27.4321 20.1282 27.4321 19.778C27.4321 19.4279 27.1482 19.144 26.7981 19.144C26.4479 19.144 26.1641 19.4279 26.1641 19.778C26.1641 20.1282 26.4479 20.412 26.7981 20.412Z" fill="#3E721D"/>
<path d="M22.362 15.977C22.7122 15.977 22.996 15.6931 22.996 15.343C22.996 14.9928 22.7122 14.709 22.362 14.709C22.0119 14.709 21.728 14.9928 21.728 15.343C21.728 15.6931 22.0119 15.977 22.362 15.977Z" fill="#3E721D"/>
<path d="M28.0639 14.0761C28.4141 14.0761 28.6979 13.7923 28.6979 13.4421C28.6979 13.092 28.4141 12.8081 28.0639 12.8081C27.7138 12.8081 27.4299 13.092 27.4299 13.4421C27.4299 13.7923 27.7138 14.0761 28.0639 14.0761Z" fill="#3E721D"/>
<path d="M21.094 10.1752C21.4441 10.1752 21.728 9.89138 21.728 9.54123C21.728 9.19108 21.4441 8.90723 21.094 8.90723C20.7438 8.90723 20.46 9.19108 20.46 9.54123C20.46 9.89138 20.7438 10.1752 21.094 10.1752Z" fill="#3E721D"/>
<path d="M14.7611 27.6159C14.7611 27.6159 13.6331 27.2589 12.9771 27.1649C12.3211 27.0709 15.5651 26.8939 17.0831 27.3889C15.5651 27.3649 14.7611 27.6159 14.7611 27.6159Z" fill="#F4900C"/>
</svg>
