<svg width="1280" height="1037" viewBox="0 0 1280 1037" fill="none" xmlns="http://www.w3.org/2000/svg">
<g opacity="0.3" clip-path="url(#clip0_1745_11046)">
<path d="M0 -440C60.5819 -427.239 262.623 -385.345 363.491 -363.433C464.359 -341.521 507.021 -336.899 605.209 -308.53C703.396 -280.161 842.827 -218.742 952.617 -193.219C1062.41 -167.696 1157.87 -174.183 1263.95 -155.391C1370.03 -136.6 1474.25 -109.836 1589.1 -80.4721C1703.94 -51.1084 1892.35 3.91366 1953 20.7908V978H0V-440Z" fill="url(#paint0_linear_1745_11046)"/>
<path d="M1907 354H-46V1276H1907V354Z" fill="#4FA38E"/>
<path d="M-46 -142C14.5819 -129.239 216.623 -87.3448 317.491 -65.4331C418.359 -43.5213 461.021 -38.8985 559.209 -10.5296C657.396 17.8394 796.827 79.2578 906.617 104.781C1016.41 130.304 1111.87 123.817 1217.95 142.609C1324.03 161.4 1428.25 188.164 1543.1 217.528C1657.94 246.892 1846.35 301.914 1907 318.791V1276H-46V-142Z" fill="url(#paint1_linear_1745_11046)"/>
<path d="M-46 -35C22.7115 -17.2812 232.86 40.8813 366.269 71.313C499.678 101.745 631.924 124.532 754.455 147.59C876.986 170.648 970.399 179.358 1101.46 209.66C1232.51 239.963 1406.54 291.304 1540.79 329.406C1675.05 367.508 1845.97 420.129 1907 438.273V1276H-46V-35Z" fill="url(#paint2_linear_1745_11046)"/>
<path d="M-46 131C-9.23475 139.977 87.6914 166.11 174.591 184.864C261.492 203.617 392.717 227.664 475.401 243.519C558.085 259.375 594.344 262.858 670.697 279.994C747.05 297.131 842.966 317.515 933.52 346.338C1024.07 375.16 1137.44 426.278 1214.02 452.93C1290.61 479.582 1316.01 489.709 1393.04 506.25C1470.08 522.792 1590.57 533.801 1676.23 552.182C1761.89 570.563 1868.54 605.811 1907 616.537V1276H-46V131Z" fill="url(#paint3_linear_1745_11046)"/>
<path d="M-46 212C11.2347 221.005 193.493 232.782 297.408 266.031C401.323 299.279 477.046 376.437 577.49 411.492C677.935 446.547 791.179 457.258 900.073 476.36C1008.97 495.462 1112.74 499.641 1230.86 526.102C1348.97 552.563 1496.06 604.592 1608.75 635.126C1721.44 665.66 1857.29 696.941 1907 709.304V1276H-46V212Z" fill="url(#paint4_linear_1745_11046)"/>
<path d="M-46 372C16.7559 390.708 201.154 452.892 330.535 484.246C459.917 515.6 603.22 526.348 730.289 560.122C857.358 593.897 960.02 649.801 1092.95 686.893C1225.88 723.986 1392.19 750.295 1527.86 782.676C1663.54 815.057 1843.81 864.762 1907 881.179V1276H-46V372Z" fill="url(#paint5_linear_1745_11046)"/>
<path d="M-46 437C7.29401 441.869 179.049 434.328 273.764 466.214C368.479 498.101 427.749 589.472 522.289 628.318C616.829 667.165 741.909 685.496 841.005 699.294C940.102 713.092 1027.54 699.209 1116.87 711.105C1206.19 723 1284.25 741.755 1376.97 770.667C1469.68 799.579 1584.79 853.138 1673.13 884.579C1761.47 916.019 1868.02 946.854 1907 959.309V1276H-46V437Z" fill="url(#paint6_linear_1745_11046)"/>
<path d="M-46 567C34.0678 588.876 270.763 656.172 434.407 698.259C598.05 740.345 769.407 777.436 935.86 819.521C1102.31 861.605 1271.27 903.726 1433.12 950.767C1594.98 997.807 1828.02 1076.6 1907 1101.76V1276H-46V567Z" fill="url(#paint7_linear_1745_11046)"/>
</g>
<defs>
<linearGradient id="paint0_linear_1745_11046" x1="976.5" y1="-440" x2="407.956" y2="1126.1" gradientUnits="userSpaceOnUse">
<stop stop-color="#B3DDD1"/>
<stop offset="0.1" stop-color="#45917E"/>
</linearGradient>
<linearGradient id="paint1_linear_1745_11046" x1="930.5" y1="-142" x2="361.956" y2="1424.1" gradientUnits="userSpaceOnUse">
<stop offset="0.0312897" stop-color="#B3DDD1"/>
<stop offset="0.242139" stop-color="#3A7466"/>
</linearGradient>
<linearGradient id="paint2_linear_1745_11046" x1="930.5" y1="-35" x2="436.162" y2="1437.83" gradientUnits="userSpaceOnUse">
<stop stop-color="#B3DDD1"/>
<stop offset="0.228571" stop-color="#498E7E"/>
</linearGradient>
<linearGradient id="paint3_linear_1745_11046" x1="930.5" y1="131" x2="544.145" y2="1448.99" gradientUnits="userSpaceOnUse">
<stop stop-color="#B3DDD1"/>
<stop offset="0.357143" stop-color="#549484"/>
</linearGradient>
<linearGradient id="paint4_linear_1745_11046" x1="930.5" y1="212" x2="593.232" y2="1450.13" gradientUnits="userSpaceOnUse">
<stop stop-color="#D1DCE2"/>
<stop offset="0.485714" stop-color="#5E998B"/>
</linearGradient>
<linearGradient id="paint5_linear_1745_11046" x1="930.5" y1="372" x2="682.27" y2="1444.55" gradientUnits="userSpaceOnUse">
<stop stop-color="#D1DCE2"/>
<stop offset="0.614286" stop-color="#4E8F80"/>
</linearGradient>
<linearGradient id="paint6_linear_1745_11046" x1="930.5" y1="437" x2="715.166" y2="1439.5" gradientUnits="userSpaceOnUse">
<stop stop-color="#D1DCE2"/>
<stop offset="0.742857" stop-color="#3E9781"/>
</linearGradient>
<linearGradient id="paint7_linear_1745_11046" x1="930.5" y1="567" x2="774.763" y2="1424.98" gradientUnits="userSpaceOnUse">
<stop stop-color="#D1DCE2"/>
<stop offset="0.871429" stop-color="#5D9C8D"/>
</linearGradient>
<clipPath id="clip0_1745_11046">
<rect width="1280" height="1037" fill="white"/>
</clipPath>
</defs>
</svg>
