<svg width="80" height="80" viewBox="0 0 80 80" fill="none" xmlns="http://www.w3.org/2000/svg">
<path d="M76.875 38.7499C76.8708 35.49 75.9248 32.3008 74.1507 29.5659C72.3766 26.831 69.85 24.667 66.875 23.3343V22.4999C66.8719 19.3279 65.8197 16.2461 63.8824 13.7345C61.945 11.2228 59.2314 9.42253 56.1642 8.614C53.097 7.80547 49.8485 8.03413 46.9248 9.26436C44.0011 10.4946 41.5664 12.6573 40 15.4155C38.4336 12.6573 35.999 10.4946 33.0753 9.26436C30.1516 8.03413 26.9031 7.80547 23.8359 8.614C20.7687 9.42253 18.055 11.2228 16.1177 13.7345C14.1804 16.2461 13.1282 19.3279 13.125 22.4999V23.3343C10.1477 24.6626 7.61885 26.8249 5.84424 29.5597C4.06963 32.2946 3.12524 35.485 3.12524 38.7452C3.12524 42.0054 4.06963 45.1958 5.84424 47.9307C7.61885 50.6656 10.1477 52.8279 13.125 54.1562V54.9999C13.1282 58.1719 14.1804 61.2538 16.1177 63.7654C18.055 66.277 20.7687 68.0773 23.8359 68.8858C26.9031 69.6944 30.1516 69.4657 33.0753 68.2355C35.999 67.0052 38.4336 64.8425 40 62.0843C41.5664 64.8425 44.0011 67.0052 46.9248 68.2355C49.8485 69.4657 53.097 69.6944 56.1642 68.8858C59.2314 68.0773 61.945 66.277 63.8824 63.7654C65.8197 61.2538 66.8719 58.1719 66.875 54.9999V54.1562C69.85 52.826 72.3769 50.6639 74.1511 47.9304C75.9254 45.197 76.8714 42.0087 76.875 38.7499ZM27.5 65.6249C24.7386 65.6263 22.0851 64.5524 20.1017 62.6309C18.1184 60.7095 16.9611 58.0913 16.875 55.3312C17.9052 55.5266 18.9515 55.6249 20 55.6249H22.5C22.9973 55.6249 23.4742 55.4274 23.8258 55.0757C24.1775 54.7241 24.375 54.2472 24.375 53.7499C24.375 53.2526 24.1775 52.7757 23.8258 52.4241C23.4742 52.0725 22.9973 51.8749 22.5 51.8749H20C16.902 51.8774 13.903 50.784 11.5336 48.7881C9.16416 46.7922 7.57714 44.0225 7.05334 40.9691C6.52953 37.9157 7.1027 34.7754 8.67143 32.1039C10.2402 29.4324 12.7033 27.402 15.625 26.3718C15.9907 26.2425 16.3074 26.0029 16.5312 25.6862C16.7551 25.3694 16.8752 24.991 16.875 24.603V22.4999C16.875 19.682 17.9944 16.9795 19.987 14.9869C21.9796 12.9943 24.6821 11.8749 27.5 11.8749C30.3179 11.8749 33.0205 12.9943 35.013 14.9869C37.0056 16.9795 38.125 19.682 38.125 22.4999V45.328C36.7802 43.8462 35.1401 42.6622 33.3102 41.8522C31.4803 41.0422 29.5012 40.6241 27.5 40.6249C27.0027 40.6249 26.5258 40.8225 26.1742 41.1741C25.8226 41.5257 25.625 42.0026 25.625 42.4999C25.625 42.9972 25.8226 43.4741 26.1742 43.8257C26.5258 44.1774 27.0027 44.3749 27.5 44.3749C30.3179 44.3749 33.0205 45.4943 35.013 47.4869C37.0056 49.4795 38.125 52.182 38.125 54.9999C38.125 57.8178 37.0056 60.5204 35.013 62.5129C33.0205 64.5055 30.3179 65.6249 27.5 65.6249ZM60 51.8749H57.5C57.0027 51.8749 56.5258 52.0725 56.1742 52.4241C55.8226 52.7757 55.625 53.2526 55.625 53.7499C55.625 54.2472 55.8226 54.7241 56.1742 55.0757C56.5258 55.4274 57.0027 55.6249 57.5 55.6249H60C61.0486 55.6249 62.0948 55.5266 63.125 55.3312C63.06 57.4173 62.3819 59.438 61.1756 61.1411C59.9693 62.8443 58.288 64.1544 56.3418 64.9081C54.3955 65.6617 52.2703 65.8254 50.2316 65.3788C48.1928 64.9322 46.3307 63.895 44.8778 62.3967C43.4248 60.8985 42.4452 59.0054 42.0614 56.9539C41.6776 54.9024 41.9065 52.7833 42.7195 50.8611C43.5325 48.9388 44.8936 47.2986 46.633 46.1451C48.3723 44.9916 50.4129 44.3759 52.5 44.3749C52.9973 44.3749 53.4742 44.1774 53.8259 43.8257C54.1775 43.4741 54.375 42.9972 54.375 42.4999C54.375 42.0026 54.1775 41.5257 53.8259 41.1741C53.4742 40.8225 52.9973 40.6249 52.5 40.6249C50.4989 40.6241 48.5197 41.0422 46.6899 41.8522C44.86 42.6622 43.2199 43.8462 41.875 45.328V22.4999C41.875 19.682 42.9944 16.9795 44.987 14.9869C46.9796 12.9943 49.6821 11.8749 52.5 11.8749C55.318 11.8749 58.0205 12.9943 60.013 14.9869C62.0056 16.9795 63.125 19.682 63.125 22.4999V24.603C63.1248 24.991 63.2449 25.3694 63.4688 25.6862C63.6927 26.0029 64.0093 26.2425 64.375 26.3718C67.2968 27.402 69.7599 29.4324 71.3286 32.1039C72.8973 34.7754 73.4705 37.9157 72.9467 40.9691C72.4229 44.0225 70.8359 46.7922 68.4665 48.7881C66.0971 50.784 63.098 51.8774 60 51.8749ZM64.375 34.9999C64.375 35.4972 64.1775 35.9741 63.8259 36.3257C63.4742 36.6774 62.9973 36.8749 62.5 36.8749H61.25C58.4321 36.8749 55.7296 35.7555 53.737 33.7629C51.7444 31.7704 50.625 29.0678 50.625 26.2499V24.9999C50.625 24.5026 50.8226 24.0257 51.1742 23.6741C51.5258 23.3225 52.0027 23.1249 52.5 23.1249C52.9973 23.1249 53.4742 23.3225 53.8259 23.6741C54.1775 24.0257 54.375 24.5026 54.375 24.9999V26.2499C54.375 28.0733 55.0994 29.822 56.3887 31.1113C57.678 32.4006 59.4267 33.1249 61.25 33.1249H62.5C62.9973 33.1249 63.4742 33.3225 63.8259 33.6741C64.1775 34.0257 64.375 34.5026 64.375 34.9999ZM18.75 36.8749H17.5C17.0027 36.8749 16.5258 36.6774 16.1742 36.3257C15.8226 35.9741 15.625 35.4972 15.625 34.9999C15.625 34.5026 15.8226 34.0257 16.1742 33.6741C16.5258 33.3225 17.0027 33.1249 17.5 33.1249H18.75C20.5734 33.1249 22.3221 32.4006 23.6114 31.1113C24.9007 29.822 25.625 28.0733 25.625 26.2499V24.9999C25.625 24.5026 25.8226 24.0257 26.1742 23.6741C26.5258 23.3225 27.0027 23.1249 27.5 23.1249C27.9973 23.1249 28.4742 23.3225 28.8258 23.6741C29.1775 24.0257 29.375 24.5026 29.375 24.9999V26.2499C29.375 29.0678 28.2556 31.7704 26.263 33.7629C24.2705 35.7555 21.568 36.8749 18.75 36.8749Z" fill="url(#paint0_linear_1518_8884)"/>
<defs>
<linearGradient id="paint0_linear_1518_8884" x1="40.0001" y1="8.13916" x2="40.0001" y2="69.3607" gradientUnits="userSpaceOnUse">
<stop style="stop-color: var(--start-color, white)" />
<stop offset="1" style="stop-color: var(--end-color, white)"/>
</linearGradient>
</defs>
</svg>
