<svg width="80" height="80" viewBox="0 0 80 80" fill="none" xmlns="http://www.w3.org/2000/svg">
<g clip-path="url(#clip0_2458_19)">
<path fill-rule="evenodd" clip-rule="evenodd" d="M80 0L0 0L0 80L40 80C40 57.9086 57.9086 40 80 40L80 0Z" fill="white"/>
</g>
<defs>
<clipPath id="clip0_2458_19">
<rect width="80" height="80" fill="white" transform="translate(80) rotate(90)"/>
</clipPath>
</defs>
</svg>
