<svg width="9" height="9" viewBox="0 0 9 9" fill="none" xmlns="http://www.w3.org/2000/svg">
<path d="M4.5 1.61803L5.03478 3.26393L5.14704 3.60942H5.51031H7.24091L5.84083 4.62664L5.54694 4.84017L5.65919 5.18566L6.19398 6.83156L4.79389 5.81434L4.5 5.60081L4.20611 5.81434L2.80602 6.83156L3.34081 5.18566L3.45306 4.84017L3.15917 4.62664L1.75909 3.60942H3.48969H3.85296L3.96522 3.26393L4.5 1.61803Z" stroke="#ffcf25"/>
</svg>
