<svg width="15" height="15" viewBox="0 0 15 15" fill="none" xmlns="http://www.w3.org/2000/svg">
<path d="M7.5 0L9.15463 5.84537L15 7.5L9.15463 9.15463L7.5 15L5.84537 9.15463L0 7.5L5.84537 5.84537L7.5 0Z" fill="#F3A691"/>
</svg>
