<svg width="62" height="52" viewBox="0 0 62 52" fill="none" xmlns="http://www.w3.org/2000/svg">
<path fill-rule="evenodd" clip-rule="evenodd" d="M12.4093 0L13.3484 2.89039H16.3876L13.9288 4.67674L14.868 7.56713L12.4093 5.78077L9.95054 7.56713L10.8897 4.67674L8.43096 2.89039H11.4701L12.4093 0ZM5.46064 15.0404L5.73305 16.1184L6.74574 15.6592L6.8316 15.6203L6.77454 15.6954L6.10154 16.5805L7.09193 17.0859L7.1759 17.1288L7.08165 17.131L5.97002 17.1567L6.19234 18.2461L6.21119 18.3385L6.15072 18.2662L5.43754 17.4131L4.72437 18.2662L4.6639 18.3385L4.68275 18.2461L4.90506 17.1567L3.79343 17.131L3.69918 17.1288L3.78315 17.0859L4.77355 16.5805L4.10054 15.6954L4.04348 15.6203L4.12935 15.6592L5.14204 16.1184L5.41444 15.0404L5.43754 14.949L5.46064 15.0404ZM9.79811 13.2546L8.01596 14.0627L7.2221 14.4226L6.36187 14.8126L6.13048 13.8969L5.91693 13.0518L5.43754 11.1547L4.95815 13.0518L4.7446 13.8969L4.51321 14.8126L3.65299 14.4226L2.85912 14.0627L1.07697 13.2546L2.26133 14.8123L2.78891 15.5061L3.36058 16.258L2.5193 16.6873L1.74291 17.0836L0 17.9731L1.95626 18.0183L2.82769 18.0385L3.77195 18.0603L3.58311 18.9857L3.40884 19.8398L3.01761 21.757L4.27267 20.2558L4.83174 19.587L5.43754 18.8624L6.04334 19.587L6.60241 20.2558L7.85747 21.757L7.46625 19.8398L7.29197 18.9857L7.10313 18.0603L8.0474 18.0385L8.91882 18.0183L10.8751 17.9731L9.13217 17.0836L8.35578 16.6873L7.5145 16.258L8.08617 15.5061L8.61375 14.8123L9.79811 13.2546ZM49.1501 37.3497L49.4225 38.4278L50.4352 37.9686L50.5211 37.9297L50.464 38.0047L49.791 38.8898L50.7814 39.3953L50.8654 39.4382L50.7711 39.4403L49.6595 39.466L49.8818 40.5555L49.9006 40.6479L49.8402 40.5755L49.127 39.7225L48.4138 40.5755L48.3534 40.6479L48.3722 40.5555L48.5945 39.466L47.4829 39.4403L47.3886 39.4382L47.4726 39.3953L48.463 38.8898L47.79 38.0047L47.7329 37.9297L47.8188 37.9686L48.8315 38.4278L49.1039 37.3497L49.127 37.2583L49.1501 37.3497ZM53.4876 35.564L51.7054 36.372L50.9116 36.732L50.0513 37.122L49.8199 36.2063L49.6064 35.3612L49.127 33.4641L48.6476 35.3612L48.4341 36.2063L48.2027 37.122L47.3424 36.732L46.5486 36.372L44.7664 35.564L45.9508 37.1216L46.4784 37.8155L47.05 38.5673L46.2088 38.9967L45.4324 39.3929L43.6895 40.2825L45.6457 40.3277L46.5171 40.3478L47.4614 40.3697L47.2726 41.2951L47.0983 42.1491L46.7071 44.0664L47.9621 42.5651L48.5212 41.8964L49.127 41.1717L49.7328 41.8964L50.2919 42.5651L51.5469 44.0664L51.1557 42.1491L50.9814 41.2951L50.7926 40.3697L51.7369 40.3478L52.6083 40.3277L54.5645 40.2825L52.8216 39.3929L52.0452 38.9967L51.204 38.5673L51.7756 37.8155L52.3032 37.1216L53.4876 35.564ZM57.0283 16.732L57.9674 19.6224H61.0066L58.5479 21.4088L59.487 24.2992L57.0283 22.5128L54.5696 24.2992L55.5087 21.4088L53.05 19.6224H56.0891L57.0283 16.732ZM46.3383 17.1968C46.3383 17.9669 45.714 18.5911 44.944 18.5911C44.1739 18.5911 43.5496 17.9669 43.5496 17.1968C43.5496 16.4267 44.1739 15.8025 44.944 15.8025C45.714 15.8025 46.3383 16.4267 46.3383 17.1968ZM46.3383 50.6609C46.3383 51.4309 45.714 52.0552 44.944 52.0552C44.1739 52.0552 43.5496 51.4309 43.5496 50.6609C43.5496 49.8908 44.1739 49.2665 44.944 49.2665C45.714 49.2665 46.3383 49.8908 46.3383 50.6609Z" fill="white"/>
</svg>
