<svg width="80" height="205" viewBox="0 0 80 205" fill="none" xmlns="http://www.w3.org/2000/svg">
<g filter="url(#filter0_df_1679_9799)">
<path d="M51.735 50.2119C51.735 52.8706 50.7256 55.4791 47.7476 55.4791H36.6435C33.918 55.4791 33.2114 53.1214 33.1609 49.7604H51.735V50.2119ZM34.6246 41.2325H45.123V48.8574H34.6246V41.2325ZM40.2776 31.5007V29.3436C40.2776 27.5879 41.8423 26.4341 43.6593 26.4341H53.0473V31.5007H40.2776ZM26.8013 31.5007V26.4341H35.7855C37.8044 26.4341 39.2681 27.7885 39.2681 29.3436V31.5007H26.8013ZM39.2681 20.3643V22.722C39.2681 24.4777 37.653 25.481 35.7855 25.481H26.8013V20.3643H39.2681ZM53.0473 20.3643V25.481H43.6593C41.6404 25.481 40.2776 24.3774 40.2776 22.722V20.3643H53.0473ZM62.9905 48.8574C60.164 48.8574 58.7003 46.901 58.7003 44.744H57.7918C57.7918 46.6502 56.8328 48.8574 54.9653 48.8574H48.5047V41.2325H61.3249V40.3296C59.7603 40.3296 56.8833 38.7745 56.8833 36.4669H55.9748C55.9748 38.7243 54.3596 40.3296 52.795 40.3296H48.5047V38.9751C48.5047 38.323 49.1609 37.7712 50.3218 37.7712V36.8682C47.8486 36.8682 46.2839 35.7646 46.0315 33.5574H45.123V40.3296H34.6246V38.9751C34.6246 38.323 35.2808 37.7712 36.4416 37.7712V36.8682C33.9685 36.8682 32.4543 35.7145 32.2524 33.5072H31.2934V40.3296H19.5331V41.2325H31.2934V48.8574H17.6151V49.7604H32.2019C31.7981 53.5729 27.3565 57.9371 16.5552 62.5021L16.959 63.1542C28.4164 60.044 33.1609 56.3319 36.6435 56.3319H47.7476C50.776 56.3319 51.735 60.044 51.735 62.803H52.6435C52.6435 59.9939 53.9558 56.3319 56.6814 56.3319V55.4791C53.8044 55.4791 52.6435 52.7702 52.6435 50.2119V49.7604H54.9653C56.8328 49.7604 57.7918 52.1181 57.7918 53.7735H58.7003C58.7003 51.9174 60.1136 49.7102 62.9905 49.7102V48.8574ZM56.3786 34.9118V21.8692C56.3786 21.0164 57.1356 20.3643 58.6498 20.3643V19.662C56.4795 19.662 54.9653 17.5551 54.9653 16H54.1073C54.1073 17.7056 53.3502 19.4613 51.5836 19.4613H26.7003L23.4196 16.9531V30.6479C23.4196 31.4505 22.9653 32.1027 21.3502 32.1027V32.8551C23.47 32.8551 24.9338 34.5607 24.9338 36.2161H25.7918C25.7918 34.1092 26.4479 32.4538 28.2145 32.4538H53.0473V34.9118H56.3786Z" fill="white"/>
<path d="M48.3028 96.112V110.007H39.9243V96.112H48.3028ZM23.7729 119.689C23.7729 120.341 23.1167 120.893 21.9558 120.893V121.796C24.1767 121.796 26.0946 123.401 26.2965 125.558H27.2555V121.495H61.1735V120.592C59.4069 120.592 56.1262 118.886 56.1262 116.278H55.2177C55.1672 118.886 53.0978 120.592 51.5836 120.592H27.2555V96.112H36.4921V109.957C36.4921 110.81 35.8864 111.512 34.7256 111.512V112.365C36.5426 112.365 37.9558 114.572 37.9558 115.977H38.8644C38.8644 114.322 39.6215 110.91 41.2871 110.91H48.3028V114.974H51.6845V96.112H53.9054C55.9243 96.112 57.6404 97.6169 57.6404 100.276H58.5489C58.5489 97.3159 61.1735 96.0618 63.6972 96.0618V95.2592C61.1735 95.2592 58.5489 94.1054 58.5489 90.9451H57.6404C57.6404 93.7542 55.9243 95.209 53.9054 95.209H51.6845V84.8251C51.6845 84.2231 52.2902 83.7215 53.4006 83.7215V82.7683C51.0284 82.7683 49.4637 81.5142 49.2114 79.307H48.3028V95.209H39.9243V84.0726C39.9243 83.4706 40.53 82.969 41.6404 82.969V82.0159C39.2681 82.0159 37.7035 80.7618 37.4511 78.5546H36.4921V95.209H27.2555V84.9254C27.2555 84.2733 27.9117 83.7716 29.0726 83.7716V82.8185C26.5994 82.8185 24.9338 81.5142 24.6814 79.2568H23.7729V95.209H16.6057V96.112H23.7729V119.689Z" fill="white"/>
<path d="M27.1041 160.422V153.6H36.6435C38.5615 153.6 39.6215 154.954 39.6215 156.509V160.422H27.1041ZM53.0978 145.524V152.647H43.7098C41.7413 152.647 40.6814 151.493 40.6814 149.838V145.524H53.0978ZM39.6215 149.838C39.6215 151.593 38.4101 152.647 36.6435 152.647H27.1041V145.524H39.6215V149.838ZM40.6814 160.422V156.509C40.6814 154.754 41.8927 153.6 43.7098 153.6H53.0978V160.422H40.6814ZM16 174.97L16.3028 175.672C22.2082 174.017 27.3565 171.308 31.3438 168.097V173.214C31.3438 177.98 29.1735 184.05 20.5426 187.611L20.9464 188.364C30.8391 184.852 34.6246 179.886 34.6246 173.666V171.96C34.6246 171.408 35.1798 170.907 36.1388 170.907V170.004C34.2208 170.004 32.9085 169.05 32.4038 167.245C34.5741 165.389 36.3407 163.382 37.7035 161.325H44.5174C47.8486 167.495 54.7129 172.411 60.4669 174.217C60.7697 172.863 61.7287 171.509 64 171.509V170.806C56.2776 169.903 48.6562 165.238 45.4259 161.325H53.0978V164.034H56.5804V147.43C56.5804 146.527 57.388 145.875 58.5994 145.875V144.972C56.6814 144.972 55.0158 142.714 55.0158 141.159H54.2082C54.2082 142.915 53.4511 144.671 51.836 144.671H27.0032L23.6215 142.213V159.921C23.6215 160.773 22.8644 161.526 21.6025 161.526V162.379C23.5205 162.379 25.1861 164.385 25.1861 165.99H25.9937C25.9937 164.185 26.7508 161.325 28.3155 161.325H33.0095C30.9401 166.492 21.9054 172.963 16 174.97ZM43.306 183.347V184.25C45.2744 184.25 47.142 186.156 47.3438 188.213H48.2019V172.11C48.2019 171.509 48.7571 170.957 49.817 170.957V170.004C47.5962 170.004 45.9306 168.649 45.7287 166.191H44.9211V181.993C44.9211 182.795 44.3659 183.347 43.306 183.347Z" fill="white"/>
</g>
<defs>
<filter id="filter0_df_1679_9799" x="0" y="0" width="80" height="204.363" filterUnits="userSpaceOnUse" color-interpolation-filters="sRGB">
<feFlood flood-opacity="0" result="BackgroundImageFix"/>
<feColorMatrix in="SourceAlpha" type="matrix" values="0 0 0 0 0 0 0 0 0 0 0 0 0 0 0 0 0 0 127 0" result="hardAlpha"/>
<feOffset/>
<feGaussianBlur stdDeviation="8"/>
<feComposite in2="hardAlpha" operator="out"/>
<feColorMatrix type="matrix" values="0 0 0 0 0.121569 0 0 0 0 0.0941176 0 0 0 0 0.156863 0 0 0 0.1 0"/>
<feBlend mode="normal" in2="BackgroundImageFix" result="effect1_dropShadow_1679_9799"/>
<feBlend mode="normal" in="SourceGraphic" in2="effect1_dropShadow_1679_9799" result="shape"/>
<feGaussianBlur stdDeviation="1" result="effect2_foregroundBlur_1679_9799"/>
</filter>
</defs>
</svg>
