Library\Bee\artifacts\mvdfrm\UnityEditor.Graphs.dll_D9196CC3B66D97B5.mvfrm
Library\Bee\artifacts\mvdfrm\UnityEditor.CoreModule.dll_D86E41DFA90B5083.mvfrm
Library\Bee\artifacts\mvdfrm\UnityEditor.DeviceSimulatorModule.dll_636528CF275A59AE.mvfrm
Library\Bee\artifacts\mvdfrm\UnityEditor.DiagnosticsModule.dll_A3DDC8CA50CF707C.mvfrm
Library\Bee\artifacts\mvdfrm\UnityEditor.dll_07C59820FB6451A2.mvfrm
Library\Bee\artifacts\mvdfrm\UnityEditor.EditorToolbarModule.dll_87DF47F14E431DBE.mvfrm
Library\Bee\artifacts\mvdfrm\UnityEditor.GraphViewModule.dll_808DAB1A1B975CD3.mvfrm
Library\Bee\artifacts\mvdfrm\UnityEditor.PresetsUIModule.dll_3BF3E3FC1DEFB4D8.mvfrm
Library\Bee\artifacts\mvdfrm\UnityEditor.QuickSearchModule.dll_2EED49D7A9A66CD5.mvfrm
Library\Bee\artifacts\mvdfrm\UnityEditor.SceneTemplateModule.dll_AB7EB8AF4D2FC7F6.mvfrm
Library\Bee\artifacts\mvdfrm\UnityEditor.SceneViewModule.dll_BF3D8E2210BA29E1.mvfrm
Library\Bee\artifacts\mvdfrm\UnityEditor.TextCoreFontEngineModule.dll_6E13762775CB12A1.mvfrm
Library\Bee\artifacts\mvdfrm\UnityEditor.TextCoreTextEngineModule.dll_B5FBAC99054ECBBF.mvfrm
Library\Bee\artifacts\mvdfrm\UnityEditor.UIBuilderModule.dll_D51658368E4FD607.mvfrm
Library\Bee\artifacts\mvdfrm\UnityEditor.UIElementsModule.dll_CC1277988D303EDF.mvfrm
Library\Bee\artifacts\mvdfrm\UnityEditor.UIElementsSamplesModule.dll_0D3062528D4C957E.mvfrm
Library\Bee\artifacts\mvdfrm\UnityEditor.UnityConnectModule.dll_E9EF0D03FA2D40B9.mvfrm
Library\Bee\artifacts\mvdfrm\UnityEngine.AccessibilityModule.dll_DE2424464DA5EF93.mvfrm
Library\Bee\artifacts\mvdfrm\UnityEngine.AIModule.dll_12092960A939AC77.mvfrm
Library\Bee\artifacts\mvdfrm\UnityEngine.AndroidJNIModule.dll_4A5B606BD64FADB5.mvfrm
Library\Bee\artifacts\mvdfrm\UnityEngine.AnimationModule.dll_4F132742F5F43179.mvfrm
Library\Bee\artifacts\mvdfrm\UnityEngine.ARModule.dll_CB7BEE6406570B40.mvfrm
Library\Bee\artifacts\mvdfrm\UnityEngine.AssetBundleModule.dll_72D67CC90C0D21C7.mvfrm
Library\Bee\artifacts\mvdfrm\UnityEngine.AudioModule.dll_384960CB8E330C2B.mvfrm
Library\Bee\artifacts\mvdfrm\UnityEngine.ClothModule.dll_9F31BDC6684FEB0F.mvfrm
Library\Bee\artifacts\mvdfrm\UnityEngine.ClusterInputModule.dll_698B8219ABB5137F.mvfrm
Library\Bee\artifacts\mvdfrm\UnityEngine.ClusterRendererModule.dll_6911EB4097156732.mvfrm
Library\Bee\artifacts\mvdfrm\UnityEngine.ContentLoadModule.dll_0BECD609DA8FC9B4.mvfrm
Library\Bee\artifacts\mvdfrm\UnityEngine.CoreModule.dll_FB8F15325110BBAE.mvfrm
Library\Bee\artifacts\mvdfrm\UnityEngine.CrashReportingModule.dll_66D886B4EA226806.mvfrm
Library\Bee\artifacts\mvdfrm\UnityEngine.DirectorModule.dll_81E344024C31854B.mvfrm
Library\Bee\artifacts\mvdfrm\UnityEngine.dll_3A69DEF959D7DE87.mvfrm
Library\Bee\artifacts\mvdfrm\UnityEngine.DSPGraphModule.dll_8734A56BBE92566C.mvfrm
Library\Bee\artifacts\mvdfrm\UnityEngine.GameCenterModule.dll_74A8AA869C909EA6.mvfrm
Library\Bee\artifacts\mvdfrm\UnityEngine.GIModule.dll_AA45726E44E89491.mvfrm
Library\Bee\artifacts\mvdfrm\UnityEngine.GridModule.dll_D9003120696551A5.mvfrm
Library\Bee\artifacts\mvdfrm\UnityEngine.HotReloadModule.dll_D05BE548D1274CFB.mvfrm
Library\Bee\artifacts\mvdfrm\UnityEngine.ImageConversionModule.dll_D503E8F1193A1F26.mvfrm
Library\Bee\artifacts\mvdfrm\UnityEngine.IMGUIModule.dll_70A900325464A00C.mvfrm
Library\Bee\artifacts\mvdfrm\UnityEngine.InputLegacyModule.dll_041B97E7A3FED7B8.mvfrm
Library\Bee\artifacts\mvdfrm\UnityEngine.InputModule.dll_9EBF287C046B30CF.mvfrm
Library\Bee\artifacts\mvdfrm\UnityEngine.JSONSerializeModule.dll_3E3BAD824CE1501D.mvfrm
Library\Bee\artifacts\mvdfrm\UnityEngine.LocalizationModule.dll_A7D84C6C43310678.mvfrm
Library\Bee\artifacts\mvdfrm\UnityEngine.ParticleSystemModule.dll_B9EAD0015833F394.mvfrm
Library\Bee\artifacts\mvdfrm\UnityEngine.PerformanceReportingModule.dll_DB4E6FD100937E6D.mvfrm
Library\Bee\artifacts\mvdfrm\UnityEngine.Physics2DModule.dll_9BB9173396F1290E.mvfrm
Library\Bee\artifacts\mvdfrm\UnityEngine.PhysicsModule.dll_C1B706D6037BBA5C.mvfrm
Library\Bee\artifacts\mvdfrm\UnityEngine.ProfilerModule.dll_B4297D38E58B0C58.mvfrm
Library\Bee\artifacts\mvdfrm\UnityEngine.PropertiesModule.dll_A1E3E9C50F7C02E2.mvfrm
Library\Bee\artifacts\mvdfrm\UnityEngine.RuntimeInitializeOnLoadManagerInitializerModule.dll_98233FEC4FB5B5D7.mvfrm
Library\Bee\artifacts\mvdfrm\UnityEngine.ScreenCaptureModule.dll_58235B07614D7C7F.mvfrm
Library\Bee\artifacts\mvdfrm\UnityEngine.SharedInternalsModule.dll_591527C690681A76.mvfrm
Library\Bee\artifacts\mvdfrm\UnityEngine.SpriteMaskModule.dll_5DD51D16BE003420.mvfrm
Library\Bee\artifacts\mvdfrm\UnityEngine.SpriteShapeModule.dll_8C37AA23C1AF59D1.mvfrm
Library\Bee\artifacts\mvdfrm\UnityEngine.StreamingModule.dll_03A81493457BE8B7.mvfrm
Library\Bee\artifacts\mvdfrm\UnityEngine.SubstanceModule.dll_E05328DC90CEE6C5.mvfrm
Library\Bee\artifacts\mvdfrm\UnityEngine.SubsystemsModule.dll_C88283788C481C33.mvfrm
Library\Bee\artifacts\mvdfrm\UnityEngine.TerrainModule.dll_DBFD8244D93A034A.mvfrm
Library\Bee\artifacts\mvdfrm\UnityEngine.TerrainPhysicsModule.dll_BA6578D47176EE21.mvfrm
Library\Bee\artifacts\mvdfrm\UnityEngine.TextCoreFontEngineModule.dll_EC72F17A88C8D16C.mvfrm
Library\Bee\artifacts\mvdfrm\UnityEngine.TextCoreTextEngineModule.dll_345B27EC184C8A8A.mvfrm
Library\Bee\artifacts\mvdfrm\UnityEngine.TextRenderingModule.dll_8162CD121884FC74.mvfrm
Library\Bee\artifacts\mvdfrm\UnityEngine.TilemapModule.dll_7AF9E9C5F0F6E453.mvfrm
Library\Bee\artifacts\mvdfrm\UnityEngine.TLSModule.dll_B6BC6F203AE61430.mvfrm
Library\Bee\artifacts\mvdfrm\UnityEngine.UIElementsModule.dll_CCC0E4E08F74582A.mvfrm
Library\Bee\artifacts\mvdfrm\UnityEngine.UIModule.dll_0D7CC78E0580B223.mvfrm
Library\Bee\artifacts\mvdfrm\UnityEngine.UmbraModule.dll_B31E0CE41B59B79E.mvfrm
Library\Bee\artifacts\mvdfrm\UnityEngine.UnityAnalyticsCommonModule.dll_768D2D151A7C1CCB.mvfrm
Library\Bee\artifacts\mvdfrm\UnityEngine.UnityAnalyticsModule.dll_D98A40CB045B4590.mvfrm
Library\Bee\artifacts\mvdfrm\UnityEngine.UnityConnectModule.dll_D74E9112F4B54164.mvfrm
Library\Bee\artifacts\mvdfrm\UnityEngine.UnityCurlModule.dll_822FC87466082366.mvfrm
Library\Bee\artifacts\mvdfrm\UnityEngine.UnityTestProtocolModule.dll_C8F31844E747EAD4.mvfrm
Library\Bee\artifacts\mvdfrm\UnityEngine.UnityWebRequestAssetBundleModule.dll_835022200E071461.mvfrm
Library\Bee\artifacts\mvdfrm\UnityEngine.UnityWebRequestAudioModule.dll_534AC3AF86FE4905.mvfrm
Library\Bee\artifacts\mvdfrm\UnityEngine.UnityWebRequestModule.dll_E6A2F09B242EB9A5.mvfrm
Library\Bee\artifacts\mvdfrm\UnityEngine.UnityWebRequestTextureModule.dll_162E3429F753617A.mvfrm
Library\Bee\artifacts\mvdfrm\UnityEngine.UnityWebRequestWWWModule.dll_FF1D6D48080C46F6.mvfrm
Library\Bee\artifacts\mvdfrm\UnityEngine.VehiclesModule.dll_F9A63D81C65B54E6.mvfrm
Library\Bee\artifacts\mvdfrm\UnityEngine.VFXModule.dll_379B078F11537D9D.mvfrm
Library\Bee\artifacts\mvdfrm\UnityEngine.VideoModule.dll_5D52E53650C527D0.mvfrm
Library\Bee\artifacts\mvdfrm\UnityEngine.VirtualTexturingModule.dll_AEC318AE3CE998CC.mvfrm
Library\Bee\artifacts\mvdfrm\UnityEngine.VRModule.dll_604EEE13A73B379B.mvfrm
Library\Bee\artifacts\mvdfrm\UnityEngine.WindModule.dll_71DDF05AE2473A17.mvfrm
Library\Bee\artifacts\mvdfrm\UnityEngine.XRModule.dll_930DB118307584F9.mvfrm
Library\Bee\artifacts\mvdfrm\UnityEditor.WindowsStandalone.Extensions.dll_B59A1259D1F9144D.mvfrm
Library\Bee\artifacts\mvdfrm\Unity.Plastic.Antlr3.Runtime.dll_06567403B026473B.mvfrm
Library\Bee\artifacts\mvdfrm\Unity.Plastic.Newtonsoft.Json.dll_2AAE32905E8C08CA.mvfrm
Library\Bee\artifacts\mvdfrm\Unity.VisualScripting.IonicZip.dll_BE5647D59BA90757.mvfrm
Library\Bee\artifacts\mvdfrm\Unity.VisualScripting.YamlDotNet.dll_73B4528AAC4BDD55.mvfrm
Library\Bee\artifacts\mvdfrm\Unity.VisualScripting.TextureAssets.dll_0AD27BDE6D193B4D.mvfrm
Library\Bee\artifacts\mvdfrm\Unity.VisualScripting.Antlr3.Runtime.dll_2521796BDD14ED74.mvfrm