ConsumerId,AccountId
13492846,4271103
13493590,4271115
13492722,4271189
13493888,4271190
13493236,4271217
13493796,4271227
13444703,4271268
13278038,4271341
13494670,4271352
13492546,4271378
13261737,4271418
13495040,4271421
13474746,4271452
13495113,4271454
13491324,4271499
13494192,4271534
13479704,4271545
13495839,4271631
13495869,4271632
13495996,4271658
13495941,4271660
13496042,4271686
13496131,4271701
13496510,4271775
13496681,4271812
13496623,4271849
13453920,4272026
13497933,4272032
13497908,4272038
13498163,4272084
13497578,4272085
13492181,4272093
13498225,4272095
13498296,4272123
13484006,4272157
13484254,4272175
13498587,4272209
13481353,4272218
13496140,4272251
13498831,4272273
13498127,4272301
13481856,4272311
13495916,4272331
13497077,4272340
13498955,4272368
13499271,4272389
13499544,4272448
13490880,4272456
13470577,4272488
13499823,4272503
13500097,4272554
13500542,4272612
13500567,4272623
13500761,4272662
13500826,4272683
13501050,4272729
13501381,4272793
13499867,4272800
13501645,4272825
13490910,4272829
13501836,4272867
13501914,4272877
13502305,4272907
13502388,4272924
13502376,4272954
13502181,4272966
13502753,4273005
13502706,4273033
13485739,4273034
13487181,4273086
13482223,4273093
13467294,4273102
13503271,4273128
13503815,4273238
13502311,4273239
13500744,4273275
13504162,4273297
13504275,4273326
13504230,4273340
13494663,4273398
13501918,4273428
13505115,4273474
13505354,4273519
13488245,4273573
13505770,4273584
13505976,4273613
13453934,4273635
13506089,4273636
13506261,4273645
13476074,4273746
13506721,4273752
13506769,4273763
13278399,4273822
13505693,4273865
13507290,4273867
13507225,4273879
13507298,4273882
13507105,4273891
13507549,4273932
13507614,4273943
13507545,4273947
13507178,4274109
13508453,4274127
13508610,4274165
13508678,4274172
13508674,4274176
13508881,4274200
13509069,4274242
13509096,4274245
13490097,4274281
13509386,4274292
13509730,4274346
13508838,4274375
13510056,4274383
13510166,4274399
13501500,4274419
13509584,4274439
13296439,4274442
13510558,4274473
13506667,4274476
13510590,4274496
13510656,4274497
13510797,4274527
13506411,4274550
13468963,4274577
13507770,4274600
13506276,4274606
13503845,4274611
13511353,4274662
13415239,4274745
13379287,4274794
13512300,4274841
13512462,4274895
13512565,4274899
13513036,4274985
13513112,4274999
13513237,4275022
13513341,4275035
13513855,4275103
13512607,4275141
13513279,4275161
13514112,4275171
13503058,4275238
13514249,4275239
13514382,4275246
13514385,4275250
13514408,4275252
13514634,4275313
13514958,4275388
13515097,4275421
13515301,4275481
13515321,4275496
13515354,4275502
13492548,4275533
13515647,4275554
13515641,4275560
13515807,4275597
13419249,4275610
13516003,4275644
13516121,4275681
13516285,4275702
13481904,4275744
13515206,4275753
13499041,4275761
13516562,4275786
13516610,4275801
13516653,4275802
13516605,4275838
13495280,4275873
13516398,4275882
13517363,4275937
13400588,4275966
13513627,4276005
13515103,4276064
13498987,4276183
13518804,4276212
13518884,4276228
13519002,4276245
13498255,4276258
13519080,4276265
13519102,4276270
13519154,4276279
13519182,4276290
13295346,4276302
13517040,4276323
13519362,4276344
13519479,4276370
13371537,4276372
13519583,4276387
13519656,4276390
13519826,4276464
13520057,4276484
13519883,4276493
13520101,4276513
13520232,4276525
13520133,4276531
13520392,4276563
13520481,4276582
13518409,4276586
13520470,4276590
13519523,4276606
13519414,4276630
13474512,4276648
13520890,4276669
13521110,4276709
13521104,4276715
13521212,4276751
13504180,4276764
13521608,4276788
13519088,4276810
13522222,4276878
13521344,4276901
13522372,4276909
13522388,4276915
13522472,4276926
13522639,4276967
13522663,4277000
13522867,4277011
13522878,4277015
13523145,4277072
13522038,4277077
13520873,4277090
13523129,4277176
13523614,4277179
13523894,4277250
13523674,4277253
13519116,4277281
13524039,4277285
13524007,4277294
13451269,4277315
13524090,4277317
13524506,4277398
13524389,4277403
13450067,4277495
13287866,4277499
13525073,4277532
13525065,4277657
13525794,4277664
13525979,4277687
13526304,4277733
13526437,4277776
13524773,4277822
13525170,4277839
13513425,4277841
13526500,4277873
13526863,4277886
13300805,4277913
13492027,4277940
13527035,4277955
13527200,4277958
13527551,4278052
13518610,4278107
13520468,4278131
13526776,4278153
13518423,4278231
13487368,4278258
13528421,4278271
13519015,4278278
13528425,4278296
13528869,4278338
13528945,4278345
13526246,4278366
13525492,4278425
13529371,4278442
13524766,4278449
13529408,4278450
13337259,4278453
13529439,4278487
13514961,4278529
13530037,4278582
13530051,4278583
13530084,4278586
13530189,4278604
13529049,4278626
13530722,4278649
13530780,4278660
13431389,4278679
13530456,4278681
13530465,4278688
13530172,4278689
13530419,4278695
13530874,4278697
13523828,4278726
13530974,4278731
13531043,4278749
13531026,4278763
13531157,4278771
13531122,4278774
13531193,4278784
13515773,4278795
13531268,4278808
13531399,4278831
13514453,4278876
13521075,4278900
13531627,4278904
13531702,4278924
13531729,4278945
13531722,4278960
13531867,4278965
13531951,4278989
13529934,4279016
13532374,4279105
13491639,4279142
13532562,4279159
13532560,4279167
13479409,4279185
13532811,4279211
13532838,4279228
13533002,4279256
13532929,4279276
13516571,4279278
13533080,4279283
13533566,4279374
13533663,4279389
13533659,4279390
13533850,4279443
13528823,4279473
13534230,4279489
13534411,4279526
13534510,4279534
13534673,4279561
13534780,4279599
13534609,4279600
13528065,4279614
13534994,4279622
13535014,4279629
13534541,4279633
13534695,4279650
13501094,4279653
13535215,4279701
13535142,4279751
13535347,4279757
13533688,4279772
13535176,4279773
13534490,4279774
13479899,4279777
13535474,4279799
13535626,4279838
13535804,4279869
13535874,4279886
13536128,4279966
13536139,4279976
13536234,4279993
13536060,4280022
13533444,4280059
13536607,4280102
13536767,4280117
13529558,4280131
13536849,4280136
13536967,4280163
13537611,4280304
13537868,4280308
13538055,4280328
13498999,4280377
13538206,4280389
13380292,4280395
13538513,4280401
13538073,4280404
13538233,4280411
13538153,4280418
13538702,4280433
13538762,4280449
13538678,4280453
13538512,4280461
13538592,4280469
13538590,4280522
13538780,4280524
13538887,4280547
13527290,4280568
13539174,4280583
13539595,4280627
13538922,4280631
13539659,4280635
13538989,4280650
13539143,4280657
13539290,4280658
13539761,4280660
13539734,4280672
13396307,4280689
13539464,4280741
13539475,4280751
13539904,4280769
13525048,4280805
13540161,4280809
13540245,4280825
13539954,4280851
13540361,4280856
13540448,4280860
13540480,4280867
13540531,4280871
13540679,4280912
13540881,4280922
13540950,4280928
13540997,4280935
13541157,4280955
13541133,4280957
13540436,4280973
13541329,4280980
13540674,4280981
13540046,4280984
13540924,4280986
13540956,4280988
13541442,4280995
13541444,4280997
13537079,4280998
13541553,4281005
13541619,4281010
13541626,4281011
13541487,4281016
13428041,4281104
13542091,4281115
13541785,4281128
13495637,4281139
13541937,4281152
13542201,4281178
13542211,4281195
13542461,4281208
13542628,4281221
13542403,4281226
13542850,4281276
13543449,4281413
13543474,4281418
13543546,4281445
13543587,4281449
13542551,4281454
13543669,4281469
13544191,4281604
13544215,4281610
13544328,4281643
13544472,4281664
13544544,4281686
13510042,4281687
13540844,4281703
13544706,4281720
13544690,4281738
13544781,4281743
13544835,4281747
13530541,4281809
13533518,4281813
13545383,4281819
13539194,4281825
13542996,4281833
13544684,4281850
13545555,4281864
13545505,4281865
13519594,4281877
13545508,4281886
13545806,4281888
13546012,4281902
13545698,4281915
13545785,4281966
13546214,4282008
13532441,4282027
13546413,4282041
13529878,4282051
13545576,4282096
13527566,4282108
13545539,4282113
13348148,4282123
13540703,4282156
13546686,4282176
13540315,4282178
13539930,4282189
13489119,4282233
13542174,4282259
13547300,4282261
13547359,4282284
13547399,4282289
13537248,4282290
13547458,4282296
13547411,4282300
13547425,4282303
13547597,4282329
13547735,4282377
13547849,4282396
13547910,4282399
13548156,4282456
13538126,4282498
13548238,4282589
13549165,4282632
13549207,4282633
13549596,4282673
13549714,4282697
13548722,4282712
13518938,4282715
13548376,4282738
13549730,4282751
13540524,4282800
13550219,4282820
13550214,4282821
13550083,4282822
13550258,4282838
13550296,4282848
13550412,4282863
13549850,4282867
13513324,4282886
13550618,4282909
13442539,4282911
13551018,4282989
13551060,4283000
13550561,4283067
13551405,4283072
13549163,4283118
13550852,4283131
13551578,4283139
13549851,4283143
13551818,4283190
13551878,4283193
13551921,4283211
13552281,4283280
13544096,4283293
13550942,4283301
13552399,4283308
13552321,4283319
13572780,4283374
13538952,4283379
13572809,4283381
13572946,4283406
13551080,4283452
13573329,4283461
13573546,4283481
13573563,4283487
13573045,4283504
13573744,4283531
13551888,4283539
13453112,4283562
13548707,4283565
13573339,4283566
13573910,4283593
13572870,4283606
13511713,4283636
13574174,4283643
13574210,4283648
13552442,4283708
13551925,4283736
13574752,4283800
13575093,4283869
13575210,4283900
13575524,4283988
13575719,4284077
13572806,4284105
13535544,4284114
13575901,4284144
13576181,4284149
13576173,4284151
13576188,4284159
13576124,4284188
13576503,4284238
13551941,4284245
13576374,4284246
13576484,4284249
13575910,4284266
13574399,4284279
13576293,4284314
13374313,4284322
13461453,4284323
13514707,4284337
13577175,4284376
13577165,4284383
13577290,4284399
13552591,4284404
13577962,4284492
13574550,4284510
13578244,4284548
13578311,4284561
13578569,4284642
13574986,4284658
13578841,4284702
13579195,4284786
13579293,4284805
13579387,4284823
13579329,4284838
13579621,4284879
13576531,4284892
13579683,4284925
13521183,4284971
13580025,4284988
13580107,4285010
13580091,4285013
13543596,4285026
13580324,4285064
13580489,4285105
13580075,4285124
13580508,4285126
13580639,4285142
13505529,4285171
13580893,4285194
13580959,4285206
13580975,4285210
13341754,4285228
13581199,4285259
13581206,4285261
13581671,4285319
13580957,4285322
13582173,4285397
13582096,4285398
13579282,4285408
13582227,4285410
13582440,4285456
13582459,4285464
13582565,4285486
13582593,4285503
13582713,4285528
13582373,4285542
13582860,4285547
13582483,4285568
13576961,4285602
13583231,4285626
13583274,4285636
13583117,4285640
13582367,4285644
13544625,4285674
13583418,4285676
13505123,4285683
13583538,4285722
13583676,4285745
13583639,4285747
13583805,4285773
13583948,4285810
13583979,4285828
13584083,4285848
13584403,4285913
13584458,4285929
13584467,4285931
13584521,4285937
13584500,4285941
13584541,4285947
13584730,4285982
13584765,4285985
13584704,4286007
13585135,4286036
13585314,4286060
13585289,4286061
13584864,4286098
13585785,4286116
13585311,4286117
13585346,4286119
13585927,4286152
13585947,4286156
13585697,4286166
13586577,4286308
13586762,4286324
13539179,4286396
13586445,4286423
13587205,4286432
13587534,4286494
13587487,4286502
13586875,4286517
13587176,4286528
13587714,4286537
13587763,4286550
13587518,4286558
13364040,4286569
13588058,4286610
13474251,4286646
13482545,4286649
13588341,4286674
13588528,4286716
13588699,4286751
13589057,4286802
13589091,4286807
13588217,4286852
13588952,4286877
13574344,4286892
13588470,4286905
13586108,4286910
13586489,4286911
13588552,4286923
13586440,4286928
13588518,4286931
13586998,4286934
13588638,4286938
13574339,4286940
13587291,4286947
13512540,4286950
13587449,4286951
13588781,4286986
13588852,4286994
13590079,4287001
13491904,4287003
13590088,4287006
13513331,4287016
13336703,4287022
13590172,4287027
13552418,4287031
13590181,4287032
13586617,4287059
13583530,4287081
13590121,4287084
13590417,4287100
13590673,4287153
13585636,4287193
13590815,4287194
13590892,4287268
13591102,4287271
13580481,4287288
13591249,4287295
13580525,4287296
13577945,4287304
13588505,4287322
13590089,4287324
13591529,4287368
13588554,4287392
13588841,4287412
13590957,4287431
13591797,4287446
13592011,4287490
13592088,4287512
13592209,4287541
13592234,4287543
13592215,4287553
13452833,4287555
13592267,4287558
13592279,4287567
13592382,4287578
13592472,4287595
13587747,4287611
13592969,4287678
13592914,4287679
13524154,4287728
13591946,4287747
13593607,4287759
13492866,4287770
13585832,4287849
13593957,4287852
13590124,4287855
13583758,4287861
13593925,4287867
13592216,4287900
13582864,4287904
13584233,4287956
13594405,4287968
13594496,4287998
13594691,4288031
13594700,4288035
13593839,4288070
13576355,4288104
13595117,4288106
13595139,4288113
13595217,4288125
13595235,4288154
13595411,4288178
13595456,4288183
13587465,4288190
13595440,4288200
13595614,4288228
13595746,4288258
13595763,4288260
13595197,4288365
13596325,4288375
13596229,4288383
13596425,4288394
13470188,4288397
13533559,4288403
13596478,4288411
13596846,4288462
13593311,4288518
13591105,4288559
13596432,4288567
13592591,4288575
13582202,4288578
13597637,4288589
13596880,4288604
13597720,4288606
13494011,4288661
13597920,4288668
13598067,4288692
13597845,4288704
13575272,4288708
13597776,4288718
13598196,4288731
13594764,4288780
13546004,4288806
13544602,4288819
13598593,4288829
13537324,4288869
13482089,4288907
13592938,4288911
13598578,4288921
13597839,4288937
13599054,4288939
13599118,4288959
13598552,4288979
13599276,4289005
13599366,4289009
13598858,4289031
13599504,4289038
13596449,4289039
13599501,4289044
13599600,4289061
13599566,4289069
13599691,4289078
13599704,4289084
13413812,4289108
13599984,4289149
13600089,4289181
13600060,4289182
13600098,4289203
13599962,4289220
13598218,4289229
13449840,4289247
13600406,4289255
13598810,4289286
13599820,4289326
13600980,4289347
13601038,4289353
13601453,4289422
13601560,4289426
13600384,4289433
13584952,4289434
13600935,4289438
13588261,4289443
13597849,4289446
13393578,4289464
13601094,4289467
13600721,4289472
13597972,4289473
13600769,4289480
13590435,4289482
13601747,4289485
13600489,4289496
13599686,4289506
13598954,4289507