[
    {
        "name": "manoj",
        "nickName": "test",
        "DOB": "1/2/2002",
        "hobbies": "gaming",
        "id": "f5ca56c1-d2e5-4d93-afd1-ca1f05491c1c"
    },
    {
        "name": "kamal",
        "nickName": "test",
        "DOB": "1/2/2002",
        "hobbies": "gaim",
        "id": "5c333629-5d71-447a-aea3-723ec73eea60"
    }
]