{
  "noBuddiesError": "No buddies present",
  "noBuddyWithIdError": "No buddy with that id is found",
  "noBuddyWithNameError": "No buddy with that name is found",
  "buddyWithSameNameExistsError": "An buddy with the same name already exists"
}
