<?xml version="1.0" encoding="UTF-8"?>
<session version="1.0">
<refactoring accessors="true" comment="Delete element from project &apos;CucumberProject&apos;&#x0A;- Original project: &apos;CucumberProject&apos;&#x0A;- Original element: &apos;com&apos;" description="Delete element" element1="src/test/resources/com" elements="0" flags="589830" id="org.eclipse.jdt.ui.delete" resources="1" stamp="1674105870001" subPackages="false" version="1.0"/>
</session>