
--Response 
HTTP/1.1 200 OK
Date: Wed, 07 Apr 2021 13:56:38 GMT
Content-Length: 0000002957
Content-Type: text/html
X-Cache: MISS from 10.10.30.96
X-Cache-Lookup: MISS from 10.10.30.96:3128
Via: 1.1 10.10.30.96 (squid/3.5.12)
Connection: keep-alive
----

--Response 
HTTP/1.1 200 OK
Date: Wed, 07 Apr 2021 13:56:38 GMT
Content-Length: 16522
Content-Type: image/gif
X-Cache: MISS from 10.10.30.96
X-Cache-Lookup: MISS from 10.10.30.96:3128
Via: 1.1 10.10.30.96 (squid/3.5.12)
Connection: keep-alive
----

--Response 
HTTP/1.1 200 OK
Date: Wed, 07 Apr 2021 13:56:38 GMT
Content-Length: 4125
Content-Type: image/gif
X-Cache: MISS from 10.10.30.96
X-Cache-Lookup: MISS from 10.10.30.96:3128
Via: 1.1 10.10.30.96 (squid/3.5.12)
Connection: keep-alive
----

--Response 
HTTP/1.1 200 OK
Date: Wed, 07 Apr 2021 13:56:38 GMT
Content-Length: 1323
Content-Type: image/gif
X-Cache: MISS from 10.10.30.96
X-Cache-Lookup: MISS from 10.10.30.96:3128
Via: 1.1 10.10.30.96 (squid/3.5.12)
Connection: keep-alive
----

--Response 
HTTP/1.1 200 OK
Date: Wed, 07 Apr 2021 13:56:38 GMT
Content-Length: 22548
Content-Type: image/jpeg
X-Cache: MISS from 10.10.30.96
X-Cache-Lookup: MISS from 10.10.30.96:3128
Via: 1.1 10.10.30.96 (squid/3.5.12)
Connection: keep-alive
----

--Response 
HTTP/1.1 200 OK
Date: Wed, 07 Apr 2021 13:56:38 GMT
Content-Length: 2018
Content-Type: image/gif
X-Cache: MISS from 10.10.30.96
X-Cache-Lookup: MISS from 10.10.30.96:3128
Via: 1.1 10.10.30.96 (squid/3.5.12)
Connection: keep-alive
----

