
--Response 
HTTP/1.1 200
status: 200
date: Fri, 21 May 2021 08:19:02 GMT
content-type: text/plain; charset=UTF-8
content-length: 1
access-control-allow-origin: *
----

--Response 
HTTP/1.1 302
status: 302
date: Fri, 21 May 2021 08:19:02 GMT
content-length: 0
location: https://i.liadm.com/s/35637?bidder_id=100905&amp;bidder_uuid=164570703793000811338
server: AAWebServer
p3p: policyref=\"https://www.agkn.com/p3p/p3p.xml\",CP=\"NOI NID\"
cache-control: no-cache, no-store, must-revalidate
pragma: no-cache
expires: 0
set-cookie: ab=0001%3AvBzILW1GW1RBxigHc0ZMGc11S5Hhu4AL; Domain=.agkn.com; Secure; SameSite=None; Expires=Fri,  21 May 2022 08:19:02 GMT; Path=/
----

--Response 
HTTP/1.1 302
status: 302
set-cookie: ssi=2d51d0d9-fb43-4b72-8010-2804946b34bf#1621585142851; Domain=.sitescout.com; Expires=Sat, 21-May-2022 08:19:02 GMT; Path=/; Secure; SameSite=None
location: https://pixel-sync.sitescout.com/dmp/pixelSync?cookieQ=1&nid=12&rurl=https%3A%2F%2Fi.liadm.com%2Fs%2F35758%3Fbidder_id%3D2380%26bidder_uuid%3D%7BuserId%7D
content-length: 0
date: Fri, 21 May 2021 08:19:02 GMT
server: AC1.1
----

--Response 
HTTP/1.1 204
status: 204
server: nginx
date: Fri, 21 May 2021 08:19:02 GMT
cache-control: no-cache
x-powered-by: Undertow/1
p3p: policyref=/w3c/p3p.xml, CP=NOI DSP COR NID CURa ADMa DEVa PSAa PSDa OUR BUS COM INT OTC PUR STA
p3p: policyref=/w3c/p3p.xml, CP=NOI DSP COR NID CURa ADMa DEVa PSAa PSDa OUR BUS COM INT OTC PUR STA
access-control-allow-credentials: true
----

--Response 
HTTP/1.1 302
status: 302
cache-control: max-age=0,no-cache,no-store
pragma: no-cache
expires: Tue, 11 Oct 1977 12:34:56 GMT
p3p: CP=\"NON DEVa PSAa PSDa OUR NOR NAV\",policyref=\"/w3c/p3p.xml\"
set-cookie: ssi=2d51d0d9-fb43-4b72-8010-2804946b34bf#1621585142851; Domain=.sitescout.com; Expires=Sat, 21-May-2022 08:19:03 GMT; Path=/; Secure; SameSite=None
set-cookie: _ssuma=eyI0OSI6MTYyMTU4NTE0MzAxN30; Domain=.sitescout.com; Expires=Sun, 20-Jun-2021 08:19:03 GMT; Path=/; Secure; SameSite=None
location: https://i.liadm.com/s/35758?bidder_id=2380&bidder_uuid=2d51d0d9-fb43-4b72-8010-2804946b34bf-60a76cf6-494e
content-length: 0
date: Fri, 21 May 2021 08:19:02 GMT
server: AC1.1
----

--Response 
HTTP/1.1 200 OK
Cache-Control: no-store
Content-Type: image/gif
Date: Fri, 21 May 2021 08:19:02 GMT
Set-Cookie: lidid=51e452ef-39b5-42e8-b7ed-83178ae8eaea; Max-Age=63072000; Expires=Sun, 21 May 2023 08:19:02 GMT; Path=/; Domain=liadm.com
Strict-Transport-Security: max-age=31536000; includeSubDomains
trace-id: 09ac557e4b5b6957
Content-Length: 43
Connection: keep-alive
----

--Response 
HTTP/1.1 302
status: 302
date: Fri, 21 May 2021 08:19:03 GMT
content-length: 0
location: https://i.liadm.com/s/19948?bidder_id=178256&bidder_uuid=a62186e477e7c8816c7ab52ec28b8769
server: nginx
pragma: no-cache
cache-control: max-age=0, no-cache, no-store, private, must-revalidate, s-maxage=0
expires: Thu, 01 Jan 1970 00:00:00 GMT
set-cookie: sessionid=h-a62186e477e7c8816c7ab52ec28b8769_t-1621585018; Domain=.rkdms.com; Expires=Sat, 21-May-2022 14:07:49 GMT; Path=/; SameSite=None; secure
set-cookie: sc=13%3A91040; Domain=.rkdms.com; Expires=Sat, 21-May-2022 14:07:49 GMT; Path=/; SameSite=None; secure
----

--Response 
HTTP/1.1 200 OK
Cache-Control: no-store
Content-Type: image/gif
Date: Fri, 21 May 2021 08:19:03 GMT
Set-Cookie: lidid=51e452ef-39b5-42e8-b7ed-83178ae8eaea; Max-Age=63072000; Expires=Sun, 21 May 2023 08:19:03 GMT; Path=/; Domain=liadm.com
Strict-Transport-Security: max-age=31536000; includeSubDomains
trace-id: 81a9771b4c335a36
Content-Length: 43
Connection: keep-alive
----

--Response 
HTTP/1.1 302 Found
Content-Type: text/html; charset=utf-8
Content-Length: 312
Cache-Control: no-cache, no-store, must-revalidate
Expires: Thu, 01 Dec 1994 16:00:00 GMT
Location: https://stags.bluekai.com/site/23178?id=UELIl_hC4nHu4t6Bs09O&redir=https%3A%2F%2Fb1sync.zemanta.com%2Fusersync%2Fbluekai%2Fcallback%2F%3Fd%3DF4XWSLTMNFQWI3JOMNXW2L3TF4ZTKMBQGQ7WE2LEMRSXEX3JMQ6TSOBSGU2CMYTJMRSGK4S7OV2WSZB5KVCUYSLML5UEGNDOJB2TI5BWIJZTAOKPEZSXQY3IMFXGOZJ5NRUXMZLJNZ2GK3TU
P3p: CP=\"We do not support P3P header.\"
Pragma: no-cache
Set-Cookie: zuid=UELIl_hC4nHu4t6Bs09O; Path=/; Domain=zemanta.com; Expires=Sat, 21 May 2022 08:19:03 GMT; Max-Age=31536000
Date: Fri, 21 May 2021 08:19:03 GMT
----

--Response 
HTTP/1.1 303 See Other
Date: Fri, 21 May 2021 08:19:03 GMT
Location: https://x.bidswitch.net/sync?dsp_id=42&user_id=
Set-Cookie: _li_ss=MgUIBhC-DzIFCAoQvg8yBQh6EL0PMgYIiwEQvg8yBQgLEL4PMgUICxC-DzIFCHkQvQ8yCQj_____BxC-DzIGCIEBEL0PMgUICRC-DzIFCHsQvQ8yBgiIARC-DzIGCIYBEL0PMgUIDRCwDw; Max-Age=2592000; Expires=Sun, 20 Jun 2021 08:19:03 GMT; Path=/s
Set-Cookie: lidid=51e452ef-39b5-42e8-b7ed-83178ae8eaea; Max-Age=63072000; Expires=Sun, 21 May 2023 08:19:03 GMT; Path=/; Domain=liadm.com
Strict-Transport-Security: max-age=31536000; includeSubDomains
trace-id: d9bcdd2a7b8a73e2
Content-Length: 0
Connection: keep-alive
----

--Response 
HTTP/1.1 302 Moved Temporarily
Content-Length: 0
P3P: CP=\"NOI DSP COR CUR ADMo DEVo PSAo PSDo OUR SAMo BUS UNI NAV\", policyref=\"http://tags.bluekai.com/w3c/p3p.xml\"
Pragma: no-cache
Expires: Thu, 01 Dec 1994 16:00:00 GMT
Cache-Control: max-age=0, no-cache, no-store
Location: https://b1sync.zemanta.com/usersync/bluekai/callback/?d=F4XWSLTMNFQWI3JOMNXW2L3TF4ZTKMBQGQ7WE2LEMRSXEX3JMQ6TSOBSGU2CMYTJMRSGK4S7OV2WSZB5KVCUYSLML5UEGNDOJB2TI5BWIJZTAOKPEZSXQY3IMFXGOZJ5NRUXMZLJNZ2GK3TU
BK-Server: 5dbe
Date: Fri, 21 May 2021 08:19:03 GMT
Connection: keep-alive
Set-Cookie: bkpa=; expires=Sat, 16-Jan-2016 00:00:00 GMT; path=/; domain=.bluekai.com; SameSite=None; Secure
Set-Cookie: bku=53R99wjLoteBT+1X; expires=Wed, 17-Nov-2021 08:19:03 GMT; path=/; domain=.bluekai.com; SameSite=None; Secure
----

