
--Response 
HTTP/1.1 200
status: 200
ede-bundle_params: {\"channelId\":\"WebStore\",\"pageId\":\"PDP\",\"executedInfoList\":[{\"placementId\":\"Horizontal1\",\"departmentName\":\"\",\"category\":\"\",\"subCategory\":\"\",\"bundleId\":\"1156\",\"placementRevision\":\"1618508414104\",\"bundleRevision\":\"1621435095099\",\"kiraRevision\":\"1581439416680\",\"uuid\":\"8a3bd8d4-f370-49ba-923b-9f7c761f035e\",\"infoMeta\":{\"type\":\"FlatRec\"},\"infoPayload\":{\"executedAlgorithmsInfo\":{\"executedAlgorithmInfoList\":[{\"algorithmId\":\"299\",\"ccpParametersUsed\":[\"productNumbers\"],\"isPersonalized\":false}],\"contextBasedOptimized\":false,\"autoOptimized\":false,\"optimizedMetric\":\"None\"},\"executedRulesInfo\":{\"executedRuleInfoList\":[{\"ruleId\":\"1\",\"ruleType\":\"BURY\"},{\"ruleId\":\"283\",\"ruleType\":\"DO_NOT_RECOMMEND\"}],\"backfillDisabledFromRule\":false},\"isAb\":false,\"abTestId\":\"\",\"currentAbVariationId\":\"\",\"recGenerationCycleStatus\":{\"recGenerationCycleMask\":71468390023232,\"requestId\":\"b323519f-2de7-4e52-ab92-4e7f01ddf971\"}}},{\"placementId\":\"Horizontal2\",\"departmentName\":\"\",\"category\":\"\",\"subCategory\":\"\",\"bundleId\":\"1311\",\"placementRevision\":\"1621456685796\",\"bundleRevision\":\"1619724784478\",\"kiraRevision\":\"1592808373655\",\"uuid\":\"811b2539-ea20-45a2-99ec-9a92880b14fd\",\"infoMeta\":{\"type\":\"FlatRec\"},\"infoPayload\":{\"executedAlgorithmsInfo\":{\"executedAlgorithmInfoList\":[{\"algorithmId\":\"281\",\"ccpParametersUsed\":[\"productNumbers\"],\"isPersonalized\":false}],\"contextBasedOptimized\":false,\"autoOptimized\":false,\"optimizedMetric\":\"None\"},\"executedRulesInfo\":{\"executedRuleInfoList\":[{\"ruleId\":\"1\",\"ruleType\":\"BURY\"},{\"ruleId\":\"283\",\"ruleType\":\"DO_NOT_RECOMMEND\"}],\"backfillDisabledFromRule\":false},\"isAb\":false,\"abTestId\":\"\",\"currentAbVariationId\":\"\",\"recGenerationCycleStatus\":{\"recGenerationCycleMask\":71468255805504,\"requestId\":\"b323519f-2de7-4e52-ab92-4e7f01ddf971\"}}},{\"placementId\":\"Horizontal3\",\"departmentName\":\"\",\"category\":\"\",\"subCategory\":\"\",\"bundleId\":\"1275\",\"placementRevision\":\"1618506077256\",\"bundleRevision\":\"1618501499036\",\"kiraRevision\":\"1599841110782\",\"uuid\":\"a2c0bcf4-2c33-48fa-9eb0-b3ca541d17be\",\"infoMeta\":{\"type\":\"FlatRec\"},\"infoPayload\":{\"executedAlgorithmsInfo\":{\"executedAlgorithmInfoList\":[{\"algorithmId\":\"817\",\"ccpParametersUsed\":[\"rvProductNumbers\"],\"isPersonalized\":false}],\"contextBasedOptimized\":false,\"autoOptimized\":false,\"optimizedMetric\":\"None\"},\"executedRulesInfo\":{\"executedRuleInfoList\":[{\"ruleId\":\"1\",\"ruleType\":\"BURY\"},{\"ruleId\":\"283\",\"ruleType\":\"DO_NOT_RECOMMEND\"}],\"backfillDisabledFromRule\":false},\"isAb\":false,\"abTestId\":\"\",\"currentAbVariationId\":\"\",\"recGenerationCycleStatus\":{\"recGenerationCycleMask\":71468256854080,\"requestId\":\"b323519f-2de7-4e52-ab92-4e7f01ddf971\"}}}]}
access-control-allow-origin: *
access-control-expose-headers: EDE-AB_VAR_PARAMS, EDE-BUNDLE_PARAMS, Content-Type
content-type: application/json
vary: Accept-Encoding
content-encoding: gzip
date: Fri, 21 May 2021 07:36:39 GMT
content-length: 4198
server-timing: cdn-cache; desc=MISS
server-timing: edge; dur=252
server-timing: origin; dur=66
fwdhst: origin-ede-gcp-central-blue.kohls.com
set-cookie: akacd_EDE_GCP=2177452799~rv=78~id=a8631ebcf4be580519f241d421091fb3; path=/; Expires=Mon, 31 Dec 2038 23:59:59 GMT; Secure; SameSite=None
akamai-request-id2: 104.77.173.149:58e5c424
----

--Response 
HTTP/1.1 200
status: 200
cache-control: no-cache,no-store,must-revalidate,max-age=0
pragma: no-cache
expires: Sat, 01 Jan 2000 00:00:00 GMT
x-envoy-upstream-service-time: 3
server: envoy
x-pinterest-rid: 3316875837799594
accept-ranges: bytes
date: Fri, 21 May 2021 07:36:39 GMT
via: 1.1 varnish
x-served-by: cache-del21732-DEL
x-cache: MISS
x-cache-hits: 0
x-timer: S1621582600.670538,VS0,VE276
access-control-allow-origin: *
access-control-allow-methods: GET, POST, OPTIONS
access-control-max-age: 86400
content-length: 0
----

--Response 
HTTP/1.1 200 OK
Cache-Control: no-cache, no-transform, must-revalidate, max-age=0
Content-Type: image/gif
Date: Fri, 21 May 2021 07:36:39 GMT
Expires: -1
P3P: policyref=\"/w3c/p3p.xml\", CP=\"ADMa OUR IND DSP NON COR\"
Server: nginx/1.12.1
Set-Cookie: BVID=e537eedb-5491-4e0f-9e45-95b5731a4a0c;Version=1;Domain=.network.bazaarvoice.com;Max-Age=31536000;Expires=Sat, 21 May 2022 07:36:39 GMT;Secure;SameSite=None
Set-Cookie: BVSID=3cd6451d-ef9f-483c-9e1a-048ebdde220b;Version=1;Domain=.network.bazaarvoice.com;Max-Age=1800;Expires=Fri, 21 May 2021 08:06:39 GMT;Secure;SameSite=None
Content-Length: 43
Connection: keep-alive
----

--Response 
HTTP/1.1 200
status: 200
server: Apache
x-runtime-version: 2020.7.2.476
content-type: application/x-javascript;charset=utf-8
cache-control: max-age=43200
content-encoding: gzip
via: 1.1 varnish, 1.1 varnish
accept-ranges: bytes
date: Fri, 21 May 2021 07:36:40 GMT
x-served-by: cache-lga21983-LGA, cache-del21722-DEL
x-cache: HIT, HIT
x-cache-hits: 184, 56
x-timer: S1621582600.010030,VS0,VE0
vary: Accept-Encoding
content-length: 4261
----

--Response 
HTTP/1.1 200 OK
Cache-Control: no-cache, no-transform, must-revalidate, max-age=0
Content-Type: image/gif
Date: Fri, 21 May 2021 07:36:39 GMT
Expires: -1
P3P: policyref=\"/w3c/p3p.xml\", CP=\"ADMa OUR IND DSP NON COR\"
Server: nginx/1.12.1
Set-Cookie: BVID=e537eedb-5491-4e0f-9e45-95b5731a4a0c;Version=1;Domain=.network.bazaarvoice.com;Max-Age=31536000;Expires=Sat, 21 May 2022 07:36:39 GMT;Secure;SameSite=None
Set-Cookie: BVSID=3cd6451d-ef9f-483c-9e1a-048ebdde220b;Version=1;Domain=.network.bazaarvoice.com;Max-Age=1800;Expires=Fri, 21 May 2021 08:06:39 GMT;Secure;SameSite=None
Content-Length: 43
Connection: keep-alive
----

--Response 
HTTP/1.1 200
status: 200
date: Fri, 21 May 2021 07:36:39 GMT
content-type: text/plain;charset=utf-8
content-length: 33
set-cookie: AWSALB=sHB+uWBGdeyQIhUmwXajxZRXraIP1f1Aymh1s7qbYfHzrIi5z2Kc8kkU36Nr7zJ3f1umaoq2QDZojs+hqna8n+boSyOx/z0H6uxIBCH0FlvTwzE7L0DxHDEhVj/J; Expires=Fri, 28 May 2021 07:36:39 GMT; Path=/
set-cookie: AWSALBCORS=sHB+uWBGdeyQIhUmwXajxZRXraIP1f1Aymh1s7qbYfHzrIi5z2Kc8kkU36Nr7zJ3f1umaoq2QDZojs+hqna8n+boSyOx/z0H6uxIBCH0FlvTwzE7L0DxHDEhVj/J; Expires=Fri, 28 May 2021 07:36:39 GMT; Path=/; SameSite=None; Secure
x-xss-protection: 1; mode=block
strict-transport-security: max-age=31536000; includeSubDomains
x-content-type-options: nosniff
x-frame-options: DENY
content-security-policy: default-src 'self';
access-control-allow-origin: *
access-control-allow-headers: apikey
----

--Response 
HTTP/1.1 200 OK
Server: nginx
Content-Type: application/javascript; charset=utf-8
Last-Modified: Thu, 10 Oct 2019 22:08:16 GMT
ETag: \"65b8cb09dc193bdece1c4f60f0729362\"
x-amz-server-side-encryption: AES256
x-amz-version-id: null
P3P: CP=NOI DSP COR NID
Content-Encoding: gzip
Content-Length: 311
Cache-Control: max-age=31536000
Date: Fri, 21 May 2021 07:36:32 GMT
Vary: Accept-Encoding
----

--Response 
HTTP/1.1 200 OK
Cache-Control: no-cache, no-transform, must-revalidate, max-age=0
Content-Type: image/gif
Date: Fri, 21 May 2021 07:36:39 GMT
Expires: -1
P3P: policyref=\"/w3c/p3p.xml\", CP=\"ADMa OUR IND DSP NON COR\"
Server: nginx/1.12.1
Set-Cookie: BVID=e537eedb-5491-4e0f-9e45-95b5731a4a0c;Version=1;Domain=.network.bazaarvoice.com;Max-Age=31536000;Expires=Sat, 21 May 2022 07:36:39 GMT;Secure;SameSite=None
Set-Cookie: BVSID=3cd6451d-ef9f-483c-9e1a-048ebdde220b;Version=1;Domain=.network.bazaarvoice.com;Max-Age=1800;Expires=Fri, 21 May 2021 08:06:39 GMT;Secure;SameSite=None
Content-Length: 43
Connection: keep-alive
----

--Response 
HTTP/1.1 200 OK
Cache-Control: no-cache, no-transform, must-revalidate, max-age=0
Content-Type: image/gif
Date: Fri, 21 May 2021 07:36:39 GMT
Expires: -1
P3P: policyref=\"/w3c/p3p.xml\", CP=\"ADMa OUR IND DSP NON COR\"
Server: nginx/1.12.1
Set-Cookie: BVID=e537eedb-5491-4e0f-9e45-95b5731a4a0c;Version=1;Domain=.network.bazaarvoice.com;Max-Age=31536000;Expires=Sat, 21 May 2022 07:36:39 GMT;Secure;SameSite=None
Set-Cookie: BVSID=3cd6451d-ef9f-483c-9e1a-048ebdde220b;Version=1;Domain=.network.bazaarvoice.com;Max-Age=1800;Expires=Fri, 21 May 2021 08:06:39 GMT;Secure;SameSite=None
Content-Length: 43
Connection: keep-alive
----

--Response 
HTTP/1.1 200
status: 200
p3p: policyref=\"https://googleads.g.doubleclick.net/pagead/gcn_p3p_.xml\", CP=\"CURa ADMa DEVa TAIo PSAo PSDo OUR IND UNI PUR INT DEM STA PRE COM NAV OTC NOI DSP COR\"
timing-allow-origin: *
cross-origin-resource-policy: cross-origin
date: Fri, 21 May 2021 07:36:40 GMT
pragma: no-cache
expires: Fri, 01 Jan 1990 00:00:00 GMT
cache-control: no-cache, must-revalidate
content-type: text/javascript; charset=UTF-8
x-content-type-options: nosniff
content-disposition: attachment; filename=\"f.txt\"
content-encoding: gzip
server: cafe
content-length: 1246
x-xss-protection: 0
alt-svc: h3-29=\":443\"; ma=2592000,h3-T051=\":443\"; ma=2592000,h3-Q050=\":443\"; ma=2592000,h3-Q046=\":443\"; ma=2592000,h3-Q043=\":443\"; ma=2592000,quic=\":443\"; ma=2592000; v=\"46,43\"
----

--Response 
HTTP/1.1 200
status: 200
p3p: policyref=\"https://googleads.g.doubleclick.net/pagead/gcn_p3p_.xml\", CP=\"CURa ADMa DEVa TAIo PSAo PSDo OUR IND UNI PUR INT DEM STA PRE COM NAV OTC NOI DSP COR\"
timing-allow-origin: *
cross-origin-resource-policy: cross-origin
date: Fri, 21 May 2021 07:36:40 GMT
pragma: no-cache
expires: Fri, 01 Jan 1990 00:00:00 GMT
cache-control: no-cache, must-revalidate
content-type: text/javascript; charset=UTF-8
x-content-type-options: nosniff
content-disposition: attachment; filename=\"f.txt\"
content-encoding: gzip
server: cafe
content-length: 1245
x-xss-protection: 0
alt-svc: h3-29=\":443\"; ma=2592000,h3-T051=\":443\"; ma=2592000,h3-Q050=\":443\"; ma=2592000,h3-Q046=\":443\"; ma=2592000,h3-Q043=\":443\"; ma=2592000,quic=\":443\"; ma=2592000; v=\"46,43\"
----

--Response 
HTTP/1.1 200 OK
Cache-Control: no-cache, no-transform, must-revalidate, max-age=0
Content-Type: image/gif
Date: Fri, 21 May 2021 07:36:40 GMT
Expires: -1
P3P: policyref=\"/w3c/p3p.xml\", CP=\"ADMa OUR IND DSP NON COR\"
Server: nginx/1.12.1
Set-Cookie: BVID=e537eedb-5491-4e0f-9e45-95b5731a4a0c;Version=1;Domain=.network.bazaarvoice.com;Max-Age=31536000;Expires=Sat, 21 May 2022 07:36:40 GMT;Secure;SameSite=None
Set-Cookie: BVSID=3cd6451d-ef9f-483c-9e1a-048ebdde220b;Version=1;Domain=.network.bazaarvoice.com;Max-Age=1800;Expires=Fri, 21 May 2021 08:06:40 GMT;Secure;SameSite=None
Content-Length: 43
Connection: keep-alive
----

--Response 
HTTP/1.1 200 OK
Cache-Control: no-cache, no-transform, must-revalidate, max-age=0
Content-Type: image/gif
Date: Fri, 21 May 2021 07:36:40 GMT
Expires: -1
P3P: policyref=\"/w3c/p3p.xml\", CP=\"ADMa OUR IND DSP NON COR\"
Server: nginx/1.12.1
Set-Cookie: BVID=e537eedb-5491-4e0f-9e45-95b5731a4a0c;Version=1;Domain=.network.bazaarvoice.com;Max-Age=31536000;Expires=Sat, 21 May 2022 07:36:40 GMT;Secure;SameSite=None
Set-Cookie: BVSID=3cd6451d-ef9f-483c-9e1a-048ebdde220b;Version=1;Domain=.network.bazaarvoice.com;Max-Age=1800;Expires=Fri, 21 May 2021 08:06:40 GMT;Secure;SameSite=None
Content-Length: 43
Connection: keep-alive
----

--Response 
HTTP/1.1 200 OK
Cache-Control: no-cache, no-transform, must-revalidate, max-age=0
Content-Type: image/gif
Date: Fri, 21 May 2021 07:36:40 GMT
Expires: -1
P3P: policyref=\"/w3c/p3p.xml\", CP=\"ADMa OUR IND DSP NON COR\"
Server: nginx/1.12.1
Set-Cookie: BVID=e537eedb-5491-4e0f-9e45-95b5731a4a0c;Version=1;Domain=.network.bazaarvoice.com;Max-Age=31536000;Expires=Sat, 21 May 2022 07:36:40 GMT;Secure;SameSite=None
Set-Cookie: BVSID=3cd6451d-ef9f-483c-9e1a-048ebdde220b;Version=1;Domain=.network.bazaarvoice.com;Max-Age=1800;Expires=Fri, 21 May 2021 08:06:40 GMT;Secure;SameSite=None
Content-Length: 43
Connection: keep-alive
----

--Response 
HTTP/1.1 200
status: 200
date: Fri, 21 May 2021 07:36:40 GMT
content-type: image/png; charset=utf-8
content-length: 95
cf-cache-status: DYNAMIC
cf-request-id: 0a2f73eeb80000dc7d07a60000000001
expect-ct: max-age=604800, report-uri=\"https://report-uri.cloudflare.com/cdn-cgi/beacon/expect-ct\"
server: cloudflare
cf-ray: 652c22912e59dc7d-MAA
alt-svc: h3-27=\":443\"; ma=86400, h3-28=\":443\"; ma=86400, h3-29=\":443\"; ma=86400
----

--Response 
HTTP/1.1 200
status: 200
access-control-allow-origin: *
last-modified: Thu, 21 Jan 2021 22:52:25 GMT
etag: \"957a9fa6eb5129103526c996f564116a\"
server: Unknown
content-type: image/webp
content-length: 4606
timing-allow-origin: *
expires: Mon, 24 May 2021 05:05:00 GMT
date: Fri, 21 May 2021 07:36:41 GMT
----

--Response 
HTTP/1.1 200
status: 200
content-type: image/webp
content-length: 5168
access-control-allow-origin: *
last-modified: Mon, 02 Mar 2020 21:19:43 GMT
etag: \"3e226d0b620c8cf82a12bd00f8d52ac9\"
timing-allow-origin: *
server: Unknown
strict-transport-security: max-age=31536000; includeSubDomains
expires: Sat, 22 May 2021 03:12:58 GMT
date: Fri, 21 May 2021 07:36:41 GMT
----

--Response 
HTTP/1.1 200
status: 200
access-control-allow-origin: *
last-modified: Fri, 16 Oct 2020 14:21:29 GMT
etag: \"019d3934aba7c5e7f59467e2a11df568\"
server: Unknown
strict-transport-security: max-age=31536000; includeSubDomains
content-type: image/webp
content-length: 4632
timing-allow-origin: *
expires: Wed, 26 May 2021 09:22:40 GMT
date: Fri, 21 May 2021 07:36:41 GMT
----

--Response 
HTTP/1.1 200
status: 200
access-control-allow-origin: *
last-modified: Mon, 13 Jul 2020 19:22:40 GMT
etag: \"9fb2dcc5eec0373d1e3e72160f9535a8\"
server: Unknown
strict-transport-security: max-age=31536000; includeSubDomains
content-type: image/jpeg
content-length: 8837
timing-allow-origin: *
expires: Tue, 25 May 2021 10:58:43 GMT
date: Fri, 21 May 2021 07:36:41 GMT
----

--Response 
HTTP/1.1 200
status: 200
accept-ranges: bytes
content-type: application/x-javascript
etag: \"76ec4e573021c58c940627400b14e574:1621528998.531868\"
last-modified: Thu, 20 May 2021 16:43:18 GMT
server: AkamaiNetStorage
vary: Accept-Encoding
content-encoding: gzip
content-length: 389
cache-control: max-age=3600
expires: Fri, 21 May 2021 08:36:41 GMT
date: Fri, 21 May 2021 07:36:41 GMT
access-control-allow-origin: https://www.kohls.com
timing-allow-origin: *
----

--Response 
HTTP/1.1 200
status: 200
content-type: image/webp
content-length: 5210
access-control-allow-origin: *
last-modified: Mon, 15 Mar 2021 18:25:57 GMT
etag: \"395a8df75e5fa016e030de3b65277c0b\"
timing-allow-origin: *
server: Unknown
expires: Sun, 23 May 2021 15:42:35 GMT
date: Fri, 21 May 2021 07:36:41 GMT
----

--Response 
HTTP/1.1 200
status: 200
access-control-allow-origin: *
last-modified: Thu, 21 Jan 2021 22:52:06 GMT
etag: \"b2f769b5e4bafa0f2e590ddde6d3d4b9\"
server: Unknown
strict-transport-security: max-age=31536000; includeSubDomains
content-type: image/webp
content-length: 4790
timing-allow-origin: *
expires: Tue, 25 May 2021 18:06:13 GMT
date: Fri, 21 May 2021 07:36:41 GMT
----

--Response 
HTTP/1.1 200
status: 200
access-control-allow-origin: *
last-modified: Tue, 27 Apr 2021 19:50:22 GMT
etag: \"483d3adba0f5189e9c8715dbe91dd028\"
server: Unknown
strict-transport-security: max-age=31536000; includeSubDomains
content-type: image/webp
content-length: 5714
timing-allow-origin: *
expires: Wed, 26 May 2021 19:59:44 GMT
date: Fri, 21 May 2021 07:36:41 GMT
----

--Response 
HTTP/1.1 200
status: 200
access-control-allow-origin: *
last-modified: Thu, 17 Sep 2020 20:06:03 GMT
etag: \"995b53102745a7af9935b92924b08c19\"
server: Unknown
strict-transport-security: max-age=31536000; includeSubDomains
content-type: image/jpeg
content-length: 6659
timing-allow-origin: *
expires: Sat, 22 May 2021 11:40:39 GMT
date: Fri, 21 May 2021 07:36:41 GMT
----

--Response 
HTTP/1.1 200
status: 200
content-type: image/webp
content-length: 5156
access-control-allow-origin: *
last-modified: Tue, 02 Feb 2021 20:21:08 GMT
etag: \"6c1444f91a47734db9a28eba95b9c969\"
timing-allow-origin: *
server: Unknown
expires: Wed, 26 May 2021 05:02:34 GMT
date: Fri, 21 May 2021 07:36:41 GMT
----

--Response 
HTTP/1.1 200
status: 200
access-control-allow-origin: *
last-modified: Tue, 13 Apr 2021 17:20:54 GMT
etag: \"4b83cf7288a0fb871c4f13f3f6c80178\"
server: Unknown
strict-transport-security: max-age=31536000; includeSubDomains
content-type: image/webp
content-length: 6092
timing-allow-origin: *
expires: Sun, 23 May 2021 16:52:58 GMT
date: Fri, 21 May 2021 07:36:41 GMT
----

--Response 
HTTP/1.1 200
status: 200
access-control-allow-origin: *
last-modified: Thu, 21 Jan 2021 20:20:50 GMT
etag: \"462acb3f66d11acee12045cfd227136e\"
server: Unknown
strict-transport-security: max-age=31536000; includeSubDomains
content-type: image/webp
content-length: 6718
timing-allow-origin: *
expires: Mon, 24 May 2021 05:57:45 GMT
date: Fri, 21 May 2021 07:36:41 GMT
----

--Response 
HTTP/1.1 200
status: 200
access-control-allow-origin: *
last-modified: Thu, 18 Mar 2021 20:20:50 GMT
etag: \"776210776257d07e0db901075de9d916\"
server: Unknown
strict-transport-security: max-age=31536000; includeSubDomains
content-type: image/webp
content-length: 5780
timing-allow-origin: *
expires: Mon, 24 May 2021 05:04:52 GMT
date: Fri, 21 May 2021 07:36:41 GMT
----

--Response 
HTTP/1.1 200
status: 200
access-control-allow-origin: *
last-modified: Mon, 15 Mar 2021 20:50:53 GMT
etag: \"38c2ccab94e167b59e77addf0a14acd6\"
server: Unknown
strict-transport-security: max-age=31536000; includeSubDomains
content-type: image/webp
content-length: 6110
timing-allow-origin: *
expires: Wed, 26 May 2021 07:20:52 GMT
date: Fri, 21 May 2021 07:36:41 GMT
----

--Response 
HTTP/1.1 200
status: 200
access-control-allow-origin: *
last-modified: Fri, 29 Jan 2021 18:50:16 GMT
etag: \"713b6211ac1ec8a2cb57936b91e34149\"
server: Unknown
strict-transport-security: max-age=31536000; includeSubDomains
content-type: image/jpeg
content-length: 6735
timing-allow-origin: *
expires: Mon, 24 May 2021 05:40:06 GMT
date: Fri, 21 May 2021 07:36:41 GMT
----

--Response 
HTTP/1.1 200
status: 200
access-control-allow-origin: *
last-modified: Thu, 21 Jan 2021 20:20:48 GMT
etag: \"c57f2c7d4bbb3d89c1feed99502ec914\"
server: Unknown
strict-transport-security: max-age=31536000; includeSubDomains
content-type: image/webp
content-length: 6262
timing-allow-origin: *
expires: Wed, 26 May 2021 09:59:30 GMT
date: Fri, 21 May 2021 07:36:41 GMT
----

--Response 
HTTP/1.1 200
status: 200
access-control-allow-origin: *
last-modified: Thu, 21 Jan 2021 20:20:59 GMT
etag: \"8bda0dee33d1b4a65f363f4e8e8aedce\"
server: Unknown
strict-transport-security: max-age=31536000; includeSubDomains
content-type: image/webp
content-length: 6464
timing-allow-origin: *
expires: Wed, 26 May 2021 07:06:47 GMT
date: Fri, 21 May 2021 07:36:41 GMT
----

--Response 
HTTP/1.1 200
status: 200
cache-control: private,max-age=1800
content-length: 8911
content-type: application/javascript
content-encoding: gzip
last-modified: Fri, 21 May 2021 00:51:47 GMT
accept-ranges: bytes
etag: \"8013f579db4dd71:0\"
vary: Accept-Encoding
access-control-allow-origin: *
x-cache: CONFIG_NOCACHE
x-msedge-ref: Ref A: A8828F6CD6894713B4B95C2B48A2EC87 Ref B: DEL01EDGE0213 Ref C: 2021-05-21T07:36:31Z
date: Fri, 21 May 2021 07:36:30 GMT
----

--Response 
HTTP/1.1 200
status: 200
content-type: application/javascript; charset=UTF-8
content-length: 43269
date: Wed, 12 May 2021 13:50:41 GMT
x-amz-replication-status: COMPLETED
last-modified: Fri, 12 Mar 2021 16:52:13 GMT
etag: \"4f257ca78f0201aab8eb513bdd3b14f2\"
cache-control: max-age=31557600
content-encoding: gzip
x-amz-version-id: rcfmhh38Se7WvQNqi2_7bRZ9_AK10sBt
accept-ranges: bytes
server: AmazonS3
x-cache: Hit from cloudfront
via: 1.1 ece1c48664fc515e04af2cc69809b65a.cloudfront.net (CloudFront)
x-amz-cf-pop: BOM50-C1
x-amz-cf-id: ja9EshTUMAj6vEpitn18-anSRvB0Oa7q-CtRoEU5eH8kX0W_RGBoDw==
age: 755161
----

