
--Response 
HTTP/1.1 204
status: 204
cache-control: no-store, no-cache, must-revalidate, post-check=0, pre-check=0
pragma: no-cache
expires: Fri, 21 May 2021 08:05:28 GMT
p3p: policyref=\"/w3c/p3p.xml\", CP=\"ALL BUS LEG DSP COR ADM CUR DEV PSA OUR NAV INT\"
set-cookie: brwsr=38bf4dbd-ba0b-11eb-a1f4-42010a24631e; Domain=.sjv.io; Path=/; Secure; Max-Age=62208000; Expires=Thu, 11 May 2023 08:05:28 GMT; HttpOnly
content-length: 0
date: Fri, 21 May 2021 08:05:28 GMT
via: 1.1 google
alt-svc: clear
----

--Response 
HTTP/1.1 200 OK
Server: nginx
Content-Type: application/javascript; charset=utf-8
Last-Modified: Thu, 16 Jan 2020 19:30:42 GMT
ETag: \"f6dc55142ef9aa5bac26b4b5c9febf29\"
P3P: CP=NOI DSP COR NID
Content-Encoding: gzip
Content-Length: 1602
Cache-Control: max-age=14400
Date: Fri, 21 May 2021 08:04:57 GMT
Vary: Accept-Encoding
----

--Response 
HTTP/1.1 200
status: 200
content-type: text/javascript
x-uuid: c85b8b27-c428-465b-827e-4f7d01d1300c
cache-control: no-cache max-age=0
expires: Thu, 01 Dec 1994 16:00:00 GMT
pragma: no-cache
p3p: policyref=\"https://movableink.com/w3c/p3p.xml\", CP=\"DEVa PSAa PSDa IVAa IVDa OUR IND DSP NON COR NAV UNI\"
timing-allow-origin: https://www.kohls.com
date: Fri, 21 May 2021 08:05:28 GMT
content-encoding: gzip
vary: Accept-Encoding
x-cache: Miss from cloudfront
via: 1.1 e46fe002b19695c8710c92d0f72b4dbc.cloudfront.net (CloudFront)
x-amz-cf-pop: DEL54-C1
x-amz-cf-id: TElumx8jDyDCzdQrFGHON8bLEIE5SsHCAT9aYz_5Ix46MYvZ-2Bu2A==
----

--Response 
HTTP/1.1 200
status: 200
p3p: policyref=\"https://googleads.g.doubleclick.net/pagead/gcn_p3p_.xml\", CP=\"CURa ADMa DEVa TAIo PSAo PSDo OUR IND UNI PUR INT DEM STA PRE COM NAV OTC NOI DSP COR\"
timing-allow-origin: *
cross-origin-resource-policy: cross-origin
date: Fri, 21 May 2021 08:05:29 GMT
pragma: no-cache
expires: Fri, 01 Jan 1990 00:00:00 GMT
cache-control: no-cache, must-revalidate
content-type: text/javascript; charset=UTF-8
x-content-type-options: nosniff
content-disposition: attachment; filename=\"f.txt\"
content-encoding: gzip
server: cafe
content-length: 1069
x-xss-protection: 0
alt-svc: h3-29=\":443\"; ma=2592000,h3-T051=\":443\"; ma=2592000,h3-Q050=\":443\"; ma=2592000,h3-Q046=\":443\"; ma=2592000,h3-Q043=\":443\"; ma=2592000,quic=\":443\"; ma=2592000; v=\"46,43\"
----

--Response 
HTTP/1.1 200
status: 200
p3p: policyref=\"https://googleads.g.doubleclick.net/pagead/gcn_p3p_.xml\", CP=\"CURa ADMa DEVa TAIo PSAo PSDo OUR IND UNI PUR INT DEM STA PRE COM NAV OTC NOI DSP COR\"
timing-allow-origin: *
cross-origin-resource-policy: cross-origin
date: Fri, 21 May 2021 08:05:29 GMT
pragma: no-cache
expires: Fri, 01 Jan 1990 00:00:00 GMT
cache-control: no-cache, must-revalidate
content-type: text/javascript; charset=UTF-8
x-content-type-options: nosniff
content-disposition: attachment; filename=\"f.txt\"
content-encoding: gzip
server: cafe
content-length: 1068
x-xss-protection: 0
alt-svc: h3-29=\":443\"; ma=2592000,h3-T051=\":443\"; ma=2592000,h3-Q050=\":443\"; ma=2592000,h3-Q046=\":443\"; ma=2592000,h3-Q043=\":443\"; ma=2592000,quic=\":443\"; ma=2592000; v=\"46,43\"
----



--Response 
HTTP/1.1 302
status: 302
server: nginx
date: Fri, 21 May 2021 08:05:29 GMT
content-length: 0
cache-control: no-cache, private, max-age=0, no-store
expires: 0
pragma: no-cache
p3p: policyref=\"/w3c/p3p.xml\", CP=\"NOI DSP NID OUR STP\"
location: https://login.dotomi.com/pixel.gif
----

