--Request 
POST https://play.google.com/log?format=json&hasfast=true&authuser=0
Host: play.google.com
Host: play.google.com
Connection: keep-alive
Content-Length: 1931
Authorization: SAPISIDHASH c8daafd5c24a1a5c3afe252a42bcf02e1856f8de
Origin: https://ogs.google.com
X-Goog-AuthUser: 0
User-Agent: Mozilla/5.0 (Windows NT 10.0; Win64; x64) AppleWebKit/537.36 (KHTML, like Gecko) Chrome/79.0.3945.130 Safari/537.36
Content-Type: application/x-www-form-urlencoded;charset=UTF-8
Accept: */*
Sec-Fetch-Site: same-site
Sec-Fetch-Mode: cors
Referer: https://ogs.google.com/
Accept-Encoding: gzip, deflate, br
Accept-Language: en-GB,en-US;q=0.9,en;q=0.8
Cookie: SID=8wdD23M0zT1muB_G7zm1RcdpXcTV9pgu899MrjEHx4F9koQYO2nUhhv57bJP9jOa-xXwCQ.; __Secure-3PSID=8wdD23M0zT1muB_G7zm1RcdpXcTV9pgu899MrjEHx4F9koQYA-wfYnEQ-ysFwqZqC3qmBw.; HSID=ARsC0xTZAuXrWMsnv; SSID=AcVA6-GGICXqf9J2j; APISID=YJ2-WvqJsfDZ_6LX/Aw6EB3te0F5GcNF_4; SAPISID=eZPEKcNhzxFHpS8e/AXrnV3TZ36Wk7edFa; __Secure-3PAPISID=eZPEKcNhzxFHpS8e/AXrnV3TZ36Wk7edFa; 1P_JAR=2021-04-28-06; SEARCH_SAMESITE=CgQIuZIB; NID=214=Atokn4Q0yZ25GhTZ0XijMI0V-LFxghRKeweF5LkHOyn-q7mDEKj5k3YK3WToFskS25eBOSFJdzjSYHxnrhwXOzAYkaSFdjVHwAwBZEgAzS9qSzi1kIaTqF0rsQjFxRWrSW-6OUYKFsLMQ_jcZWJ-DuOfdICtr2YjqCqONVISBjjuGWXDN4P79gWIBVUBHMXSg5EshyeoWIsy78ZLcQ; SIDCC=AJi4QfH92ge6_Wk7B01wDr-oBSfpyJgbRmFSg0AsPvKvs1Qkm68k4TSmTGI15gAKNgNJMhkT; __Secure-3PSIDCC=AJi4QfH1aeH6lzVMOiQg_Lw7y6V3vdT3YmD0S4ik4dhhY8NRudC4aOKOfSozY80d4zOEaHh_XA
----
 POSTDATA [[1,null,null,null,null,null,null,null,null,null,[null,null,null,null,"en",null,"boq_onegooglehttpserver_20210426.03_p0"]],241,[["1619591936225",null,[],null,null,null,null,"[1619591936217,[[\"2397168675742140944\",null,[[419,1]]],[\"16147638372540442232\",null,[[497,1]]],[\"14719340685975485085\",null,[[660,1]]],[\"17077408715954654437\",null,[[964,1]]],[\"3318688667027929436\",null,[[497,1]]],[\"5790177495296899286\",null,[[11,1]]],[\"16829267986558572790\",null,[[88,1]]],[\"16339156775003354937\",null,[[137,1]]],[\"749851692583976763\",null,[[12,1]]],[\"15419336178855610526\",null,[[287,1]]],[\"17276521865292187132\",null,[[1,1]]],[\"8257051839445688306\",null,[[963,1]]],[\"7792735449360349632\",null,[[963,1]]],[\"7094487270460551484\",null,[[8,1]]],[\"12563104964214410683\",null,[[344,1]]],[\"15605813632677093659\",null,[[118,1]]],[\"17914751415692637656\",null,[[7,1]]],[\"9797767207516844257\",null,[[0,1]]],[\"14906952326733574741\",null,[[4,1]]],[\"4891744519482609478\",null,[[177,1]]],[\"14307859671070593733\",null,[[123,1]]],[\"7494582641517049914\",null,[[3,1]]],[\"6667106912793420619\",null,[[0,1]]],[\"10118692516388306266\",null,[[1,1]]],[\"408159237941253787\",null,[[260,1]]],[\"476083397694989718\",null,[[260,1]]],[\"8791060314450143495\",null,[[1,1]]],[\"6342145065879578001\",null,[[3,1]]],[\"13596961294000664596\",null,[[344,1]]],[\"2107494750385856652\",null,[[62,1]]],[\"1309831198388189068\",null,[[3,1]]],[\"522022639063469804\",null,[[0,1]]],[\"4950535922500196698\",null,[[4144,1]]],[\"1757184925777806825\",null,[[136,1]]],[\"3079121564595244695\",null,[[108,1]]],[\"10652791942255425261\",null,[[11343,1]]],[\"4132870161583308123\",null,[[114,1]]]],null,null,\"[1,\\\"qBzSPd_PL\\\"]\"]",null,null,null,376525489,null,null,-19800,[null,[],null,"[[],[],[1763433,1772879],[]]"],null,null,null,[],1,null,null,null,null,null,[]]],"1619591936226",[],null,null,null,null,null,null,null,null,0]
--Response 
HTTP/1.1 200
status: 200
access-control-allow-origin: https://ogs.google.com
access-control-allow-credentials: true
access-control-allow-headers: X-Playlog-Web
content-type: text/plain; charset=UTF-8
content-encoding: gzip
date: Wed, 28 Apr 2021 06:38:57 GMT
server: Playlog
cache-control: private
content-length: 131
x-xss-protection: 0
x-frame-options: SAMEORIGIN
set-cookie: SIDCC=AJi4QfEL9AitW0OrI8W18Jyxn9yDCKsHph7c_1n3ltsl_auTlGeFPIFwmDnTgN3OmvZ-2mDx; expires=Thu, 28-Apr-2022 06:38:57 GMT; path=/; domain=.google.com; priority=high
set-cookie: __Secure-3PSIDCC=AJi4QfFjdKvnUOolnZaZHr9EjS_D9FC5CfxZC3eiTsbYLtFb6RTMtBSLyGH_HRg7v2r6vq8ooQ; expires=Thu, 28-Apr-2022 06:38:57 GMT; path=/; domain=.google.com; Secure; HttpOnly; priority=high; SameSite=none
alt-svc: h3-29=\":443\"; ma=2592000,h3-T051=\":443\"; ma=2592000,h3-Q050=\":443\"; ma=2592000,h3-Q046=\":443\"; ma=2592000,h3-Q043=\":443\"; ma=2592000,quic=\":443\"; ma=2592000; v=\"46,43\"
expires: Wed, 28 Apr 2021 06:38:57 GMT
----
--Request 
GET https://0.client-channel.google.com/client-channel/channel/cbp?ctype=hangouts&prop=gmail&appver=babel-chat.frontend_20210425.07_p0&gsessionid=5XRL_CVWERs3Iaon28J11LUbDxDW1wG2yevT4lSq81k&VER=8&MODE=init&zx=h8u9zuafk3sh&t=1
Host: 0.client-channel.google.com
Host: 0.client-channel.google.com
Connection: keep-alive
Authorization: SAPISIDHASH 1619591934_b035b7581508dcf9fd29e426b44eaaa616c6ed54
X-Origin: https://hangouts.google.com
X-Goog-AuthUser: 0
User-Agent: Mozilla/5.0 (Windows NT 10.0; Win64; x64) AppleWebKit/537.36 (KHTML, like Gecko) Chrome/79.0.3945.130 Safari/537.36
Accept: */*
Sec-Fetch-Site: same-origin
Sec-Fetch-Mode: cors
Referer: https://0.client-channel.google.com/client-channel/client?cfg=%7B%222%22%3A%22hangouts%22%2C%226%22%3A%22gmail%22%2C%227%22%3A%22babel-chat.frontend_20210425.07_p0%22%2C%228%22%3Afalse%2C%2213%22%3Afalse%7D&ctype=hangouts&xpc=%7B%22cn%22%3A%220gmaBrxzwo%22%2C%22tp%22%3Anull%2C%22osh%22%3Anull%2C%22ppu%22%3A%22https%3A%2F%2Fhangouts.google.com%2Frobots.txt%22%2C%22lpu%22%3A%22https%3A%2F%2F0.client-channel.google.com%2Frobots.txt%22%7D
Accept-Encoding: gzip, deflate, br
Accept-Language: en-GB,en-US;q=0.9,en;q=0.8
Cookie: SID=8wdD23M0zT1muB_G7zm1RcdpXcTV9pgu899MrjEHx4F9koQYO2nUhhv57bJP9jOa-xXwCQ.; __Secure-3PSID=8wdD23M0zT1muB_G7zm1RcdpXcTV9pgu899MrjEHx4F9koQYA-wfYnEQ-ysFwqZqC3qmBw.; HSID=ARsC0xTZAuXrWMsnv; SSID=AcVA6-GGICXqf9J2j; APISID=YJ2-WvqJsfDZ_6LX/Aw6EB3te0F5GcNF_4; SAPISID=eZPEKcNhzxFHpS8e/AXrnV3TZ36Wk7edFa; __Secure-3PAPISID=eZPEKcNhzxFHpS8e/AXrnV3TZ36Wk7edFa; 1P_JAR=2021-04-28-06; SEARCH_SAMESITE=CgQIuZIB; NID=214=Atokn4Q0yZ25GhTZ0XijMI0V-LFxghRKeweF5LkHOyn-q7mDEKj5k3YK3WToFskS25eBOSFJdzjSYHxnrhwXOzAYkaSFdjVHwAwBZEgAzS9qSzi1kIaTqF0rsQjFxRWrSW-6OUYKFsLMQ_jcZWJ-DuOfdICtr2YjqCqONVISBjjuGWXDN4P79gWIBVUBHMXSg5EshyeoWIsy78ZLcQ; SIDCC=AJi4QfH92ge6_Wk7B01wDr-oBSfpyJgbRmFSg0AsPvKvs1Qkm68k4TSmTGI15gAKNgNJMhkT; __Secure-3PSIDCC=AJi4QfH1aeH6lzVMOiQg_Lw7y6V3vdT3YmD0S4ik4dhhY8NRudC4aOKOfSozY80d4zOEaHh_XA
----
--Response 
HTTP/1.1 200
status: 200
cache-control: no-cache, no-store, max-age=0, must-revalidate
pragma: no-cache
expires: Mon, 01 Jan 1990 00:00:00 GMT
date: Wed, 28 Apr 2021 06:38:57 GMT
content-type: text/plain; charset=utf-8
x-client-wire-protocol: h2
content-encoding: gzip
x-content-type-options: nosniff
x-xss-protection: 1; mode=block
content-length: 25
server: GSE
set-cookie: SIDCC=AJi4QfFa7C4V2riKuNzfn9v9aofo3vH0dZU4G1RBfRt58kyUnu462Aw80W85U3a9LrV68zZa; expires=Thu, 28-Apr-2022 06:38:57 GMT; path=/; domain=.google.com; priority=high
set-cookie: __Secure-3PSIDCC=AJi4QfE1WGleHc9UPW-BHNchjho3T1Xfl4AqCIugr-V-HD3vgKC_7YtPhpNk_xxxqDfsrG4zrA; expires=Thu, 28-Apr-2022 06:38:57 GMT; path=/; domain=.google.com; Secure; HttpOnly; priority=high; SameSite=none
alt-svc: h3-29=\":443\"; ma=2592000,h3-T051=\":443\"; ma=2592000,h3-Q050=\":443\"; ma=2592000,h3-Q046=\":443\"; ma=2592000,h3-Q043=\":443\"; ma=2592000,quic=\":443\"; ma=2592000; v=\"46,43\"
----
--Request 
GET https://0.client-channel.google.com/client-channel/channel/cbp?ctype=hangouts&prop=gmail&appver=babel-chat.frontend_20210425.07_p0&gsessionid=5XRL_CVWERs3Iaon28J11LUbDxDW1wG2yevT4lSq81k&VER=8&TYPE=xmlhttp&zx=v361o91scimc&t=1
Host: 0.client-channel.google.com
Host: 0.client-channel.google.com
Connection: keep-alive
Authorization: SAPISIDHASH 1619591934_b035b7581508dcf9fd29e426b44eaaa616c6ed54
X-Origin: https://hangouts.google.com
X-Goog-AuthUser: 0
User-Agent: Mozilla/5.0 (Windows NT 10.0; Win64; x64) AppleWebKit/537.36 (KHTML, like Gecko) Chrome/79.0.3945.130 Safari/537.36
Accept: */*
Sec-Fetch-Site: same-origin
Sec-Fetch-Mode: cors
Referer: https://0.client-channel.google.com/client-channel/client?cfg=%7B%222%22%3A%22hangouts%22%2C%226%22%3A%22gmail%22%2C%227%22%3A%22babel-chat.frontend_20210425.07_p0%22%2C%228%22%3Afalse%2C%2213%22%3Afalse%7D&ctype=hangouts&xpc=%7B%22cn%22%3A%220gmaBrxzwo%22%2C%22tp%22%3Anull%2C%22osh%22%3Anull%2C%22ppu%22%3A%22https%3A%2F%2Fhangouts.google.com%2Frobots.txt%22%2C%22lpu%22%3A%22https%3A%2F%2F0.client-channel.google.com%2Frobots.txt%22%7D
Accept-Encoding: gzip, deflate, br
Accept-Language: en-GB,en-US;q=0.9,en;q=0.8
Cookie: SID=8wdD23M0zT1muB_G7zm1RcdpXcTV9pgu899MrjEHx4F9koQYO2nUhhv57bJP9jOa-xXwCQ.; __Secure-3PSID=8wdD23M0zT1muB_G7zm1RcdpXcTV9pgu899MrjEHx4F9koQYA-wfYnEQ-ysFwqZqC3qmBw.; HSID=ARsC0xTZAuXrWMsnv; SSID=AcVA6-GGICXqf9J2j; APISID=YJ2-WvqJsfDZ_6LX/Aw6EB3te0F5GcNF_4; SAPISID=eZPEKcNhzxFHpS8e/AXrnV3TZ36Wk7edFa; __Secure-3PAPISID=eZPEKcNhzxFHpS8e/AXrnV3TZ36Wk7edFa; 1P_JAR=2021-04-28-06; SEARCH_SAMESITE=CgQIuZIB; NID=214=Atokn4Q0yZ25GhTZ0XijMI0V-LFxghRKeweF5LkHOyn-q7mDEKj5k3YK3WToFskS25eBOSFJdzjSYHxnrhwXOzAYkaSFdjVHwAwBZEgAzS9qSzi1kIaTqF0rsQjFxRWrSW-6OUYKFsLMQ_jcZWJ-DuOfdICtr2YjqCqONVISBjjuGWXDN4P79gWIBVUBHMXSg5EshyeoWIsy78ZLcQ; SIDCC=AJi4QfFa7C4V2riKuNzfn9v9aofo3vH0dZU4G1RBfRt58kyUnu462Aw80W85U3a9LrV68zZa; __Secure-3PSIDCC=AJi4QfE1WGleHc9UPW-BHNchjho3T1Xfl4AqCIugr-V-HD3vgKC_7YtPhpNk_xxxqDfsrG4zrA
----
--Response 
HTTP/1.1 200
status: 200
cache-control: no-cache, no-store, max-age=0, must-revalidate
pragma: no-cache
expires: Mon, 01 Jan 1990 00:00:00 GMT
date: Wed, 28 Apr 2021 06:38:57 GMT
content-type: text/plain; charset=utf-8
x-content-type-options: nosniff
x-xss-protection: 1; mode=block
server: GSE
set-cookie: SIDCC=AJi4QfE8UQEUOzbMIuSLYbZ9_d0NeT9OC9b6v-R7Q1RjpoxIwjHY7HZgMdVTCl3O1qyH3CWa; expires=Thu, 28-Apr-2022 06:38:57 GMT; path=/; domain=.google.com; priority=high
set-cookie: __Secure-3PSIDCC=AJi4QfH-AcFRLycl2aJUZbUiUMyY5Yf7RUzi48OSVjJr92o0pVRmJu3Oxq31QBJ5dHFxe3-ygw; expires=Thu, 28-Apr-2022 06:38:57 GMT; path=/; domain=.google.com; Secure; HttpOnly; priority=high; SameSite=none
alt-svc: h3-29=\":443\"; ma=2592000,h3-T051=\":443\"; ma=2592000,h3-Q050=\":443\"; ma=2592000,h3-Q046=\":443\"; ma=2592000,h3-Q043=\":443\"; ma=2592000,quic=\":443\"; ma=2592000; v=\"46,43\"
----
--Request 
GET https://contacts.google.com/widget/hovercard/v/2?hl=en&origin=https://mail.google.com&usegapi=1&jsh=m;/_/scs/abc-static/_/js/k%3Dgapi.gapi.en.jcYff4gdSOQ.O/d%3D1/ct%3Dzgms/rs%3DAHpOoo_CvAHQybwQAZJQL2tdeysMj0HgHw/m%3D__features__#id=__HC_94253229&_gfid=__HC_94253229&parent=https%3A%2F%2Fmail.google.com&pfname=&rpctoken=41207972
Host: contacts.google.com
Host: contacts.google.com
Connection: keep-alive
Upgrade-Insecure-Requests: 1
User-Agent: Mozilla/5.0 (Windows NT 10.0; Win64; x64) AppleWebKit/537.36 (KHTML, like Gecko) Chrome/79.0.3945.130 Safari/537.36
Accept: text/html,application/xhtml+xml,application/xml;q=0.9,image/webp,image/apng,*/*;q=0.8,application/signed-exchange;v=b3;q=0.9
Sec-Fetch-Site: same-site
Sec-Fetch-Mode: nested-navigate
Referer: https://mail.google.com/mail/u/0/
Accept-Encoding: gzip, deflate, br
Accept-Language: en-GB,en-US;q=0.9,en;q=0.8
Cookie: SID=8wdD23M0zT1muB_G7zm1RcdpXcTV9pgu899MrjEHx4F9koQYO2nUhhv57bJP9jOa-xXwCQ.; __Secure-3PSID=8wdD23M0zT1muB_G7zm1RcdpXcTV9pgu899MrjEHx4F9koQYA-wfYnEQ-ysFwqZqC3qmBw.; HSID=ARsC0xTZAuXrWMsnv; SSID=AcVA6-GGICXqf9J2j; APISID=YJ2-WvqJsfDZ_6LX/Aw6EB3te0F5GcNF_4; SAPISID=eZPEKcNhzxFHpS8e/AXrnV3TZ36Wk7edFa; __Secure-3PAPISID=eZPEKcNhzxFHpS8e/AXrnV3TZ36Wk7edFa; 1P_JAR=2021-04-28-06; SEARCH_SAMESITE=CgQIuZIB; NID=214=Atokn4Q0yZ25GhTZ0XijMI0V-LFxghRKeweF5LkHOyn-q7mDEKj5k3YK3WToFskS25eBOSFJdzjSYHxnrhwXOzAYkaSFdjVHwAwBZEgAzS9qSzi1kIaTqF0rsQjFxRWrSW-6OUYKFsLMQ_jcZWJ-DuOfdICtr2YjqCqONVISBjjuGWXDN4P79gWIBVUBHMXSg5EshyeoWIsy78ZLcQ; SIDCC=AJi4QfFa7C4V2riKuNzfn9v9aofo3vH0dZU4G1RBfRt58kyUnu462Aw80W85U3a9LrV68zZa; __Secure-3PSIDCC=AJi4QfE1WGleHc9UPW-BHNchjho3T1Xfl4AqCIugr-V-HD3vgKC_7YtPhpNk_xxxqDfsrG4zrA
----
--Response 
HTTP/1.1 200
status: 200
content-type: text/html; charset=utf-8
x-frame-options: ALLOW-FROM https://mail.google.com
vary: Sec-Fetch-Dest, Sec-Fetch-Mode, Sec-Fetch-Site
x-ua-compatible: IE=edge
cache-control: no-cache, no-store, max-age=0, must-revalidate
pragma: no-cache
expires: Mon, 01 Jan 1990 00:00:00 GMT
date: Wed, 28 Apr 2021 06:38:57 GMT
strict-transport-security: max-age=31536000
content-security-policy: script-src 'report-sample' 'nonce-DIyIqN6hFqRa4wEA47UPpQ' 'unsafe-inline';object-src 'none';base-uri 'self';report-uri /_/SocialPeopleHovercardUi/cspreport;worker-src 'self'
content-security-policy: script-src 'nonce-DIyIqN6hFqRa4wEA47UPpQ' 'self' https://apis.google.com https://ssl.gstatic.com https://www.google.com https://www.gstatic.com https://www.google-analytics.com;report-uri /_/SocialPeopleHovercardUi/cspreport;frame-ancestors https://mail.google.com
content-security-policy: require-trusted-types-for 'script';report-uri /_/SocialPeopleHovercardUi/cspreport
report-to: {\"group\":\"SocialPeopleHovercardUi\",\"max_age\":2592000,\"endpoints\":[{\"url\":\"https://csp.withgoogle.com/csp/report-to/SocialPeopleHovercardUi/external\"}]}
cross-origin-opener-policy: same-origin; report-to=\"SocialPeopleHovercardUi\"
cross-origin-resource-policy: same-site
content-encoding: gzip
server: ESF
x-xss-protection: 0
x-content-type-options: nosniff
set-cookie: SIDCC=AJi4QfEoRBNEUQmdiayPlS8HhAQkKq7Ke6ZQ6ONwGbNHB8Psf4D60GR6-1KH-t1J-VMrAN67; expires=Thu, 28-Apr-2022 06:38:58 GMT; path=/; domain=.google.com; priority=high
set-cookie: __Secure-3PSIDCC=AJi4QfE96gfMG0JcFCkVKFiPxvrYhnf8t53Bpk8CIm2x_rZ3WpPgW-_odo4hRwYJ7_0ybCnaRA; expires=Thu, 28-Apr-2022 06:38:58 GMT; path=/; domain=.google.com; Secure; HttpOnly; priority=high; SameSite=none
alt-svc: h3-29=\":443\"; ma=2592000,h3-T051=\":443\"; ma=2592000,h3-Q050=\":443\"; ma=2592000,h3-Q046=\":443\"; ma=2592000,h3-Q043=\":443\"; ma=2592000,quic=\":443\"; ma=2592000; v=\"46,43\"
----

