--Request 
POST https://async-px.dynamicyield.com/uia?cnst=1&_=1621937649503
Host: async-px.dynamicyield.com
Origin: https://www.kohls.com
User-Agent: Mozilla/5.0 (Windows NT 10.0; WOW64) AppleWebKit/537.36 (KHTML, like Gecko) Chrome/56.0.2924.87 Safari/537.36
Content-Type: application/x-www-form-urlencoded
Accept: */*
Sec-Fetch-Site: cross-site
Sec-Fetch-Mode: cors
Referer: https://www.kohls.com/catalog/mens-brown-belts-accessories.jsp?CN=Gender:Mens+Color:Brown+Product:Belts+Department:Accessories&icid=mensbelts-VN2-brown&BST=397410&pfm=browse%20p13n_control%20Visual%20Nav&kls_sbp=74283710457332868823275532843712593523
Accept-Encoding: gzip, deflate, br
Accept-Language: en-GB,en-US;q=0.9,en;q=0.8
----
 POSTDATA msn=webserve-c8260c7.use&id=-3265109393214222885&se=8776374&cl=dk.w.c.ms.&rf=internal&trf=0&p=3&sub=www.kohls.com&sd=&url=https%3A%2F%2Fwww.kohls.com%2Fcatalog%2Fmens-brown-belts-accessories.jsp%3FCN%3DGender%3AMens%2BColor%3ABrown%2BProduct%3ABelts%2BDepartment%3AAccessories%26icid%3Dmensbelts-VN2-brown%26BST%3D397410%26pfm%3Dbrowse%2520p13n_control%2520Visual%2520Nav%26kls_sbp%3D74283710457332868823275532843712593523&title=Mens%20Brown%20Belts%20%7C%20Kohl's&lay=def&ses=7efee5a80754536c90c96997e6ecc8b0&aud=1408117.1362540.1362545&svars=&gv=&exps=%5B%5B%221067036%22%2C%229863190%22%2C%2225792075%22%2C0%2Cnull%2Cnull%2C%22-4899145934616091816%22%2C%222%22%2C%223%22%5D%2C%5B%221096558%22%2C%2210092862%22%2C%2226047526%22%2C0%2Cnull%2Cnull%2C%22-4899145934145173509%22%2C%221%22%2Cnull%5D%5D&lts=15%3A44&ctx=%7B%22type%22%3A%22CATEGORY%22%2C%22data%22%3A%5B%22Accessories%22%2C%22Mens%22%5D%7D&lpInfo=false&expSes=11660&br=Other&tsrc=Referral&geoData=&feedProps%5Bcategories%5D=&feedProps%5Bkeywords%5D=&cookieInfo=0.0.2659&reqts=1621937648478&rri=8109327&nocks=false
--Response 
HTTP/1.1 200
status: 200
date: Tue, 25 May 2021 10:14:09 GMT
content-length: 0
access-control-allow-origin: *
access-control-allow-methods: POST, GET, OPTIONS
access-control-allow-headers: Content-Type, Authorization, Content-Length, X-Requested-With
cache-control: no-cache, no-store, must-revalidate
pragma: no-cache
expires: 0
----

