
--Response 
HTTP/1.1 204
status: 204
access-control-allow-origin: *
date: Fri, 21 May 2021 08:18:18 GMT
pragma: no-cache
expires: Fri, 01 Jan 1990 00:00:00 GMT
cache-control: no-cache, no-store, must-revalidate
last-modified: Wed, 21 Jan 2004 19:51:30 GMT
content-type: image/gif
cross-origin-resource-policy: cross-origin
server: Golfe2
content-length: 0
alt-svc: h3-29=\":443\"; ma=2592000,h3-T051=\":443\"; ma=2592000,h3-Q050=\":443\"; ma=2592000,h3-Q046=\":443\"; ma=2592000,h3-Q043=\":443\"; ma=2592000,quic=\":443\"; ma=2592000; v=\"46,43\"
----

