--Request 
POST https://update.googleapis.com/service/update2/json?cup2key=9:2602016094&cup2hreq=0b13581bafe657ddbffb8a1771b7a76314bb0ec11a417cf28c830fc57cff9bee
Host: update.googleapis.com
Host: update.googleapis.com
Connection: keep-alive
Content-Length: 3009
X-Goog-Update-AppId: oimompecagnajdejgnnjijobebaeigek,gcmjkmgdlgnkkcocmoeiminaijmmjnii,llkgjffcdpffmhiakmfcdcblohccpfmo,hfnkpimlhhgieaddgfemjhofmfblmnib,khaoiebndkojlmppeemjhbpbandiljpe,bklopemakmnopmghhmccadeonafabnal,jflookgnkcckhobaglndicnbbgbonegd,giekcmmlnklenlaomppkphknjmnnpneh
X-Goog-Update-Interactivity: bg
X-Goog-Update-Updater: chrome-79.0.3945.130
Content-Type: application/json
Sec-Fetch-Site: none
Sec-Fetch-Mode: no-cors
User-Agent: Mozilla/5.0 (Windows NT 10.0; Win64; x64) AppleWebKit/537.36 (KHTML, like Gecko) Chrome/79.0.3945.130 Safari/537.36
Accept-Encoding: gzip, deflate, br
----
 POSTDATA {"request":{"@os":"win","@updater":"chrome","acceptformat":"crx2,crx3","app":[{"appid":"oimompecagnajdejgnnjijobebaeigek","cohort":"1::","enabled":true,"packages":{"package":[{"fp":"1.3a7afafe965da76cea59344022f69dcb9eaaef382ce56eb1daa8d20f9ec80c16"}]},"ping":{"ping_freshness":"{78e4baab-aa8e-4228-9eae-0d3fd5e1a20a}","rd":5230},"updatecheck":{},"version":"4.10.1610.0"},{"appid":"gcmjkmgdlgnkkcocmoeiminaijmmjnii","cohort":"1:bm1:","cohorthint":"M54ToM99","cohortname":"M54ToM99","enabled":true,"packages":{"package":[{"fp":"1.4dcc255c0d82123c9c4251bb453165672ea0458f0379f3a7a534dc2a666d7c6d"}]},"ping":{"ping_freshness":"{d78ebd90-7d62-4fd4-af16-16fccd1257a5}","rd":5230},"updatecheck":{},"version":"9.22.0"},{"appid":"llkgjffcdpffmhiakmfcdcblohccpfmo","cohort":"1::","enabled":true,"packages":{"package":[{"fp":"1.3d885f0577e4fd9e5b9251ba18576da6b49e80870ceaafcaa996e3b1dc762c01"}]},"ping":{"ping_freshness":"{cfaac548-fdfe-4ab3-afdb-c2ded7c77b04}","rd":5230},"updatecheck":{},"version":"1.0.0.4"},{"appid":"hfnkpimlhhgieaddgfemjhofmfblmnib","cohort":"1:jcl:","cohorthint":"Auto","cohortname":"Auto","enabled":true,"packages":{"package":[{"fp":"1.94b02f6d6bbb3b971f646107d197f7c7ef7783dc4e08df76ac2968d5ad326be0"}]},"ping":{"ping_freshness":"{ad19a2cc-0485-4e5c-9000-9d200c1f7b38}","rd":5230},"updatecheck":{},"version":"6570"},{"appid":"khaoiebndkojlmppeemjhbpbandiljpe","cohort":"1:cux:","cohorthint":"Auto","cohortname":"Auto","enabled":true,"packages":{"package":[{"fp":"1.ffd1d2d75a8183b0a1081bd03a7ce1d140fded7a9fb52cf3ae864cd4d408ceb4"}]},"ping":{"ping_freshness":"{d0d0b67b-f589-48bb-b39a-112a63a58931}","rd":5230},"updatecheck":{},"version":"43"},{"appid":"bklopemakmnopmghhmccadeonafabnal","cohort":"1:swl:","cohorthint":"Auto","cohortname":"Auto","enabled":true,"packages":{"package":[{"fp":"1.70497f45af368f6d591eb9b93a097b7b56821b0770ee00f04b2f5901487a0421"}]},"ping":{"ping_freshness":"{c479c1c1-9beb-4542-a753-203eb72c7ba9}","rd":5230},"updatecheck":{},"version":"4"},{"appid":"jflookgnkcckhobaglndicnbbgbonegd","cohort":"1:s7x:","cohorthint":"Auto","cohortname":"Auto","enabled":true,"packages":{"package":[{"fp":"1.70dba5eed1c56cea56059b5555dea35cec86b8ec84172850567c7f372b41e80b"}]},"ping":{"ping_freshness":"{9e0665b3-6887-4b83-bc8b-f9f3effb268a}","rd":5230},"updatecheck":{},"version":"2622"},{"appid":"giekcmmlnklenlaomppkphknjmnnpneh","cohort":"1:j5l:","cohorthint":"Auto","cohortname":"Auto","enabled":true,"packages":{"package":[{"fp":"1.fd515ec0dc30d25a09641b8b83729234bc50f4511e35ce17d24fd996252eaace"}]},"ping":{"ping_freshness":"{0e82c366-c46a-46cf-9d80-f5f9ad8d48a9}","rd":5230},"updatecheck":{},"version":"7"}],"arch":"x64","dedup":"cr","domainjoined":false,"hw":{"physmemory":16},"lang":"en-GB","nacl_arch":"x86-64","os":{"arch":"x86_64","platform":"Windows","version":"10.0.19041.928"},"prodversion":"79.0.3945.130","protocol":"3.1","requestid":"{25acb0e8-7bc2-48e2-b1cd-4ca9428cdd61}","sessionid":"{cf95c84f-ac3c-4b40-a14b-057d9074ee09}","updaterversion":"79.0.3945.130"}}
--Response 
HTTP/1.1 200
status: 200
content-security-policy: script-src 'report-sample' 'nonce-uaSrV+zGhlTQ6hdX0OuEGg' 'unsafe-inline' 'strict-dynamic' https: http:;object-src 'none';base-uri 'self';report-uri https://csp.withgoogle.com/csp/clientupdate-aus/1
cache-control: no-cache, no-store, max-age=0, must-revalidate
pragma: no-cache
expires: Mon, 01 Jan 1990 00:00:00 GMT
date: Wed, 28 Apr 2021 07:02:48 GMT
x-cup-server-proof: 3046022100a7beedd2e0d5f92d46a5a947c9de397471bbb66a35d7adcd91b9a65f45c41881022100edf38fb61ffaefd65b660a536fb1565b49dd06877848d1cdafe9026e79241188:0b13581bafe657ddbffb8a1771b7a76314bb0ec11a417cf28c830fc57cff9bee
etag: W/\"3046022100a7beedd2e0d5f92d46a5a947c9de397471bbb66a35d7adcd91b9a65f45c41881022100edf38fb61ffaefd65b660a536fb1565b49dd06877848d1cdafe9026e79241188:0b13581bafe657ddbffb8a1771b7a76314bb0ec11a417cf28c830fc57cff9bee\"
content-type: application/json; charset=utf-8
x-daynum: 5231
x-daystart: 168
content-encoding: gzip
x-content-type-options: nosniff
x-frame-options: SAMEORIGIN
x-xss-protection: 1; mode=block
content-length: 1061
server: GSE
alt-svc: h3-29=\":443\"; ma=2592000,h3-T051=\":443\"; ma=2592000,h3-Q050=\":443\"; ma=2592000,h3-Q046=\":443\"; ma=2592000,h3-Q043=\":443\"; ma=2592000,quic=\":443\"; ma=2592000; v=\"46,43\"
----

