
--Response 
HTTP/1.1 200 OK
Server: nginx/1.19.10
Date: Fri, 21 May 2021 07:37:08 GMT
Content-Length: 0
Connection: keep-alive
Access-Control-Allow-Origin: *
Access-Control-Allow-Methods: GET, PUT, PATCH, POST, DELETE, OPTIONS
Access-Control-Allow-Headers: Authorization, Content-Type, Accept
----

--Response 
HTTP/1.1 302
status: 302
p3p: policyref=\"https://googleads.g.doubleclick.net/pagead/gcn_p3p_.xml\", CP=\"CURa ADMa DEVa TAIo PSAo PSDo OUR IND UNI PUR INT DEM STA PRE COM NAV OTC NOI DSP COR\"
timing-allow-origin: *
cross-origin-resource-policy: cross-origin
date: Fri, 21 May 2021 07:37:09 GMT
pragma: no-cache
expires: Fri, 01 Jan 1990 00:00:00 GMT
cache-control: no-cache, must-revalidate
follow-only-when-prerender-shown: 1
strict-transport-security: max-age=21600
location: https://8632166.fls.doubleclick.net/activityi;dc_pre=COKT44Si2vACFRH-aAodIXkD-Q;src=8632166;type=landi0;cat=pdpta0;ord=6281970222192;gtm=2od5c1;auiddc=1177027742.1621582573;u1=4009813;u10=https%3A%2F%2Fwww.kohls.com%2Fproduct%2Fprd-4009813%2Fwomens-lc-lauren-conrad-patch-pocket-high-rise-flare-pants.jsp%3Fprdpv%3D4;u11=Women's%20LC%20Lauren%20Conrad%20Patch%20Pocket%20High%20Rise%20Flare%20Jeans;u13=bottoms;u2=Women's%20LC%20Lauren%20Conrad%20Patch%20Pocket%20High%20Rise%20Flare%20Jeans;u23=New%20Customer;u24=;u25=04c7b2a4-9eb5-41be-bf31-441b23617ef2;u3=29.99;~oref=https%3A%2F%2Fwww.kohls.com%2Fproduct%2Fprd-4009813%2Fwomens-lc-lauren-conrad-patch-pocket-high-rise-flare-pants.jsp%3FprdPV%3D4?
content-type: text/html; charset=UTF-8
x-content-type-options: nosniff
server: cafe
content-length: 0
x-xss-protection: 0
alt-svc: h3-29=\":443\"; ma=2592000,h3-T051=\":443\"; ma=2592000,h3-Q050=\":443\"; ma=2592000,h3-Q046=\":443\"; ma=2592000,h3-Q043=\":443\"; ma=2592000,quic=\":443\"; ma=2592000; v=\"46,43\"
----

