
--Response 
HTTP/1.1 204
status: 204
access-control-allow-origin: *
date: Fri, 21 May 2021 08:16:58 GMT
server-timing: cdn-cache; desc=MISS
server-timing: edge; dur=219
server-timing: origin; dur=63
fwdhst: origin-gcp-us-central1-ecs.kohls.com
set-cookie: akacd_BD_ECS_ELB2=2177452799~rv=9~id=9cd1244f84cb335e781bb0d0ec8343b0; path=/; Expires=Mon, 31 Dec 2038 23:59:59 GMT; Secure; SameSite=None
akamai-request-id2: 96.17.182.213:42430c0c
----

