--Request 
GET http://10.10.30.102:8111/cgi-bin/findflight?outboundFlight=button0&hidden_outboundFlight_button0=000%7C0%7C06-01-2021&hidden_outboundFlight_button1=001%7C0%7C06-01-2021&hidden_outboundFlight_button2=002%7C0%7C06-01-2021&hidden_outboundFlight_button3=003%7C0%7C06-01-2021&numPassengers=1&advanceDiscount=&seatType=Coach&seatPref=None&reserveFlights.x=87&reserveFlights.y=11
Host: 10.10.30.102:8111
Upgrade-Insecure-Requests: 1
User-Agent: Mozilla/5.0 (Windows NT 10.0; WOW64) AppleWebKit/537.36 (KHTML, like Gecko) Chrome/56.0.2924.87 Safari/537.36
Accept: text/html,application/xhtml+xml,application/xml;q=0.9,image/webp,image/apng,*/*;q=0.8,application/signed-exchange;v=b3;q=0.9
Referer: http://10.10.30.102:8111/cgi-bin/findflight?depart=Acapulco&departDate=06-01-2021&arrive=Acapulco&returnDate=06-02-2021&numPassengers=1&seatPref=None&seatType=Coach&findFlights.x=40&findFlights.y=23
Accept-Encoding: gzip, deflate
Accept-Language: en-GB,en-US;q=0.9,en;q=0.8
Cookie: SL_Cookie=a1
----
--Response 
HTTP/1.1 200 OK
Content-length: 0000004304
Connection: Keep-Alive
Content-type: text/html
----
--Request 
GET http://10.10.30.102:8111/tours/Merc10-dev/images/banner_animated.gif
Host: 10.10.30.102:8111
User-Agent: Mozilla/5.0 (Windows NT 10.0; WOW64) AppleWebKit/537.36 (KHTML, like Gecko) Chrome/56.0.2924.87 Safari/537.36
Accept: image/webp,image/apng,image/*,*/*;q=0.8
Referer: http://10.10.30.102:8111/cgi-bin/findflight?outboundFlight=button0&hidden_outboundFlight_button0=000%7C0%7C06-01-2021&hidden_outboundFlight_button1=001%7C0%7C06-01-2021&hidden_outboundFlight_button2=002%7C0%7C06-01-2021&hidden_outboundFlight_button3=003%7C0%7C06-01-2021&numPassengers=1&advanceDiscount=&seatType=Coach&seatPref=None&reserveFlights.x=87&reserveFlights.y=11
Accept-Encoding: gzip, deflate
Accept-Language: en-GB,en-US;q=0.9,en;q=0.8
Cookie: SL_Cookie=a1
----
--Response 
HTTP/1.1 200 OK
Content-Length: 0000016522
Content-Type: image/gif
Connection: Keep-Alive
Date: Mon, 31-May-2021 23:37:33 IST
----
--Request 
GET http://10.10.30.102:8111/tours/Merc10-dev/images/sun_swede.gif
Host: 10.10.30.102:8111
User-Agent: Mozilla/5.0 (Windows NT 10.0; WOW64) AppleWebKit/537.36 (KHTML, like Gecko) Chrome/56.0.2924.87 Safari/537.36
Accept: image/webp,image/apng,image/*,*/*;q=0.8
Referer: http://10.10.30.102:8111/cgi-bin/findflight?outboundFlight=button0&hidden_outboundFlight_button0=000%7C0%7C06-01-2021&hidden_outboundFlight_button1=001%7C0%7C06-01-2021&hidden_outboundFlight_button2=002%7C0%7C06-01-2021&hidden_outboundFlight_button3=003%7C0%7C06-01-2021&numPassengers=1&advanceDiscount=&seatType=Coach&seatPref=None&reserveFlights.x=87&reserveFlights.y=11
Accept-Encoding: gzip, deflate
Accept-Language: en-GB,en-US;q=0.9,en;q=0.8
Cookie: SL_Cookie=a1
----
--Response 
HTTP/1.1 200 OK
Content-Length: 0000004125
Content-Type: image/gif
Connection: Keep-Alive
Date: Mon, 31-May-2021 23:37:33 IST
----
--Request 
GET http://10.10.30.102:8111/tours/Merc10-dev/images/flights.gif
Host: 10.10.30.102:8111
User-Agent: Mozilla/5.0 (Windows NT 10.0; WOW64) AppleWebKit/537.36 (KHTML, like Gecko) Chrome/56.0.2924.87 Safari/537.36
Accept: image/webp,image/apng,image/*,*/*;q=0.8
Referer: http://10.10.30.102:8111/cgi-bin/findflight?outboundFlight=button0&hidden_outboundFlight_button0=000%7C0%7C06-01-2021&hidden_outboundFlight_button1=001%7C0%7C06-01-2021&hidden_outboundFlight_button2=002%7C0%7C06-01-2021&hidden_outboundFlight_button3=003%7C0%7C06-01-2021&numPassengers=1&advanceDiscount=&seatType=Coach&seatPref=None&reserveFlights.x=87&reserveFlights.y=11
Accept-Encoding: gzip, deflate
Accept-Language: en-GB,en-US;q=0.9,en;q=0.8
Cookie: SL_Cookie=a1
----
--Response 
HTTP/1.1 200 OK
Content-Length: 0000001519
Content-Type: image/gif
Connection: Keep-Alive
Date: Mon, 31-May-2021 23:37:33 IST
----
--Request 
GET http://10.10.30.102:8111/tours/Merc10-dev/images/home.gif
Host: 10.10.30.102:8111
User-Agent: Mozilla/5.0 (Windows NT 10.0; WOW64) AppleWebKit/537.36 (KHTML, like Gecko) Chrome/56.0.2924.87 Safari/537.36
Accept: image/webp,image/apng,image/*,*/*;q=0.8
Referer: http://10.10.30.102:8111/cgi-bin/findflight?outboundFlight=button0&hidden_outboundFlight_button0=000%7C0%7C06-01-2021&hidden_outboundFlight_button1=001%7C0%7C06-01-2021&hidden_outboundFlight_button2=002%7C0%7C06-01-2021&hidden_outboundFlight_button3=003%7C0%7C06-01-2021&numPassengers=1&advanceDiscount=&seatType=Coach&seatPref=None&reserveFlights.x=87&reserveFlights.y=11
Accept-Encoding: gzip, deflate
Accept-Language: en-GB,en-US;q=0.9,en;q=0.8
Cookie: SL_Cookie=a1
----
--Response 
HTTP/1.1 200 OK
Content-Length: 0000001268
Content-Type: image/gif
Connection: Keep-Alive
Date: Mon, 31-May-2021 23:37:33 IST
----
--Request 
GET http://10.10.30.102:8111/tours/Merc10-dev/images/signoff.gif
Host: 10.10.30.102:8111
User-Agent: Mozilla/5.0 (Windows NT 10.0; WOW64) AppleWebKit/537.36 (KHTML, like Gecko) Chrome/56.0.2924.87 Safari/537.36
Accept: image/webp,image/apng,image/*,*/*;q=0.8
Referer: http://10.10.30.102:8111/cgi-bin/findflight?outboundFlight=button0&hidden_outboundFlight_button0=000%7C0%7C06-01-2021&hidden_outboundFlight_button1=001%7C0%7C06-01-2021&hidden_outboundFlight_button2=002%7C0%7C06-01-2021&hidden_outboundFlight_button3=003%7C0%7C06-01-2021&numPassengers=1&advanceDiscount=&seatType=Coach&seatPref=None&reserveFlights.x=87&reserveFlights.y=11
Accept-Encoding: gzip, deflate
Accept-Language: en-GB,en-US;q=0.9,en;q=0.8
Cookie: SL_Cookie=a1
----
--Response 
HTTP/1.1 200 OK
Content-Length: 0000001260
Content-Type: image/gif
Connection: Keep-Alive
Date: Mon, 31-May-2021 23:37:33 IST
----
--Request 
GET http://10.10.30.102:8111/tours/images/splash_creditcard.gif
Host: 10.10.30.102:8111
User-Agent: Mozilla/5.0 (Windows NT 10.0; WOW64) AppleWebKit/537.36 (KHTML, like Gecko) Chrome/56.0.2924.87 Safari/537.36
Accept: image/webp,image/apng,image/*,*/*;q=0.8
Referer: http://10.10.30.102:8111/cgi-bin/findflight?outboundFlight=button0&hidden_outboundFlight_button0=000%7C0%7C06-01-2021&hidden_outboundFlight_button1=001%7C0%7C06-01-2021&hidden_outboundFlight_button2=002%7C0%7C06-01-2021&hidden_outboundFlight_button3=003%7C0%7C06-01-2021&numPassengers=1&advanceDiscount=&seatType=Coach&seatPref=None&reserveFlights.x=87&reserveFlights.y=11
Accept-Encoding: gzip, deflate
Accept-Language: en-GB,en-US;q=0.9,en;q=0.8
Cookie: SL_Cookie=a1
----
--Response 
HTTP/1.1 200 OK
Content-Length: 0000002707
Content-Type: image/gif
Connection: Keep-Alive
Date: Mon, 31-May-2021 23:37:33 IST
----
--Request 
GET http://10.10.30.102:8111/tours/images/purchaseflight.gif
Host: 10.10.30.102:8111
User-Agent: Mozilla/5.0 (Windows NT 10.0; WOW64) AppleWebKit/537.36 (KHTML, like Gecko) Chrome/56.0.2924.87 Safari/537.36
Accept: image/webp,image/apng,image/*,*/*;q=0.8
Referer: http://10.10.30.102:8111/cgi-bin/findflight?outboundFlight=button0&hidden_outboundFlight_button0=000%7C0%7C06-01-2021&hidden_outboundFlight_button1=001%7C0%7C06-01-2021&hidden_outboundFlight_button2=002%7C0%7C06-01-2021&hidden_outboundFlight_button3=003%7C0%7C06-01-2021&numPassengers=1&advanceDiscount=&seatType=Coach&seatPref=None&reserveFlights.x=87&reserveFlights.y=11
Accept-Encoding: gzip, deflate
Accept-Language: en-GB,en-US;q=0.9,en;q=0.8
Cookie: SL_Cookie=a1
----
--Response 
HTTP/1.1 200 OK
Content-Length: 0000001541
Content-Type: image/gif
Connection: Keep-Alive
Date: Mon, 31-May-2021 23:37:33 IST
----
--Request 
GET http://10.10.30.102:8111/tours/images/startover.gif
Host: 10.10.30.102:8111
User-Agent: Mozilla/5.0 (Windows NT 10.0; WOW64) AppleWebKit/537.36 (KHTML, like Gecko) Chrome/56.0.2924.87 Safari/537.36
Accept: image/webp,image/apng,image/*,*/*;q=0.8
Referer: http://10.10.30.102:8111/cgi-bin/findflight?outboundFlight=button0&hidden_outboundFlight_button0=000%7C0%7C06-01-2021&hidden_outboundFlight_button1=001%7C0%7C06-01-2021&hidden_outboundFlight_button2=002%7C0%7C06-01-2021&hidden_outboundFlight_button3=003%7C0%7C06-01-2021&numPassengers=1&advanceDiscount=&seatType=Coach&seatPref=None&reserveFlights.x=87&reserveFlights.y=11
Accept-Encoding: gzip, deflate
Accept-Language: en-GB,en-US;q=0.9,en;q=0.8
Cookie: SL_Cookie=a1
----
--Response 
HTTP/1.1 200 OK
Content-Length: 0000001455
Content-Type: image/gif
Connection: Keep-Alive
Date: Mon, 31-May-2021 23:37:33 IST
----
--Request 
GET http://10.10.30.102:8111/tours/vep/images/velocigen.gif
Host: 10.10.30.102:8111
User-Agent: Mozilla/5.0 (Windows NT 10.0; WOW64) AppleWebKit/537.36 (KHTML, like Gecko) Chrome/56.0.2924.87 Safari/537.36
Accept: image/webp,image/apng,image/*,*/*;q=0.8
Referer: http://10.10.30.102:8111/cgi-bin/findflight?outboundFlight=button0&hidden_outboundFlight_button0=000%7C0%7C06-01-2021&hidden_outboundFlight_button1=001%7C0%7C06-01-2021&hidden_outboundFlight_button2=002%7C0%7C06-01-2021&hidden_outboundFlight_button3=003%7C0%7C06-01-2021&numPassengers=1&advanceDiscount=&seatType=Coach&seatPref=None&reserveFlights.x=87&reserveFlights.y=11
Accept-Encoding: gzip, deflate
Accept-Language: en-GB,en-US;q=0.9,en;q=0.8
Cookie: SL_Cookie=a1
----
--Response 
HTTP/1.1 200 OK
Content-Length: 0000002018
Content-Type: image/gif
Connection: Keep-Alive
Date: Mon, 31-May-2021 23:37:33 IST
----
--Request 
GET http://10.10.30.102:8111/favicon.ico
Host: 10.10.30.102:8111
User-Agent: Mozilla/5.0 (Windows NT 10.0; WOW64) AppleWebKit/537.36 (KHTML, like Gecko) Chrome/56.0.2924.87 Safari/537.36
Accept: image/webp,image/apng,image/*,*/*;q=0.8
Referer: http://10.10.30.102:8111/cgi-bin/findflight?outboundFlight=button0&hidden_outboundFlight_button0=000%7C0%7C06-01-2021&hidden_outboundFlight_button1=001%7C0%7C06-01-2021&hidden_outboundFlight_button2=002%7C0%7C06-01-2021&hidden_outboundFlight_button3=003%7C0%7C06-01-2021&numPassengers=1&advanceDiscount=&seatType=Coach&seatPref=None&reserveFlights.x=87&reserveFlights.y=11
Accept-Encoding: gzip, deflate
Accept-Language: en-GB,en-US;q=0.9,en;q=0.8
Cookie: SL_Cookie=a1
----
--Response 
HTTP/1.1 200 OK
Content-Length: 0000000110
Content-Type: image/x-icon
Vary: Accept-Encoding
Server: AkamaiNetStorage
Last-Modified: Fri, 02 Sep 2016 05:34:36 GMT
Cache-Control: max-age=86400
ETag: \"169a2cc888940e4a00633edee13b02ca:1472794476\"
Server-Timing: edge
Accept-Ranges: bytes
Server: AkamaiNetStorage
Last-Modified: Fri, 02 Sep 2016 05:34:36 GMT
Cache-Control: max-age=86400
ETag: \"169a2cc888940e4a00633edee13b02ca:1472794476\"
Accept-Ranges: bytes
Content-Encoding: gzip
Date: Mon, 31-May-2021 23:37:04 IST
----

