--Request 
POST https://ing-district.clicktale.net/ctn_v2/wr/?3301609570255062&24&11&7&0&3&8&subsid=233441&msgsize=120
Host: ing-district.clicktale.net
Host: ing-district.clicktale.net
Connection: keep-alive
Content-Length: 9045
Origin: https://www.kohls.com
User-Agent: Mozilla/5.0 (Windows NT 10.0; WOW64) AppleWebKit/537.36 (KHTML, like Gecko) Chrome/56.0.2924.87 Safari/537.36
Content-Type: text/plain
Accept: */*
Sec-Fetch-Site: cross-site
Sec-Fetch-Mode: cors
Referer: https://www.kohls.com/product/prd-3847510/womens-apt-9-tummy-control-shorts.jsp?color=Medium%20Wash&prdPV=1
Accept-Encoding: gzip, deflate, br
Accept-Language: en-GB,en-US;q=0.9,en;q=0.8
----
 POSTDATA qcm_buffer_timing_fix&7639&9B3XP_([{"type":0,"addedNodes":[{"nodeType":1,"id":"SCRIPT162","type":1,"parentNode":"HEAD1","tagName":"SCRIPT"}],"removedNodes":[]},{"type":0,"addedNodes":[{"nodeType":1,"id":"SCRIPT163","type":1,"parentNode":"HEAD1","tagName":"SCRIPT"}],"removedNodes":[]}])&8CIP_([{"type":0,"addedNodes":[{"nodeType":1,"id":"SCRIPT164","type":1,"nextSibling":"SCRIPT1","tagName":"SCRIPT"}],"removedNodes":[]}])&8BRP_([{"type":1,"attribute":{"attributeName":"style","attributeValue":"display: none;","id":"DIV207"}},{"type":1,"attribute":{"attributeName":"style","attributeValue":"height: auto;","id":"DIV204"}}])&0P_([{"type":0,"addedNodes":[{"nodeType":1,"id":"SCRIPT165","type":1,"nextSibling":"SCRIPT164","tagName":"SCRIPT"}],"removedNodes":[]}])&qP_([{"type":0,"addedNodes":[{"nodeType":1,"id":"SCRIPT166","type":1,"nextSibling":"SCRIPT165","tagName":"SCRIPT"}],"removedNodes":[]}])&GP_([{"type":0,"addedNodes":[{"nodeType":1,"id":"SCRIPT167","type":1,"nextSibling":"SCRIPT166","tagName":"SCRIPT"}],"removedNodes":[]}])&CP_([{"type":0,"addedNodes":[{"nodeType":1,"id":"SCRIPT168","type":1,"nextSibling":"SCRIPT167","tagName":"SCRIPT"}],"removedNodes":[]}])&CP_([{"type":0,"addedNodes":[{"nodeType":1,"id":"SCRIPT169","type":1,"nextSibling":"SCRIPT168","tagName":"SCRIPT"}],"removedNodes":[]}])&KP_([{"type":0,"addedNodes":[{"nodeType":1,"id":"SCRIPT170","type":1,"nextSibling":"SCRIPT169","tagName":"SCRIPT"}],"removedNodes":[]}])&CP_([{"type":0,"addedNodes":[{"nodeType":1,"id":"SCRIPT171","type":1,"nextSibling":"SCRIPT170","tagName":"SCRIPT"}],"removedNodes":[]}])&BP_([{"type":0,"addedNodes":[{"nodeType":1,"id":"SCRIPT172","type":1,"nextSibling":"SCRIPT171","tagName":"SCRIPT"}],"removedNodes":[]}])&CP_([{"type":0,"addedNodes":[{"nodeType":1,"id":"SCRIPT173","type":1,"nextSibling":"SCRIPT172","tagName":"SCRIPT"}],"removedNodes":[]}])&BP_([{"type":0,"addedNodes":[{"nodeType":1,"id":"SCRIPT174","type":1,"nextSibling":"SCRIPT173","tagName":"SCRIPT"}],"removedNodes":[]}])&FP_([{"type":0,"addedNodes":[{"nodeType":1,"id":"SCRIPT175","type":1,"nextSibling":"SCRIPT174","tagName":"SCRIPT"}],"removedNodes":[]}])&OP_([{"type":0,"addedNodes":[{"nodeType":1,"id":"SCRIPT176","type":1,"nextSibling":"SCRIPT175","tagName":"SCRIPT"}],"removedNodes":[]}])&PP_([{"type":0,"addedNodes":[{"nodeType":1,"id":"SCRIPT177","type":1,"nextSibling":"SCRIPT176","tagName":"SCRIPT"}],"removedNodes":[]}])&HP_([{"type":1,"attribute":{"attributeName":"data-attached","attributeValue":"true","id":"DIV155"}},{"type":0,"addedNodes":[{"nodeType":1,"id":"DIV319","type":1,"parentNode":"DIV155","tagName":"DIV","attributes":{"class":"fp-element","role":"widget"},"childNodes":[{"nodeType":1,"id":"DIV320","tagName":"DIV","attributes":{"class":"fp-logo-container"},"childNodes":[{"nodeType":1,"id":"DIV321","tagName":"DIV","attributes":{"class":"fp-logo"}},{"nodeType":1,"id":"DIV322","tagName":"DIV","attributes":{"class":"fp-logo-text","tabindex":"0","role":"button"},"childNodes":[{"nodeType":3,"id":"#text2095","textContent":"Fit Predictor"}]}]},{"nodeType":1,"id":"DIV323","tagName":"DIV","attributes":{"class":"fp-info-container"},"childNodes":[{"nodeType":1,"id":"DIV324","tagName":"DIV","attributes":{"class":"fp-cta"},"childNodes":[{"nodeType":3,"id":"#text2096","textContent":"Calculate your size"}]}]}]}],"removedNodes":[]},{"type":0,"addedNodes":[{"id":"DIV321","type":0,"parentNode":"DIV320"}],"removedNodes":[]},{"type":0,"addedNodes":[{"id":"DIV322","type":0,"parentNode":"DIV320"}],"removedNodes":[]},{"type":0,"addedNodes":[{"id":"DIV324","type":0,"parentNode":"DIV323"}],"removedNodes":[]}])&8H2P_([{"type":0,"addedNodes":[{"nodeType":1,"id":"SCRIPT178","type":1,"parentNode":"BODY1","tagName":"SCRIPT"}],"removedNodes":[]},{"type":0,"addedNodes":[{"nodeType":1,"id":"SCRIPT179","type":1,"nextSibling":"SCRIPT177","tagName":"SCRIPT"}],"removedNodes":[]}])&8CRP_([{"type":1,"attribute":{"attributeName":"class","attributeValue":"kjs khrgDefaultFontfamily","id":"BODY1"}},{"type":0,"addedNodes":[{"nodeType":1,"id":"IFRAME8","type":1,"parentNode":"BODY1","tagName":"IFRAME","attributes":{"id":"khrg_id_addtolist_target","name":"khrg_addtolist_target","title":"Cross Domain","style":"width: 0px; height: 0px; visibility: hidden;"}}],"removedNodes":[]},{"type":0,"addedNodes":[{"nodeType":1,"id":"FORM6","type":1,"parentNode":"BODY1","tagName":"FORM","attributes":{"name":"form_doPost","id":"form_id_doPost","action":"https://registry.kohls.com/v2/addItemsToList","method":"POST","target":"khrg_addtolist_target"}}],"removedNodes":[]}])&8BPP_([{"type":0,"addedNodes":[{"nodeType":1,"id":"SCRIPT180","type":1,"nextSibling":"SCRIPT42","tagName":"SCRIPT"}],"removedNodes":[]},{"type":0,"addedNodes":[{"nodeType":1,"id":"SCRIPT181","type":1,"nextSibling":"SCRIPT42","tagName":"SCRIPT"}],"removedNodes":[]},{"type":0,"addedNodes":[{"nodeType":1,"id":"SCRIPT182","type":1,"nextSibling":"SCRIPT42","tagName":"SCRIPT"}],"removedNodes":[]},{"type":0,"addedNodes":[{"nodeType":1,"id":"LINK23","type":1,"parentNode":"HEAD1","tagName":"LINK","attributes":{"href":"https://s3.amazonaws.com/nv-p1-s3-assets-01/233441/24/CSS/https/www.kohls.com/snb/media/44.0.0-1535/css/skava-custom.css","rel":"stylesheet","media":"only x","type":"text/css","data-kjs":""}}],"removedNodes":[]}])&qP_([{"type":0,"addedNodes":[{"nodeType":1,"id":"SCRIPT183","type":1,"parentNode":"BODY1","tagName":"SCRIPT"}],"removedNodes":[]},{"type":0,"addedNodes":[{"nodeType":1,"id":"SCRIPT184","type":1,"nextSibling":"SCRIPT179","tagName":"SCRIPT"}],"removedNodes":[]}])&HP_([{"type":0,"addedNodes":[{"nodeType":1,"id":"SCRIPT185","type":1,"parentNode":"HEAD1","tagName":"SCRIPT"}],"removedNodes":[]}])&DP_([{"type":0,"addedNodes":[],"removedNodes":[{"id":"SCRIPT38"}]}])&KP_([{"type":0,"addedNodes":[{"nodeType":1,"id":"LINK24","type":1,"nextSibling":"SCRIPT184","tagName":"LINK","attributes":{"id":"tfc-fitrec-css","type":"text/css","rel":"stylesheet","href":"https://s3.amazonaws.com/nv-p1-s3-assets-01/233441/24/CSS/https/cdn.truefitcorp.com/store-koh/6.56.1.19/resources/store/koh/css/fitrec.css"}}],"removedNodes":[]},{"type":0,"addedNodes":[{"nodeType":1,"id":"SCRIPT186","type":1,"nextSibling":"SCRIPT184","tagName":"SCRIPT"}],"removedNodes":[]},{"type":0,"addedNodes":[{"nodeType":1,"id":"SCRIPT187","type":1,"nextSibling":"SCRIPT186","tagName":"SCRIPT"}],"removedNodes":[]}])&SZOC8D8WC9BjsAP_([{"type":0,"addedNodes":[],"removedNodes":[{"id":"SCRIPT165"}]}])&qP_([{"type":0,"addedNodes":[],"removedNodes":[{"id":"SCRIPT166"}]}])&DP_([{"type":0,"addedNodes":[],"removedNodes":[{"id":"SCRIPT167"}]}])&DP_([{"type":0,"addedNodes":[],"removedNodes":[{"id":"SCRIPT168"}]}])&BP_([{"type":0,"addedNodes":[],"removedNodes":[{"id":"SCRIPT170"}]}])&CP_([{"type":0,"addedNodes":[{"nodeType":3,"id":"#text2098","type":1,"parentNode":"DIV106","textContent":""}],"removedNodes":[]},{"type":0,"addedNodes":[{"nodeType":1,"id":"DIV333","type":1,"parentNode":"BODY1","tagName":"DIV","attributes":{"tabindex":"-1"},"childNodes":[{"nodeType":3,"id":"#text2099","textContent":""}]}],"removedNodes":[]},{"type":0,"addedNodes":[{"id":"#text2099","type":0,"parentNode":"DIV333"}],"removedNodes":[]},{"type":1,"attribute":{"attributeName":"data-bv-ready","attributeValue":"true","id":"DIV106"}}])&qP_([{"type":0,"addedNodes":[],"removedNodes":[{"id":"SCRIPT169"}]}])&AP_([{"type":0,"addedNodes":[],"removedNodes":[{"id":"SCRIPT173"}]}])&8BUP_([{"type":0,"addedNodes":[],"removedNodes":[{"id":"SCRIPT172"}]}])&BP_([{"type":0,"addedNodes":[{"nodeType":1,"id":"DIV334","type":1,"parentNode":"DIV235","tagName":"DIV","attributes":{"id":"BVQAContainer"}}],"removedNodes":[]},{"type":1,"attribute":{"attributeName":"data-bv-ready","attributeValue":"true","id":"DIV235"}}])&IP_([{"type":0,"addedNodes":[],"removedNodes":[{"id":"SCRIPT174"}]}])&AP_([{"type":1,"attribute":{"attributeName":"data-bv-ready","attributeValue":"true","id":"DIV230"}}])&NZODKWD9Ck+AZOEKWE9CmPAP_([{"type":0,"addedNodes":[],"removedNodes":[{"id":"SCRIPT171"}]}])&DP_([{"type":0,"addedNodes":[],"removedNodes":[{"id":"SCRIPT175"}]}])&DP_([{"type":0,"addedNodes":[{"nodeType":1,"id":"DIV335","type":1,"parentNode":"DIV240","tagName":"DIV","attributes":{"id":"BVRRContainer"}}],"removedNodes":[]},{"type":1,"attribute":{"attributeName":"data-bv-ready","attributeValue":"true","id":"DIV240"}}])&IP_([{"type":0,"addedNodes":[],"removedNodes":[{"id":"SCRIPT176"}]}])&AP_([{"type":1,"attribute":{"attributeName":"media","attributeValue":"all","id":"LINK23"}}])&HZOFTWF9PM/AP_([{"type":0,"addedNodes":[],"removedNodes":[{"id":"SCRIPT177"}]}])&8B8P_([{"type":0,"addedNodes":[{"nodeType":1,"id":"SCRIPT189","type":1,"nextSibling":"SCRIPT187","tagName":"SCRIPT"}],"removedNodes":[]}])&CP_([{"type":0,"addedNodes":[{"nodeType":1,"id":"SCRIPT190","type":1,"nextSibling":"SCRIPT189","tagName":"SCRIPT"}],"removedNodes":[]}])&dP_([{"type":1,"attribute":{"attributeName":"nvsensitive","attributeValue":"","id":"INPUT7"}},{"type":1,"attribute":{"attributeName":"nvsensitive","attributeValue":"","id":"DIV17"}}])&8Djqcm_buffer_timing_fix&9721&F
--Response 
HTTP/1.1 200
status: 200
date: Fri, 21 May 2021 08:11:01 GMT
content-type: text/plain; charset=UTF-8
content-length: 1
access-control-allow-origin: *
----

