--Request 
GET http://10.10.30.102:8111/cgi-bin/reservation
Host: 10.10.30.102:8111
Upgrade-Insecure-Requests: 1
User-Agent: Mozilla/5.0 (Windows NT 10.0; WOW64) AppleWebKit/537.36 (KHTML, like Gecko) Chrome/56.0.2924.87 Safari/537.36
Accept: text/html,application/xhtml+xml,application/xml;q=0.9,image/webp,image/apng,*/*;q=0.8,application/signed-exchange;v=b3;q=0.9
Referer: http://10.10.30.102:8111/cgi-bin/login?userSession=75893.0884568651DQADHfApHDHfcDtccpfAttcf&username=&password=&login.x=45&login.y=19&JSFormSubmit=off
Accept-Encoding: gzip, deflate
Accept-Language: en-GB,en-US;q=0.9,en;q=0.8
Cookie: SL_Cookie=a1
----
--Response 
HTTP/1.1 200 OK
Content-length: 0000004653
Connection: Keep-Alive
Content-type: text/html
----
--Request 
GET http://10.10.30.102:8111/tours/Merc10-dev/images/banner_animated.gif
Host: 10.10.30.102:8111
User-Agent: Mozilla/5.0 (Windows NT 10.0; WOW64) AppleWebKit/537.36 (KHTML, like Gecko) Chrome/56.0.2924.87 Safari/537.36
Accept: image/webp,image/apng,image/*,*/*;q=0.8
Referer: http://10.10.30.102:8111/cgi-bin/reservation
Accept-Encoding: gzip, deflate
Accept-Language: en-GB,en-US;q=0.9,en;q=0.8
Cookie: SL_Cookie=a1
----
--Response 
HTTP/1.1 200 OK
Content-Length: 0000016522
Content-Type: image/gif
Connection: Keep-Alive
Date: Mon, 31-May-2021 23:37:08 IST
----
--Request 
GET http://10.10.30.102:8111/tours/Merc10-dev/images/sun_swede.gif
Host: 10.10.30.102:8111
User-Agent: Mozilla/5.0 (Windows NT 10.0; WOW64) AppleWebKit/537.36 (KHTML, like Gecko) Chrome/56.0.2924.87 Safari/537.36
Accept: image/webp,image/apng,image/*,*/*;q=0.8
Referer: http://10.10.30.102:8111/cgi-bin/reservation
Accept-Encoding: gzip, deflate
Accept-Language: en-GB,en-US;q=0.9,en;q=0.8
Cookie: SL_Cookie=a1
----
--Response 
HTTP/1.1 200 OK
Content-Length: 0000004125
Content-Type: image/gif
Connection: Keep-Alive
Date: Mon, 31-May-2021 23:37:08 IST
----
--Request 
GET http://10.10.30.102:8111/tours/Merc10-dev/images/flights.gif
Host: 10.10.30.102:8111
User-Agent: Mozilla/5.0 (Windows NT 10.0; WOW64) AppleWebKit/537.36 (KHTML, like Gecko) Chrome/56.0.2924.87 Safari/537.36
Accept: image/webp,image/apng,image/*,*/*;q=0.8
Referer: http://10.10.30.102:8111/cgi-bin/reservation
Accept-Encoding: gzip, deflate
Accept-Language: en-GB,en-US;q=0.9,en;q=0.8
Cookie: SL_Cookie=a1
----
--Response 
HTTP/1.1 200 OK
Content-Length: 0000001519
Content-Type: image/gif
Connection: Keep-Alive
Date: Mon, 31-May-2021 23:37:08 IST
----
--Request 
GET http://10.10.30.102:8111/tours/Merc10-dev/images/home.gif
Host: 10.10.30.102:8111
User-Agent: Mozilla/5.0 (Windows NT 10.0; WOW64) AppleWebKit/537.36 (KHTML, like Gecko) Chrome/56.0.2924.87 Safari/537.36
Accept: image/webp,image/apng,image/*,*/*;q=0.8
Referer: http://10.10.30.102:8111/cgi-bin/reservation
Accept-Encoding: gzip, deflate
Accept-Language: en-GB,en-US;q=0.9,en;q=0.8
Cookie: SL_Cookie=a1
----
--Response 
HTTP/1.1 200 OK
Content-Length: 0000001268
Content-Type: image/gif
Connection: Keep-Alive
Date: Mon, 31-May-2021 23:37:08 IST
----
--Request 
GET http://10.10.30.102:8111/tours/Merc10-dev/images/signoff.gif
Host: 10.10.30.102:8111
User-Agent: Mozilla/5.0 (Windows NT 10.0; WOW64) AppleWebKit/537.36 (KHTML, like Gecko) Chrome/56.0.2924.87 Safari/537.36
Accept: image/webp,image/apng,image/*,*/*;q=0.8
Referer: http://10.10.30.102:8111/cgi-bin/reservation
Accept-Encoding: gzip, deflate
Accept-Language: en-GB,en-US;q=0.9,en;q=0.8
Cookie: SL_Cookie=a1
----
--Response 
HTTP/1.1 200 OK
Content-Length: 0000001260
Content-Type: image/gif
Connection: Keep-Alive
Date: Mon, 31-May-2021 23:37:08 IST
----
--Request 
GET http://10.10.30.102:8111/tours/Merc10-dev/images/splash_Findflight.gif
Host: 10.10.30.102:8111
User-Agent: Mozilla/5.0 (Windows NT 10.0; WOW64) AppleWebKit/537.36 (KHTML, like Gecko) Chrome/56.0.2924.87 Safari/537.36
Accept: image/webp,image/apng,image/*,*/*;q=0.8
Referer: http://10.10.30.102:8111/cgi-bin/reservation
Accept-Encoding: gzip, deflate
Accept-Language: en-GB,en-US;q=0.9,en;q=0.8
Cookie: SL_Cookie=a1
----
--Response 
HTTP/1.1 200 OK
Content-Length: 0000002215
Content-Type: image/gif
Connection: Keep-Alive
Date: Mon, 31-May-2021 23:37:08 IST
----
--Request 
GET http://10.10.30.102:8111/tours/images/continue.gif
Host: 10.10.30.102:8111
User-Agent: Mozilla/5.0 (Windows NT 10.0; WOW64) AppleWebKit/537.36 (KHTML, like Gecko) Chrome/56.0.2924.87 Safari/537.36
Accept: image/webp,image/apng,image/*,*/*;q=0.8
Referer: http://10.10.30.102:8111/cgi-bin/reservation
Accept-Encoding: gzip, deflate
Accept-Language: en-GB,en-US;q=0.9,en;q=0.8
Cookie: SL_Cookie=a1
----
--Response 
HTTP/1.1 200 OK
Content-Length: 0000001432
Content-Type: image/gif
Connection: Keep-Alive
Date: Mon, 31-May-2021 23:37:08 IST
----
--Request 
GET http://10.10.30.102:8111/tours/vep/images/velocigen.gif
Host: 10.10.30.102:8111
User-Agent: Mozilla/5.0 (Windows NT 10.0; WOW64) AppleWebKit/537.36 (KHTML, like Gecko) Chrome/56.0.2924.87 Safari/537.36
Accept: image/webp,image/apng,image/*,*/*;q=0.8
Referer: http://10.10.30.102:8111/cgi-bin/reservation
Accept-Encoding: gzip, deflate
Accept-Language: en-GB,en-US;q=0.9,en;q=0.8
Cookie: SL_Cookie=a1
----
--Response 
HTTP/1.1 200 OK
Content-Length: 0000002018
Content-Type: image/gif
Connection: Keep-Alive
Date: Mon, 31-May-2021 23:37:08 IST
----
--Request 
GET http://10.10.30.102:8111/favicon.ico
Host: 10.10.30.102:8111
User-Agent: Mozilla/5.0 (Windows NT 10.0; WOW64) AppleWebKit/537.36 (KHTML, like Gecko) Chrome/56.0.2924.87 Safari/537.36
Accept: image/webp,image/apng,image/*,*/*;q=0.8
Referer: http://10.10.30.102:8111/cgi-bin/reservation
Accept-Encoding: gzip, deflate
Accept-Language: en-GB,en-US;q=0.9,en;q=0.8
Cookie: SL_Cookie=a1
----
--Response 
HTTP/1.1 200 OK
Content-Length: 0000000110
Content-Type: image/x-icon
Vary: Accept-Encoding
Server: AkamaiNetStorage
Last-Modified: Fri, 02 Sep 2016 05:34:36 GMT
Cache-Control: max-age=86400
ETag: \"169a2cc888940e4a00633edee13b02ca:1472794476\"
Server-Timing: edge
Accept-Ranges: bytes
Server: AkamaiNetStorage
Last-Modified: Fri, 02 Sep 2016 05:34:36 GMT
Cache-Control: max-age=86400
ETag: \"169a2cc888940e4a00633edee13b02ca:1472794476\"
Accept-Ranges: bytes
Content-Encoding: gzip
Date: Mon, 31-May-2021 23:37:04 IST
----

