
--Response 
HTTP/1.1 200
status: 200
timing-allow-origin: *
x-oneagent-js-injection: true
correlation-id: :null::9ae9a103-353e-4a3e-b861-3a1a29bfab4f::1621584334501::us-central1-b::cprod-blue-accservice-prod-7543::null::ACC::session::22.0.2-20210426.231950-1117::null::null::null::null::null::null
x-isvalidated: true
x-partner_guid: 66469016512772ACCM570fe8cace1a
x-lat: A
x-sessionid_expires: 2021-05-21 03:20:34.503
x-sessionid: 196815f0-9900-44f0-adaf-570fe8cace1a
content-type: application/json
content-encoding: gzip
content-length: 223
x-edgeconnect-midmile-rtt: 158
x-edgeconnect-origin-mex-latency: 115
x-origin-ttl: Thu, 01 Jan 1970 00:00:00 GMT
x-origin-ttl: Thu, 01 Jan 1970 00:00:00 GMT
expires: Fri, 21 May 2021 08:05:34 GMT
cache-control: max-age=0, no-cache, no-store
pragma: no-cache
date: Fri, 21 May 2021 08:05:34 GMT
vary: Accept-Encoding
set-cookie: dtCookie=v_4_srv_3_sn_213F6B634D3B4E7995C9AF774CF4D9D4_perc_100000_ol_0_mul_1_app-3Aea7c4b59f27d43eb_1_rcs-3Acss_0; Path=/; Domain=.kohls.com
set-cookie: X-SESSIONID=196815f0-9900-44f0-adaf-570fe8cace1a; Path=/; Secure; HttpOnly
set-cookie: X-PROFILEID=; Path=/; Expires=Thu, 01-Jan-1970 00:00:00 GMT; Max-Age=0; Secure; HttpOnly
set-cookie: VisitorId=196815f0-9900-44f0-adaf-570fe8cace1a; Path=/; Domain=.www.kohls.com; Secure
set-cookie: DYN_USER_ID=; Path=/; Expires=Thu, 01-Jan-1970 00:00:00 GMT; Max-Age=0; Secure
set-cookie: SoftLoggedInCookie=; Path=/; Domain=.www.kohls.com; Expires=Thu, 01-Jan-1970 00:00:00 GMT; Max-Age=0; Secure
set-cookie: loyalty_id=; Path=/; Domain=.www.kohls.com; Expires=Thu, 01-Jan-1970 00:00:00 GMT; Max-Age=0; Secure
set-cookie: _dyid_server=7656119531360184738; expires=Sat, 21-May-2022 08:05:34 GMT; path=/; domain=.kohls.com; secure
set-cookie: akavpau_www=1621584634~id=11a4f85adb19d17a873ad776b179c1c8; Path=/; HttpOnly; Secure; SameSite=None
server-timing: cdn-cache; desc=MISS
server-timing: edge; dur=177
server-timing: origin; dur=115
server-timing: dtRpid;desc=\"-180231854\"
content-security-policy: block-all-mixed-content; frame-ancestors https://testzuiweb.kohls.zootweb.com https://testapplynow.kohls.zootweb.com 'self';
x-frame-options: SAMEORIGIN
strict-transport-security: max-age=15768000 ; preload
----

--Response 
HTTP/1.1 200
status: 200
content-type: application/javascript
accept-ranges: bytes
content-encoding: br
etag: \"609ebb8d-13bf9\"
last-modified: Wed, 19 May 2021 14:00:11 GMT
server: Akamai Resource Optimizer
x-origin-cc: max-age=86400
x-origin-cc: max-age=86400
x-origin-cc: max-age=86400
x-origin-cc: max-age=86400
x-origin-ttl: Thu, 20 May 2021 14:00:10 GMT
x-origin-ttl: Thu, 20 May 2021 14:00:10 GMT
x-origin-ttl: Thu, 20 May 2021 14:00:10 GMT
x-origin-ttl: Thu, 20 May 2021 14:00:10 GMT
content-length: 10037
cache-control: max-age=86400
expires: Sat, 22 May 2021 08:05:34 GMT
date: Fri, 21 May 2021 08:05:34 GMT
set-cookie: _dyid_server=7656119531360184738; expires=Sat, 21-May-2022 08:05:34 GMT; path=/; domain=.kohls.com; secure
server-timing: cdn-cache; desc=HIT
server-timing: edge; dur=21
server-timing: dtRpid;desc=\"-664263584\"
content-security-policy: block-all-mixed-content; frame-ancestors https://testzuiweb.kohls.zootweb.com https://testapplynow.kohls.zootweb.com 'self';
x-frame-options: SAMEORIGIN
strict-transport-security: max-age=15768000 ; preload
----

