--Request 
GET http://10.10.30.102:8333/cgi-bin/welcome
Host: 10.10.30.102:8333
Host: 10.10.30.102:8333
Connection: keep-alive
Upgrade-Insecure-Requests: 1
User-Agent: Mozilla/5.0 (Windows NT 10.0; Win64; x64) AppleWebKit/537.36 (KHTML, like Gecko) Chrome/79.0.3945.130 Safari/537.36
Accept: text/html,application/xhtml+xml,application/xml;q=0.9,image/webp,image/apng,*/*;q=0.8,application/signed-exchange;v=b3;q=0.9
Referer: http://10.10.30.102:8333/cgi-bin/findflight?firstName=Tiger&lastName=Scott&address1=4261+Stevenson+Blvd.&address2=Fremont%2C+CA+94538&pass1=Scott+Tiger&creditCard=&expDate=&oldCCOption=&numPassengers=1&seatType=Coach&seatPref=None&outboundFlight=002%7C0%7C05-25-2021&advanceDiscount=&buyFlights.x=48&buyFlights.y=13&.cgifields=saveCC
Accept-Encoding: gzip, deflate
Accept-Language: en-GB,en-US;q=0.9,en;q=0.8
----
--Response 
HTTP/1.1 200 OK
Content-length: 0000002957
Connection: Keep-Alive
Content-type: text/html
----
--Request 
GET http://10.10.30.102:8333/tours/Merc10-dev/images/banner_animated.gif
Host: 10.10.30.102:8333
Host: 10.10.30.102:8333
Connection: keep-alive
User-Agent: Mozilla/5.0 (Windows NT 10.0; Win64; x64) AppleWebKit/537.36 (KHTML, like Gecko) Chrome/79.0.3945.130 Safari/537.36
Accept: image/webp,image/apng,image/*,*/*;q=0.8
Referer: http://10.10.30.102:8333/cgi-bin/welcome
Accept-Encoding: gzip, deflate
Accept-Language: en-GB,en-US;q=0.9,en;q=0.8
----
--Response 
HTTP/1.1 200 OK
Content-Length: 16522
Content-Type: image/gif
Connection: Keep-Alive
----
--Request 
GET http://10.10.30.102:8333/tours/Merc10-dev/images/sun_swede.gif
Host: 10.10.30.102:8333
Host: 10.10.30.102:8333
Connection: keep-alive
User-Agent: Mozilla/5.0 (Windows NT 10.0; Win64; x64) AppleWebKit/537.36 (KHTML, like Gecko) Chrome/79.0.3945.130 Safari/537.36
Accept: image/webp,image/apng,image/*,*/*;q=0.8
Referer: http://10.10.30.102:8333/cgi-bin/welcome
Accept-Encoding: gzip, deflate
Accept-Language: en-GB,en-US;q=0.9,en;q=0.8
----
--Response 
HTTP/1.1 200 OK
Content-Length: 4125
Content-Type: image/gif
Connection: Keep-Alive
----
--Request 
GET http://10.10.30.102:8333/tours/Merc10-dev/images/login.gif
Host: 10.10.30.102:8333
Host: 10.10.30.102:8333
Connection: keep-alive
User-Agent: Mozilla/5.0 (Windows NT 10.0; Win64; x64) AppleWebKit/537.36 (KHTML, like Gecko) Chrome/79.0.3945.130 Safari/537.36
Accept: image/webp,image/apng,image/*,*/*;q=0.8
Referer: http://10.10.30.102:8333/cgi-bin/welcome
Accept-Encoding: gzip, deflate
Accept-Language: en-GB,en-US;q=0.9,en;q=0.8
----
--Response 
HTTP/1.1 200 OK
Content-Length: 1323
Content-Type: image/gif
Connection: Keep-Alive
----
--Request 
GET http://10.10.30.102:8333/tours/images/banner_merctur.jpg
Host: 10.10.30.102:8333
Host: 10.10.30.102:8333
Connection: keep-alive
User-Agent: Mozilla/5.0 (Windows NT 10.0; Win64; x64) AppleWebKit/537.36 (KHTML, like Gecko) Chrome/79.0.3945.130 Safari/537.36
Accept: image/webp,image/apng,image/*,*/*;q=0.8
Referer: http://10.10.30.102:8333/cgi-bin/welcome
Accept-Encoding: gzip, deflate
Accept-Language: en-GB,en-US;q=0.9,en;q=0.8
----
--Response 
HTTP/1.1 200 OK
Content-Length: 22548
Content-Type: image/jpeg
Connection: Keep-Alive
----
--Request 
GET http://10.10.30.102:8333/tours/vep/images/velocigen.gif
Host: 10.10.30.102:8333
Host: 10.10.30.102:8333
Connection: keep-alive
User-Agent: Mozilla/5.0 (Windows NT 10.0; Win64; x64) AppleWebKit/537.36 (KHTML, like Gecko) Chrome/79.0.3945.130 Safari/537.36
Accept: image/webp,image/apng,image/*,*/*;q=0.8
Referer: http://10.10.30.102:8333/cgi-bin/welcome
Accept-Encoding: gzip, deflate
Accept-Language: en-GB,en-US;q=0.9,en;q=0.8
----
--Response 
HTTP/1.1 200 OK
Content-Length: 2018
Content-Type: image/gif
Connection: Keep-Alive
----

