--Request 
POST https://play.google.com/log?format=json&hasfast=true&authuser=0
Host: play.google.com
Host: play.google.com
Connection: keep-alive
Content-Length: 7815
Authorization: SAPISIDHASH 9d2231cb21a5d87db5e2378f9c5f35c29a338813
Origin: https://mail.google.com
X-Goog-AuthUser: 0
User-Agent: Mozilla/5.0 (Windows NT 10.0; Win64; x64) AppleWebKit/537.36 (KHTML, like Gecko) Chrome/79.0.3945.130 Safari/537.36
Content-Type: application/x-www-form-urlencoded;charset=UTF-8
Accept: */*
Sec-Fetch-Site: same-site
Sec-Fetch-Mode: cors
Referer: https://mail.google.com/mail/u/0/
Accept-Encoding: gzip, deflate, br
Accept-Language: en-GB,en-US;q=0.9,en;q=0.8
Cookie: SID=8wdD23M0zT1muB_G7zm1RcdpXcTV9pgu899MrjEHx4F9koQYO2nUhhv57bJP9jOa-xXwCQ.; __Secure-3PSID=8wdD23M0zT1muB_G7zm1RcdpXcTV9pgu899MrjEHx4F9koQYA-wfYnEQ-ysFwqZqC3qmBw.; HSID=ARsC0xTZAuXrWMsnv; SSID=AcVA6-GGICXqf9J2j; APISID=YJ2-WvqJsfDZ_6LX/Aw6EB3te0F5GcNF_4; SAPISID=eZPEKcNhzxFHpS8e/AXrnV3TZ36Wk7edFa; __Secure-3PAPISID=eZPEKcNhzxFHpS8e/AXrnV3TZ36Wk7edFa; 1P_JAR=2021-04-28-06; SEARCH_SAMESITE=CgQIuZIB; NID=214=Atokn4Q0yZ25GhTZ0XijMI0V-LFxghRKeweF5LkHOyn-q7mDEKj5k3YK3WToFskS25eBOSFJdzjSYHxnrhwXOzAYkaSFdjVHwAwBZEgAzS9qSzi1kIaTqF0rsQjFxRWrSW-6OUYKFsLMQ_jcZWJ-DuOfdICtr2YjqCqONVISBjjuGWXDN4P79gWIBVUBHMXSg5EshyeoWIsy78ZLcQ; SIDCC=AJi4QfHs4GyA0ZGXj5VcVm6TUIGZLtPDQokc62EHqoX8raPZ4QfBm4yjtR5mwQRlm3VhisE7; __Secure-3PSIDCC=AJi4QfG821BXWQsMWMdM6TJfbiC6D2_Um5gzwI1Iox8dxoRvgCpRjI1Hq9WcHg1WoTglUtv2iw
----
 POSTDATA [[1,null,null,null,null,null,null,null,null,null,[null,null,null,null,"en"]],893,[["1619591951109",null,[],null,null,null,null,"[\"1619591946094\",[[null,null,[[\"0\",\"11\"]],\"-4959446818712997655\"],[null,null,[[\"0\",\"5\"]],\"942790293620930274\"],[null,null,[[\"0\",\"5\"]],\"-6599056016198770034\"],[null,null,[[\"0\",\"5\"]],\"7367863417336259419\"],[null,null,[[\"51680114\",\"1\"]],\"2783112258024556088\"],[null,null,[[\"38560034\",\"1\"]],\"-3967474719957906250\"],[null,null,[[\"1\",\"1\"]],\"8156935523321976108\"],[null,null,[[\"3837\",\"1\"]],\"-4481849414583003945\"],[null,null,[[\"0\",\"1\"]],\"7060951837351133665\"],[null,null,[[\"0\",\"2\"],[\"50\",\"9\"]],\"-2516723497608421612\"],[null,null,[[\"0\",\"1\"]],\"-8116503699014023182\"],[null,null,[[\"0\",\"1\"]],\"2562181559016560727\"],[null,null,[[\"107\",\"3\"]],\"5831036667936232446\"],[null,null,[[\"0\",\"1\"]],\"1034946293555366177\"],[null,null,[[\"107\",\"1\"]],\"-161189394366280054\"],[null,null,[[\"151\",\"1\"]],\"-3070150658141692169\"],[null,null,[[\"1112916\",\"1\"]],\"1872363352292334908\"],[null,null,[[\"0\",\"1\"]],\"-6188756759949672964\"],[null,null,[[\"0\",\"1\"]],\"8668660156681077229\"],[null,null,[[\"0\",\"1\"]],\"-8692212986168768267\"],[null,null,[[\"3803\",\"1\"]],\"3674416918965118215\"],[null,null,[[\"0\",\"1\"]],\"-2626802438754436212\"],[null,null,[[\"50\",\"5\"],[\"0\",\"1\"]],\"-7442833728258606944\"],[null,null,[[\"0\",\"1\"]],\"6064600358658876886\"],[null,null,[[\"3837\",\"1\"]],\"-9071897846402698467\"],[null,null,[[\"0\",\"1\"]],\"-2785542543111349306\"]],null,null,\"[[null,null,null,370149053,null,25,\\\"gmail_fe_210421.06_p2\\\",7,null,null,null,null,null,null,null,[6,2,9,4],8192,0,\\\"iv.os\\\"],null,null,null,null,null,null,null,[1,1,0,0,6,null,0,[1,1]]]\"]",null,null,null,null,null,null,-19800,[null,[],null,"[[],[],[7113,7766,7518,7433,7465,7594,7677,7514,7782,7753,7424,7057,7416,7758,7628,7682,7030,7546,7496,7158,6623,7137,5192,6456,6318,7798,7418,7407,5020,7468,7446,7164,7189,6807,5001,6162,6587,7500,5499,6455,8202316,8203183,8203161,8203028,8203691,8202193,8202009,8202484,8201523,8202805,8203287,8203359,8203555,8202610,8203883,8203699,8203378,8202855,8203222,8203363,8202578,8203587,8203298,8203550,8203570,8202965,8202124,45717508,8202813,8202257,8202891,8203044,8203388,8203582,8203464,8203424,8203244,8202563,8203312,8203310,8203295,8203311,8203291,8203609,8202123,8202721,8203455,45779046,8202126,8203514,8203270,8203664,8202463,45775010,8203292,8203421,45772160,8202709,8203103,8202737,8203643,8202918,8200010,45751720,8202511,8203695,8203075,8203178,8203297,45769960,8203347,8203757,8203451,8202753,8203586,8203381,8202924,8203596,8203427,8203385,8203239,8203543,8202125,8202953,8203054,8203611,45772005,8203624,8202323,8202843,45704154],[]]"],null,null,null,[],1,null,null,null,null,null,[]],["1619591951109",null,[],null,null,null,null,"[\"1619591946094\",[[null,null,[[\"13\",\"1\"],[\"1\",\"1\"]],\"8592769406416781108\"],[null,null,[[\"28\",\"1\"],[\"11\",\"1\"]],\"-7558660779622016800\"],[null,null,[[\"1\",\"2\"]],\"-7121550470961355275\"]],null,null,\"[[null,null,null,370149053,null,25,\\\"gmail_fe_210421.06_p2\\\",7,null,null,null,null,null,null,null,[6,2,9,4],8192,0,\\\"iv.os\\\"],null,null,null,null,null,null,[null,null,null,null,null,null,null,null,null,null,null,null,null,null,null,[null,[\\\"ItemsCoordinator.getStoredItemDetailsOrNull\\\",1]]],[1,1,0,0,6,null,0,[1,1]]]\"]",null,null,null,null,null,null,-19800,[null,[],null,"[[],[],[7113,7766,7518,7433,7465,7594,7677,7514,7782,7753,7424,7057,7416,7758,7628,7682,7030,7546,7496,7158,6623,7137,5192,6456,6318,7798,7418,7407,5020,7468,7446,7164,7189,6807,5001,6162,6587,7500,5499,6455,8202316,8203183,8203161,8203028,8203691,8202193,8202009,8202484,8201523,8202805,8203287,8203359,8203555,8202610,8203883,8203699,8203378,8202855,8203222,8203363,8202578,8203587,8203298,8203550,8203570,8202965,8202124,45717508,8202813,8202257,8202891,8203044,8203388,8203582,8203464,8203424,8203244,8202563,8203312,8203310,8203295,8203311,8203291,8203609,8202123,8202721,8203455,45779046,8202126,8203514,8203270,8203664,8202463,45775010,8203292,8203421,45772160,8202709,8203103,8202737,8203643,8202918,8200010,45751720,8202511,8203695,8203075,8203178,8203297,45769960,8203347,8203757,8203451,8202753,8203586,8203381,8202924,8203596,8203427,8203385,8203239,8203543,8202125,8202953,8203054,8203611,45772005,8203624,8202323,8202843,45704154],[]]"],null,null,null,[],2,null,null,null,null,null,[]],["1619591951110",null,[],null,null,null,null,"[\"1619591946094\",[[null,null,[[\"0\",\"1\"]],\"8592769406416781108\"],[null,null,[[\"1\",\"1\"]],\"-7558660779622016800\"],[null,null,[[\"1\",\"1\"]],\"-7121550470961355275\"]],null,null,\"[[null,null,null,370149053,null,25,\\\"gmail_fe_210421.06_p2\\\",7,null,null,null,null,null,null,null,[6,2,9,4],8192,0,\\\"iv.os\\\"],null,null,null,null,null,null,[null,null,null,null,null,null,null,null,null,null,null,null,null,null,null,[null,[\\\"ItemsStorageUpdateHintCalculator.getItemsStorageUpdateHint\\\",0]]],[1,1,0,0,6,null,0,[1,1]]]\"]",null,null,null,null,null,null,-19800,[null,[],null,"[[],[],[7113,7766,7518,7433,7465,7594,7677,7514,7782,7753,7424,7057,7416,7758,7628,7682,7030,7546,7496,7158,6623,7137,5192,6456,6318,7798,7418,7407,5020,7468,7446,7164,7189,6807,5001,6162,6587,7500,5499,6455,8202316,8203183,8203161,8203028,8203691,8202193,8202009,8202484,8201523,8202805,8203287,8203359,8203555,8202610,8203883,8203699,8203378,8202855,8203222,8203363,8202578,8203587,8203298,8203550,8203570,8202965,8202124,45717508,8202813,8202257,8202891,8203044,8203388,8203582,8203464,8203424,8203244,8202563,8203312,8203310,8203295,8203311,8203291,8203609,8202123,8202721,8203455,45779046,8202126,8203514,8203270,8203664,8202463,45775010,8203292,8203421,45772160,8202709,8203103,8202737,8203643,8202918,8200010,45751720,8202511,8203695,8203075,8203178,8203297,45769960,8203347,8203757,8203451,8202753,8203586,8203381,8202924,8203596,8203427,8203385,8203239,8203543,8202125,8202953,8203054,8203611,45772005,8203624,8202323,8202843,45704154],[]]"],null,null,null,[],3,null,null,null,null,null,[]],["1619591951110",null,[],null,null,null,null,"[\"1619591946094\",[[null,null,[[\"0\",\"1\"]],\"8592769406416781108\"],[null,null,[[\"1\",\"1\"]],\"-7558660779622016800\"],[null,null,[[\"1\",\"1\"]],\"-7121550470961355275\"]],null,null,\"[[null,null,null,370149053,null,25,\\\"gmail_fe_210421.06_p2\\\",7,null,null,null,null,null,null,null,[6,2,9,4],8192,0,\\\"iv.os\\\"],null,null,null,null,null,null,[null,null,null,null,null,null,null,null,null,null,null,null,null,null,null,[null,[\\\"ItemsCoordinator.getCurrentWriteVersion\\\",0]]],[1,1,0,0,6,null,0,[1,1]]]\"]",null,null,null,null,null,null,-19800,[null,[],null,"[[],[],[7113,7766,7518,7433,7465,7594,7677,7514,7782,7753,7424,7057,7416,7758,7628,7682,7030,7546,7496,7158,6623,7137,5192,6456,6318,7798,7418,7407,5020,7468,7446,7164,7189,6807,5001,6162,6587,7500,5499,6455,8202316,8203183,8203161,8203028,8203691,8202193,8202009,8202484,8201523,8202805,8203287,8203359,8203555,8202610,8203883,8203699,8203378,8202855,8203222,8203363,8202578,8203587,8203298,8203550,8203570,8202965,8202124,45717508,8202813,8202257,8202891,8203044,8203388,8203582,8203464,8203424,8203244,8202563,8203312,8203310,8203295,8203311,8203291,8203609,8202123,8202721,8203455,45779046,8202126,8203514,8203270,8203664,8202463,45775010,8203292,8203421,45772160,8202709,8203103,8202737,8203643,8202918,8200010,45751720,8202511,8203695,8203075,8203178,8203297,45769960,8203347,8203757,8203451,8202753,8203586,8203381,8202924,8203596,8203427,8203385,8203239,8203543,8202125,8202953,8203054,8203611,45772005,8203624,8202323,8202843,45704154],[]]"],null,null,null,[],4,null,null,null,null,null,[]]],"1619591961114",[],null,null,null,null,null,null,null,null,0]
--Response 
HTTP/1.1 200
status: 200
access-control-allow-origin: https://mail.google.com
access-control-allow-credentials: true
access-control-allow-headers: X-Playlog-Web
content-type: text/plain; charset=UTF-8
content-encoding: gzip
date: Wed, 28 Apr 2021 06:39:22 GMT
server: Playlog
cache-control: private
content-length: 131
x-xss-protection: 0
x-frame-options: SAMEORIGIN
set-cookie: SIDCC=AJi4QfExMFLgEgv012N4YzYO-wldyHIJdZ-79atZFn8aSy3VYtpTb2b4XDKaSN1nH1Wikfur; expires=Thu, 28-Apr-2022 06:39:22 GMT; path=/; domain=.google.com; priority=high
set-cookie: __Secure-3PSIDCC=AJi4QfFS8iLcNSLLmXmL6P-UR1mb-hpYzXcH2VKdZMqxWLJNWo1G4bM1ZxW6WGsxK656gHSyVg; expires=Thu, 28-Apr-2022 06:39:22 GMT; path=/; domain=.google.com; Secure; HttpOnly; priority=high; SameSite=none
alt-svc: h3-29=\":443\"; ma=2592000,h3-T051=\":443\"; ma=2592000,h3-Q050=\":443\"; ma=2592000,h3-Q046=\":443\"; ma=2592000,h3-Q043=\":443\"; ma=2592000,quic=\":443\"; ma=2592000; v=\"46,43\"
expires: Wed, 28 Apr 2021 06:39:22 GMT
----
--Request 
GET https://ssl.gstatic.com/ui/v1/icons/mail/images/cleardot.gif?zx=hfwkygewod5o
Host: ssl.gstatic.com
Host: ssl.gstatic.com
Connection: keep-alive
User-Agent: Mozilla/5.0 (Windows NT 10.0; Win64; x64) AppleWebKit/537.36 (KHTML, like Gecko) Chrome/79.0.3945.130 Safari/537.36
Accept: image/webp,image/apng,image/*,*/*;q=0.8
Sec-Fetch-Site: cross-site
Sec-Fetch-Mode: no-cors
Referer: https://mail.google.com/mail/u/0/
Accept-Encoding: gzip, deflate, br
Accept-Language: en-GB,en-US;q=0.9,en;q=0.8
----
--Response 
HTTP/1.1 200
status: 200
accept-ranges: bytes
content-type: image/gif
cross-origin-resource-policy: cross-origin
content-length: 43
date: Wed, 28 Apr 2021 06:39:22 GMT
pragma: no-cache
expires: Fri, 01 Jan 1990 00:00:00 GMT
cache-control: no-cache, no-store, must-revalidate
last-modified: Tue, 03 Mar 2020 20:15:00 GMT
x-content-type-options: nosniff
server: sffe
x-xss-protection: 0
alt-svc: h3-29=\":443\"; ma=2592000,h3-T051=\":443\"; ma=2592000,h3-Q050=\":443\"; ma=2592000,h3-Q046=\":443\"; ma=2592000,h3-Q043=\":443\"; ma=2592000,quic=\":443\"; ma=2592000; v=\"46,43\"
----
--Request 
GET https://www.gstatic.com/images/icons/material/system/1x/archive_black_20dp.png
Host: www.gstatic.com
Host: www.gstatic.com
Connection: keep-alive
User-Agent: Mozilla/5.0 (Windows NT 10.0; Win64; x64) AppleWebKit/537.36 (KHTML, like Gecko) Chrome/79.0.3945.130 Safari/537.36
Accept: image/webp,image/apng,image/*,*/*;q=0.8
Sec-Fetch-Site: cross-site
Sec-Fetch-Mode: no-cors
Referer: https://mail.google.com/mail/u/0/
Accept-Encoding: gzip, deflate, br
Accept-Language: en-GB,en-US;q=0.9,en;q=0.8
----
--Response 
HTTP/1.1 200
status: 200
accept-ranges: bytes
content-type: image/png
vary: Origin
cross-origin-resource-policy: cross-origin
content-length: 166
date: Sat, 24 Apr 2021 21:35:06 GMT
expires: Sun, 24 Apr 2022 21:35:06 GMT
last-modified: Tue, 22 Oct 2019 18:15:00 GMT
x-content-type-options: nosniff
server: sffe
x-xss-protection: 0
age: 291872
cache-control: public, max-age=31536000
alt-svc: h3-29=\":443\"; ma=2592000,h3-T051=\":443\"; ma=2592000,h3-Q050=\":443\"; ma=2592000,h3-Q046=\":443\"; ma=2592000,h3-Q043=\":443\"; ma=2592000,quic=\":443\"; ma=2592000; v=\"46,43\"
----
--Request 
GET https://www.gstatic.com/images/icons/material/system/1x/delete_black_20dp.png
Host: www.gstatic.com
Host: www.gstatic.com
Connection: keep-alive
User-Agent: Mozilla/5.0 (Windows NT 10.0; Win64; x64) AppleWebKit/537.36 (KHTML, like Gecko) Chrome/79.0.3945.130 Safari/537.36
Accept: image/webp,image/apng,image/*,*/*;q=0.8
Sec-Fetch-Site: cross-site
Sec-Fetch-Mode: no-cors
Referer: https://mail.google.com/mail/u/0/
Accept-Encoding: gzip, deflate, br
Accept-Language: en-GB,en-US;q=0.9,en;q=0.8
----
--Response 
HTTP/1.1 200
status: 200
accept-ranges: bytes
content-type: image/png
vary: Origin
cross-origin-resource-policy: cross-origin
content-length: 105
date: Thu, 22 Apr 2021 02:03:02 GMT
expires: Fri, 22 Apr 2022 02:03:02 GMT
last-modified: Tue, 22 Oct 2019 18:15:00 GMT
x-content-type-options: nosniff
server: sffe
x-xss-protection: 0
age: 534996
cache-control: public, max-age=31536000
alt-svc: h3-29=\":443\"; ma=2592000,h3-T051=\":443\"; ma=2592000,h3-Q050=\":443\"; ma=2592000,h3-Q046=\":443\"; ma=2592000,h3-Q043=\":443\"; ma=2592000,quic=\":443\"; ma=2592000; v=\"46,43\"
----
--Request 
GET https://www.gstatic.com/images/icons/material/system/1x/drafts_black_20dp.png
Host: www.gstatic.com
Host: www.gstatic.com
Connection: keep-alive
User-Agent: Mozilla/5.0 (Windows NT 10.0; Win64; x64) AppleWebKit/537.36 (KHTML, like Gecko) Chrome/79.0.3945.130 Safari/537.36
Accept: image/webp,image/apng,image/*,*/*;q=0.8
Sec-Fetch-Site: cross-site
Sec-Fetch-Mode: no-cors
Referer: https://mail.google.com/mail/u/0/
Accept-Encoding: gzip, deflate, br
Accept-Language: en-GB,en-US;q=0.9,en;q=0.8
----
--Response 
HTTP/1.1 200
status: 200
accept-ranges: bytes
content-type: image/png
vary: Origin
cross-origin-resource-policy: cross-origin
content-length: 189
date: Sat, 24 Apr 2021 08:03:44 GMT
expires: Sun, 24 Apr 2022 08:03:44 GMT
last-modified: Tue, 22 Oct 2019 18:15:00 GMT
x-content-type-options: nosniff
server: sffe
x-xss-protection: 0
cache-control: public, max-age=31536000
age: 340554
alt-svc: h3-29=\":443\"; ma=2592000,h3-T051=\":443\"; ma=2592000,h3-Q050=\":443\"; ma=2592000,h3-Q046=\":443\"; ma=2592000,h3-Q043=\":443\"; ma=2592000,quic=\":443\"; ma=2592000; v=\"46,43\"
----

