
--Response 
HTTP/1.1 200
status: 200
content-type: text/html; charset=utf-8
set-cookie: CavNV=4674162754846552467-33333-233048192974-0-9-0-2-145-28079-26476; path=/; domain=www.kohls.com
set-cookie: akavpau_www=1621582893~id=23f121edf27e200fd3344594b6d577ae; Path=/; HttpOnly; Secure; SameSite=None
set-cookie: mosaic=gcpb; expires=Sun, 20-Jun-2021 07:36:33 GMT; path=/; secure
set-cookie: _dyid_server=6440147674919822059; expires=Sat, 21-May-2022 07:36:33 GMT; path=/; domain=.kohls.com; secure
x-cavnv: 4673388698664423124_33333_9_0
strict-transport-security: max-age=15768000 ; preload
x-origin-ttl: Sat, 22 May 2021 07:36:32 GMT
x-origin-ttl: Sat, 22 May 2021 07:36:32 GMT
x-origin-ttl: Sat, 22 May 2021 07:36:32 GMT
x-origin-ttl: Sat, 22 May 2021 07:36:32 GMT
x-frame-options: SAMEORIGIN
x-frame-options: SAMEORIGIN
x-frame-options: SAMEORIGIN
content-security-policy: block-all-mixed-content; frame-ancestors 'self';
content-security-policy: default-src https: 'unsafe-inline' 'unsafe-eval' data: blob:; img-src https: http: 'unsafe-inline' 'unsafe-eval' data: blob:; frame-ancestors 'self';
content-security-policy: block-all-mixed-content; frame-ancestors https://testzuiweb.kohls.zootweb.com https://testapplynow.kohls.zootweb.com 'self';
esi_status: ENABLED
server-timing: origin; dur=360
server-timing: edge; dur=270
server-timing: cdn-cache; desc=REVALIDATE
vary: Accept-Encoding
x-akamai-transformed: 9 - 0 pmb=mTOE,2mRUM,2
x-edgeconnect-cache-status: 1
x-edgeconnect-origin-mex-latency: 360
x-edgeconnect-origin-mex-latency: 360
x-edgeconnect-midmile-rtt: 105
x-edgeconnect-midmile-rtt: 0
correlation-id: webstore::43a5d150-ba07-11eb-93bd-c92dfe5cedfe::1621582592::us-central1-f::cprod-blue-snbui-prod-c6qt::182.71.119.212
content-encoding: gzip
expires: Fri, 21 May 2021 07:36:33 GMT
cache-control: max-age=0, no-cache, no-store
pragma: no-cache
date: Fri, 21 May 2021 07:36:33 GMT
----

--Response 
HTTP/1.1 200 OK
Date: Fri, 21 May 2021 07:36:32 GMT
Connection: Keep-Alive
Cache-Control: no-cache, no-store
Content-Length: 42
Content-Type: image/gif
Server: prod-xre-app33.lhr11
Pragma: no-cache
P3P: policyref=\"/w3c/p3p.xml\", CP=\"CURa ADMa DEVa PSAo PSDo OUR BUS UNI  PUR INT DEM STA PRE COM NAV OTC NOI DSP COR\"
Expires: Fri, 01 Jan 1990 00:00:00 GMT
X-HW: 1621582592.dop020.lo4.shc,1621582592.dop020.lo4.t,1621582592.cds070.lo4.sc,1621582592.cds070.lo4.p
----

--Response 
HTTP/1.1 302
status: 302
date: Fri, 21 May 2021 07:36:32 GMT
content-type: text/html; charset=UTF-8
location: https://servedby.flashtalking.com/segment/modify/xa2-xa211;;pixel/?valuePairs=klsct0;klsurct1&setTime=0;0&granularity=day;day
server: nginx
x-powered-by: PHP/5.6.40
----

--Response 
HTTP/1.1 200
status: 200
p3p: policyref=\"https://www.googleadservices.com/pagead/p3p.xml\", CP=\"NOI DEV PSA PSD IVA IVD OTP OUR OTR IND OTC\"
timing-allow-origin: *
cross-origin-resource-policy: cross-origin
date: Fri, 21 May 2021 07:36:32 GMT
pragma: no-cache
expires: Fri, 01 Jan 1990 00:00:00 GMT
cache-control: no-cache, no-store, must-revalidate
content-type: image/gif
content-security-policy: script-src 'none'; object-src 'none'
x-content-type-options: nosniff
server: cafe
content-length: 42
x-xss-protection: 0
alt-svc: h3-29=\":443\"; ma=2592000,h3-T051=\":443\"; ma=2592000,h3-Q050=\":443\"; ma=2592000,h3-Q046=\":443\"; ma=2592000,h3-Q043=\":443\"; ma=2592000,quic=\":443\"; ma=2592000; v=\"46,43\"
----

--Response 
HTTP/1.1 200
status: 200
p3p: policyref=\"https://www.googleadservices.com/pagead/p3p.xml\", CP=\"NOI DEV PSA PSD IVA IVD OTP OUR OTR IND OTC\"
timing-allow-origin: *
cross-origin-resource-policy: cross-origin
date: Fri, 21 May 2021 07:36:32 GMT
pragma: no-cache
expires: Fri, 01 Jan 1990 00:00:00 GMT
cache-control: no-cache, no-store, must-revalidate
content-type: image/gif
content-security-policy: script-src 'none'; object-src 'none'
x-content-type-options: nosniff
server: cafe
content-length: 42
x-xss-protection: 0
alt-svc: h3-29=\":443\"; ma=2592000,h3-T051=\":443\"; ma=2592000,h3-Q050=\":443\"; ma=2592000,h3-Q046=\":443\"; ma=2592000,h3-Q043=\":443\"; ma=2592000,quic=\":443\"; ma=2592000; v=\"46,43\"
----

--Response 
HTTP/1.1 200
status: 200
server: nginx
date: Fri, 21 May 2021 07:36:32 GMT
content-type: image/gif
content-length: 43
last-modified: Mon, 28 Sep 1970 06:00:00 GMT
----

