
--Response 
HTTP/1.1 200
status: 200
date: Fri, 21 May 2021 07:37:13 GMT
content-type: text/plain; charset=UTF-8
content-length: 1
access-control-allow-origin: *
----

--Response 
HTTP/1.1 200 OK
Content-Type: image/gif
Content-Length: 19
Expires: Fri, 21 May 2021 07:37:13 GMT
Cache-Control: max-age=0, no-cache, no-store
Pragma: no-cache
Date: Fri, 21 May 2021 07:37:13 GMT
Connection: keep-alive
Set-Cookie: _lc2_fpi=0b10d8358f40--01f66xpm9mhnhjgd8c760569v9; Max-Age=63072000; Domain=.kohls.com; SameSite=Lax
----

