
--Response 
HTTP/1.1 200
status: 200
date: Fri, 21 May 2021 07:36:23 GMT
content-type: application/json;charset=UTF-8
vary: origin,access-control-request-method,access-control-request-headers,accept-encoding
x-request-id: d7a5b7d0b6c062aeaeaa3c1803ba94ec
access-control-allow-credentials: true
access-control-allow-origin: https://www.kohls.com
content-encoding: gzip
----

--Response 
HTTP/1.1 200 OK
Accept-Ranges: bytes
Cache-Control: no-cache,no-store,must-revalidate,max-age=0,proxy-revalidate,no-transform,private
content-encoding: gzip
Content-Type: text/html;charset=UTF-8
date: Fri, 21 May 2021 07:36:23 GMT
DCS: dcscanary-prod-ind1-1-v009-05bbf7990.edge-ind1.demdex.com 6.2.1.20210507120117-PR_1432-SNAPSHOT
Expires: Thu, 01 Jan 1970 00:00:00 UTC
last-modified: Mon, 10 May 2021 12:59:53 GMT
P3P: policyref=\"/w3c/p3p.xml\", CP=\"NOI NID CURa ADMa DEVa PSAa PSDa OUR SAMa BUS PUR COM NAV INT\"
Pragma: no-cache
Strict-Transport-Security: max-age=31536000; includeSubDomains
vary: accept-encoding
X-TID: cCW5v7uyRNI=
transfer-encoding: chunked
Connection: keep-alive
----

--Response 
HTTP/1.1 200
status: 200
access-control-allow-origin: *
last-modified: Wed, 28 Apr 2021 19:42:45 GMT
etag: \"6e0489146620f3b2278df2cf5f149969\"
server: Unknown
strict-transport-security: max-age=31536000; includeSubDomains
content-type: image/webp
content-length: 2380
timing-allow-origin: *
expires: Sat, 22 May 2021 22:11:49 GMT
date: Fri, 21 May 2021 07:36:24 GMT
----

--Response 
HTTP/1.1 200
status: 200
content-type: text/javascript; charset=utf-8
expires: Fri, 21 May 2021 07:36:23 GMT
cache-control: no-cache
p3p: policyref=\"/w3c/p3p.xml\", CP=\"NOI DSP COR NID CUR ADM DEV OUR BUS\"
content-encoding: gzip
content-length: 2497
date: Fri, 21 May 2021 07:36:24 GMT
vary: Accept-Encoding
set-cookie: DYID=6440147674919822059; Domain=.dynamicyield.com; Path=/; Expires=Fri, 15 Jul 2022 07:36:24 GMT; Secure; SameSite=None
set-cookie: DYSES=e520494583b9eb872bf95fb8bcb6fc39; Domain=.dynamicyield.com; Path=/; Secure; SameSite=None
access-control-allow-origin: *
server: DYCDN
----

--Response 
HTTP/1.1 200
status: 200
content-type: application/javascript
accept-ranges: bytes
content-encoding: br
etag: \"609ebb82-b81c\"
last-modified: Thu, 20 May 2021 22:33:38 GMT
server: Akamai Resource Optimizer
x-origin-cc: max-age=86400
x-origin-cc: max-age=86400
x-origin-cc: max-age=86400
x-origin-ttl: Fri, 21 May 2021 22:33:37 GMT
x-origin-ttl: Fri, 21 May 2021 22:33:37 GMT
x-origin-ttl: Fri, 21 May 2021 22:33:37 GMT
content-length: 10598
cache-control: max-age=86400
expires: Sat, 22 May 2021 07:36:24 GMT
date: Fri, 21 May 2021 07:36:24 GMT
set-cookie: _dyid_server=6440147674919822059; expires=Sat, 21-May-2022 07:36:24 GMT; path=/; domain=.kohls.com; secure
server-timing: cdn-cache; desc=HIT
server-timing: edge; dur=11
server-timing: dtRpid;desc=\"936104672\"
content-security-policy: block-all-mixed-content; frame-ancestors https://testzuiweb.kohls.zootweb.com https://testapplynow.kohls.zootweb.com 'self';
x-frame-options: SAMEORIGIN
strict-transport-security: max-age=15768000 ; preload
----

--Response 
HTTP/1.1 200
status: 200
content-type: text/css
accept-ranges: bytes
content-encoding: br
etag: \"609ebb8d-e69f\"
last-modified: Tue, 18 May 2021 21:04:27 GMT
server: Akamai Resource Optimizer
x-origin-cc: max-age=86400
x-origin-cc: max-age=86400
x-origin-cc: max-age=86400
x-origin-cc: max-age=86400
x-origin-cc: max-age=86400
x-origin-cc: max-age=86400
x-origin-ttl: Wed, 19 May 2021 21:04:26 GMT
x-origin-ttl: Wed, 19 May 2021 21:04:26 GMT
x-origin-ttl: Wed, 19 May 2021 21:04:26 GMT
x-origin-ttl: Wed, 19 May 2021 21:04:26 GMT
x-origin-ttl: Wed, 19 May 2021 21:04:26 GMT
x-origin-ttl: Wed, 19 May 2021 21:04:26 GMT
content-length: 9641
cache-control: max-age=86400
expires: Sat, 22 May 2021 07:36:24 GMT
date: Fri, 21 May 2021 07:36:24 GMT
set-cookie: _dyid_server=6440147674919822059; expires=Sat, 21-May-2022 07:36:24 GMT; path=/; domain=.kohls.com; secure
server-timing: cdn-cache; desc=HIT
server-timing: edge; dur=2
server-timing: dtRpid;desc=\"-1638091643\"
content-security-policy: block-all-mixed-content; frame-ancestors https://testzuiweb.kohls.zootweb.com https://testapplynow.kohls.zootweb.com 'self';
x-frame-options: SAMEORIGIN
strict-transport-security: max-age=15768000 ; preload
----

--Response 
HTTP/1.1 200
status: 200
content-type: text/css
accept-ranges: bytes
content-encoding: br
etag: \"609c2f24-461\"
last-modified: Tue, 18 May 2021 20:56:04 GMT
server: Akamai Resource Optimizer
x-origin-cc: max-age=86400
x-origin-cc: max-age=86400
x-origin-cc: max-age=86400
x-origin-cc: max-age=86400
x-origin-cc: max-age=86400
x-origin-ttl: Wed, 19 May 2021 20:56:03 GMT
x-origin-ttl: Wed, 19 May 2021 20:56:03 GMT
x-origin-ttl: Wed, 19 May 2021 20:56:03 GMT
x-origin-ttl: Wed, 19 May 2021 20:56:03 GMT
x-origin-ttl: Wed, 19 May 2021 20:56:03 GMT
content-length: 346
cache-control: max-age=86400
expires: Sat, 22 May 2021 07:36:24 GMT
date: Fri, 21 May 2021 07:36:24 GMT
set-cookie: _dyid_server=6440147674919822059; expires=Sat, 21-May-2022 07:36:24 GMT; path=/; domain=.kohls.com; secure
server-timing: cdn-cache; desc=HIT
server-timing: edge; dur=6
server-timing: dtRpid;desc=\"-900590901\"
content-security-policy: block-all-mixed-content; frame-ancestors https://testzuiweb.kohls.zootweb.com https://testapplynow.kohls.zootweb.com 'self';
x-frame-options: SAMEORIGIN
strict-transport-security: max-age=15768000 ; preload
----

--Response 
HTTP/1.1 200
status: 200
accept-ranges: bytes
content-type: image/gif
etag: \"498cea522de993e22192a73eedfd00be:1473453269\"
last-modified: Fri, 09 Sep 2016 20:34:29 GMT
server: AkamaiNetStorage
content-length: 1942
expires: Fri, 21 May 2021 07:36:24 GMT
cache-control: max-age=0, no-cache, no-store
pragma: no-cache
date: Fri, 21 May 2021 07:36:24 GMT
set-cookie: _dyid_server=6440147674919822059; expires=Sat, 21-May-2022 07:36:24 GMT; path=/; domain=.kohls.com; secure
server-timing: cdn-cache; desc=HIT
server-timing: edge; dur=1
content-security-policy: block-all-mixed-content; frame-ancestors https://testzuiweb.kohls.zootweb.com https://testapplynow.kohls.zootweb.com 'self';
x-frame-options: SAMEORIGIN
strict-transport-security: max-age=15768000 ; preload
----

