--Request 
POST https://bat.bing.com/actionp/0?ti=4024145&tm=al001&Ver=2&mid=ac19675c-3e96-4fab-b6cb-65f5175e1313&sid=fdce5dc0ba0b11ebb694f78bbcad10ea&vid=fdcf3810ba0b11eb8504894104a43503&vids=0&evt=pageHide
Host: bat.bing.com
Host: bat.bing.com
Connection: keep-alive
Content-Length: 0
Origin: https://www.kohls.com
User-Agent: Mozilla/5.0 (Windows NT 10.0; WOW64) AppleWebKit/537.36 (KHTML, like Gecko) Chrome/56.0.2924.87 Safari/537.36
Content-Type: text/plain;charset=UTF-8
Accept: */*
Sec-Fetch-Site: cross-site
Sec-Fetch-Mode: no-cors
Referer: https://www.kohls.com/product/prd-3847510/womens-apt-9-tummy-control-shorts.jsp?color=Medium%20Wash&prdPV=1
Accept-Encoding: gzip, deflate, br
Accept-Language: en-GB,en-US;q=0.9,en;q=0.8
Cookie: MUID=2FEDAA73973269530F04BA4D9634684E; MR=0
----
 POSTDATA 
--Response 
HTTP/1.1 204
status: 204
cache-control: no-cache, must-revalidate
pragma: no-cache
expires: Fri, 01 Jan 1990 00:00:00 GMT
access-control-allow-origin: *
x-cache: CONFIG_NOCACHE
x-msedge-ref: Ref A: 849C116F44374B0F8324379D77F0C43B Ref B: DEL01EDGE0520 Ref C: 2021-05-21T08:11:34Z
date: Fri, 21 May 2021 08:11:34 GMT
----

