
--Response 
HTTP/1.1 200
status: 200
p3p: policyref=\"https://www.googleadservices.com/pagead/p3p.xml\", CP=\"NOI DEV PSA PSD IVA IVD OTP OUR OTR IND OTC\"
timing-allow-origin: *
cross-origin-resource-policy: cross-origin
access-control-allow-origin: *
content-type: application/json; charset=UTF-8
x-content-type-options: nosniff
content-disposition: attachment; filename=\"f.txt\"
content-encoding: gzip
date: Fri, 21 May 2021 08:18:54 GMT
server: cafe
cache-control: private
content-length: 6951
x-xss-protection: 0
alt-svc: h3-29=\":443\"; ma=2592000,h3-T051=\":443\"; ma=2592000,h3-Q050=\":443\"; ma=2592000,h3-Q046=\":443\"; ma=2592000,h3-Q043=\":443\"; ma=2592000,quic=\":443\"; ma=2592000; v=\"46,43\"
----

--Response 
HTTP/1.1 302 Found
Cache-Control: no-cache,no-store,must-revalidate,max-age=0,proxy-revalidate,no-transform,private
DCS: dcs-prod-ind1-1-v006-03113a449.edge-ind1.demdex.com 6.2.1.20210514105329-PR_1432-SNAPSHOT
Expires: Thu, 01 Jan 1970 00:00:00 UTC
Location: https://s.thebrighttag.com/cs?aam_uuid=84622417935889388173660587809767566339&btt=0&tp=dT9Y2Vu&gdpr=0
P3P: policyref=\"/w3c/p3p.xml\", CP=\"NOI NID CURa ADMa DEVa PSAa PSDa OUR SAMa BUS PUR COM NAV INT\"
Pragma: no-cache
set-cookie: dpm=84622417935889388173660587809767566339; Max-Age=15552000; Expires=Wed, 17 Nov 2021 08:18:54 GMT; Path=/; Domain=.dpm.demdex.net
set-cookie: demdex=84622417935889388173660587809767566339; Max-Age=15552000; Expires=Wed, 17 Nov 2021 08:18:54 GMT; Path=/; Domain=.demdex.net
Strict-Transport-Security: max-age=31536000; includeSubDomains
X-TID: y+mYORZzSjE=
Content-Length: 0
Connection: keep-alive
----

--Response 
HTTP/1.1 200 OK
Server: nginx
Date: Fri, 21 May 2021 08:18:54 GMT
Pragma: no-cache
Expires: Thu, 01 Jan 1970 00:00:00 GMT
Set-Cookie: bt3=lqAhx0bTHh7411-wi_1jpa-Gk9rNqwjOPuHMV1ce3FejlbEV2Nic-dc8-oGtF-YR; Domain=.s.thebrighttag.com; Expires=Sat, 21-May-2022 08:18:54 GMT; Path=/; SameSite=None; Secure
Cache-Control: private, must-revalidate
X-BT-RequestId: 2eaaf8b0-ba0d-11eb-a527-0000ac1702bd
P3P: CP=NOI DSP COR NID
Content-Type: text/javascript
Content-Length: 506
ETag: ef9d948749594d426f0ac1293026e6ac
content-encoding: gzip
----

--Response 
HTTP/1.1 302 Moved Temporarily
Date: Fri, 21 May 2021 08:18:57 GMT
Content-Type: text/javascript
Content-Length: 0
Connection: keep-alive
Keep-Alive: timeout=360
Server: MT3 3736 915c305 master nrt-pixel-x16
Cache-Control: no-cache
P3P: CP=\"NOI DSP COR NID CURa ADMa DEVa PSAa PSDa OUR BUS COM INT OTC PUR STA\"
location: https://s.thebrighttag.com/cs?tp=mm&uid=4b6160a7-6c9c-4b00-adb0-67cdff2b1c0c&btt=oH3oRdDtkhb3BUZ2VXTfadFG_ezPX-BeuU5DBBtTeBA&gdpr=0&gdpr_consent=
Expires: Fri, 21 May 2021 08:18:56 GMT
----

--Response 
HTTP/1.1 200
status: 200
accept-ranges: bytes
vary: Accept-Encoding
content-encoding: gzip
content-type: text/html
cross-origin-resource-policy: cross-origin
content-length: 5022
date: Sun, 16 May 2021 02:52:51 GMT
expires: Mon, 16 May 2022 02:52:51 GMT
last-modified: Wed, 20 Jan 2021 19:23:06 GMT
x-content-type-options: nosniff
server: sffe
x-xss-protection: 0
cache-control: public, max-age=31536000
age: 451475
alt-svc: h3-29=\":443\"; ma=2592000,h3-T051=\":443\"; ma=2592000,h3-Q050=\":443\"; ma=2592000,h3-Q046=\":443\"; ma=2592000,h3-Q043=\":443\"; ma=2592000,quic=\":443\"; ma=2592000; v=\"46,43\"
----

--Response 
HTTP/1.1 200 OK
Server: nginx
Date: Fri, 21 May 2021 08:18:55 GMT
Content-Type: image/gif
Content-Length: 35
Connection: keep-alive
Pragma: no-cache
Expires: Thu, 01 Jan 1970 00:00:00 GMT
Set-Cookie: bt3=lqAhx0bTHh7411-wi_1jpa-Gk9rNqwjOPuHMV1ce3FejlbEV2Nic-dc8-oGtF-YR; Domain=.s.thebrighttag.com; Expires=Sat, 21-May-2022 08:18:55 GMT; Path=/; SameSite=None; Secure
Set-Cookie: btv3.dT9Y2Vu=V5nCM7HTXvC6c-jLHwuyuysMy6qzof4Zz3PPsUbj1X7C3L9STVlAHE3gcN2Y7SsyRwz4EBwyXzSbMabrlN1DbbyO7w7NDfew3N7sZRJ-351DJkm0atyFKtu4TL7v4C3jT1M7iosxv5QwGXsd1dKHuQ; Domain=.s.thebrighttag.com; Expires=Sun, 20-Jun-2021 08:18:55 GMT; Path=/; SameSite=None; Secure
Cache-Control: private, must-revalidate
X-BT-RequestId: 2f2076d0-ba0d-11eb-85c8-0000ac1700b9
P3P: CP=NOI DSP COR NID
----

--Response 
HTTP/1.1 200
status: 200
content-length: 0000000332
content-type: text/plain
access-control-allow-origin: https://www.kohls.com
timing-allow-origin: *
access-control-allow-credentials: true
access-control-allow-methods: POST, PUT, DELETE, GET, OPTIONS
access-control-request-headers: *
access-control-allow-headers: Origin, X-Requested-With, Content-Type, Accept, Authorization, Content-Encoding
access-control-max-age: 300
expires: Fri, 21 May 2021 08:18:55 GMT
cache-control: max-age=0, no-cache, no-store
pragma: no-cache
date: Fri, 21 May 2021 08:18:55 GMT
set-cookie: Cavisson_Netvision=1330238474.20480.0000; expires=Fri, 21-May-2021 08:58:55 GMT; path=/; Httponly; Secure
----

--Response 
HTTP/1.1 200 OK
Cache-Control: no-store
Content-Type: image/gif
Date: Fri, 21 May 2021 08:18:55 GMT
Set-Cookie: lidid=51e452ef-39b5-42e8-b7ed-83178ae8eaea; Max-Age=63072000; Expires=Sun, 21 May 2023 08:18:55 GMT; Path=/; Domain=liadm.com
Strict-Transport-Security: max-age=31536000; includeSubDomains
trace-id: 4c23470267b3e05e
Content-Length: 43
Connection: keep-alive
----

--Response 
HTTP/1.1 200 OK
Server: nginx
Date: Fri, 21 May 2021 08:18:55 GMT
Content-Type: image/gif
Content-Length: 35
Connection: keep-alive
Pragma: no-cache
Expires: Thu, 01 Jan 1970 00:00:00 GMT
Set-Cookie: bt3=lqAhx0bTHh7411-wi_1jpa-Gk9rNqwjOPuHMV1ce3FejlbEV2Nic-dc8-oGtF-YR; Domain=.s.thebrighttag.com; Expires=Sat, 21-May-2022 08:18:55 GMT; Path=/; SameSite=None; Secure
Set-Cookie: btv3.mm=PhlxA-m8HuAene60kPbHt2PZwMqGGuu57KCUP1XeirqUzQbKZjIIRO0rcxPQOtuPQJsCPtKzsYEiMtOjbNkG3A; Domain=.s.thebrighttag.com; Expires=Fri, 28-May-2021 08:18:55 GMT; Path=/; SameSite=None; Secure
Cache-Control: private, must-revalidate
X-BT-RequestId: 2f55b7a0-ba0d-11eb-b8fa-0000ac170106
P3P: CP=NOI DSP COR NID
----

