
--Response 
HTTP/1.1 200 OK
Date: Wed, 07 Apr 2021 14:01:29 GMT
Content-Length: 0000004069
Content-Type: text/html
X-Cache: MISS from 10.10.30.96
X-Cache-Lookup: MISS from 10.10.30.96:3128
Via: 1.1 10.10.30.96 (squid/3.5.12)
Connection: keep-alive
----

--Response 
HTTP/1.1 200 OK
Date: Wed, 07 Apr 2021 14:01:29 GMT
Content-Length: 16522
Content-Type: image/gif
X-Cache: MISS from 10.10.30.96
X-Cache-Lookup: MISS from 10.10.30.96:3128
Via: 1.1 10.10.30.96 (squid/3.5.12)
Connection: keep-alive
----

--Response 
HTTP/1.1 200 OK
Date: Wed, 07 Apr 2021 14:01:29 GMT
Content-Length: 4125
Content-Type: image/gif
X-Cache: MISS from 10.10.30.96
X-Cache-Lookup: MISS from 10.10.30.96:3128
Via: 1.1 10.10.30.96 (squid/3.5.12)
Connection: keep-alive
----

--Response 
HTTP/1.1 200 OK
Date: Wed, 07 Apr 2021 14:01:29 GMT
Content-Length: 1268
Content-Type: image/gif
X-Cache: MISS from 10.10.30.96
X-Cache-Lookup: MISS from 10.10.30.96:3128
Via: 1.1 10.10.30.96 (squid/3.5.12)
Connection: keep-alive
----

--Response 
HTTP/1.1 200 OK
Date: Wed, 07 Apr 2021 14:01:29 GMT
Content-Length: 1519
Content-Type: image/gif
X-Cache: MISS from 10.10.30.96
X-Cache-Lookup: MISS from 10.10.30.96:3128
Via: 1.1 10.10.30.96 (squid/3.5.12)
Connection: keep-alive
----

--Response 
HTTP/1.1 200 OK
Date: Wed, 07 Apr 2021 14:01:29 GMT
Content-Length: 1260
Content-Type: image/gif
X-Cache: MISS from 10.10.30.96
X-Cache-Lookup: MISS from 10.10.30.96:3128
Via: 1.1 10.10.30.96 (squid/3.5.12)
Connection: keep-alive
----

--Response 
HTTP/1.1 200 OK
Date: Wed, 07 Apr 2021 14:01:29 GMT
Content-Length: 2018
Content-Type: image/gif
X-Cache: MISS from 10.10.30.96
X-Cache-Lookup: MISS from 10.10.30.96:3128
Via: 1.1 10.10.30.96 (squid/3.5.12)
Connection: keep-alive
----

--Response 
HTTP/1.1 200 OK
Date: Wed, 07 Apr 2021 14:01:29 GMT
Content-Length: 1992
Content-Type: image/gif
X-Cache: MISS from 10.10.30.96
X-Cache-Lookup: MISS from 10.10.30.96:3128
Via: 1.1 10.10.30.96 (squid/3.5.12)
Connection: keep-alive
----

--Response 
HTTP/1.1 200 OK
Date: Wed, 07 Apr 2021 14:01:29 GMT
Content-Length: 3013
Content-Type: image/gif
X-Cache: MISS from 10.10.30.96
X-Cache-Lookup: MISS from 10.10.30.96:3128
Via: 1.1 10.10.30.96 (squid/3.5.12)
Connection: keep-alive
----

