
--Response 
HTTP/1.1 200
status: 200
content-length: 0000000001
content-type: text/plain
access-control-allow-origin: https://www.kohls.com
timing-allow-origin: *
access-control-allow-credentials: true
access-control-allow-methods: POST, PUT, DELETE, GET, OPTIONS
access-control-request-headers: *
access-control-allow-headers: Origin, X-Requested-With, Content-Type, Accept, Authorization, Content-Encoding
access-control-max-age: 300
expires: Fri, 21 May 2021 08:17:27 GMT
cache-control: max-age=0, no-cache, no-store
pragma: no-cache
date: Fri, 21 May 2021 08:17:27 GMT
set-cookie: Cavisson_Netvision=1330238474.20480.0000; expires=Fri, 21-May-2021 08:57:27 GMT; path=/; Httponly; Secure
----

--Response 
HTTP/1.1 200
status: 200
accept-ranges: bytes
vary: Accept-Encoding
content-encoding: br
content-type: text/javascript
cross-origin-resource-policy: cross-origin
content-length: 5790
date: Thu, 20 May 2021 05:39:26 GMT
expires: Fri, 20 May 2022 05:39:26 GMT
last-modified: Wed, 12 May 2021 09:08:00 GMT
x-content-type-options: nosniff
server: sffe
x-xss-protection: 0
age: 95881
cache-control: public, max-age=31536000
alt-svc: h3-29=\":443\"; ma=2592000,h3-T051=\":443\"; ma=2592000,h3-Q050=\":443\"; ma=2592000,h3-Q046=\":443\"; ma=2592000,h3-Q043=\":443\"; ma=2592000,quic=\":443\"; ma=2592000; v=\"46,43\"
----

