
--Response 
HTTP/1.1 200 OK
Access-Control-Allow-Origin: *
Cache-Control: private, max-age=300, stale-while-revalidate=60, stale-if-error=120
Timing-Allow-Origin: *
Vary: Accept-Encoding
Content-Encoding: gzip
Date: Fri, 21 May 2021 08:04:49 GMT
Content-Length: 3044
Connection: keep-alive
Content-Type: application/json
----

--Response 
HTTP/1.1 307
status: 307
cache-control: no-cache, no-store
location: https://dpm.demdex.net/ibs:dpid=477&dpuuid=b201840b42797d932539188f9c3852e988231dce162c53e745951b91633de064b0da87c991749652
p3p: CP=\"NOI DSP COR NID CURa ADMa DEVa PSAa PSDa OUR BUS COM INT OTC PUR STA\"
set-cookie: rlas3=WqyPnqnEtXXmDv9s56B477LY0HLys0/zop5LTfTXlfQ=; Path=/; Domain=rlcdn.com; Expires=Sat, 21 May 2022 08:04:49 GMT; Secure; SameSite=None
set-cookie: pxrc=CKHTnYUGEgUI6AcQABIGCPHrARAA; Path=/; Domain=rlcdn.com; Expires=Tue, 20 Jul 2021 08:04:49 GMT; Secure; SameSite=None
timing-allow-origin: *
date: Fri, 21 May 2021 08:04:49 GMT
content-length: 0
via: 1.1 google
alt-svc: clear
----

--Response 
HTTP/1.1 200 OK
Cache-Control: no-cache,no-store,must-revalidate,max-age=0,proxy-revalidate,no-transform,private
content-encoding: gzip
Content-Type: image/gif
DCS: dcs-prod-ind1-1-v006-011b47a37.edge-ind1.demdex.com 6.2.1.20210514105329-PR_1432-SNAPSHOT
Expires: Thu, 01 Jan 1970 00:00:00 UTC
P3P: policyref=\"/w3c/p3p.xml\", CP=\"NOI NID CURa ADMa DEVa PSAa PSDa OUR SAMa BUS PUR COM NAV INT\"
Pragma: no-cache
set-cookie: dpm=71429088129042532550393988433173938227; Max-Age=15552000; Expires=Wed, 17 Nov 2021 08:04:49 GMT; Path=/; Domain=.dpm.demdex.net
set-cookie: demdex=71429088129042532550393988433173938227; Max-Age=15552000; Expires=Wed, 17 Nov 2021 08:04:49 GMT; Path=/; Domain=.demdex.net
Strict-Transport-Security: max-age=31536000; includeSubDomains
X-Content-Type-Options: nosniff
X-TID: /cenKxLfQgU=
Content-Length: 59
Connection: keep-alive
----

