--Request 
GET http://10.10.30.41:8080/cgi-bin/reservation
Host: 10.10.30.41:8080
Accept: text/html,application/xhtml+xml,application/xml;q=0.9,image/webp,image/apng,*/*;q=0.8
Upgrade-Insecure-Requests: 1
Referer: http://10.10.30.41:8080/cgi-bin/login?userSession=75893.0884568651DQADHfApHDHfcDtccpfAttcf&username=cavisson&password=123&login.x=46&login.y=9&JSFormSubmit=off
User-Agent: Mozilla/5.0 (Windows NT 10.0; Win64; x64) AppleWebKit/537.36 (KHTML, like Gecko) Chrome/69.0.3497.12 Safari/537.36
Accept-Encoding: gzip, deflate
Accept-Language: en-us
----
--Response 
HTTP/1.1 200 OK
Connection: Keep-Alive
Content-type: text/html
Content-length: 0000004653
----
--Request 
GET http://10.10.30.41:8080/tours/Merc10-dev/images/banner_animated.gif
Host: 10.10.30.41:8080
Referer: http://10.10.30.41:8080/cgi-bin/reservation
User-Agent: Mozilla/5.0 (Windows NT 10.0; Win64; x64) AppleWebKit/537.36 (KHTML, like Gecko) Chrome/69.0.3497.12 Safari/537.36
Accept-Encoding: gzip, deflate
Accept-Language: en-us
Accept: image/webp,image/apng,image/*,*/*;q=0.8
----
--Response 
HTTP/1.1 200 OK
Connection: Keep-Alive
Content-Length: 16522
Content-Type: image/gif
----
--Request 
GET http://10.10.30.41:8080/tours/Merc10-dev/images/sun_swede.gif
Host: 10.10.30.41:8080
Referer: http://10.10.30.41:8080/cgi-bin/reservation
User-Agent: Mozilla/5.0 (Windows NT 10.0; Win64; x64) AppleWebKit/537.36 (KHTML, like Gecko) Chrome/69.0.3497.12 Safari/537.36
Accept-Encoding: gzip, deflate
Accept-Language: en-us
Accept: image/webp,image/apng,image/*,*/*;q=0.8
----
--Response 
HTTP/1.1 200 OK
Connection: Keep-Alive
Content-Length: 4125
Content-Type: image/gif
----
--Request 
GET http://10.10.30.41:8080/tours/Merc10-dev/images/flights.gif
Host: 10.10.30.41:8080
Referer: http://10.10.30.41:8080/cgi-bin/reservation
User-Agent: Mozilla/5.0 (Windows NT 10.0; Win64; x64) AppleWebKit/537.36 (KHTML, like Gecko) Chrome/69.0.3497.12 Safari/537.36
Accept-Encoding: gzip, deflate
Accept-Language: en-us
Accept: image/webp,image/apng,image/*,*/*;q=0.8
----
--Response 
HTTP/1.1 200 OK
Connection: Keep-Alive
Content-Length: 1519
Content-Type: image/gif
----
--Request 
GET http://10.10.30.41:8080/tours/Merc10-dev/images/home.gif
Host: 10.10.30.41:8080
Referer: http://10.10.30.41:8080/cgi-bin/reservation
User-Agent: Mozilla/5.0 (Windows NT 10.0; Win64; x64) AppleWebKit/537.36 (KHTML, like Gecko) Chrome/69.0.3497.12 Safari/537.36
Accept-Encoding: gzip, deflate
Accept-Language: en-us
Accept: image/webp,image/apng,image/*,*/*;q=0.8
----
--Response 
HTTP/1.1 200 OK
Connection: Keep-Alive
Content-Length: 1268
Content-Type: image/gif
----
--Request 
GET http://10.10.30.41:8080/tours/Merc10-dev/images/signoff.gif
Host: 10.10.30.41:8080
Referer: http://10.10.30.41:8080/cgi-bin/reservation
User-Agent: Mozilla/5.0 (Windows NT 10.0; Win64; x64) AppleWebKit/537.36 (KHTML, like Gecko) Chrome/69.0.3497.12 Safari/537.36
Accept-Encoding: gzip, deflate
Accept-Language: en-us
Accept: image/webp,image/apng,image/*,*/*;q=0.8
----
--Response 
HTTP/1.1 200 OK
Connection: Keep-Alive
Content-Length: 1260
Content-Type: image/gif
----
--Request 
GET http://10.10.30.41:8080/tours/Merc10-dev/images/splash_Findflight.gif
Host: 10.10.30.41:8080
Referer: http://10.10.30.41:8080/cgi-bin/reservation
User-Agent: Mozilla/5.0 (Windows NT 10.0; Win64; x64) AppleWebKit/537.36 (KHTML, like Gecko) Chrome/69.0.3497.12 Safari/537.36
Accept-Encoding: gzip, deflate
Accept-Language: en-us
Accept: image/webp,image/apng,image/*,*/*;q=0.8
----
--Response 
HTTP/1.1 200 OK
Connection: Keep-Alive
Content-Length: 2215
Content-Type: image/gif
----
--Request 
GET https://clients1.google.com/tbproxy/af/query?q=Chc2LjEuMTcxNS4xNDQyL2VuIChHR0xMKRMZqGmnODyTUagjLVRiKa0kIy17ncSlJCMtHzs5hSQjLdqFmWEkIy2pjkq9JBQ=
Host: clients1.google.com
User-Agent: Mozilla/5.0 (Windows NT 10.0; Win64; x64) AppleWebKit/537.36 (KHTML, like Gecko) Chrome/69.0.3497.12 Safari/537.36
Accept-Encoding: gzip, deflate
Accept-Language: en-us
----
--Response 
HTTP/1.1 200
date: Thu, 31 Dec 2020 13:17:21 GMT
content-length: 32
server: AutoFill Server
x-content-type-options: nosniff
x-xss-protection: 0
content-encoding: gzip
x-frame-options: SAMEORIGIN
content-type: text/proto
alt-svc: h3-29=\":443\"; ma=2592000,h3-T051=\":443\"; ma=2592000,h3-Q050=\":443\"; ma=2592000,h3-Q046=\":443\"; ma=2592000,h3-Q043=\":443\"; ma=2592000,quic=\":443\"; ma=2592000; v=\"46,43\"
cache-control: private,max-age=604800
status: 200
----
--Request 
GET http://10.10.30.41:8080/tours/vep/images/velocigen.gif
Host: 10.10.30.41:8080
Referer: http://10.10.30.41:8080/cgi-bin/reservation
User-Agent: Mozilla/5.0 (Windows NT 10.0; Win64; x64) AppleWebKit/537.36 (KHTML, like Gecko) Chrome/69.0.3497.12 Safari/537.36
Accept-Encoding: gzip, deflate
Accept-Language: en-us
Accept: image/webp,image/apng,image/*,*/*;q=0.8
----
--Response 
HTTP/1.1 200 OK
Connection: Keep-Alive
Content-Length: 2018
Content-Type: image/gif
----
--Request 
GET http://10.10.30.41:8080/tours/images/continue.gif
Host: 10.10.30.41:8080
Referer: http://10.10.30.41:8080/cgi-bin/reservation
User-Agent: Mozilla/5.0 (Windows NT 10.0; Win64; x64) AppleWebKit/537.36 (KHTML, like Gecko) Chrome/69.0.3497.12 Safari/537.36
Accept-Encoding: gzip, deflate
Accept-Language: en-us
Accept: image/webp,image/apng,image/*,*/*;q=0.8
----
--Response 
HTTP/1.1 200 OK
Connection: Keep-Alive
Content-Length: 1432
Content-Type: image/gif
----

