--Request 
GET http://10.10.70.46:8888/cgi-bin/findflight?depart=Acapulco&departDate=04-03-2021&arrive=Acapulco&returnDate=04-04-2021&numPassengers=1&seatPref=None&seatType=Coach&findFlights.x=79&findFlights.y=23
Host: 10.10.70.46:8888
Host: 10.10.70.46:8888
Connection: keep-alive
Upgrade-Insecure-Requests: 1
User-Agent: Mozilla/5.0 (Windows NT 10.0; Win64; x64) AppleWebKit/537.36 (KHTML, like Gecko) Chrome/79.0.3945.130 Safari/537.36
Accept: text/html,application/xhtml+xml,application/xml;q=0.9,image/webp,image/apng,*/*;q=0.8,application/signed-exchange;v=b3;q=0.9
Referer: http://10.10.70.46:8888/cgi-bin/reservation
Accept-Encoding: gzip, deflate
Accept-Language: en-US,en;q=0.9
----
--Response 
HTTP/1.1 200 OK
Content-length: 0000004269
Connection: Keep-Alive
Content-type: text/html
----
--Request 
GET http://10.10.70.46:8888/tours/Merc10-dev/images/banner_animated.gif
Host: 10.10.70.46:8888
Host: 10.10.70.46:8888
Connection: keep-alive
User-Agent: Mozilla/5.0 (Windows NT 10.0; Win64; x64) AppleWebKit/537.36 (KHTML, like Gecko) Chrome/79.0.3945.130 Safari/537.36
Accept: image/webp,image/apng,image/*,*/*;q=0.8
Referer: http://10.10.70.46:8888/cgi-bin/findflight?depart=Acapulco&departDate=04-03-2021&arrive=Acapulco&returnDate=04-04-2021&numPassengers=1&seatPref=None&seatType=Coach&findFlights.x=79&findFlights.y=23
Accept-Encoding: gzip, deflate
Accept-Language: en-US,en;q=0.9
----
--Response 
HTTP/1.1 200 OK
Content-Length: 16522
Content-Type: image/gif
Connection: Keep-Alive
----
--Request 
GET http://10.10.70.46:8888/tours/Merc10-dev/images/sun_swede.gif
Host: 10.10.70.46:8888
Host: 10.10.70.46:8888
Connection: keep-alive
User-Agent: Mozilla/5.0 (Windows NT 10.0; Win64; x64) AppleWebKit/537.36 (KHTML, like Gecko) Chrome/79.0.3945.130 Safari/537.36
Accept: image/webp,image/apng,image/*,*/*;q=0.8
Referer: http://10.10.70.46:8888/cgi-bin/findflight?depart=Acapulco&departDate=04-03-2021&arrive=Acapulco&returnDate=04-04-2021&numPassengers=1&seatPref=None&seatType=Coach&findFlights.x=79&findFlights.y=23
Accept-Encoding: gzip, deflate
Accept-Language: en-US,en;q=0.9
----
--Response 
HTTP/1.1 200 OK
Content-Length: 4125
Content-Type: image/gif
Connection: Keep-Alive
----
--Request 
GET http://10.10.70.46:8888/tours/Merc10-dev/images/flights.gif
Host: 10.10.70.46:8888
Host: 10.10.70.46:8888
Connection: keep-alive
User-Agent: Mozilla/5.0 (Windows NT 10.0; Win64; x64) AppleWebKit/537.36 (KHTML, like Gecko) Chrome/79.0.3945.130 Safari/537.36
Accept: image/webp,image/apng,image/*,*/*;q=0.8
Referer: http://10.10.70.46:8888/cgi-bin/findflight?depart=Acapulco&departDate=04-03-2021&arrive=Acapulco&returnDate=04-04-2021&numPassengers=1&seatPref=None&seatType=Coach&findFlights.x=79&findFlights.y=23
Accept-Encoding: gzip, deflate
Accept-Language: en-US,en;q=0.9
----
--Response 
HTTP/1.1 200 OK
Content-Length: 1519
Content-Type: image/gif
Connection: Keep-Alive
----
--Request 
GET http://10.10.70.46:8888/tours/images/splash_Searchresults.gif
Host: 10.10.70.46:8888
Host: 10.10.70.46:8888
Connection: keep-alive
User-Agent: Mozilla/5.0 (Windows NT 10.0; Win64; x64) AppleWebKit/537.36 (KHTML, like Gecko) Chrome/79.0.3945.130 Safari/537.36
Accept: image/webp,image/apng,image/*,*/*;q=0.8
Referer: http://10.10.70.46:8888/cgi-bin/findflight?depart=Acapulco&departDate=04-03-2021&arrive=Acapulco&returnDate=04-04-2021&numPassengers=1&seatPref=None&seatType=Coach&findFlights.x=79&findFlights.y=23
Accept-Encoding: gzip, deflate
Accept-Language: en-US,en;q=0.9
----
--Response 
HTTP/1.1 200 OK
Content-Length: 2599
Content-Type: image/gif
Connection: Keep-Alive
----
--Request 
GET http://10.10.70.46:8888/tours/Merc10-dev/images/home.gif
Host: 10.10.70.46:8888
Host: 10.10.70.46:8888
Connection: keep-alive
User-Agent: Mozilla/5.0 (Windows NT 10.0; Win64; x64) AppleWebKit/537.36 (KHTML, like Gecko) Chrome/79.0.3945.130 Safari/537.36
Accept: image/webp,image/apng,image/*,*/*;q=0.8
Referer: http://10.10.70.46:8888/cgi-bin/findflight?depart=Acapulco&departDate=04-03-2021&arrive=Acapulco&returnDate=04-04-2021&numPassengers=1&seatPref=None&seatType=Coach&findFlights.x=79&findFlights.y=23
Accept-Encoding: gzip, deflate
Accept-Language: en-US,en;q=0.9
----
--Response 
HTTP/1.1 200 OK
Content-Length: 1268
Content-Type: image/gif
Connection: Keep-Alive
----
--Request 
GET http://10.10.70.46:8888/tours/Merc10-dev/images/signoff.gif
Host: 10.10.70.46:8888
Host: 10.10.70.46:8888
Connection: keep-alive
User-Agent: Mozilla/5.0 (Windows NT 10.0; Win64; x64) AppleWebKit/537.36 (KHTML, like Gecko) Chrome/79.0.3945.130 Safari/537.36
Accept: image/webp,image/apng,image/*,*/*;q=0.8
Referer: http://10.10.70.46:8888/cgi-bin/findflight?depart=Acapulco&departDate=04-03-2021&arrive=Acapulco&returnDate=04-04-2021&numPassengers=1&seatPref=None&seatType=Coach&findFlights.x=79&findFlights.y=23
Accept-Encoding: gzip, deflate
Accept-Language: en-US,en;q=0.9
----
--Response 
HTTP/1.1 200 OK
Content-Length: 1260
Content-Type: image/gif
Connection: Keep-Alive
----
--Request 
GET http://10.10.70.46:8888/tours/images/continue.gif
Host: 10.10.70.46:8888
Host: 10.10.70.46:8888
Connection: keep-alive
User-Agent: Mozilla/5.0 (Windows NT 10.0; Win64; x64) AppleWebKit/537.36 (KHTML, like Gecko) Chrome/79.0.3945.130 Safari/537.36
Accept: image/webp,image/apng,image/*,*/*;q=0.8
Referer: http://10.10.70.46:8888/cgi-bin/findflight?depart=Acapulco&departDate=04-03-2021&arrive=Acapulco&returnDate=04-04-2021&numPassengers=1&seatPref=None&seatType=Coach&findFlights.x=79&findFlights.y=23
Accept-Encoding: gzip, deflate
Accept-Language: en-US,en;q=0.9
----
--Response 
HTTP/1.1 200 OK
Content-Length: 1432
Content-Type: image/gif
Connection: Keep-Alive
----
--Request 
GET http://10.10.70.46:8888/tours/images/startover.gif
Host: 10.10.70.46:8888
Host: 10.10.70.46:8888
Connection: keep-alive
User-Agent: Mozilla/5.0 (Windows NT 10.0; Win64; x64) AppleWebKit/537.36 (KHTML, like Gecko) Chrome/79.0.3945.130 Safari/537.36
Accept: image/webp,image/apng,image/*,*/*;q=0.8
Referer: http://10.10.70.46:8888/cgi-bin/findflight?depart=Acapulco&departDate=04-03-2021&arrive=Acapulco&returnDate=04-04-2021&numPassengers=1&seatPref=None&seatType=Coach&findFlights.x=79&findFlights.y=23
Accept-Encoding: gzip, deflate
Accept-Language: en-US,en;q=0.9
----
--Response 
HTTP/1.1 200 OK
Content-Length: 1455
Content-Type: image/gif
Connection: Keep-Alive
----
--Request 
GET http://10.10.70.46:8888/tours/vep/images/velocigen.gif
Host: 10.10.70.46:8888
Host: 10.10.70.46:8888
Connection: keep-alive
User-Agent: Mozilla/5.0 (Windows NT 10.0; Win64; x64) AppleWebKit/537.36 (KHTML, like Gecko) Chrome/79.0.3945.130 Safari/537.36
Accept: image/webp,image/apng,image/*,*/*;q=0.8
Referer: http://10.10.70.46:8888/cgi-bin/findflight?depart=Acapulco&departDate=04-03-2021&arrive=Acapulco&returnDate=04-04-2021&numPassengers=1&seatPref=None&seatType=Coach&findFlights.x=79&findFlights.y=23
Accept-Encoding: gzip, deflate
Accept-Language: en-US,en;q=0.9
----
--Response 
HTTP/1.1 200 OK
Content-Length: 2018
Content-Type: image/gif
Connection: Keep-Alive
----

