--Request 
GET http://10.10.30.96/tours/index.html
Host: 10.10.30.96
Host: 10.10.30.96
Connection: keep-alive
Upgrade-Insecure-Requests: 1
User-Agent: Mozilla/5.0 (Windows NT 10.0; Win64; x64) AppleWebKit/537.36 (KHTML, like Gecko) Chrome/79.0.3945.130 Safari/537.36
Accept: text/html,application/xhtml+xml,application/xml;q=0.9,image/webp,image/apng,*/*;q=0.8,application/signed-exchange;v=b3;q=0.9
Accept-Encoding: gzip, deflate
Accept-Language: en-GB,en-US;q=0.9,en;q=0.8
----
--Response 
HTTP/1.1 200 OK
Content-Length: 2975
Content-Type: text/html
Connection: Keep Alive
----
--Request 
GET http://10.10.30.96/tours/Merc10-dev/images/banner_animated.gif
Host: 10.10.30.96
Host: 10.10.30.96
Connection: keep-alive
User-Agent: Mozilla/5.0 (Windows NT 10.0; Win64; x64) AppleWebKit/537.36 (KHTML, like Gecko) Chrome/79.0.3945.130 Safari/537.36
Accept: image/webp,image/apng,image/*,*/*;q=0.8
Referer: http://10.10.30.96/tours/index.html
Accept-Encoding: gzip, deflate
Accept-Language: en-GB,en-US;q=0.9,en;q=0.8
----
--Response 
HTTP/1.1 200 OK
Content-Length: 16522
Content-Type: image/gif
Connection: Keep Alive
----
--Request 
GET http://10.10.30.96/tours/Merc10-dev/images/sun_swede.gif
Host: 10.10.30.96
Host: 10.10.30.96
Connection: keep-alive
User-Agent: Mozilla/5.0 (Windows NT 10.0; Win64; x64) AppleWebKit/537.36 (KHTML, like Gecko) Chrome/79.0.3945.130 Safari/537.36
Accept: image/webp,image/apng,image/*,*/*;q=0.8
Referer: http://10.10.30.96/tours/index.html
Accept-Encoding: gzip, deflate
Accept-Language: en-GB,en-US;q=0.9,en;q=0.8
----
--Response 
HTTP/1.1 200 OK
Content-Length: 4125
Content-Type: image/gif
Connection: Keep Alive
----
--Request 
GET http://10.10.30.96/tours/Merc10-dev/images/login.gif
Host: 10.10.30.96
Host: 10.10.30.96
Connection: keep-alive
User-Agent: Mozilla/5.0 (Windows NT 10.0; Win64; x64) AppleWebKit/537.36 (KHTML, like Gecko) Chrome/79.0.3945.130 Safari/537.36
Accept: image/webp,image/apng,image/*,*/*;q=0.8
Referer: http://10.10.30.96/tours/index.html
Accept-Encoding: gzip, deflate
Accept-Language: en-GB,en-US;q=0.9,en;q=0.8
----
--Response 
HTTP/1.1 200 OK
Content-Length: 1323
Content-Type: image/gif
Connection: Keep Alive
----
--Request 
GET http://10.10.30.96/tours/images/banner_merctur.jpg
Host: 10.10.30.96
Host: 10.10.30.96
Connection: keep-alive
User-Agent: Mozilla/5.0 (Windows NT 10.0; Win64; x64) AppleWebKit/537.36 (KHTML, like Gecko) Chrome/79.0.3945.130 Safari/537.36
Accept: image/webp,image/apng,image/*,*/*;q=0.8
Referer: http://10.10.30.96/tours/index.html
Accept-Encoding: gzip, deflate
Accept-Language: en-GB,en-US;q=0.9,en;q=0.8
----
--Response 
HTTP/1.1 200 OK
Content-Length: 22548
Content-Type: image/jpeg
Connection: Keep Alive
----
--Request 
GET https://ssl.gstatic.com/safebrowsing/csd/client_model_v5_ext_variation_0.pb
Host: ssl.gstatic.com
Host: ssl.gstatic.com
Connection: keep-alive
Sec-Fetch-Site: none
Sec-Fetch-Mode: no-cors
User-Agent: Mozilla/5.0 (Windows NT 10.0; Win64; x64) AppleWebKit/537.36 (KHTML, like Gecko) Chrome/79.0.3945.130 Safari/537.36
Accept-Encoding: gzip, deflate, br
----
--Response 
HTTP/1.1 200
status: 200
accept-ranges: bytes
vary: Accept-Encoding
content-type: application/octet-stream
content-length: 77948
date: Tue, 28 Jul 2020 19:10:40 GMT
expires: Wed, 05 Aug 2020 19:10:40 GMT
last-modified: Tue, 22 Oct 2019 18:15:00 GMT
x-content-type-options: nosniff
server: sffe
x-xss-protection: 0
cache-control: public, max-age=691200
age: 642545
alt-svc: h3-29=\":443\"; ma=2592000,h3-27=\":443\"; ma=2592000,h3-T050=\":443\"; ma=2592000,h3-Q050=\":443\"; ma=2592000,h3-Q046=\":443\"; ma=2592000,h3-Q043=\":443\"; ma=2592000,quic=\":443\"; ma=2592000; v=\"46,43\"
----
--Request 
GET https://ssl.gstatic.com/safebrowsing/csd/client_model_v5_variation_0.pb
Host: ssl.gstatic.com
Host: ssl.gstatic.com
Connection: keep-alive
Sec-Fetch-Site: none
Sec-Fetch-Mode: no-cors
User-Agent: Mozilla/5.0 (Windows NT 10.0; Win64; x64) AppleWebKit/537.36 (KHTML, like Gecko) Chrome/79.0.3945.130 Safari/537.36
Accept-Encoding: gzip, deflate, br
----
--Response 
HTTP/1.1 200
status: 200
accept-ranges: bytes
vary: Accept-Encoding
content-type: application/octet-stream
content-length: 77948
date: Thu, 30 Jul 2020 00:55:16 GMT
expires: Fri, 07 Aug 2020 00:55:16 GMT
last-modified: Tue, 22 Oct 2019 18:15:00 GMT
x-content-type-options: nosniff
server: sffe
x-xss-protection: 0
cache-control: public, max-age=691200
age: 535469
alt-svc: h3-29=\":443\"; ma=2592000,h3-27=\":443\"; ma=2592000,h3-T050=\":443\"; ma=2592000,h3-Q050=\":443\"; ma=2592000,h3-Q046=\":443\"; ma=2592000,h3-Q043=\":443\"; ma=2592000,quic=\":443\"; ma=2592000; v=\"46,43\"
----

