--Request 
POST https://ing-district.clicktale.net/ctn_v2/wr/?3301609095856292&24&11&4&0&2&8&subsid=233441&msgsize=120
Host: ing-district.clicktale.net
Host: ing-district.clicktale.net
Connection: keep-alive
Content-Length: 9744
Origin: https://www.kohls.com
User-Agent: Mozilla/5.0 (Windows NT 10.0; WOW64) AppleWebKit/537.36 (KHTML, like Gecko) Chrome/56.0.2924.87 Safari/537.36
Content-Type: text/plain
Accept: */*
Sec-Fetch-Site: cross-site
Sec-Fetch-Mode: cors
Referer: https://www.kohls.com/
Accept-Encoding: gzip, deflate, br
Accept-Language: en-GB,en-US;q=0.9,en;q=0.8
----
 POSTDATA qcm_buffer_timing_fix&15902&9D4eP_([{"type":0,"addedNodes":[{"nodeType":1,"id":"SCRIPT166","type":1,"parentNode":"BODY1","tagName":"SCRIPT"}],"removedNodes":[]},{"type":1,"attribute":{"attributeName":"nvsensitive","attributeValue":"","id":"INPUT3"}},{"type":1,"attribute":{"attributeName":"nvsensitive","attributeValue":"","id":"DIV17"}}])&8CRP_([{"type":0,"addedNodes":[],"removedNodes":[{"id":"FORM5"}]}])&XP_([{"type":0,"addedNodes":[{"nodeType":1,"id":"SCRIPT167","type":1,"parentNode":"HEAD1","tagName":"SCRIPT"}],"removedNodes":[]},{"type":1,"attribute":{"attributeName":"nvsensitive","attributeValue":"","id":"INPUT3"}},{"type":1,"attribute":{"attributeName":"nvsensitive","attributeValue":"","id":"DIV17"}}])&8BgP_([{"type":0,"addedNodes":[{"nodeType":3,"id":"#text6003","type":1,"parentNode":"BODY1","textContent":"\n"}],"removedNodes":[]},{"type":0,"addedNodes":[{"nodeType":8,"id":"#comment209","type":1,"parentNode":"BODY1"}],"removedNodes":[]},{"type":0,"addedNodes":[{"nodeType":3,"id":"#text6004","type":1,"parentNode":"BODY1","textContent":"\n"}],"removedNodes":[]},{"type":0,"addedNodes":[{"nodeType":1,"id":"SCRIPT168","type":1,"parentNode":"BODY1","tagName":"SCRIPT"}],"removedNodes":[]},{"type":1,"attribute":{"attributeName":"nvsensitive","attributeValue":"","id":"INPUT3"}},{"type":1,"attribute":{"attributeName":"nvsensitive","attributeValue":"","id":"DIV17"}}])&3P_([{"type":0,"addedNodes":[{"nodeType":1,"id":"SCRIPT169","type":1,"nextSibling":"SCRIPT1","tagName":"SCRIPT"}],"removedNodes":[]},{"type":1,"attribute":{"attributeName":"nvsensitive","attributeValue":"","id":"INPUT3"}},{"type":1,"attribute":{"attributeName":"nvsensitive","attributeValue":"","id":"DIV17"}}])&SP_(%5B%7B%22type%22%3A0%2C%22addedNodes%22%3A%5B%7B%22nodeType%22%3A3%2C%22id%22%3A%22%23text6005%22%2C%22type%22%3A1%2C%22parentNode%22%3A%22BODY1%22%2C%22textContent%22%3A%22%5Cn%22%7D%5D%2C%22removedNodes%22%3A%5B%5D%7D%2C%7B%22type%22%3A0%2C%22addedNodes%22%3A%5B%7B%22nodeType%22%3A1%2C%22id%22%3A%22SCRIPT170%22%2C%22type%22%3A1%2C%22parentNode%22%3A%22BODY1%22%2C%22tagName%22%3A%22SCRIPT%22%7D%5D%2C%22removedNodes%22%3A%5B%5D%7D%2C%7B%22type%22%3A0%2C%22addedNodes%22%3A%5B%7B%22nodeType%22%3A1%2C%22id%22%3A%22SCRIPT171%22%2C%22type%22%3A1%2C%22parentNode%22%3A%22HEAD1%22%2C%22tagName%22%3A%22SCRIPT%22%7D%5D%2C%22removedNodes%22%3A%5B%5D%7D%2C%7B%22type%22%3A0%2C%22addedNodes%22%3A%5B%7B%22nodeType%22%3A1%2C%22id%22%3A%22SCRIPT172%22%2C%22type%22%3A1%2C%22parentNode%22%3A%22HEAD1%22%2C%22tagName%22%3A%22SCRIPT%22%7D%5D%2C%22removedNodes%22%3A%5B%5D%7D%2C%7B%22type%22%3A0%2C%22addedNodes%22%3A%5B%7B%22nodeType%22%3A3%2C%22id%22%3A%22%23text6006%22%2C%22type%22%3A1%2C%22parentNode%22%3A%22BODY1%22%2C%22textContent%22%3A%22%5Cn%22%7D%5D%2C%22removedNodes%22%3A%5B%5D%7D%2C%7B%22type%22%3A0%2C%22addedNodes%22%3A%5B%7B%22nodeType%22%3A1%2C%22id%22%3A%22SCRIPT173%22%2C%22type%22%3A1%2C%22parentNode%22%3A%22BODY1%22%2C%22tagName%22%3A%22SCRIPT%22%7D%5D%2C%22removedNodes%22%3A%5B%5D%7D%2C%7B%22type%22%3A0%2C%22addedNodes%22%3A%5B%7B%22nodeType%22%3A1%2C%22id%22%3A%22SCRIPT174%22%2C%22type%22%3A1%2C%22nextSibling%22%3A%22SCRIPT169%22%2C%22tagName%22%3A%22SCRIPT%22%7D%5D%2C%22removedNodes%22%3A%5B%5D%7D%2C%7B%22type%22%3A0%2C%22addedNodes%22%3A%5B%7B%22nodeType%22%3A1%2C%22id%22%3A%22IMG152%22%2C%22type%22%3A1%2C%22parentNode%22%3A%22BODY1%22%2C%22tagName%22%3A%22IMG%22%2C%22attributes%22%3A%7B%22height%22%3A%221%22%2C%22width%22%3A%221%22%2C%22style%22%3A%22display%3Anone%22%2C%22src%22%3A%22https%3A%2F%2Fwww.facebook.com%2Ftr%3Fid%3D1272022626312394%26ev%3DPageView%26cd%5Border_id%5D%3D09167193449239534971532002446042350327%22%7D%7D%5D%2C%22removedNodes%22%3A%5B%5D%7D%2C%7B%22type%22%3A0%2C%22addedNodes%22%3A%5B%7B%22nodeType%22%3A1%2C%22id%22%3A%22SCRIPT175%22%2C%22type%22%3A1%2C%22parentNode%22%3A%22BODY1%22%2C%22tagName%22%3A%22SCRIPT%22%7D%5D%2C%22removedNodes%22%3A%5B%5D%7D%2C%7B%22type%22%3A0%2C%22addedNodes%22%3A%5B%7B%22nodeType%22%3A1%2C%22id%22%3A%22SCRIPT176%22%2C%22type%22%3A1%2C%22nextSibling%22%3A%22SCRIPT174%22%2C%22tagName%22%3A%22SCRIPT%22%7D%5D%2C%22removedNodes%22%3A%5B%5D%7D%2C%7B%22type%22%3A0%2C%22addedNodes%22%3A%5B%7B%22nodeType%22%3A1%2C%22id%22%3A%22SCRIPT177%22%2C%22type%22%3A1%2C%22parentNode%22%3A%22BODY1%22%2C%22tagName%22%3A%22SCRIPT%22%7D%5D%2C%22removedNodes%22%3A%5B%5D%7D%2C%7B%22type%22%3A1%2C%22attribute%22%3A%7B%22attributeName%22%3A%22nvsensitive%22%2C%22attributeValue%22%3A%22%22%2C%22id%22%3A%22INPUT3%22%7D%7D%2C%7B%22type%22%3A1%2C%22attribute%22%3A%7B%22attributeName%22%3A%22nvsensitive%22%2C%22attributeValue%22%3A%22%22%2C%22id%22%3A%22DIV17%22%7D%7D%5D)&8C+P_([{"type":0,"addedNodes":[{"nodeType":1,"id":"SCRIPT178","type":1,"parentNode":"HEAD1","tagName":"SCRIPT"}],"removedNodes":[]},{"type":1,"attribute":{"attributeName":"nvsensitive","attributeValue":"","id":"INPUT3"}},{"type":1,"attribute":{"attributeName":"nvsensitive","attributeValue":"","id":"DIV17"}}])&RP_([{"type":0,"addedNodes":[{"nodeType":1,"id":"IFRAME9","type":1,"parentNode":"BODY1","tagName":"IFRAME","attributes":{"id":"google_osd_static_frame_6969297753291","name":"google_osd_static_frame","style":"display: none; width: 0px; height: 0px;"}}],"removedNodes":[]},{"type":1,"attribute":{"attributeName":"nvsensitive","attributeValue":"","id":"INPUT3"}},{"type":1,"attribute":{"attributeName":"nvsensitive","attributeValue":"","id":"DIV17"}}])&8BXP_([{"type":1,"attribute":{"attributeName":"data-load-complete","attributeValue":"true","id":"IFRAME4"}}])&8BTP_([{"type":1,"attribute":{"attributeName":"data-load-complete","attributeValue":"true","id":"IFRAME3"}}])&wP_([{"type":1,"attribute":{"attributeName":"data-load-complete","attributeValue":"true","id":"IFRAME2"}}])&8BYP_([{"type":0,"addedNodes":[{"nodeType":1,"id":"IFRAME10","type":1,"parentNode":"BODY1","tagName":"IFRAME","attributes":{"src":"https://tpc.googlesyndication.com/sodar/sodar2/222/runner.html","width":"0","height":"0","style":"display: none;"}}],"removedNodes":[]},{"type":0,"addedNodes":[{"nodeType":1,"id":"IFRAME11","type":1,"parentNode":"BODY1","tagName":"IFRAME","attributes":{"src":"https://www.google.com/recaptcha/api2/aframe","width":"0","height":"0","style":"display: none;"}}],"removedNodes":[]},{"type":1,"attribute":{"attributeName":"nvsensitive","attributeValue":"","id":"INPUT3"}},{"type":1,"attribute":{"attributeName":"nvsensitive","attributeValue":"","id":"DIV17"}}])&8DCP_([{"type":0,"addedNodes":[],"removedNodes":[{"id":"SCRIPT166"}]}])&FP_([{"type":0,"addedNodes":[{"nodeType":1,"id":"SCRIPT179","type":1,"nextSibling":"SCRIPT176","tagName":"SCRIPT"}],"removedNodes":[]},{"type":1,"attribute":{"attributeName":"nvsensitive","attributeValue":"","id":"INPUT3"}},{"type":1,"attribute":{"attributeName":"nvsensitive","attributeValue":"","id":"DIV17"}}])&8BCP_(%5B%7B%22type%22%3A0%2C%22addedNodes%22%3A%5B%7B%22nodeType%22%3A8%2C%22id%22%3A%22%23comment210%22%2C%22type%22%3A1%2C%22parentNode%22%3A%22BODY1%22%7D%5D%2C%22removedNodes%22%3A%5B%5D%7D%2C%7B%22type%22%3A0%2C%22addedNodes%22%3A%5B%7B%22nodeType%22%3A3%2C%22id%22%3A%22%23text6007%22%2C%22type%22%3A1%2C%22parentNode%22%3A%22BODY1%22%2C%22textContent%22%3A%22%5Cn%22%7D%5D%2C%22removedNodes%22%3A%5B%5D%7D%2C%7B%22type%22%3A0%2C%22addedNodes%22%3A%5B%7B%22nodeType%22%3A1%2C%22id%22%3A%22SCRIPT180%22%2C%22type%22%3A1%2C%22parentNode%22%3A%22BODY1%22%2C%22tagName%22%3A%22SCRIPT%22%7D%5D%2C%22removedNodes%22%3A%5B%5D%7D%2C%7B%22type%22%3A0%2C%22addedNodes%22%3A%5B%7B%22nodeType%22%3A1%2C%22id%22%3A%22IFRAME12%22%2C%22type%22%3A1%2C%22parentNode%22%3A%22BODY1%22%2C%22tagName%22%3A%22IFRAME%22%2C%22attributes%22%3A%7B%22style%22%3A%22position%3Aabsolute%3B%20visibility%3Ahidden%3B%20width%3A1px%3B%20height%3A1px%3B%22%2C%22src%22%3A%22https%3A%2F%2Fservedby.flashtalking.com%2Fcontainer%2F1638%3B12462%3B1480%3Biframe%2F%3FspotName%3DHomepage%26U3%3D09167193449239534971532002446042350327%26U7%3Dc68333f4-b7d4-42dd-be5f-49d1eb509125%26U10%3DN%2FA%26cachebuster%3D508927.46390276833%22%7D%7D%5D%2C%22removedNodes%22%3A%5B%5D%7D%2C%7B%22type%22%3A1%2C%22attribute%22%3A%7B%22attributeName%22%3A%22nvsensitive%22%2C%22attributeValue%22%3A%22%22%2C%22id%22%3A%22INPUT3%22%7D%7D%2C%7B%22type%22%3A1%2C%22attribute%22%3A%7B%22attributeName%22%3A%22nvsensitive%22%2C%22attributeValue%22%3A%22%22%2C%22id%22%3A%22DIV17%22%7D%7D%5D)&8CnP_([{"type":0,"addedNodes":[{"nodeType":1,"id":"SCRIPT181","type":1,"parentNode":"HEAD1","tagName":"SCRIPT"}],"removedNodes":[]},{"type":1,"attribute":{"attributeName":"nvsensitive","attributeValue":"","id":"INPUT3"}},{"type":1,"attribute":{"attributeName":"nvsensitive","attributeValue":"","id":"DIV17"}}])&WP_([{"type":0,"addedNodes":[{"nodeType":1,"id":"SCRIPT182","type":1,"parentNode":"HEAD1","tagName":"SCRIPT"}],"removedNodes":[]},{"type":1,"attribute":{"attributeName":"nvsensitive","attributeValue":"","id":"INPUT3"}},{"type":1,"attribute":{"attributeName":"nvsensitive","attributeValue":"","id":"DIV17"}}])&SP_([{"type":0,"addedNodes":[{"nodeType":1,"id":"SCRIPT183","type":1,"parentNode":"BODY1","tagName":"SCRIPT"}],"removedNodes":[]},{"type":0,"addedNodes":[{"nodeType":1,"id":"SCRIPT184","type":1,"nextSibling":"SCRIPT179","tagName":"SCRIPT"}],"removedNodes":[]},{"type":1,"attribute":{"attributeName":"nvsensitive","attributeValue":"","id":"INPUT3"}},{"type":1,"attribute":{"attributeName":"nvsensitive","attributeValue":"","id":"DIV17"}}])&8DDP_([{"type":0,"addedNodes":[{"nodeType":1,"id":"SCRIPT185","type":1,"parentNode":"BODY1","tagName":"SCRIPT"}],"removedNodes":[]},{"type":1,"attribute":{"attributeName":"nvsensitive","attributeValue":"","id":"INPUT3"}},{"type":1,"attribute":{"attributeName":"nvsensitive","attributeValue":"","id":"DIV17"}}])&Vqcm_buffer_timing_fix&17445&F
--Response 
HTTP/1.1 200
status: 200
date: Fri, 21 May 2021 08:10:31 GMT
content-type: text/plain; charset=UTF-8
content-length: 1
access-control-allow-origin: *
----
--Request 
GET https://i.flashtalking.com/ft/?aid=1638&uid=D9:953f32075a0d4775aaeb985aae6fb15e&seg=xh0
Host: i.flashtalking.com
Host: i.flashtalking.com
Connection: keep-alive
User-Agent: Mozilla/5.0 (Windows NT 10.0; WOW64) AppleWebKit/537.36 (KHTML, like Gecko) Chrome/56.0.2924.87 Safari/537.36
Accept: image/webp,image/apng,image/*,*/*;q=0.8
Sec-Fetch-Site: same-site
Sec-Fetch-Mode: no-cors
Referer: https://servedby.flashtalking.com/container/1638;12462;1480;iframe/?spotName=Homepage&U3=09167193449239534971532002446042350327&U7=c68333f4-b7d4-42dd-be5f-49d1eb509125&U10=N/A&cachebuster=508927.46390276833
Accept-Encoding: gzip, deflate, br
Accept-Language: en-GB,en-US;q=0.9,en;q=0.8
Cookie: flashtalkingad1=\"GUID=4889036A7EB909|segment=(xh0)\"; _D9J=8f80840b94c84fa4a52c7d221e8925b3
----
--Response 
HTTP/1.1 200
status: 200
date: Fri, 21 May 2021 08:10:31 GMT
content-type: image/gif
content-length: 41
----
--Request 
GET https://dpm.demdex.net/ibs:dpid=129099&dpuuid=3eaf6708fd6f725db0ac88e0b98e58bc
Host: dpm.demdex.net
Host: dpm.demdex.net
Connection: keep-alive
User-Agent: Mozilla/5.0 (Windows NT 10.0; WOW64) AppleWebKit/537.36 (KHTML, like Gecko) Chrome/56.0.2924.87 Safari/537.36
Accept: image/webp,image/apng,image/*,*/*;q=0.8
Sec-Fetch-Site: cross-site
Sec-Fetch-Mode: no-cors
Referer: https://kohls.demdex.net/dest5.html?d_nsid=0
Accept-Encoding: gzip, deflate, br
Accept-Language: en-GB,en-US;q=0.9,en;q=0.8
Cookie: demdex=04008972383028020332047544168878754783; dpm=04008972383028020332047544168878754783; dextp=21-1-1621584621741|60-1-1621584621908|358-1-1621584622024|477-1-1621584622133|601-1-1621584622350|640-1-1621584622468|771-1-1621584622578|822-1-1621584622687|992-1-1621584623181|1123-1-1621584623334|1083-1-1621584623626|1085-1-1621584624165|1086-1-1621584624279|1087-1-1621584624418|1088-1-1621584624538|903-1-1621584624704|20-1-1621584624819|3047-1-1621584624924|28645-1-1621584625115|30064-1-1621584625232|30646-1-1621584625377|575-1-1621584625508|53196-1-1621584625618|49276-1-1621584625748|73426-1-1621584626339|75557-1-1621584626461|79908-1-1621584626940|2340-1-1621584627937|66757-1-1621584628046|121998-1-1621584628152|144230-1-1621584628277|144231-1-1621584628504|144232-1-1621584628746|144233-1-1621584628884|144234-1-1621584628995|144235-1-1621584629126|144236-1-1621584629232|144237-1-1621584629351|129099-1-1621584629485|161033-1-1621584629707
----
--Response 
HTTP/1.1 200 OK
Cache-Control: no-cache,no-store,must-revalidate,max-age=0,proxy-revalidate,no-transform,private
content-encoding: gzip
Content-Type: image/gif
DCS: dcs-prod-ind1-2-v006-0be75c808.edge-ind1.demdex.com 6.2.1.20210514105329-PR_1432-SNAPSHOT
Expires: Thu, 01 Jan 1970 00:00:00 UTC
P3P: policyref=\"/w3c/p3p.xml\", CP=\"NOI NID CURa ADMa DEVa PSAa PSDa OUR SAMa BUS PUR COM NAV INT\"
Pragma: no-cache
set-cookie: dpm=04008972383028020332047544168878754783; Max-Age=15552000; Expires=Wed, 17 Nov 2021 08:10:31 GMT; Path=/; Domain=.dpm.demdex.net
set-cookie: demdex=04008972383028020332047544168878754783; Max-Age=15552000; Expires=Wed, 17 Nov 2021 08:10:31 GMT; Path=/; Domain=.demdex.net
Strict-Transport-Security: max-age=31536000; includeSubDomains
X-Content-Type-Options: nosniff
X-TID: lnykJjlIRZk=
Content-Length: 59
Connection: keep-alive
----
--Request 
GET https://subscription.omnithrottle.com/index.php?p_CID=n2JkAzYLvYKbnhMciAlQsmqCD5Pp6sXpRLupwzHov54&p_uid=bd6214b1e4ec410740f27d745339eb1c9937b893e7c63ee14f916a496f3d3bf58191bb57fc32d6d7&rm=HTTP_REDIRECT&v_id=
Host: subscription.omnithrottle.com
Host: subscription.omnithrottle.com
Connection: keep-alive
User-Agent: Mozilla/5.0 (Windows NT 10.0; WOW64) AppleWebKit/537.36 (KHTML, like Gecko) Chrome/56.0.2924.87 Safari/537.36
Accept: image/webp,image/apng,image/*,*/*;q=0.8
Sec-Fetch-Site: cross-site
Sec-Fetch-Mode: no-cors
Referer: https://www.kohls.com/
Accept-Encoding: gzip, deflate, br
Accept-Language: en-GB,en-US;q=0.9,en;q=0.8
----
--Response 
HTTP/1.1 200
status: 200
date: Fri, 21 May 2021 08:10:31 GMT
content-type: text/html; charset=UTF-8
server: nginx
vary: Accept-Encoding
set-cookie: uuid=8723d345c23ee7c1f746699bdc2d5c86; expires=Thu, 19-Aug-2021 08:10:28 GMT; Max-Age=7776000; path=/; HttpOnly
x-xss-protection: 1; mode=block
x-content-type-options: nosniff
content-encoding: gzip
----
--Request 
GET https://match.adsrvr.org/track/cmf/generic?ttd_pid=liveintent&ttd_tpi=1
Host: match.adsrvr.org
Host: match.adsrvr.org
Connection: keep-alive
User-Agent: Mozilla/5.0 (Windows NT 10.0; WOW64) AppleWebKit/537.36 (KHTML, like Gecko) Chrome/56.0.2924.87 Safari/537.36
Accept: image/webp,image/apng,image/*,*/*;q=0.8
Sec-Fetch-Site: cross-site
Sec-Fetch-Mode: no-cors
Referer: https://i.liadm.com/s/c/a-00oc?s=&cim=&ps=true&ls=true&duid=0b10d8358f40--01f66zkj520w2ekqxg68j6fva2&ppid=0&euns=0&ci=0&version=sc-v0.2.0&nosync=false&monitorExternalSyncs=false&
Accept-Encoding: gzip, deflate, br
Accept-Language: en-GB,en-US;q=0.9,en;q=0.8
Cookie: TDID=8e4131eb-9a1d-4233-9e84-ee0b02d0f9aa; TDCPM=CAESEgoDYWFtEgsIop62vr2OzjkQBRIVCgZzaWduYWwSCwjEt9jhvY7OORAFGAEgASgCMgsIxK_bjtSOzjkQBTgBWgZzaWduYWxgAg..
----
--Response 
HTTP/1.1 302
status: 302
date: Fri, 21 May 2021 08:10:31 GMT
content-type: text/html
content-length: 215
location: https://i.liadm.com/s/35759?bidder_id=44489&bidder_uuid=8e4131eb-9a1d-4233-9e84-ee0b02d0f9aa
cache-control: private,no-cache, must-revalidate
pragma: no-cache
x-aspnet-version: 4.0.30319
set-cookie: TDID=8e4131eb-9a1d-4233-9e84-ee0b02d0f9aa; domain=.adsrvr.org; expires=Sat, 21-May-2022 08:10:31 GMT; path=/; secure; SameSite=None
set-cookie: TDCPM=CAESEgoDYWFtEgsIop62vr2OzjkQBRIVCgZzaWduYWwSCwjEt9jhvY7OORAFEhkKCmxpdmVpbnRlbnQSCwiK75z2vY7OORAFGAEgASgCMgsIiuefo9SOzjkQBTgBWgpsaXZlaW50ZW50YAI.; domain=.adsrvr.org; expires=Sat, 21-May-2022 08:10:31 GMT; path=/; secure; SameSite=None
p3p: CP=\"NOI DSP COR CUR ADMo DEVo PSAo PSDo OUR SAMo BUS UNI NAV\"
----
--Request 
GET https://dpm.demdex.net/ibs:dpid=127444&dpuuid=925b9c46-901d-46a8-9a05-faf7c8a16460&redir=https%3A%2F%2Fi.liadm.com%2Fs%2Fe%2Fa-00oc%2F0%2Fb2385ff59a9b477e832962b2e12e2abc%3Fmpid%3D82775%26muid%3D%24%7BDD_UUID%7D
Host: dpm.demdex.net
Host: dpm.demdex.net
Connection: keep-alive
User-Agent: Mozilla/5.0 (Windows NT 10.0; WOW64) AppleWebKit/537.36 (KHTML, like Gecko) Chrome/56.0.2924.87 Safari/537.36
Accept: image/webp,image/apng,image/*,*/*;q=0.8
Sec-Fetch-Site: cross-site
Sec-Fetch-Mode: no-cors
Referer: https://i.liadm.com/s/c/a-00oc?s=&cim=&ps=true&ls=true&duid=0b10d8358f40--01f66zkj520w2ekqxg68j6fva2&ppid=0&euns=0&ci=0&version=sc-v0.2.0&nosync=false&monitorExternalSyncs=false&
Accept-Encoding: gzip, deflate, br
Accept-Language: en-GB,en-US;q=0.9,en;q=0.8
Cookie: demdex=04008972383028020332047544168878754783; dpm=04008972383028020332047544168878754783; dextp=21-1-1621584621741|60-1-1621584621908|358-1-1621584622024|477-1-1621584622133|601-1-1621584622350|640-1-1621584622468|771-1-1621584622578|822-1-1621584622687|992-1-1621584623181|1123-1-1621584623334|1083-1-1621584623626|1085-1-1621584624165|1086-1-1621584624279|1087-1-1621584624418|1088-1-1621584624538|903-1-1621584624704|20-1-1621584624819|3047-1-1621584624924|28645-1-1621584625115|30064-1-1621584625232|30646-1-1621584625377|575-1-1621584625508|53196-1-1621584625618|49276-1-1621584625748|73426-1-1621584626339|75557-1-1621584626461|79908-1-1621584626940|2340-1-1621584627937|66757-1-1621584628046|121998-1-1621584628152|144230-1-1621584628277|144231-1-1621584628504|144232-1-1621584628746|144233-1-1621584628884|144234-1-1621584628995|144235-1-1621584629126|144236-1-1621584629232|144237-1-1621584629351|129099-1-1621584629485|161033-1-1621584629707
----
--Response 
HTTP/1.1 302 Found
Cache-Control: no-cache,no-store,must-revalidate,max-age=0,proxy-revalidate,no-transform,private
DCS: dcs-prod-ind1-1-v006-011b47a37.edge-ind1.demdex.com 6.2.1.20210514105329-PR_1432-SNAPSHOT
Expires: Thu, 01 Jan 1970 00:00:00 UTC
Location: https://i.liadm.com/s/e/a-00oc/0/b2385ff59a9b477e832962b2e12e2abc?mpid=82775&muid=04008972383028020332047544168878754783
P3P: policyref=\"/w3c/p3p.xml\", CP=\"NOI NID CURa ADMa DEVa PSAa PSDa OUR SAMa BUS PUR COM NAV INT\"
Pragma: no-cache
set-cookie: dpm=04008972383028020332047544168878754783; Max-Age=15552000; Expires=Wed, 17 Nov 2021 08:10:31 GMT; Path=/; Domain=.dpm.demdex.net
set-cookie: demdex=04008972383028020332047544168878754783; Max-Age=15552000; Expires=Wed, 17 Nov 2021 08:10:31 GMT; Path=/; Domain=.demdex.net
Strict-Transport-Security: max-age=31536000; includeSubDomains
X-TID: hVsn9E86QTg=
Content-Length: 0
Connection: keep-alive
----
--Request 
GET https://trc.taboola.com/sg/liveintent/1/cm/
Host: trc.taboola.com
Host: trc.taboola.com
Connection: keep-alive
User-Agent: Mozilla/5.0 (Windows NT 10.0; WOW64) AppleWebKit/537.36 (KHTML, like Gecko) Chrome/56.0.2924.87 Safari/537.36
Accept: image/webp,image/apng,image/*,*/*;q=0.8
Sec-Fetch-Site: cross-site
Sec-Fetch-Mode: no-cors
Referer: https://i.liadm.com/s/c/a-00oc?s=&cim=&ps=true&ls=true&duid=0b10d8358f40--01f66zkj520w2ekqxg68j6fva2&ppid=0&euns=0&ci=0&version=sc-v0.2.0&nosync=false&monitorExternalSyncs=false&
Accept-Encoding: gzip, deflate, br
Accept-Language: en-GB,en-US;q=0.9,en;q=0.8
----
--Response 
HTTP/1.1 200
status: 200
server: nginx
cache-control: no-cache, no-store
pragma: no-cache
accept-ranges: bytes
date: Fri, 21 May 2021 08:10:31 GMT
via: 1.1 varnish
x-served-by: cache-del21729-DEL
x-cache: MISS
x-cache-hits: 0
x-timer: S1621584632.616460,VS0,VE219
x-vcl-time-ms: 219
----
--Request 
GET https://i.liadm.com/s/e/a-00oc/0/b2385ff59a9b477e832962b2e12e2abc?mpid=82775&muid=04008972383028020332047544168878754783
Host: i.liadm.com
Host: i.liadm.com
Connection: keep-alive
User-Agent: Mozilla/5.0 (Windows NT 10.0; WOW64) AppleWebKit/537.36 (KHTML, like Gecko) Chrome/56.0.2924.87 Safari/537.36
Accept: image/webp,image/apng,image/*,*/*;q=0.8
Sec-Fetch-Site: cross-site
Sec-Fetch-Mode: no-cors
Referer: https://i.liadm.com/s/c/a-00oc?s=&cim=&ps=true&ls=true&duid=0b10d8358f40--01f66zkj520w2ekqxg68j6fva2&ppid=0&euns=0&ci=0&version=sc-v0.2.0&nosync=false&monitorExternalSyncs=false&
Accept-Encoding: gzip, deflate, br
Accept-Language: en-GB,en-US;q=0.9,en;q=0.8
Cookie: _li_ss=MgUIBhC-DzIFCAoQvg8yBQh6EL0PMgYIiwEQvg8yBQgLEL4PMgUICxC-DzIFCHkQvQ8; lidid=3b390670-5aa0-43ba-b47d-f317213131a2
----
--Response 
HTTP/1.1 200 OK
Cache-Control: no-store
Content-Type: image/gif
Date: Fri, 21 May 2021 08:10:31 GMT
Strict-Transport-Security: max-age=31536000; includeSubDomains
trace-id: da6897c78077b2b8
Content-Length: 43
Connection: keep-alive
----
--Request 
GET https://i.liadm.com/s/35759?bidder_id=44489&bidder_uuid=8e4131eb-9a1d-4233-9e84-ee0b02d0f9aa
Host: i.liadm.com
Host: i.liadm.com
Connection: keep-alive
User-Agent: Mozilla/5.0 (Windows NT 10.0; WOW64) AppleWebKit/537.36 (KHTML, like Gecko) Chrome/56.0.2924.87 Safari/537.36
Accept: image/webp,image/apng,image/*,*/*;q=0.8
Sec-Fetch-Site: cross-site
Sec-Fetch-Mode: no-cors
Referer: https://i.liadm.com/s/c/a-00oc?s=&cim=&ps=true&ls=true&duid=0b10d8358f40--01f66zkj520w2ekqxg68j6fva2&ppid=0&euns=0&ci=0&version=sc-v0.2.0&nosync=false&monitorExternalSyncs=false&
Accept-Encoding: gzip, deflate, br
Accept-Language: en-GB,en-US;q=0.9,en;q=0.8
Cookie: _li_ss=MgUIBhC-DzIFCAoQvg8yBQh6EL0PMgYIiwEQvg8yBQgLEL4PMgUICxC-DzIFCHkQvQ8; lidid=3b390670-5aa0-43ba-b47d-f317213131a2
----
--Response 
HTTP/1.1 303 See Other
Date: Fri, 21 May 2021 08:10:31 GMT
Location: https://i6.liadm.com/s/35759?bidder_id=44489&bidder_uuid=8e4131eb-9a1d-4233-9e84-ee0b02d0f9aa
Set-Cookie: _li_ss=MgUIBhC-DzIFCAoQvg8yBQh6EL0PMgYIiwEQvg8yBQgLEL4PMgUICxC-DzIFCHkQvQ8yCQj_____BxC-Dw; Max-Age=2592000; Expires=Sun, 20 Jun 2021 08:10:31 GMT; Path=/s
Set-Cookie: lidid=3b390670-5aa0-43ba-b47d-f317213131a2; Max-Age=63072000; Expires=Sun, 21 May 2023 08:10:31 GMT; Path=/; Domain=liadm.com
Strict-Transport-Security: max-age=31536000; includeSubDomains
trace-id: 9012962ae70d5fb6
Content-Length: 0
Connection: keep-alive
----
--Request 
GET https://x.dlx.addthis.com/e/live_intent_sync?na_exid=925b9c46-901d-46a8-9a05-faf7c8a16460
Host: x.dlx.addthis.com
Host: x.dlx.addthis.com
Connection: keep-alive
User-Agent: Mozilla/5.0 (Windows NT 10.0; WOW64) AppleWebKit/537.36 (KHTML, like Gecko) Chrome/56.0.2924.87 Safari/537.36
Accept: image/webp,image/apng,image/*,*/*;q=0.8
Sec-Fetch-Site: cross-site
Sec-Fetch-Mode: no-cors
Referer: https://i.liadm.com/s/c/a-00oc?s=&cim=&ps=true&ls=true&duid=0b10d8358f40--01f66zkj520w2ekqxg68j6fva2&ppid=0&euns=0&ci=0&version=sc-v0.2.0&nosync=false&monitorExternalSyncs=false&
Accept-Encoding: gzip, deflate, br
Accept-Language: en-GB,en-US;q=0.9,en;q=0.8
----
--Response 
HTTP/1.1 302
status: 302
content-length: 0
location: https://x.dlx.addthis.com/e/live_intent_sync?na_exid=925b9c46-901d-46a8-9a05-faf7c8a16460&rd=Y
expires: Fri, 21 May 2021 08:10:31 GMT
cache-control: max-age=0, no-cache, no-store
pragma: no-cache
date: Fri, 21 May 2021 08:10:31 GMT
set-cookie: na_id=2021052108103100018047382520; Path=/; Domain=addthis.com; Max-Age=34214400; Secure; SameSite=None
set-cookie: na_tc=Y; Path=/; Domain=addthis.com; Max-Age=34214400; Secure; SameSite=None
set-cookie: uid=60a76af7b18b253a; Path=/; Domain=addthis.com; Max-Age=34214400; Secure; SameSite=None
set-cookie: ouid=60a76af70001b40bd189743dfed3b2b8b30930fb83dddebba982; Path=/; Domain=addthis.com; Max-Age=34214400; Secure; SameSite=None
strict-transport-security: max-age=2628000
----
--Request 
GET https://sync.mathtag.com/sync/img?mt_exid=36&redir=https%3A%2F%2Fi.liadm.com%2Fs%2Fe%2Fa-00oc%2F0%2Fb2385ff59a9b477e832962b2e12e2abc%3Fmpid%3D7156%26muid%3D%5BMM_UUID%5D&925b9c46-901d-46a8-9a05-faf7c8a16460
Host: sync.mathtag.com
Host: sync.mathtag.com
Connection: keep-alive
User-Agent: Mozilla/5.0 (Windows NT 10.0; WOW64) AppleWebKit/537.36 (KHTML, like Gecko) Chrome/56.0.2924.87 Safari/537.36
Accept: image/webp,image/apng,image/*,*/*;q=0.8
Sec-Fetch-Site: cross-site
Sec-Fetch-Mode: no-cors
Referer: https://i.liadm.com/s/c/a-00oc?s=&cim=&ps=true&ls=true&duid=0b10d8358f40--01f66zkj520w2ekqxg68j6fva2&ppid=0&euns=0&ci=0&version=sc-v0.2.0&nosync=false&monitorExternalSyncs=false&
Accept-Encoding: gzip, deflate, br
Accept-Language: en-GB,en-US;q=0.9,en;q=0.8
----
--Response 
HTTP/1.1 302 Moved Temporarily
Date: Fri, 21 May 2021 08:10:26 GMT
Content-Type: image/gif
Content-Length: 0
Connection: keep-alive
Keep-Alive: timeout=360
Server: MT3 3736 915c305 master nrt-pixel-x2
Cache-Control: no-cache
P3P: CP=\"NOI DSP COR NID CURa ADMa DEVa PSAa PSDa OUR BUS COM INT OTC PUR STA\"
set-cookie: uuid=55a060a7-6af7-4d00-b151-7be11f1849fa; domain=.mathtag.com; path=/; expires=Sat, 18-Jun-2022 08:10:31 GMT; SameSite=None; Secure
location: https://i.liadm.com/s/e/a-00oc/0/b2385ff59a9b477e832962b2e12e2abc?mpid=7156&muid=55a060a7-6af7-4d00-b151-7be11f1849fa
Expires: Fri, 21 May 2021 08:10:25 GMT
----

