
--Response 
HTTP/1.1 200
status: 200
content-length: 0000000001
content-type: text/plain
access-control-allow-origin: https://www.kohls.com
timing-allow-origin: *
access-control-allow-credentials: true
access-control-allow-methods: POST, PUT, DELETE, GET, OPTIONS
access-control-request-headers: *
access-control-allow-headers: Origin, X-Requested-With, Content-Type, Accept, Authorization, Content-Encoding
access-control-max-age: 300
expires: Fri, 21 May 2021 07:37:25 GMT
cache-control: max-age=0, no-cache, no-store
pragma: no-cache
date: Fri, 21 May 2021 07:37:25 GMT
set-cookie: Cavisson_Netvision=1279906826.20480.0000; expires=Fri, 21-May-2021 08:17:25 GMT; path=/; Httponly; Secure
----

--Response 
HTTP/1.1 200
status: 200
content-type: text/css
accept-ranges: bytes
content-encoding: br
etag: \"609ebe46-1928\"
last-modified: Tue, 18 May 2021 21:05:58 GMT
server: Akamai Resource Optimizer
x-origin-cc: max-age=86400
x-origin-cc: max-age=86400
x-origin-cc: max-age=86400
x-origin-cc: max-age=86400
x-origin-cc: max-age=86400
x-origin-ttl: Wed, 19 May 2021 21:05:58 GMT
x-origin-ttl: Wed, 19 May 2021 21:05:58 GMT
x-origin-ttl: Wed, 19 May 2021 21:05:58 GMT
x-origin-ttl: Wed, 19 May 2021 21:05:58 GMT
x-origin-ttl: Wed, 19 May 2021 21:05:58 GMT
content-length: 1060
cache-control: max-age=86400
expires: Sat, 22 May 2021 07:37:25 GMT
date: Fri, 21 May 2021 07:37:25 GMT
set-cookie: _dyid_server=6440147674919822059; expires=Sat, 21-May-2022 07:37:25 GMT; path=/; domain=.kohls.com; secure
server-timing: cdn-cache; desc=HIT
server-timing: edge; dur=88
server-timing: dtRpid;desc=\"738739045\"
content-security-policy: block-all-mixed-content; frame-ancestors https://testzuiweb.kohls.zootweb.com https://testapplynow.kohls.zootweb.com 'self';
x-frame-options: SAMEORIGIN
strict-transport-security: max-age=15768000 ; preload
----

--Response 
HTTP/1.1 200
status: 200
p3p: policyref=\"https://www.googleadservices.com/pagead/p3p.xml\", CP=\"NOI DEV PSA PSD IVA IVD OTP OUR OTR IND OTC\"
timing-allow-origin: *
cross-origin-resource-policy: cross-origin
access-control-allow-origin: *
content-type: image/gif
date: Fri, 21 May 2021 07:37:25 GMT
pragma: no-cache
expires: Fri, 01 Jan 1990 00:00:00 GMT
cache-control: no-cache, must-revalidate
x-content-type-options: nosniff
server: cafe
content-length: 42
x-xss-protection: 0
alt-svc: h3-29=\":443\"; ma=2592000,h3-T051=\":443\"; ma=2592000,h3-Q050=\":443\"; ma=2592000,h3-Q046=\":443\"; ma=2592000,h3-Q043=\":443\"; ma=2592000,quic=\":443\"; ma=2592000; v=\"46,43\"
----

--Response 
HTTP/1.1 200
status: 200
p3p: policyref=\"https://www.googleadservices.com/pagead/p3p.xml\", CP=\"NOI DEV PSA PSD IVA IVD OTP OUR OTR IND OTC\"
timing-allow-origin: *
cross-origin-resource-policy: cross-origin
access-control-allow-origin: *
content-type: image/gif
date: Fri, 21 May 2021 07:37:25 GMT
pragma: no-cache
expires: Fri, 01 Jan 1990 00:00:00 GMT
cache-control: no-cache, must-revalidate
x-content-type-options: nosniff
server: cafe
content-length: 42
x-xss-protection: 0
alt-svc: h3-29=\":443\"; ma=2592000,h3-T051=\":443\"; ma=2592000,h3-Q050=\":443\"; ma=2592000,h3-Q046=\":443\"; ma=2592000,h3-Q043=\":443\"; ma=2592000,quic=\":443\"; ma=2592000; v=\"46,43\"
----

--Response 
HTTP/1.1 200
status: 200
content-type: text/css
accept-ranges: bytes
content-encoding: br
etag: \"609ebe46-1732\"
last-modified: Tue, 18 May 2021 21:04:58 GMT
server: Akamai Resource Optimizer
x-origin-cc: max-age=86400
x-origin-cc: max-age=86400
x-origin-cc: max-age=86400
x-origin-cc: max-age=86400
x-origin-ttl: Wed, 19 May 2021 21:04:57 GMT
x-origin-ttl: Wed, 19 May 2021 21:04:57 GMT
x-origin-ttl: Wed, 19 May 2021 21:04:57 GMT
x-origin-ttl: Wed, 19 May 2021 21:04:57 GMT
content-length: 1365
cache-control: max-age=86400
expires: Sat, 22 May 2021 07:37:25 GMT
date: Fri, 21 May 2021 07:37:25 GMT
set-cookie: _dyid_server=6440147674919822059; expires=Sat, 21-May-2022 07:37:25 GMT; path=/; domain=.kohls.com; secure
server-timing: cdn-cache; desc=HIT
server-timing: edge; dur=52
server-timing: dtRpid;desc=\"-2011295119\"
content-security-policy: block-all-mixed-content; frame-ancestors https://testzuiweb.kohls.zootweb.com https://testapplynow.kohls.zootweb.com 'self';
x-frame-options: SAMEORIGIN
strict-transport-security: max-age=15768000 ; preload
----

--Response 
HTTP/1.1 200
status: 200
content-type: application/javascript
accept-ranges: bytes
content-encoding: br
etag: \"609ebe46-2394\"
last-modified: Tue, 18 May 2021 21:06:39 GMT
server: Akamai Resource Optimizer
x-origin-cc: max-age=86400
x-origin-cc: max-age=86400
x-origin-cc: max-age=86400
x-origin-cc: max-age=86400
x-origin-cc: max-age=86400
x-origin-ttl: Wed, 19 May 2021 21:06:38 GMT
x-origin-ttl: Wed, 19 May 2021 21:06:38 GMT
x-origin-ttl: Wed, 19 May 2021 21:06:38 GMT
x-origin-ttl: Wed, 19 May 2021 21:06:38 GMT
x-origin-ttl: Wed, 19 May 2021 21:06:38 GMT
content-length: 3327
cache-control: max-age=86400
expires: Sat, 22 May 2021 07:37:26 GMT
date: Fri, 21 May 2021 07:37:26 GMT
set-cookie: _dyid_server=6440147674919822059; expires=Sat, 21-May-2022 07:37:26 GMT; path=/; domain=.kohls.com; secure
server-timing: cdn-cache; desc=HIT
server-timing: edge; dur=133
server-timing: dtRpid;desc=\"1178714372\"
content-security-policy: block-all-mixed-content; frame-ancestors https://testzuiweb.kohls.zootweb.com https://testapplynow.kohls.zootweb.com 'self';
x-frame-options: SAMEORIGIN
strict-transport-security: max-age=15768000 ; preload
----

--Response 
HTTP/1.1 200
status: 200
content-type: text/css
accept-ranges: bytes
content-encoding: br
etag: \"609ebe46-13fd2\"
last-modified: Tue, 18 May 2021 20:59:31 GMT
server: Akamai Resource Optimizer
x-origin-cc: max-age=86400
x-origin-cc: max-age=86400
x-origin-cc: max-age=86400
x-origin-ttl: Wed, 19 May 2021 20:59:30 GMT
x-origin-ttl: Wed, 19 May 2021 20:59:30 GMT
x-origin-ttl: Wed, 19 May 2021 20:59:30 GMT
content-length: 13421
cache-control: max-age=86400
expires: Sat, 22 May 2021 07:37:26 GMT
date: Fri, 21 May 2021 07:37:26 GMT
set-cookie: _dyid_server=6440147674919822059; expires=Sat, 21-May-2022 07:37:26 GMT; path=/; domain=.kohls.com; secure
server-timing: cdn-cache; desc=HIT
server-timing: edge; dur=83
server-timing: dtRpid;desc=\"1206643893\"
content-security-policy: block-all-mixed-content; frame-ancestors https://testzuiweb.kohls.zootweb.com https://testapplynow.kohls.zootweb.com 'self';
x-frame-options: SAMEORIGIN
strict-transport-security: max-age=15768000 ; preload
----

--Response 
HTTP/1.1 200
status: 200
content-type: text/css
accept-ranges: bytes
content-encoding: br
etag: \"609ebe46-262\"
last-modified: Tue, 18 May 2021 20:59:41 GMT
server: Akamai Resource Optimizer
x-origin-cc: max-age=86400
x-origin-cc: max-age=86400
x-origin-cc: max-age=86400
x-origin-cc: max-age=86400
x-origin-ttl: Wed, 19 May 2021 20:59:40 GMT
x-origin-ttl: Wed, 19 May 2021 20:59:40 GMT
x-origin-ttl: Wed, 19 May 2021 20:59:40 GMT
x-origin-ttl: Wed, 19 May 2021 20:59:40 GMT
content-length: 213
cache-control: max-age=86400
expires: Sat, 22 May 2021 07:37:26 GMT
date: Fri, 21 May 2021 07:37:26 GMT
set-cookie: _dyid_server=6440147674919822059; expires=Sat, 21-May-2022 07:37:26 GMT; path=/; domain=.kohls.com; secure
server-timing: cdn-cache; desc=HIT
server-timing: edge; dur=106
server-timing: dtRpid;desc=\"384981217\"
content-security-policy: block-all-mixed-content; frame-ancestors https://testzuiweb.kohls.zootweb.com https://testapplynow.kohls.zootweb.com 'self';
x-frame-options: SAMEORIGIN
strict-transport-security: max-age=15768000 ; preload
----

--Response 
HTTP/1.1 200
status: 200
content-type: text/css
accept-ranges: bytes
content-encoding: br
etag: \"609ebe46-4cece\"
last-modified: Thu, 20 May 2021 23:20:56 GMT
server: Akamai Resource Optimizer
x-origin-cc: max-age=86400
x-origin-cc: max-age=86400
x-origin-cc: max-age=86400
x-origin-ttl: Fri, 21 May 2021 23:20:55 GMT
x-origin-ttl: Fri, 21 May 2021 23:20:55 GMT
x-origin-ttl: Fri, 21 May 2021 23:20:55 GMT
content-length: 51094
cache-control: max-age=86400
expires: Sat, 22 May 2021 07:37:26 GMT
date: Fri, 21 May 2021 07:37:26 GMT
set-cookie: _dyid_server=6440147674919822059; expires=Sat, 21-May-2022 07:37:26 GMT; path=/; domain=.kohls.com; secure
server-timing: cdn-cache; desc=HIT
server-timing: edge; dur=102
server-timing: dtRpid;desc=\"-292352837\"
content-security-policy: block-all-mixed-content; frame-ancestors https://testzuiweb.kohls.zootweb.com https://testapplynow.kohls.zootweb.com 'self';
x-frame-options: SAMEORIGIN
strict-transport-security: max-age=15768000 ; preload
----

