--Request 
POST https://684fc538.akstat.io/
Host: 684fc538.akstat.io
Host: 684fc538.akstat.io
Connection: keep-alive
Content-Length: 9948
Origin: https://www.kohls.com
User-Agent: Mozilla/5.0 (Windows NT 10.0; WOW64) AppleWebKit/537.36 (KHTML, like Gecko) Chrome/56.0.2924.87 Safari/537.36
Content-Type: application/x-www-form-urlencoded
Accept: */*
Sec-Fetch-Site: cross-site
Sec-Fetch-Mode: no-cors
Referer: https://www.kohls.com/product/prd-3847510/womens-apt-9-tummy-control-shorts.jsp?color=Medium%20Wash&prdPV=1
Accept-Encoding: gzip, deflate, br
Accept-Language: en-GB,en-US;q=0.9,en;q=0.8
----
--Response 
HTTP/1.1 204
status: 204
access-control-allow-origin: https://www.kohls.com
x-xss-protection: 0
access-control-allow-credentials: true
timing-allow-origin: *
content-type: image/gif
expires: Fri, 21 May 2021 08:10:54 GMT
cache-control: max-age=0, no-cache, no-store
pragma: no-cache
date: Fri, 21 May 2021 08:10:54 GMT
----
--Request 
GET https://bat.bing.com/action/0?ti=4024145&tm=al001&Ver=2&mid=ac19675c-3e96-4fab-b6cb-65f5175e1313&sid=fdce5dc0ba0b11ebb694f78bbcad10ea&vid=fdcf3810ba0b11eb8504894104a43503&vids=0&pi=0&lg=en-GB&sw=1366&sh=768&sc=24&tl=Women%27s%20Apt.%209%C2%AE%20Tummy%20Control%20Shorts&p=https%3A%2F%2Fwww.kohls.com%2Fproduct%2Fprd-3847510%2Fwomens-apt-9-tummy-control-shorts.jsp%3Fcolor%3DMedium%2520Wash%26prdPV%3D1&r=https%3A%2F%2Fwww.kohls.com%2Fcatalog%2Fsale-womens-denim-shorts-bottoms-clothing.jsp%3FCN%3DPromotions%3ASale%2BGender%3AWomens%2BMaterial%3ADenim%2BProduct%3AShorts%2BCategory%3ABottoms%2BDepartment%3AClothing%2BAssortment%3ALowest%2520Prices%2520of%2520the%2520Season%26BL%3Dy%26icid%3Dwms-maylps-1699shorts-denim%26pfm%3Dinternal%2520campaign%2520p13n_control%2520visual%2520nav%2520p13n%26kls_sbp%3D09167193449239534971532002446042350327&lt=4037&pt=1621584649113,1475,1700,,,4,4,4,4,4,,8,1315,1833,1723,2346,2346,2348,4034,4034,4037&pn=0,0&evt=pageLoad&msclkid=N&sv=1&rn=700359
Host: bat.bing.com
Host: bat.bing.com
Connection: keep-alive
User-Agent: Mozilla/5.0 (Windows NT 10.0; WOW64) AppleWebKit/537.36 (KHTML, like Gecko) Chrome/56.0.2924.87 Safari/537.36
Accept: image/webp,image/apng,image/*,*/*;q=0.8
Sec-Fetch-Site: cross-site
Sec-Fetch-Mode: no-cors
Referer: https://www.kohls.com/product/prd-3847510/womens-apt-9-tummy-control-shorts.jsp?color=Medium%20Wash&prdPV=1
Accept-Encoding: gzip, deflate, br
Accept-Language: en-GB,en-US;q=0.9,en;q=0.8
Cookie: MUID=2FEDAA73973269530F04BA4D9634684E; MR=0
----
--Response 
HTTP/1.1 204
status: 204
cache-control: no-cache, must-revalidate
pragma: no-cache
expires: Fri, 01 Jan 1990 00:00:00 GMT
access-control-allow-origin: *
x-cache: CONFIG_NOCACHE
x-msedge-ref: Ref A: C5FD2EB4467A4EE79CB935C6A7578299 Ref B: DEL01EDGE0520 Ref C: 2021-05-21T08:10:54Z
date: Fri, 21 May 2021 08:10:54 GMT
----

