
--Response 
HTTP/1.1 200
status: 200
ede-bundle_params: {\"channelId\":\"WebStore\",\"pageId\":\"PMP\",\"executedInfoList\":[{\"placementId\":\"Horizontal1\",\"departmentName\":\"\",\"category\":\"\",\"subCategory\":\"\",\"bundleId\":\"1257\",\"placementRevision\":\"1592808198336\",\"bundleRevision\":\"1620707850753\",\"kiraRevision\":\"1592808198336\",\"uuid\":\"64cbfc9e-9c35-4ce0-b818-020c507aea94\",\"infoMeta\":{\"type\":\"FlatRec\"},\"infoPayload\":{\"executedAlgorithmsInfo\":{\"executedAlgorithmInfoList\":[{\"algorithmId\":\"236\",\"ccpParametersUsed\":[\"primaryProductType\",\"productType\",\"subProductType\"],\"isPersonalized\":false}],\"contextBasedOptimized\":false,\"autoOptimized\":false,\"optimizedMetric\":\"None\"},\"executedRulesInfo\":{\"executedRuleInfoList\":[{\"ruleId\":\"1\",\"ruleType\":\"BURY\"},{\"ruleId\":\"283\",\"ruleType\":\"DO_NOT_RECOMMEND\"}],\"backfillDisabledFromRule\":false},\"isAb\":false,\"abTestId\":\"\",\"currentAbVariationId\":\"\",\"recGenerationCycleStatus\":{\"recGenerationCycleMask\":71468256854080,\"requestId\":\"c85e2a9a-cadd-4799-80e7-2a209916d9b6\"}}}]}
access-control-allow-origin: *
access-control-expose-headers: EDE-AB_VAR_PARAMS, EDE-BUNDLE_PARAMS, Content-Type
content-type: application/json
vary: Accept-Encoding
content-encoding: gzip
date: Fri, 21 May 2021 08:05:36 GMT
content-length: 1883
server-timing: cdn-cache; desc=MISS
server-timing: edge; dur=290
server-timing: origin; dur=36
fwdhst: origin-ede-gcp-central-blue.kohls.com
set-cookie: akacd_EDE_GCP=2177452799~rv=9~id=9cd1244f84cb335e781bb0d0ec8343b0; path=/; Expires=Mon, 31 Dec 2038 23:59:59 GMT; Secure; SameSite=None
akamai-request-id2: 96.17.182.36:5c2dd550
----

--Response 
HTTP/1.1 200
status: 200
content-type: image/png
content-length: 933
last-modified: Wed, 12 May 2021 19:33:05 GMT
etag: \"609c2d71-3a5\"
accept-ranges: bytes
cache-control: max-age=86400
expires: Sat, 22 May 2021 08:05:35 GMT
date: Fri, 21 May 2021 08:05:35 GMT
server-timing: cdn-cache; desc=HIT
server-timing: edge; dur=23
server-timing: dtRpid;desc=\"-692078822\"
content-security-policy: block-all-mixed-content; frame-ancestors https://testzuiweb.kohls.zootweb.com https://testapplynow.kohls.zootweb.com 'self';
x-frame-options: SAMEORIGIN
----

--Response 
HTTP/1.1 200
status: 200
access-control-allow-origin: *
last-modified: Tue, 19 Nov 2019 01:00:33 GMT
etag: \"13b17934ea3d726ad1562a62c9a1cbd6\"
server: Unknown
content-type: image/png
content-length: 10738
timing-allow-origin: *
expires: Mon, 24 May 2021 08:24:29 GMT
date: Fri, 21 May 2021 08:05:35 GMT
----

--Response 
HTTP/1.1 200
status: 200
access-control-allow-origin: *
last-modified: Wed, 11 Mar 2020 19:14:26 GMT
etag: \"709f951c2213083d1e9502d57b777165\"
server: Unknown
content-type: image/webp
content-length: 4516
timing-allow-origin: *
expires: Sun, 23 May 2021 03:58:14 GMT
date: Fri, 21 May 2021 08:05:35 GMT
----

--Response 
HTTP/1.1 200
status: 200
access-control-allow-origin: *
last-modified: Fri, 12 Apr 2019 10:55:00 GMT
etag: \"abce555158d4f4e850761b7b9dd6c869\"
server: Unknown
content-type: image/jpeg
content-length: 5516
timing-allow-origin: *
expires: Thu, 27 May 2021 05:51:50 GMT
date: Fri, 21 May 2021 08:05:35 GMT
----

--Response 
HTTP/1.1 200
status: 200
access-control-allow-origin: *
last-modified: Wed, 11 Mar 2020 19:14:44 GMT
etag: \"38b3b7fd359bc1c1946ef14c7cbbcc5e\"
server: Unknown
content-type: image/webp
content-length: 4654
timing-allow-origin: *
expires: Thu, 27 May 2021 06:08:13 GMT
date: Fri, 21 May 2021 08:05:35 GMT
----

--Response 
HTTP/1.1 200
status: 200
access-control-allow-origin: *
last-modified: Fri, 12 Apr 2019 10:48:03 GMT
etag: \"23accd819260c20c58b4fe544da5b3f5\"
server: Unknown
timing-allow-origin: *
content-type: image/webp
content-length: 80
expires: Mon, 24 May 2021 06:52:17 GMT
date: Fri, 21 May 2021 08:05:35 GMT
----

--Response 
HTTP/1.1 200
status: 200
access-control-allow-origin: *
last-modified: Thu, 22 Oct 2020 21:20:44 GMT
etag: \"444cedf75a3ad190fa56015a10b1fa2d\"
server: Unknown
content-type: image/webp
content-length: 78
timing-allow-origin: *
expires: Tue, 25 May 2021 04:35:06 GMT
date: Fri, 21 May 2021 08:05:35 GMT
----

--Response 
HTTP/1.1 200
status: 200
access-control-allow-origin: *
last-modified: Wed, 14 Apr 2021 13:50:22 GMT
etag: \"31015fe2e88a0eac76eae9364405c242\"
server: Unknown
content-type: image/webp
content-length: 112
timing-allow-origin: *
expires: Tue, 25 May 2021 04:35:06 GMT
date: Fri, 21 May 2021 08:05:35 GMT
----

--Response 
HTTP/1.1 200
status: 200
access-control-allow-origin: *
last-modified: Thu, 22 Oct 2020 21:20:58 GMT
etag: \"0ee141cc13018c0efcabecfedea980bb\"
server: Unknown
content-type: image/webp
content-length: 110
timing-allow-origin: *
expires: Sun, 23 May 2021 16:20:35 GMT
date: Fri, 21 May 2021 08:05:35 GMT
----

--Response 
HTTP/1.1 200
status: 200
access-control-allow-origin: *
last-modified: Wed, 14 Apr 2021 13:50:39 GMT
etag: \"e2b14bd5d35c1604e2d99cde27bfb6e4\"
server: Unknown
content-type: image/webp
content-length: 100
timing-allow-origin: *
expires: Sat, 22 May 2021 12:52:24 GMT
date: Fri, 21 May 2021 08:05:35 GMT
----

--Response 
HTTP/1.1 200
status: 200
access-control-allow-origin: *
last-modified: Fri, 24 May 2019 18:20:35 GMT
etag: \"0c0463feb451aafebe2dbce8fc8dd176\"
server: Unknown
timing-allow-origin: *
content-type: image/webp
content-length: 112
expires: Fri, 28 May 2021 07:09:38 GMT
date: Fri, 21 May 2021 08:05:35 GMT
----

--Response 
HTTP/1.1 200
status: 200
access-control-allow-origin: *
last-modified: Fri, 02 Oct 2020 16:50:54 GMT
etag: \"a0426a87e7f25f84ea6e55ae9d4967c5\"
server: Unknown
content-type: image/webp
content-length: 114
timing-allow-origin: *
expires: Tue, 25 May 2021 04:35:06 GMT
date: Fri, 21 May 2021 08:05:35 GMT
----

--Response 
HTTP/1.1 200
status: 200
access-control-allow-origin: *
last-modified: Thu, 22 Oct 2020 21:20:34 GMT
etag: \"c7c7d45214af80071411501eacb2de70\"
server: Unknown
content-type: image/webp
content-length: 94
timing-allow-origin: *
expires: Sat, 22 May 2021 12:52:24 GMT
date: Fri, 21 May 2021 08:05:35 GMT
----

--Response 
HTTP/1.1 200
status: 200
content-type: image/webp
content-length: 122
access-control-allow-origin: *
last-modified: Fri, 12 Apr 2019 10:55:21 GMT
etag: \"eb6f8d2e3697d641ba13e9f757f2b82d\"
timing-allow-origin: *
server: Unknown
expires: Thu, 27 May 2021 06:39:40 GMT
date: Fri, 21 May 2021 08:05:35 GMT
----

--Response 
HTTP/1.1 200
status: 200
access-control-allow-origin: *
last-modified: Tue, 03 Dec 2019 00:12:45 GMT
etag: \"b47759c2b58696d4f000c61a1fa2c631\"
server: Unknown
strict-transport-security: max-age=31536000; includeSubDomains
timing-allow-origin: *
content-type: image/webp
content-length: 1766
expires: Wed, 26 May 2021 12:14:43 GMT
date: Fri, 21 May 2021 08:05:37 GMT
----

--Response 
HTTP/1.1 200
status: 200
access-control-allow-origin: *
last-modified: Tue, 07 Jan 2020 21:25:20 GMT
etag: \"649c7b8b09b93ff3039d94fc195e88c1\"
server: Unknown
strict-transport-security: max-age=31536000; includeSubDomains
timing-allow-origin: *
content-type: image/webp
content-length: 1650
expires: Wed, 26 May 2021 11:52:25 GMT
date: Fri, 21 May 2021 08:05:37 GMT
----

--Response 
HTTP/1.1 200
status: 200
access-control-allow-origin: *
last-modified: Fri, 12 Apr 2019 10:43:39 GMT
etag: \"2f1ec8e3886a032d69e6171f5896d508\"
server: Unknown
strict-transport-security: max-age=31536000; includeSubDomains
content-type: image/webp
content-length: 1668
timing-allow-origin: *
expires: Wed, 26 May 2021 11:52:25 GMT
date: Fri, 21 May 2021 08:05:37 GMT
----

--Response 
HTTP/1.1 200
status: 200
access-control-allow-origin: *
last-modified: Fri, 15 Nov 2019 20:20:37 GMT
etag: \"9196df555bbc972b16cb6f03880b1234\"
server: Unknown
strict-transport-security: max-age=31536000; includeSubDomains
content-type: image/webp
content-length: 984
timing-allow-origin: *
expires: Wed, 26 May 2021 11:52:26 GMT
date: Fri, 21 May 2021 08:05:37 GMT
----

--Response 
HTTP/1.1 200
status: 200
access-control-allow-origin: *
last-modified: Fri, 12 Apr 2019 10:59:41 GMT
etag: \"7a8697505a4f5e0bcb89ac8aa67f52c9\"
server: Unknown
strict-transport-security: max-age=31536000; includeSubDomains
content-type: image/webp
content-length: 1742
timing-allow-origin: *
expires: Fri, 28 May 2021 07:09:40 GMT
date: Fri, 21 May 2021 08:05:37 GMT
----

--Response 
HTTP/1.1 200
status: 200
access-control-allow-origin: *
last-modified: Fri, 12 Apr 2019 10:55:21 GMT
etag: \"7deadf08ba654626605d0881d008f7d5\"
server: Unknown
content-type: image/webp
content-length: 126
timing-allow-origin: *
expires: Sun, 23 May 2021 21:13:16 GMT
date: Fri, 21 May 2021 08:05:35 GMT
----

--Response 
HTTP/1.1 200
status: 200
access-control-allow-origin: *
last-modified: Fri, 12 Apr 2019 10:55:21 GMT
etag: \"b343ef48547ff6a0dec519e5476a4a7a\"
server: Unknown
timing-allow-origin: *
content-type: image/webp
content-length: 116
expires: Sun, 23 May 2021 03:58:14 GMT
date: Fri, 21 May 2021 08:05:35 GMT
----

--Response 
HTTP/1.1 200
status: 200
access-control-allow-origin: *
last-modified: Fri, 12 Apr 2019 10:55:21 GMT
etag: \"610c4183212f9c251fef69534dd30dce\"
server: Unknown
timing-allow-origin: *
content-type: image/webp
content-length: 164
expires: Sun, 23 May 2021 21:13:16 GMT
date: Fri, 21 May 2021 08:05:35 GMT
----

--Response 
HTTP/1.1 200
status: 200
access-control-allow-origin: *
last-modified: Fri, 12 Apr 2019 10:55:21 GMT
etag: \"bd03fedaf1dfb8e25e7b5a2989110b52\"
server: Unknown
content-type: image/webp
content-length: 84
timing-allow-origin: *
expires: Wed, 26 May 2021 14:44:11 GMT
date: Fri, 21 May 2021 08:05:35 GMT
----

--Response 
HTTP/1.1 200
status: 200
access-control-allow-origin: *
last-modified: Fri, 12 Apr 2019 10:55:21 GMT
etag: \"80dee1c6944148028a10b12b4385402a\"
server: Unknown
timing-allow-origin: *
content-type: image/webp
content-length: 128
expires: Wed, 26 May 2021 14:44:12 GMT
date: Fri, 21 May 2021 08:05:35 GMT
----

--Response 
HTTP/1.1 200
status: 200
access-control-allow-origin: *
last-modified: Mon, 29 Jun 2020 13:20:23 GMT
etag: \"4ceb5cb59d618b9c61926189954b6d9d\"
server: Unknown
content-type: image/webp
content-length: 134
timing-allow-origin: *
expires: Mon, 24 May 2021 13:12:06 GMT
date: Fri, 21 May 2021 08:05:35 GMT
----

--Response 
HTTP/1.1 200
status: 200
access-control-allow-origin: *
last-modified: Wed, 05 Jun 2019 14:50:38 GMT
etag: \"c9a536d0df520553c5aad4b272faf1de\"
server: Unknown
content-type: image/webp
content-length: 84
timing-allow-origin: *
expires: Sat, 22 May 2021 14:21:50 GMT
date: Fri, 21 May 2021 08:05:35 GMT
----

--Response 
HTTP/1.1 200
status: 200
access-control-allow-origin: *
last-modified: Tue, 04 Jun 2019 16:20:53 GMT
etag: \"64239d9e442ffa227bf8fc0ab5a2cebe\"
server: Unknown
content-type: image/webp
content-length: 112
timing-allow-origin: *
expires: Wed, 26 May 2021 20:00:19 GMT
date: Fri, 21 May 2021 08:05:35 GMT
----

--Response 
HTTP/1.1 200
status: 200
access-control-allow-origin: *
last-modified: Tue, 04 Jun 2019 16:20:56 GMT
etag: \"92cdaf614548353f13005273bdaaf621\"
server: Unknown
timing-allow-origin: *
content-type: image/webp
content-length: 126
expires: Tue, 25 May 2021 16:30:10 GMT
date: Fri, 21 May 2021 08:05:35 GMT
----

--Response 
HTTP/1.1 200
status: 200
access-control-allow-origin: *
last-modified: Tue, 04 Jun 2019 16:54:43 GMT
etag: \"352f2056e0987e707763f3b4eb1bea6c\"
server: Unknown
content-type: image/webp
content-length: 86
timing-allow-origin: *
expires: Sat, 22 May 2021 06:16:58 GMT
date: Fri, 21 May 2021 08:05:35 GMT
----

--Response 
HTTP/1.1 200
status: 200
access-control-allow-origin: *
last-modified: Fri, 12 Apr 2019 10:55:00 GMT
etag: \"ff7ea4f4300758cd41c5dab5e26bc6a0\"
server: Unknown
content-type: image/webp
content-length: 80
timing-allow-origin: *
expires: Wed, 26 May 2021 20:00:20 GMT
date: Fri, 21 May 2021 08:05:35 GMT
----

--Response 
HTTP/1.1 200
status: 200
access-control-allow-origin: *
last-modified: Fri, 12 Apr 2019 10:55:21 GMT
etag: \"0ab92bf692dfba5e9d86a70e02e15d57\"
server: Unknown
content-type: image/webp
content-length: 138
timing-allow-origin: *
expires: Tue, 25 May 2021 15:27:41 GMT
date: Fri, 21 May 2021 08:05:35 GMT
----

--Response 
HTTP/1.1 200
status: 200
access-control-allow-origin: *
last-modified: Thu, 23 Jan 2020 23:50:58 GMT
etag: \"1815f0024b97b0b7b10760aec9abc1f9\"
server: Unknown
timing-allow-origin: *
content-type: image/webp
content-length: 98
expires: Wed, 26 May 2021 20:00:21 GMT
date: Fri, 21 May 2021 08:05:35 GMT
----

--Response 
HTTP/1.1 200
status: 200
access-control-allow-origin: *
last-modified: Fri, 12 Apr 2019 10:54:59 GMT
etag: \"7e49f6540b8b5ad3caf9c61bea09af9c\"
server: Unknown
content-type: image/webp
content-length: 64
timing-allow-origin: *
expires: Thu, 27 May 2021 02:54:29 GMT
date: Fri, 21 May 2021 08:05:35 GMT
----

--Response 
HTTP/1.1 200
status: 200
access-control-allow-origin: *
last-modified: Mon, 18 Jan 2021 20:50:18 GMT
etag: \"2a4c4241827f76cb67a0a52701ebcf6a\"
server: Unknown
content-type: image/webp
content-length: 120
timing-allow-origin: *
expires: Tue, 25 May 2021 19:29:57 GMT
date: Fri, 21 May 2021 08:05:36 GMT
----

--Response 
HTTP/1.1 200
status: 200
access-control-allow-origin: *
last-modified: Fri, 12 Apr 2019 10:55:23 GMT
etag: \"b02fefab1d64280214a321b248884224\"
server: Unknown
content-type: image/webp
content-length: 88
timing-allow-origin: *
expires: Thu, 27 May 2021 06:08:09 GMT
date: Fri, 21 May 2021 08:05:36 GMT
----

--Response 
HTTP/1.1 200
status: 200
access-control-allow-origin: *
last-modified: Fri, 12 Apr 2019 10:55:23 GMT
etag: \"b9b38f675328d905cd1b4096d6e58e50\"
server: Unknown
timing-allow-origin: *
content-type: image/webp
content-length: 116
expires: Thu, 27 May 2021 17:48:26 GMT
date: Fri, 21 May 2021 08:05:36 GMT
----

--Response 
HTTP/1.1 200
status: 200
access-control-allow-origin: *
last-modified: Wed, 01 Apr 2020 16:50:30 GMT
etag: \"33422bca87a09294fe9c82b24e1a01f8\"
server: Unknown
content-type: image/webp
content-length: 104
timing-allow-origin: *
expires: Mon, 24 May 2021 10:55:31 GMT
date: Fri, 21 May 2021 08:05:36 GMT
----

--Response 
HTTP/1.1 200
status: 200
access-control-allow-origin: *
last-modified: Fri, 12 Apr 2019 10:55:23 GMT
etag: \"a2cdd56d16d4196a85ec8bf229501cd4\"
server: Unknown
timing-allow-origin: *
content-type: image/webp
content-length: 84
expires: Thu, 27 May 2021 17:48:26 GMT
date: Fri, 21 May 2021 08:05:36 GMT
----

--Response 
HTTP/1.1 200
status: 200
access-control-allow-origin: *
last-modified: Fri, 12 Apr 2019 10:55:23 GMT
etag: \"9400639c343eb3f659953b55b90687cc\"
server: Unknown
content-type: image/webp
content-length: 86
timing-allow-origin: *
expires: Thu, 27 May 2021 17:48:26 GMT
date: Fri, 21 May 2021 08:05:36 GMT
----

--Response 
HTTP/1.1 200
status: 200
access-control-allow-origin: *
last-modified: Fri, 12 Apr 2019 10:55:23 GMT
etag: \"588a40497c10bb04921103dd0fec630f\"
server: Unknown
content-type: image/webp
content-length: 128
timing-allow-origin: *
expires: Thu, 27 May 2021 17:48:26 GMT
date: Fri, 21 May 2021 08:05:36 GMT
----

--Response 
HTTP/1.1 200
status: 200
access-control-allow-origin: *
last-modified: Fri, 12 Apr 2019 10:55:23 GMT
etag: \"df03b586916c7dd915c2a83f926c8e4c\"
server: Unknown
content-type: image/webp
content-length: 152
timing-allow-origin: *
expires: Thu, 27 May 2021 17:48:26 GMT
date: Fri, 21 May 2021 08:05:36 GMT
----

--Response 
HTTP/1.1 200
status: 200
content-type: image/webp
content-length: 130
access-control-allow-origin: *
last-modified: Fri, 12 Apr 2019 10:55:23 GMT
etag: \"710aca2764b0ec162b4aca1cd8d09d13\"
timing-allow-origin: *
server: Unknown
expires: Fri, 28 May 2021 05:05:54 GMT
date: Fri, 21 May 2021 08:05:36 GMT
----

--Response 
HTTP/1.1 200
status: 200
access-control-allow-origin: *
last-modified: Fri, 12 Apr 2019 10:57:33 GMT
etag: \"b08287df1be1a83a0a22295c4f66f89a\"
server: Unknown
strict-transport-security: max-age=31536000; includeSubDomains
timing-allow-origin: *
content-type: image/webp
content-length: 10822
expires: Tue, 25 May 2021 03:41:36 GMT
date: Fri, 21 May 2021 08:05:37 GMT
----

--Response 
HTTP/1.1 200
status: 200
access-control-allow-origin: *
last-modified: Fri, 12 Apr 2019 10:57:33 GMT
etag: \"61a5ab677dabe25ec90fcc6e8c07df12\"
server: Unknown
strict-transport-security: max-age=31536000; includeSubDomains
content-type: image/jpeg
content-length: 14285
timing-allow-origin: *
expires: Wed, 26 May 2021 11:52:26 GMT
date: Fri, 21 May 2021 08:05:37 GMT
----

--Response 
HTTP/1.1 200
status: 200
access-control-allow-origin: *
last-modified: Fri, 12 Apr 2019 10:57:33 GMT
etag: \"a742c9c8da9110f23e391763d791be3c\"
server: Unknown
content-type: image/jpeg
content-length: 16844
timing-allow-origin: *
strict-transport-security: max-age=31536000; includeSubDomains
expires: Wed, 26 May 2021 11:52:26 GMT
date: Fri, 21 May 2021 08:05:37 GMT
----

--Response 
HTTP/1.1 200
status: 200
access-control-allow-origin: *
last-modified: Fri, 12 Apr 2019 10:57:33 GMT
etag: \"8f9b5b4f46f3a5cf7e65753d490a0a4d\"
server: Unknown
strict-transport-security: max-age=31536000; includeSubDomains
timing-allow-origin: *
content-type: image/jpeg
content-length: 12905
expires: Mon, 24 May 2021 02:43:04 GMT
date: Fri, 21 May 2021 08:05:37 GMT
----

--Response 
HTTP/1.1 200
status: 200
access-control-allow-origin: *
last-modified: Fri, 31 May 2019 16:39:40 GMT
etag: \"fc79bd74f7cc366d3287b1c305476823\"
server: Unknown
strict-transport-security: max-age=31536000; includeSubDomains
timing-allow-origin: *
content-type: image/webp
content-length: 3800
expires: Mon, 24 May 2021 02:43:03 GMT
date: Fri, 21 May 2021 08:05:37 GMT
----

--Response 
HTTP/1.1 200
status: 200
content-type: image/webp
content-length: 13618
access-control-allow-origin: *
last-modified: Fri, 12 Apr 2019 10:57:33 GMT
etag: \"e5ef01befd56284580496bee2cba9d65\"
timing-allow-origin: *
server: Unknown
expires: Fri, 28 May 2021 07:09:41 GMT
date: Fri, 21 May 2021 08:05:37 GMT
----

--Response 
HTTP/1.1 200
status: 200
access-control-allow-origin: *
last-modified: Fri, 12 Apr 2019 10:57:33 GMT
etag: \"12d4c6719ef16f45ef335728edd980a8\"
server: Unknown
strict-transport-security: max-age=31536000; includeSubDomains
timing-allow-origin: *
content-type: image/jpeg
content-length: 13722
expires: Mon, 24 May 2021 02:43:04 GMT
date: Fri, 21 May 2021 08:05:37 GMT
----

--Response 
HTTP/1.1 200
status: 200
access-control-allow-origin: *
last-modified: Fri, 12 Apr 2019 10:57:33 GMT
etag: \"142c79538c17426b46f50a7e34284831\"
server: Unknown
strict-transport-security: max-age=31536000; includeSubDomains
timing-allow-origin: *
content-type: image/jpeg
content-length: 15554
expires: Tue, 25 May 2021 03:41:37 GMT
date: Fri, 21 May 2021 08:05:37 GMT
----

--Response 
HTTP/1.1 200
status: 200
access-control-allow-origin: *
last-modified: Fri, 12 Apr 2019 10:57:33 GMT
etag: \"28b45e07803a7408b27565989b9ba00c\"
server: Unknown
strict-transport-security: max-age=31536000; includeSubDomains
content-type: image/jpeg
content-length: 19729
timing-allow-origin: *
expires: Mon, 24 May 2021 02:43:03 GMT
date: Fri, 21 May 2021 08:05:37 GMT
----

--Response 
HTTP/1.1 200
status: 200
access-control-allow-origin: *
last-modified: Fri, 12 Apr 2019 10:57:33 GMT
etag: \"9b38279a94e416cd550ca742f4681543\"
server: Unknown
strict-transport-security: max-age=31536000; includeSubDomains
timing-allow-origin: *
content-type: image/jpeg
content-length: 15038
expires: Mon, 24 May 2021 02:43:04 GMT
date: Fri, 21 May 2021 08:05:37 GMT
----

--Response 
HTTP/1.1 200
status: 200
access-control-allow-origin: *
last-modified: Fri, 12 Apr 2019 10:57:33 GMT
etag: \"46045ae1446be01b43c94da15d36bb18\"
server: Unknown
strict-transport-security: max-age=31536000; includeSubDomains
timing-allow-origin: *
content-type: image/webp
content-length: 6232
expires: Mon, 24 May 2021 02:43:04 GMT
date: Fri, 21 May 2021 08:05:37 GMT
----

--Response 
HTTP/1.1 200
status: 200
access-control-allow-origin: *
last-modified: Fri, 12 Apr 2019 10:57:33 GMT
etag: \"ac99978a9c2b37565db57a67956ece28\"
server: Unknown
strict-transport-security: max-age=31536000; includeSubDomains
content-type: image/webp
content-length: 9988
timing-allow-origin: *
expires: Thu, 27 May 2021 02:54:16 GMT
date: Fri, 21 May 2021 08:05:37 GMT
----

--Response 
HTTP/1.1 200
status: 200
access-control-allow-origin: *
last-modified: Fri, 12 Apr 2019 10:57:33 GMT
etag: \"4e47989a2aea66210484fc69f8b67eb8\"
server: Unknown
strict-transport-security: max-age=31536000; includeSubDomains
content-type: image/jpeg
content-length: 14465
timing-allow-origin: *
expires: Thu, 27 May 2021 02:54:18 GMT
date: Fri, 21 May 2021 08:05:37 GMT
----

--Response 
HTTP/1.1 200
status: 200
access-control-allow-origin: *
last-modified: Fri, 12 Apr 2019 10:57:33 GMT
etag: \"0771d7a7a1489dac0e8af44a28b8d506\"
server: Unknown
strict-transport-security: max-age=31536000; includeSubDomains
content-type: image/webp
content-length: 7246
timing-allow-origin: *
expires: Thu, 27 May 2021 02:54:17 GMT
date: Fri, 21 May 2021 08:05:37 GMT
----

--Response 
HTTP/1.1 200
status: 200
access-control-allow-origin: *
last-modified: Fri, 12 Apr 2019 10:57:33 GMT
etag: \"fa220c88db6d65fe10bd63ce48a457df\"
server: Unknown
strict-transport-security: max-age=31536000; includeSubDomains
content-type: image/jpeg
content-length: 9938
timing-allow-origin: *
expires: Mon, 24 May 2021 02:43:04 GMT
date: Fri, 21 May 2021 08:05:37 GMT
----

--Response 
HTTP/1.1 200
status: 200
access-control-allow-origin: *
last-modified: Fri, 12 Apr 2019 10:57:33 GMT
etag: \"16e5970fa538a1b25b9d9365c991ea9c\"
server: Unknown
strict-transport-security: max-age=31536000; includeSubDomains
content-type: image/jpeg
content-length: 14794
timing-allow-origin: *
expires: Mon, 24 May 2021 02:43:03 GMT
date: Fri, 21 May 2021 08:05:37 GMT
----

--Response 
HTTP/1.1 200
status: 200
last-modified: Wed, 12 May 2021 16:44:06 GMT
etag: \"85a455336c5679f86581ba35c69cc24469bd5ce3b4eaae567a7a69bc0775d19b\"
content-type: text/css
content-encoding: gzip
content-length: 610
expires: Fri, 21 May 2021 08:05:37 GMT
cache-control: max-age=0, no-cache, no-store
pragma: no-cache
date: Fri, 21 May 2021 08:05:37 GMT
vary: Accept-Encoding
set-cookie: _dyid_server=7656119531360184738; expires=Sat, 21-May-2022 08:05:37 GMT; path=/; domain=.kohls.com; secure
server-timing: cdn-cache; desc=HIT
server-timing: edge; dur=1
content-security-policy: block-all-mixed-content; frame-ancestors https://testzuiweb.kohls.zootweb.com https://testapplynow.kohls.zootweb.com 'self';
x-frame-options: SAMEORIGIN
strict-transport-security: max-age=15768000 ; preload
----

--Response 
HTTP/1.1 200
status: 200
last-modified: Mon, 26 Apr 2021 16:10:06 GMT
etag: \"d1dbb955755ca44a0b872a64f97c471a45b14e941f69d082c19f792576ae34fb\"
content-type: application/javascript
content-encoding: gzip
content-length: 19642
expires: Fri, 21 May 2021 08:05:37 GMT
pragma: no-cache
date: Fri, 21 May 2021 08:05:37 GMT
vary: Accept-Encoding
set-cookie: _dyid_server=7656119531360184738; expires=Sat, 21-May-2022 08:05:37 GMT; path=/; domain=.kohls.com; secure
cache-control: max-age=21600
server-timing: cdn-cache; desc=HIT
server-timing: edge; dur=1
content-security-policy: block-all-mixed-content; frame-ancestors https://testzuiweb.kohls.zootweb.com https://testapplynow.kohls.zootweb.com 'self';
x-frame-options: SAMEORIGIN
strict-transport-security: max-age=15768000 ; preload
----

--Response 
HTTP/1.1 200
status: 200
last-modified: Wed, 12 May 2021 16:44:06 GMT
etag: \"f2b828bcd1b18ef766ba39f60bfa5b9903684457985f22ff9f80ffc632dfbb75\"
content-type: application/javascript
content-encoding: gzip
content-length: 3258
expires: Fri, 21 May 2021 08:05:37 GMT
cache-control: max-age=0, no-cache, no-store
pragma: no-cache
date: Fri, 21 May 2021 08:05:37 GMT
vary: Accept-Encoding
set-cookie: _dyid_server=7656119531360184738; expires=Sat, 21-May-2022 08:05:37 GMT; path=/; domain=.kohls.com; secure
server-timing: cdn-cache; desc=HIT
server-timing: edge; dur=1
content-security-policy: block-all-mixed-content; frame-ancestors https://testzuiweb.kohls.zootweb.com https://testapplynow.kohls.zootweb.com 'self';
x-frame-options: SAMEORIGIN
strict-transport-security: max-age=15768000 ; preload
----

--Response 
HTTP/1.1 200
status: 200
content-type: application/javascript
accept-ranges: bytes
content-encoding: br
etag: \"609c2f24-3b98a\"
last-modified: Wed, 19 May 2021 21:01:36 GMT
server: Akamai Resource Optimizer
x-origin-cc: max-age=86400
x-origin-cc: max-age=86400
x-origin-cc: max-age=86400
x-origin-cc: max-age=86400
x-origin-ttl: Thu, 20 May 2021 21:01:34 GMT
x-origin-ttl: Thu, 20 May 2021 21:01:34 GMT
x-origin-ttl: Thu, 20 May 2021 21:01:34 GMT
x-origin-ttl: Thu, 20 May 2021 21:01:34 GMT
content-length: 75723
cache-control: max-age=86400
expires: Sat, 22 May 2021 08:05:32 GMT
date: Fri, 21 May 2021 08:05:32 GMT
server-timing: cdn-cache; desc=HIT
server-timing: edge; dur=28
server-timing: dtRpid;desc=\"-1927863684\"
content-security-policy: block-all-mixed-content; frame-ancestors https://testzuiweb.kohls.zootweb.com https://testapplynow.kohls.zootweb.com 'self';
x-frame-options: SAMEORIGIN
----

--Response 
HTTP/1.1 301
status: 301
server: AkamaiGHost
content-length: 0
location: https://media.kohlsimg.com/is/image/kohls/JeansProductGuide-20141215-1811911
cache-control: private, max-age=0
expires: Fri, 21 May 2021 08:05:37 GMT
date: Fri, 21 May 2021 08:05:37 GMT
----

--Response 
HTTP/1.1 301
status: 301
server: AkamaiGHost
content-length: 0
location: https://media.kohlsimg.com/is/image/kohls/JeansProductGuide-20141215-1735827
cache-control: private, max-age=0
expires: Fri, 21 May 2021 08:05:37 GMT
date: Fri, 21 May 2021 08:05:37 GMT
----

--Response 
HTTP/1.1 301
status: 301
server: AkamaiGHost
content-length: 0
location: https://media.kohlsimg.com/is/image/kohls/JeansProductGuide-20141215-1755110
cache-control: private, max-age=0
expires: Fri, 21 May 2021 08:05:37 GMT
date: Fri, 21 May 2021 08:05:37 GMT
----

--Response 
HTTP/1.1 301
status: 301
server: AkamaiGHost
content-length: 0
location: https://media.kohlsimg.com/is/image/kohls/JeansProductGuide-20141215-1734847_Barham
cache-control: private, max-age=0
expires: Fri, 21 May 2021 08:05:37 GMT
date: Fri, 21 May 2021 08:05:37 GMT
----

--Response 
HTTP/1.1 301
status: 301
server: AkamaiGHost
content-length: 0
location: https://media.kohlsimg.com/is/image/kohls/JeansProductGuide-20141215-1716124
cache-control: private, max-age=0
expires: Fri, 21 May 2021 08:05:37 GMT
date: Fri, 21 May 2021 08:05:37 GMT
----

--Response 
HTTP/1.1 200
status: 200
content-type: application/javascript
accept-ranges: bytes
content-encoding: br
etag: \"609c2f24-28ee\"
last-modified: Tue, 18 May 2021 21:04:33 GMT
server: Akamai Resource Optimizer
x-origin-cc: max-age=86400
x-origin-cc: max-age=86400
x-origin-cc: max-age=86400
x-origin-cc: max-age=86400
x-origin-ttl: Wed, 19 May 2021 21:04:32 GMT
x-origin-ttl: Wed, 19 May 2021 21:04:32 GMT
x-origin-ttl: Wed, 19 May 2021 21:04:32 GMT
x-origin-ttl: Wed, 19 May 2021 21:04:32 GMT
content-length: 2132
cache-control: max-age=86400
expires: Sat, 22 May 2021 08:05:33 GMT
date: Fri, 21 May 2021 08:05:33 GMT
server-timing: cdn-cache; desc=HIT
server-timing: edge; dur=1
server-timing: dtRpid;desc=\"-515766258\"
content-security-policy: block-all-mixed-content; frame-ancestors https://testzuiweb.kohls.zootweb.com https://testapplynow.kohls.zootweb.com 'self';
x-frame-options: SAMEORIGIN
----

--Response 
HTTP/1.1 301
status: 301
server: AkamaiGHost
content-length: 0
location: https://media.kohlsimg.com/is/image/kohls/JeansProductGuide-20141215-1716153
cache-control: private, max-age=0
expires: Fri, 21 May 2021 08:05:37 GMT
date: Fri, 21 May 2021 08:05:37 GMT
----

