
--Response 
HTTP/1.1 200 OK
Content-Type: application/json
Content-Length: 163
Host: api.kohls.com
X-Forwarded-For: 174.207.161.136, 2.20.143.68, 2.16.106.28
X-Forwarded-Port: 443
X-Forwarded-Proto: https
Origin: https://m.kohls.com
Accept: */*
Accept-Language: en-us
Referer: https://m.kohls.com/product/prd-3833748/womens-lee-legendary-straight-leg-jeans.jsp?pfm=bdrecs-MCom-PDP-Horizontal1-b1156-299&bdrecsId=15ef8483-62f3-4b92-9202-98e0a4b80602&selectShip=true&bduri=yes
Client-IP-External: 174.207.161.136
X-EdgeConnect-Session-Id: b465f64860a1e6d01f01705
X-Akamai-CONFIG-LOG-DETAIL: true
Accept-Encoding: gzip
Akamai-Origin-Hop: 2
Cache-Control: max-age=86400
User-Agent: akamai-D9auipMtYq
Access-Control-Allow-Origin: *
Access-Control-Allow-Headers: X-Requested-With
X-EdgeConnect-Cache-Status: 2
Date: Fri, 21 May 2021 08:06:26 GMT
Connection: keep-alive
origin_host: api.platform.kohls.com
----

--Response 
HTTP/1.1 200
status: 200
strict-transport-security: max-age=10886400; includeSubDomains; preload
date: Fri, 21 May 2021 07:02:14 GMT
expires: Fri, 21 May 2021 09:02:14 GMT
last-modified: Fri, 09 Apr 2021 23:59:54 GMT
x-content-type-options: nosniff
content-type: text/javascript
vary: Accept-Encoding
content-encoding: gzip
cross-origin-resource-policy: cross-origin
server: Golfe2
content-length: 19569
cache-control: public, max-age=7200
age: 3852
alt-svc: h3-29=\":443\"; ma=2592000,h3-T051=\":443\"; ma=2592000,h3-Q050=\":443\"; ma=2592000,h3-Q046=\":443\"; ma=2592000,h3-Q043=\":443\"; ma=2592000,quic=\":443\"; ma=2592000; v=\"46,43\"
----

--Response 
HTTP/1.1 200
status: 200
content-type: text/css
content-length: 12531
date: Mon, 17 May 2021 12:27:38 GMT
access-control-allow-origin: *
access-control-allow-methods: GET
access-control-max-age: 86400
last-modified: Mon, 17 May 2021 12:25:03 GMT
etag: \"f676d06b25a42ecb8f926d929e5a8d55\"
cache-control: max-age=31536000
content-encoding: gzip
accept-ranges: bytes
server: AmazonS3
vary: Origin,Access-Control-Request-Headers,Access-Control-Request-Method
x-cache: Hit from cloudfront
via: 1.1 4c0ee71d8032304fad715fcdba22fe10.cloudfront.net (CloudFront)
x-amz-cf-pop: DEL54-C2
x-amz-cf-id: nwGeaQGKBnyS0TOBzTP6xN5M29KRg7EK3GSfK03Uo7MIBl4jdlUViA==
age: 329929
----

--Response 
HTTP/1.1 200
status: 200
p3p: policyref=\"https://googleads.g.doubleclick.net/pagead/gcn_p3p_.xml\", CP=\"CURa ADMa DEVa TAIo PSAo PSDo OUR IND UNI PUR INT DEM STA PRE COM NAV OTC NOI DSP COR\"
timing-allow-origin: *
cross-origin-resource-policy: cross-origin
date: Fri, 21 May 2021 08:06:26 GMT
pragma: no-cache
expires: Fri, 01 Jan 1990 00:00:00 GMT
cache-control: no-cache, must-revalidate
content-type: text/javascript; charset=UTF-8
x-content-type-options: nosniff
content-disposition: attachment; filename=\"f.txt\"
content-encoding: gzip
server: cafe
content-length: 1209
x-xss-protection: 0
alt-svc: h3-29=\":443\"; ma=2592000,h3-T051=\":443\"; ma=2592000,h3-Q050=\":443\"; ma=2592000,h3-Q046=\":443\"; ma=2592000,h3-Q043=\":443\"; ma=2592000,quic=\":443\"; ma=2592000; v=\"46,43\"
----

--Response 
HTTP/1.1 200
status: 200
p3p: policyref=\"https://googleads.g.doubleclick.net/pagead/gcn_p3p_.xml\", CP=\"CURa ADMa DEVa TAIo PSAo PSDo OUR IND UNI PUR INT DEM STA PRE COM NAV OTC NOI DSP COR\"
timing-allow-origin: *
cross-origin-resource-policy: cross-origin
date: Fri, 21 May 2021 08:06:26 GMT
pragma: no-cache
expires: Fri, 01 Jan 1990 00:00:00 GMT
cache-control: no-cache, must-revalidate
content-type: text/javascript; charset=UTF-8
x-content-type-options: nosniff
content-disposition: attachment; filename=\"f.txt\"
content-encoding: gzip
server: cafe
content-length: 1209
x-xss-protection: 0
alt-svc: h3-29=\":443\"; ma=2592000,h3-T051=\":443\"; ma=2592000,h3-Q050=\":443\"; ma=2592000,h3-Q046=\":443\"; ma=2592000,h3-Q043=\":443\"; ma=2592000,quic=\":443\"; ma=2592000; v=\"46,43\"
----

--Response 
HTTP/1.1 200
status: 200
content-type: text/html
content-length: 12
date: Fri, 21 May 2021 08:06:26 GMT
fwdhst: origin-ede-gcp-central-blue.kohls.com
set-cookie: akacd_EDE_GCP=2177452799~rv=81~id=e5f08143f48bb184e8c4efa3d627f663; path=/; Expires=Mon, 31 Dec 2038 23:59:59 GMT; Secure; SameSite=None
akamai-request-id2: 96.17.182.36:5c2f8123
access-control-allow-headers: X-APP-API_KEY, EDE-AB_VAR_PARAMS, Content-Type
access-control-allow-methods: GET, POST
access-control-allow-origin: *
----

--Response 
HTTP/1.1 200
status: 200
access-control-allow-origin: *
date: Thu, 20 May 2021 10:01:30 GMT
pragma: no-cache
expires: Mon, 01 Jan 1990 00:00:00 GMT
last-modified: Sun, 17 May 1998 03:00:00 GMT
x-content-type-options: nosniff
content-type: image/gif
cross-origin-resource-policy: cross-origin
server: Golfe2
content-length: 35
age: 79496
cache-control: no-cache, no-store, must-revalidate
alt-svc: h3-29=\":443\"; ma=2592000,h3-T051=\":443\"; ma=2592000,h3-Q050=\":443\"; ma=2592000,h3-Q046=\":443\"; ma=2592000,h3-Q043=\":443\"; ma=2592000,quic=\":443\"; ma=2592000; v=\"46,43\"
----

--Response 
HTTP/1.1 204
status: 204
date: Fri, 21 May 2021 08:06:26 GMT
timing-allow-origin: *
cache-control: no-cache, no-store, must-revalidate, pre-check=0, post-check=0
pragma: no-cache
expires: Sun, 24 Oct 1982 23:00:00 GMT
access-control-allow-origin: *
access-control-allow-methods: GET, POST, OPTIONS
access-control-allow-headers: Access-Control-Expose-Headers, Content-Type, Content-Compression, X-Requested-With
content-disposition: inline
----

--Response 
HTTP/1.1 204
status: 204
date: Fri, 21 May 2021 08:06:26 GMT
timing-allow-origin: *
cache-control: no-cache, no-store, must-revalidate, pre-check=0, post-check=0
pragma: no-cache
expires: Sun, 24 Oct 1982 23:00:00 GMT
access-control-allow-origin: *
access-control-allow-methods: GET, POST, OPTIONS
access-control-allow-headers: Access-Control-Expose-Headers, Content-Type, Content-Compression, X-Requested-With
content-disposition: inline
----

--Response 
HTTP/1.1 204
status: 204
date: Fri, 21 May 2021 08:06:26 GMT
timing-allow-origin: *
cache-control: no-cache, no-store, must-revalidate, pre-check=0, post-check=0
pragma: no-cache
expires: Sun, 24 Oct 1982 23:00:00 GMT
access-control-allow-origin: *
access-control-allow-methods: GET, POST, OPTIONS
access-control-allow-headers: Access-Control-Expose-Headers, Content-Type, Content-Compression, X-Requested-With
content-disposition: inline
----

--Response 
HTTP/1.1 204
status: 204
date: Fri, 21 May 2021 08:06:26 GMT
timing-allow-origin: *
cache-control: no-cache, no-store, must-revalidate, pre-check=0, post-check=0
pragma: no-cache
expires: Sun, 24 Oct 1982 23:00:00 GMT
access-control-allow-origin: *
access-control-allow-methods: GET, POST, OPTIONS
access-control-allow-headers: Access-Control-Expose-Headers, Content-Type, Content-Compression, X-Requested-With
content-disposition: inline
----

--Response 
HTTP/1.1 204
status: 204
date: Fri, 21 May 2021 08:06:26 GMT
timing-allow-origin: *
cache-control: no-cache, no-store, must-revalidate, pre-check=0, post-check=0
pragma: no-cache
expires: Sun, 24 Oct 1982 23:00:00 GMT
access-control-allow-origin: *
access-control-allow-methods: GET, POST, OPTIONS
access-control-allow-headers: Access-Control-Expose-Headers, Content-Type, Content-Compression, X-Requested-With
content-disposition: inline
----

--Response 
HTTP/1.1 204
status: 204
date: Fri, 21 May 2021 08:06:26 GMT
timing-allow-origin: *
cache-control: no-cache, no-store, must-revalidate, pre-check=0, post-check=0
pragma: no-cache
expires: Sun, 24 Oct 1982 23:00:00 GMT
access-control-allow-origin: *
access-control-allow-methods: GET, POST, OPTIONS
access-control-allow-headers: Access-Control-Expose-Headers, Content-Type, Content-Compression, X-Requested-With
content-disposition: inline
----

--Response 
HTTP/1.1 204
status: 204
date: Fri, 21 May 2021 08:06:26 GMT
timing-allow-origin: *
cache-control: no-cache, no-store, must-revalidate, pre-check=0, post-check=0
pragma: no-cache
expires: Sun, 24 Oct 1982 23:00:00 GMT
access-control-allow-origin: *
access-control-allow-methods: GET, POST, OPTIONS
access-control-allow-headers: Access-Control-Expose-Headers, Content-Type, Content-Compression, X-Requested-With
content-disposition: inline
----

--Response 
HTTP/1.1 204
status: 204
date: Fri, 21 May 2021 08:06:26 GMT
timing-allow-origin: *
cache-control: no-cache, no-store, must-revalidate, pre-check=0, post-check=0
pragma: no-cache
expires: Sun, 24 Oct 1982 23:00:00 GMT
access-control-allow-origin: *
access-control-allow-methods: GET, POST, OPTIONS
access-control-allow-headers: Access-Control-Expose-Headers, Content-Type, Content-Compression, X-Requested-With
content-disposition: inline
----

--Response 
HTTP/1.1 200
status: 200
p3p: policyref=\"https://www.googleadservices.com/pagead/p3p.xml\", CP=\"NOI DEV PSA PSD IVA IVD OTP OUR OTR IND OTC\"
timing-allow-origin: *
cross-origin-resource-policy: cross-origin
date: Fri, 21 May 2021 08:06:26 GMT
pragma: no-cache
expires: Fri, 01 Jan 1990 00:00:00 GMT
cache-control: no-cache, no-store, must-revalidate
content-type: image/gif
content-security-policy: script-src 'none'; object-src 'none'
x-content-type-options: nosniff
server: cafe
content-length: 42
x-xss-protection: 0
alt-svc: h3-29=\":443\"; ma=2592000,h3-T051=\":443\"; ma=2592000,h3-Q050=\":443\"; ma=2592000,h3-Q046=\":443\"; ma=2592000,h3-Q043=\":443\"; ma=2592000,quic=\":443\"; ma=2592000; v=\"46,43\"
----

--Response 
HTTP/1.1 200
status: 200
p3p: policyref=\"https://www.googleadservices.com/pagead/p3p.xml\", CP=\"NOI DEV PSA PSD IVA IVD OTP OUR OTR IND OTC\"
timing-allow-origin: *
cross-origin-resource-policy: cross-origin
date: Fri, 21 May 2021 08:06:26 GMT
pragma: no-cache
expires: Fri, 01 Jan 1990 00:00:00 GMT
cache-control: no-cache, no-store, must-revalidate
content-type: image/gif
content-security-policy: script-src 'none'; object-src 'none'
x-content-type-options: nosniff
server: cafe
content-length: 42
x-xss-protection: 0
alt-svc: h3-29=\":443\"; ma=2592000,h3-T051=\":443\"; ma=2592000,h3-Q050=\":443\"; ma=2592000,h3-Q046=\":443\"; ma=2592000,h3-Q043=\":443\"; ma=2592000,quic=\":443\"; ma=2592000; v=\"46,43\"
----

--Response 
HTTP/1.1 200
status: 200
p3p: policyref=\"https://www.googleadservices.com/pagead/p3p.xml\", CP=\"NOI DEV PSA PSD IVA IVD OTP OUR OTR IND OTC\"
timing-allow-origin: *
cross-origin-resource-policy: cross-origin
date: Fri, 21 May 2021 08:06:26 GMT
pragma: no-cache
expires: Fri, 01 Jan 1990 00:00:00 GMT
cache-control: no-cache, no-store, must-revalidate
content-type: image/gif
content-security-policy: script-src 'none'; object-src 'none'
x-content-type-options: nosniff
server: cafe
content-length: 42
x-xss-protection: 0
alt-svc: h3-29=\":443\"; ma=2592000,h3-T051=\":443\"; ma=2592000,h3-Q050=\":443\"; ma=2592000,h3-Q046=\":443\"; ma=2592000,h3-Q043=\":443\"; ma=2592000,quic=\":443\"; ma=2592000; v=\"46,43\"
----

--Response 
HTTP/1.1 200
status: 200
p3p: policyref=\"https://www.googleadservices.com/pagead/p3p.xml\", CP=\"NOI DEV PSA PSD IVA IVD OTP OUR OTR IND OTC\"
timing-allow-origin: *
cross-origin-resource-policy: cross-origin
date: Fri, 21 May 2021 08:06:26 GMT
pragma: no-cache
expires: Fri, 01 Jan 1990 00:00:00 GMT
cache-control: no-cache, no-store, must-revalidate
content-type: image/gif
content-security-policy: script-src 'none'; object-src 'none'
x-content-type-options: nosniff
server: cafe
content-length: 42
x-xss-protection: 0
alt-svc: h3-29=\":443\"; ma=2592000,h3-T051=\":443\"; ma=2592000,h3-Q050=\":443\"; ma=2592000,h3-Q046=\":443\"; ma=2592000,h3-Q043=\":443\"; ma=2592000,quic=\":443\"; ma=2592000; v=\"46,43\"
----

