--Request 
POST https://c.clicktale.net/errors?v=10.8.6&pid=2399&uu=bb1a9eb8-c26c-afeb-ed35-b32d19e0d329&sn=1&pn=2
Host: c.clicktale.net
Host: c.clicktale.net
Connection: keep-alive
Content-Length: 107
Origin: https://www.kohls.com
User-Agent: Mozilla/5.0 (Windows NT 10.0; WOW64) AppleWebKit/537.36 (KHTML, like Gecko) Chrome/56.0.2924.87 Safari/537.36
Content-Type: text/plain;charset=UTF-8
Accept: */*
Sec-Fetch-Site: cross-site
Sec-Fetch-Mode: cors
Referer: https://www.kohls.com/catalog/sale-shorts-bottoms-clothing.jsp?CN=Promotions:Sale+Product:Shorts+Category:Bottoms+Department:Clothing+Assortment:Lowest%20Prices%20of%20the%20Season&BST=3913034:3985440:4149826&icid=hpmf-hero2-startingat1699shorts&kls_sbp=09167193449239534971532002446042350327
Accept-Encoding: gzip, deflate, br
Accept-Language: en-GB,en-US;q=0.9,en;q=0.8
----
--Response 
HTTP/1.1 204
status: 204
date: Fri, 21 May 2021 08:10:38 GMT
timing-allow-origin: *
cache-control: no-cache, no-store, must-revalidate, pre-check=0, post-check=0
pragma: no-cache
expires: Sun, 24 Oct 1982 23:00:00 GMT
access-control-allow-origin: *
access-control-allow-methods: GET, POST, OPTIONS
access-control-allow-headers: Access-Control-Expose-Headers, Content-Type, Content-Compression, X-Requested-With
content-disposition: inline
----
--Request 
GET https://bat.bing.com/action/0?ti=4024145&tm=al001&Ver=2&mid=4c77d861-9bee-4799-83de-b8c2c6b7f244&sid=fdce5dc0ba0b11ebb694f78bbcad10ea&vid=fdcf3810ba0b11eb8504894104a43503&vids=0&prodid=3913034%2C3985440%2C4149826%2C4908955%2C4265343%2C3972148%2C3995184%2C3847510%2C3365047%2C3963792%2C3910050%2C4632125%2C3847629%2C3950527%2C3966553%2C3904013%2C3901492%2C4892006%2C3907532%2C3913048%2C5065808%2C2214507%2C3510365%2C4868688%2C4203958%2C3996847%2C4533511%2C4015437%2C4145304%2C2379752%2C4885070%2C3960173%2C4015111%2C3950428%2C3977634%2C4265282%2C4912215%2C4885080%2C3652872%2C4258343%2C3676761%2C3954887%2C3671783%2C2375108%2C3888224%2C4910074%2C4815916%2C2318843&pagetype=category&ea=custom&en=Y&evt=custom&msclkid=N&rn=137093
Host: bat.bing.com
Host: bat.bing.com
Connection: keep-alive
User-Agent: Mozilla/5.0 (Windows NT 10.0; WOW64) AppleWebKit/537.36 (KHTML, like Gecko) Chrome/56.0.2924.87 Safari/537.36
Accept: image/webp,image/apng,image/*,*/*;q=0.8
Sec-Fetch-Site: cross-site
Sec-Fetch-Mode: no-cors
Referer: https://www.kohls.com/catalog/sale-shorts-bottoms-clothing.jsp?CN=Promotions:Sale+Product:Shorts+Category:Bottoms+Department:Clothing+Assortment:Lowest%20Prices%20of%20the%20Season&BST=3913034:3985440:4149826&icid=hpmf-hero2-startingat1699shorts&kls_sbp=09167193449239534971532002446042350327
Accept-Encoding: gzip, deflate, br
Accept-Language: en-GB,en-US;q=0.9,en;q=0.8
Cookie: MUID=2FEDAA73973269530F04BA4D9634684E; MR=0
----
--Response 
HTTP/1.1 204
status: 204
cache-control: no-cache, must-revalidate
pragma: no-cache
expires: Fri, 01 Jan 1990 00:00:00 GMT
access-control-allow-origin: *
x-cache: CONFIG_NOCACHE
x-msedge-ref: Ref A: 81851B3C93024CC5A0487CDAE6736587 Ref B: DEL01EDGE0520 Ref C: 2021-05-21T08:10:38Z
date: Fri, 21 May 2021 08:10:37 GMT
----
--Request 
GET https://servedby.flashtalking.com/segment/modify/xa2-xa217;;pixel/?valuePairs=klsct0;klsurct1&setTime=0;0&granularity=day;day
Host: servedby.flashtalking.com
Host: servedby.flashtalking.com
Connection: keep-alive
User-Agent: Mozilla/5.0 (Windows NT 10.0; WOW64) AppleWebKit/537.36 (KHTML, like Gecko) Chrome/56.0.2924.87 Safari/537.36
Accept: image/webp,image/apng,image/*,*/*;q=0.8
Sec-Fetch-Site: same-site
Sec-Fetch-Mode: no-cors
Referer: https://servedby.flashtalking.com/container/1638;101965;1478;iframe/?spotName=Category_Page&U1=3913034,3985440,4149826,4908955,4265343,3972148,3995184,3847510,3365047,3963792,3910050,4632125,3847629,3950527,3966553,3904013,3901492,4892006,3907532,3913048,5065808,2214507,3510365,4868688,4203958,3996847,4533511,4015437,4145304,2379752,4885070,3960173,4015111,3950428,3977634,4265282,4912215,4885080,3652872,4258343,3676761,3954887,3671783,2375108,3888224,4910074,4815916,2318843&U2=1234&U3=09167193449239534971532002446042350327&U7=c68333f4-b7d4-42dd-be5f-49d1eb509125&U10=N/A&cachebuster=110214.84469972842
Accept-Encoding: gzip, deflate, br
Accept-Language: en-GB,en-US;q=0.9,en;q=0.8
Cookie: flashtalkingad1=\"GUID=4889036A7EB909|segment=(xh0)\"; _D9J=8f80840b94c84fa4a52c7d221e8925b3
----
--Response 
HTTP/1.1 200 OK
Date: Fri, 21 May 2021 08:10:38 GMT
Connection: Keep-Alive
Cache-Control: no-cache, no-store
Content-Length: 42
Content-Type: image/gif
Server: prod-xre-app28.lhr11
Set-Cookie: flashtalkingad1=\"GUID=4889036A7EB909|segment=(xh0,xa2-t:4889-m:klsct0,xa217-t:4889-m:klsurct1)\";Path=/;Domain=.flashtalking.com;Expires=Sun, 21-May-23 08:10:38 GMT;SameSite=None;Secure
Pragma: no-cache
P3P: policyref=\"/w3c/p3p.xml\", CP=\"CURa ADMa DEVa PSAo PSDo OUR BUS UNI PUR INT DEM STA PRE COM NAV OTC NOI DSP COR\"
X-HW: 1621584638.dop083.lo4.shc,1621584638.dop083.lo4.t,1621584638.cds234.lo4.sc,1621584638.cds234.lo4.p
----

