--Request 
GET https://servedby.flashtalking.com/container/1638;101965;1478;iframe/?spotName=Category_Page&U1=3414938,2702749,397410,4250385,4250313,2931948,3251942,2983088,3435216,1662804,4250380,3646112,3801787,1617650,286336,3664199,3801790,298312,1700436,2844899,142180,4250527,2277377,2421845,1617652,2076134,3045266,4250488,2702764,3887236,4148632,3262530,807431,3678681,3045459,2421747,914296,2438183,3582949,3645897,3801791,4250724,4250378,1879050,1879006,2827422,3456610,1285769,4262061,1707303,511087,298312,4250488,2827419,3045459,3456610,2931948,2277377,807430,2827597&U2=1234&U3=74283710457332868823275532843712593523&U7=89efdb34-6bfd-46b8-990d-8834876b9876&U10=N/A&cachebuster=888873.1296590168
Host: servedby.flashtalking.com
Upgrade-Insecure-Requests: 1
User-Agent: Mozilla/5.0 (Windows NT 10.0; WOW64) AppleWebKit/537.36 (KHTML, like Gecko) Chrome/56.0.2924.87 Safari/537.36
Accept: text/html,application/xhtml+xml,application/xml;q=0.9,image/webp,image/apng,*/*;q=0.8,application/signed-exchange;v=b3;q=0.9
Sec-Fetch-Site: cross-site
Sec-Fetch-Mode: nested-navigate
Referer: https://www.kohls.com/catalog/mens-belts-accessories.jsp?CN=Gender:Mens+Product:Belts+Department:Accessories&cc=mens-LN5.0-S-belts&kls_sbp=74283710457332868823275532843712593523
Accept-Encoding: gzip, deflate, br
Accept-Language: en-GB,en-US;q=0.9,en;q=0.8
Cookie: flashtalkingad1=\"GUID=48930F887A973A\"
----

--Request 
GET https://www.googletagmanager.com/gtag/js?id=DC-2195488
Host: www.googletagmanager.com
User-Agent: Mozilla/5.0 (Windows NT 10.0; WOW64) AppleWebKit/537.36 (KHTML, like Gecko) Chrome/56.0.2924.87 Safari/537.36
Accept: */*
Sec-Fetch-Site: cross-site
Sec-Fetch-Mode: no-cors
Referer: https://www.kohls.com/catalog/mens-belts-accessories.jsp?CN=Gender:Mens+Product:Belts+Department:Accessories&cc=mens-LN5.0-S-belts&kls_sbp=74283710457332868823275532843712593523
Accept-Encoding: gzip, deflate, br
Accept-Language: en-GB,en-US;q=0.9,en;q=0.8
----

--Request 
GET https://assets.adobedtm.com/6d2e783bbfe3/c0c47c5c96c6/326882ed9698/RC45c202be87f24f4b869276b8ad2213dd-source.min.js
Host: assets.adobedtm.com
User-Agent: Mozilla/5.0 (Windows NT 10.0; WOW64) AppleWebKit/537.36 (KHTML, like Gecko) Chrome/56.0.2924.87 Safari/537.36
Accept: */*
Sec-Fetch-Site: cross-site
Sec-Fetch-Mode: no-cors
Referer: https://www.kohls.com/catalog/mens-belts-accessories.jsp?CN=Gender:Mens+Product:Belts+Department:Accessories&cc=mens-LN5.0-S-belts&kls_sbp=74283710457332868823275532843712593523
Accept-Encoding: gzip, deflate, br
Accept-Language: en-GB,en-US;q=0.9,en;q=0.8
----
--Response 
HTTP/1.1 200
status: 200
accept-ranges: bytes
content-type: application/x-javascript
etag: \"d1bc7c1ca473a060d13525f76d345d6c:1621918521.046756\"
last-modified: Tue, 25 May 2021 04:55:21 GMT
server: AkamaiNetStorage
vary: Accept-Encoding
content-encoding: gzip
content-length: 506
cache-control: max-age=3600
expires: Tue, 25 May 2021 11:13:51 GMT
date: Tue, 25 May 2021 10:13:51 GMT
access-control-allow-origin: https://www.kohls.com
timing-allow-origin: *
----
--Request 
GET https://apps.zineone.com/c3/api/v1/connectwebsocket/cdf73293-625c-44e7-bfea-4c5adccbd777
Host: apps.zineone.com
Origin: https://www.kohls.com
apikey: apps@2b6b5a02-b3e0-4a05-9e3b-d727afbfa357
User-Agent: Mozilla/5.0 (Windows NT 10.0; WOW64) AppleWebKit/537.36 (KHTML, like Gecko) Chrome/56.0.2924.87 Safari/537.36
Content-Type: text/plain
Accept: */*
Sec-Fetch-Site: cross-site
Sec-Fetch-Mode: cors
Referer: https://www.kohls.com/catalog/mens-belts-accessories.jsp?CN=Gender:Mens+Product:Belts+Department:Accessories&cc=mens-LN5.0-S-belts&kls_sbp=74283710457332868823275532843712593523
Accept-Encoding: gzip, deflate, br
Accept-Language: en-GB,en-US;q=0.9,en;q=0.8
----

--Request 
GET https://mon1.kohls.com/nv/kohls/dotcom/config.js?v=REL20170123
Host: mon1.kohls.com
User-Agent: Mozilla/5.0 (Windows NT 10.0; WOW64) AppleWebKit/537.36 (KHTML, like Gecko) Chrome/56.0.2924.87 Safari/537.36
Accept: */*
Sec-Fetch-Site: same-site
Sec-Fetch-Mode: no-cors
Referer: https://www.kohls.com/catalog/mens-belts-accessories.jsp?CN=Gender:Mens+Product:Belts+Department:Accessories&cc=mens-LN5.0-S-belts&kls_sbp=74283710457332868823275532843712593523
Accept-Encoding: gzip, deflate, br
Accept-Language: en-GB,en-US;q=0.9,en;q=0.8
Cookie: bm_sz=F3FC8DBF83137CA0C555D9D6397F8D9D~YAAQNagRYDoLjnN5AQAAF6kDowvVnyiDO+AV1LyH6PbzINwVw4DQ/g3xvfgFiEaRpgNS5bORCvZ9ql5q83n2A4ORjH8PG8V17lYRKu8NA7Gyva/5ctObVIlKr4jA4v2m5DQJ8gD4ndghUcZav8JdE0k15tFAnHNFXynvF78Wkhy4PSZdL33kRSni0BCq2rwefhw6YwrQpqsx18W/ND1Xnr6AyaZt3rlVa0tZpSWFzlRG9+ZL8JP/b4zVpjx/9IYOE5AeuT3b801iUsE=; check=true; AMCVS_F0EF5E09512D2CD20A490D4D%40AdobeOrg=1; bm_mi=66F39923FF60C3540B2CB245C753CB4B~/JyIGPz8ftmZ02Ww1sMyWQxYQqgIAPK1A2YGMxg5eM+pZidmw8tMK8fC2xOUD2ZiRK4ruAqWQKUteZsRrm8MXrz4khvIUgI8gGQmPJhx6EHWpUvs9UQD5WywSUUf00UIvXbl2dubhApPEtxms6iAU+6ZwVCvxkFKeNb/yjPPCF7AKtTyHop6U6KQ3mLoLV/UZH2ZHCfgtcnxrKS0nV7MLcweJ/P7RCXy/lxtb+PtPBGLlrHXHBBGBI6YzNK3AAEiBDkXGv5UAE4USep+BDcGZ5naytazCnBUgesl46HR+HqcwSpArU+C7prXlifBOrk4; mboxEdgeCluster=31; s_ecid=MCMID%7C74283710457332868823275532843712593523; ak_bmsc=2FB815A171E60A8D1A63DE08022D8714~000000000000000000000000000000~YAAQNagRYNsOjnN5AQAAld4DowtbpX/4QyUgG+lExgx99XOyHl2B+gDezXW6BpY+B58/45mJnb2yS0zpBxtRLVrY2vKK0ETVptxwdWwXyzd2SBL9vF1W0z2hmDkNcM3BV4DncUc5rstf6nSFnjDv7z2/r5KytgoLeNASaIqKzSMWIhH5xw1Ie8dquy8dcSHRxSCMwmd0GCPk2HeetBvtEqsDZjFK2z1fUhRBG42yOXUPxZoAVyNDOGwRLWDHBPu3JTs9dr10njOfTK6IAXHPnwo/6jcVtHLxUwFDrviUztwL1RVHnUQQR877ylxaDK/EfNILbsfPVJ6EVMg+h2AdMMgFhPU4IiqXfY7CxPaDSb+0U6juZapM7EcvNHSTCAaTVU/eVj10ZaeomAWvwwCvNQNbVzoWoD6zwVbAKYO/jX7bTXrNG2yKhrY3VkM04akUfvmD/9Nh1wbwSkLXwm8uAIhyMLiktP4d4ekCPzWN8+jmVDxGSduCStJxGvE8CEG6Smk2qR/2FAIlNNAG8vqPO4G3Zxz60H2InbV6oFmgVhB3c9rGQyrF41wm2iJCcO1K2PEnNnmYZETtZ2FTmzw=; AMCV_F0EF5E09512D2CD20A490D4D%40AdobeOrg=-1712354808%7CMCIDTS%7C18773%7CMCMID%7C74283710457332868823275532843712593523%7CMCAAMLH-1622542404%7C12%7CMCAAMB-1622542404%7CRKhpRz8krg2tLO6pguXWp5olkAcUniQYPHaMWWgdJ3xzPWQmdj0y%7CMCOPTOUT-1621944806s%7CNONE%7CMCAID%7CNONE%7CMCSYNCSOP%7C411-18780%7CvVersion%7C4.3.0; s_cc=true; _dy_csc_ses=t; _dy_c_exps=; _dycnst=dg; _dyid=-3265109393214222885; _dyjsession=32771b8558de59ed0dcf429cd93c7f7b; dy_fs_page=www.kohls.com%2Fsale-event%2Fmens-clothing.jsp%3Ficid%3Dhpmf-dept-men; _dycst=dk.w.c.ms.; _dy_geo=IN.AS.IN_RJ.IN_RJ_Jaipur; _dy_df_geo=India..Jaipur; _dy_toffset=-1; s_stv=non-search; _dyid_server=-3265109393214222885; aam_uuid=79439127674770090982620414717873600347; akaalb_mon1_kohls_com=~op=mon1_kohls_com_GT_migration:mon1_colo|~rv=71~m=mon1_colo:0|~os=c253c2beba471a4a257fe6f06c24adbb~id=620f4a05084d095540ac0d7eb9fbe5bd; mbox=session#a19ee296b21f40938eea631379ea6766#1621939496|PC#a19ee296b21f40938eea631379ea6766.31_0#1685182406; _dy_ses_load_seq=11660%3A1621937639535; _dy_c_att_exps=; _dy_soct=561158.1083346.1621937626*546795.1053981.1621937639; _dyfs=1621937640000; _dy_lu_ses=32771b8558de59ed0dcf429cd93c7f7b%3A1621937640002; dtCookie=v_4_srv_1_sn_E395E33C9B0EBBB82558025A42AA4F8B_perc_100000_ol_0_mul_1_app-3Aea7c4b59f27d43eb_1; productnum=2; bm_sv=1A86D00904DDB8E415F2A1336D345D44~sE+1mBZ7u2bGIDCbqsu+xe/i62qrqfYu5ZJxTE4IVVYjKEkGhTjVAqkjK1GINS4z8dli9hvRPik2l+iL4nUEJ6mgbjMLZt4rcd+Ycdhkdr0liWPzWkdZml9yOqPgVpxq09aVqSPzBgfJ62+3gPbQTiXAYNrxReH863S2ruv/mHU=; gpv_v9=accessories%7Cbelts%7Cmens; s_sq=kohlscomprod%3D%2526c.%2526a.%2526activitymap.%2526page%253Daccessories%25257Cbelts%25257Cmens%2526link%253DBrown%252520Belts%2526region%253Dvn-box%2526pageIDType%253D1%2526.activitymap%2526.a%2526.c%2526pid%253Daccessories%25257Cbelts%25257Cmens%2526pidt%253D1%2526oid%253Dhttps%25253A%25252F%25252Fwww.kohls.com%25252Fcatalog%25252Fmens-brown-belts-accessories.jsp%25253FCN%25253DGender%25253AMens%25252BColor%25253ABrown%25252BProduct%25253ABe%2526ot%253DA; RT=\"z=1&dm=kohls.com&si=e9bc9a05-0223-462b-b10e-c5356120e6fa&ss=kp3vrmi3&sl=3&tt=mvh&bcn=%2F%2F684fc53c.akstat.io%2F&obo=1&nu=kxs52n1q&cl=115b&ld=1161&r=wwr4dc2h&ul=1162\"; _abck=48673268CAA6F44D19C40005F853CEEF~-1~YAAQNagRYJMUjnN5AQAArWEEowXpDbvTFHFrF+tg/oy0LtZbI6MpZMLKi6NCJegGAzzS2Pklr0llTdA9ecBtNnyBgjeCZAKaS7LtiWjqrLRxQxV8K3QqAg5jdz8rwQRoGwLgWVBxcIdnx2XEWTk++PqCIfoDMiLR5YHpEDA9CxZRqHFq5BetIso9o4lKrpb6CaZjWDBVfFZ9O1Fyo6H55WWtNrRXEoSE/9srwpifFpA8QBxcBrygiXhXtSKx9bDpxgGe+cfw1EpmpyFcWoT2FMWMMHlSQSwcZJ1kZr9tOSVpEHQ3cBfAwXPQMCiQes/5GqhrnKm5buVEspoBbwWHytY3rH20KKdxQlyBwlIEWNMzIwvba5m0/XecXUOHT1+FxXWXA+bs62HC6FihfJshqWH8wlMAmyNzcuB2t3ygRIGbcg==~-1~-1~-1
----
--Response 
HTTP/1.1 200
status: 200
etag: \"0233128611\"
content-type: text/javascript
vary: Accept-Encoding
content-encoding: gzip
content-length: 12521
cache-control: public, max-age=3600
expires: Tue, 25 May 2021 11:14:05 GMT
date: Tue, 25 May 2021 10:14:05 GMT
----

