
--Response 
HTTP/1.1 200
status: 200
date: Fri, 21 May 2021 08:17:05 GMT
content-type: application/json;charset=UTF-8
vary: origin,access-control-request-method,access-control-request-headers,accept-encoding
timing-allow-origin: *
cache-control: no-cache
access-control-allow-origin: https://www.kohls.com
access-control-allow-credentials: true
x-request-id: 83594b2167444a4a92731a1e5c82f9f4
pragma: no-cache
content-encoding: gzip
----

--Response 
HTTP/1.1 200
status: 200
access-control-allow-origin: *
last-modified: Tue, 28 Jul 2020 21:55:32 GMT
etag: \"8201822dda1d8005331ae22073172d0f\"
server: Unknown
content-type: image/webp
content-length: 2844
timing-allow-origin: *
expires: Thu, 27 May 2021 02:52:52 GMT
date: Fri, 21 May 2021 08:17:05 GMT
----

--Response 
HTTP/1.1 200
status: 200
access-control-allow-origin: *
last-modified: Tue, 28 Jul 2020 21:55:30 GMT
etag: \"d1d900dcbfc5131fe321f346c40f8c11\"
server: Unknown
strict-transport-security: max-age=31536000; includeSubDomains
content-type: image/webp
content-length: 3612
timing-allow-origin: *
expires: Thu, 27 May 2021 02:52:53 GMT
date: Fri, 21 May 2021 08:17:05 GMT
----

--Response 
HTTP/1.1 200
status: 200
access-control-allow-origin: *
last-modified: Tue, 28 Jul 2020 21:55:49 GMT
etag: \"fa64e10d1aff9c94cf684aa7df4d4e16\"
server: Unknown
strict-transport-security: max-age=31536000; includeSubDomains
timing-allow-origin: *
content-type: image/webp
content-length: 9954
expires: Thu, 27 May 2021 02:52:53 GMT
date: Fri, 21 May 2021 08:17:05 GMT
----

--Response 
HTTP/1.1 200
status: 200
access-control-allow-origin: *
last-modified: Tue, 28 Jul 2020 21:56:12 GMT
etag: \"277a425aaa765ece64cd798b6b1eef3c\"
server: Unknown
strict-transport-security: max-age=31536000; includeSubDomains
content-type: image/jpeg
content-length: 17214
timing-allow-origin: *
expires: Thu, 27 May 2021 02:52:53 GMT
date: Fri, 21 May 2021 08:17:05 GMT
----

--Response 
HTTP/1.1 200
status: 200
access-control-allow-origin: *
last-modified: Tue, 28 Jul 2020 21:55:48 GMT
etag: \"9c568f232c2c29b0981c0ceb5ba1473c\"
server: Unknown
strict-transport-security: max-age=31536000; includeSubDomains
content-type: image/webp
content-length: 7466
timing-allow-origin: *
expires: Thu, 27 May 2021 02:52:53 GMT
date: Fri, 21 May 2021 08:17:05 GMT
----

--Response 
HTTP/1.1 200
status: 200
access-control-allow-origin: *
last-modified: Tue, 28 Jul 2020 21:55:52 GMT
etag: \"6efa9a0d8621a479abc51397d65f6c23\"
server: Unknown
strict-transport-security: max-age=31536000; includeSubDomains
content-type: image/webp
content-length: 3092
timing-allow-origin: *
expires: Thu, 27 May 2021 02:52:52 GMT
date: Fri, 21 May 2021 08:17:05 GMT
----

--Response 
HTTP/1.1 200
status: 200
access-control-allow-origin: *
last-modified: Tue, 28 Jul 2020 21:55:52 GMT
etag: \"0737e00c760b0c104f206618653ecb83\"
server: Unknown
strict-transport-security: max-age=31536000; includeSubDomains
timing-allow-origin: *
content-type: image/webp
content-length: 2622
expires: Thu, 27 May 2021 02:52:52 GMT
date: Fri, 21 May 2021 08:17:05 GMT
----

--Response 
HTTP/1.1 200
status: 200
access-control-allow-origin: *
last-modified: Tue, 28 Jul 2020 21:55:23 GMT
etag: \"c01ee56ef0e2f86b8300959446cf4468\"
server: Unknown
strict-transport-security: max-age=31536000; includeSubDomains
content-type: image/webp
content-length: 4738
timing-allow-origin: *
expires: Thu, 27 May 2021 02:52:53 GMT
date: Fri, 21 May 2021 08:17:05 GMT
----

--Response 
HTTP/1.1 200
status: 200
access-control-allow-origin: *
last-modified: Tue, 28 Jul 2020 21:55:54 GMT
etag: \"9c86299e48f89ce3a6971979f8bee1c1\"
server: Unknown
strict-transport-security: max-age=31536000; includeSubDomains
content-type: image/webp
content-length: 9014
timing-allow-origin: *
expires: Thu, 27 May 2021 02:52:53 GMT
date: Fri, 21 May 2021 08:17:05 GMT
----
--Request 
GET http://localhost:9222/devtools/ui/XElement.js
Host: localhost:9222
Host: localhost:9222
Connection: keep-alive
Origin: http://localhost:9222
User-Agent: Mozilla/5.0 (Windows NT 10.0; WOW64) AppleWebKit/537.36 (KHTML, like Gecko) Chrome/56.0.2924.87 Safari/537.36
Accept: */*
Sec-Fetch-Site: same-origin
Sec-Fetch-Mode: cors
Accept-Encoding: gzip, deflate, br
Accept-Language: en-GB,en-US;q=0.9,en;q=0.8
----
--Response 
HTTP/1.1 200 OK
Content-Length: 3033
Content-Type: application/javascript
----
--Request 
GET http://localhost:9222/devtools/ui/XLink.js
Host: localhost:9222
Host: localhost:9222
Connection: keep-alive
Origin: http://localhost:9222
User-Agent: Mozilla/5.0 (Windows NT 10.0; WOW64) AppleWebKit/537.36 (KHTML, like Gecko) Chrome/56.0.2924.87 Safari/537.36
Accept: */*
Sec-Fetch-Site: same-origin
Sec-Fetch-Mode: cors
Accept-Encoding: gzip, deflate, br
Accept-Language: en-GB,en-US;q=0.9,en;q=0.8
----
--Response 
HTTP/1.1 200 OK
Content-Length: 2287
Content-Type: application/javascript
----
--Request 
GET http://localhost:9222/devtools/ui/XWidget.js
Host: localhost:9222
Host: localhost:9222
Connection: keep-alive
Origin: http://localhost:9222
User-Agent: Mozilla/5.0 (Windows NT 10.0; WOW64) AppleWebKit/537.36 (KHTML, like Gecko) Chrome/56.0.2924.87 Safari/537.36
Accept: */*
Sec-Fetch-Site: same-origin
Sec-Fetch-Mode: cors
Accept-Encoding: gzip, deflate, br
Accept-Language: en-GB,en-US;q=0.9,en;q=0.8
----
--Response 
HTTP/1.1 200 OK
Content-Length: 3117
Content-Type: application/javascript
----
--Request 
GET http://localhost:9222/devtools/ui/ZoomManager.js
Host: localhost:9222
Host: localhost:9222
Connection: keep-alive
Origin: http://localhost:9222
User-Agent: Mozilla/5.0 (Windows NT 10.0; WOW64) AppleWebKit/537.36 (KHTML, like Gecko) Chrome/56.0.2924.87 Safari/537.36
Accept: */*
Sec-Fetch-Site: same-origin
Sec-Fetch-Mode: cors
Accept-Encoding: gzip, deflate, br
Accept-Language: en-GB,en-US;q=0.9,en;q=0.8
----
--Response 
HTTP/1.1 200 OK
Content-Length: 789
Content-Type: application/javascript
----
--Request 
GET http://localhost:9222/devtools/services/ServiceManager.js
Host: localhost:9222
Host: localhost:9222
Connection: keep-alive
Origin: http://localhost:9222
User-Agent: Mozilla/5.0 (Windows NT 10.0; WOW64) AppleWebKit/537.36 (KHTML, like Gecko) Chrome/56.0.2924.87 Safari/537.36
Accept: */*
Sec-Fetch-Site: same-origin
Sec-Fetch-Mode: cors
Accept-Encoding: gzip, deflate, br
Accept-Language: en-GB,en-US;q=0.9,en;q=0.8
----
--Response 
HTTP/1.1 200 OK
Content-Length: 5718
Content-Type: application/javascript
----
--Request 
GET http://localhost:9222/devtools/workspace/FileManager.js
Host: localhost:9222
Host: localhost:9222
Connection: keep-alive
Origin: http://localhost:9222
User-Agent: Mozilla/5.0 (Windows NT 10.0; WOW64) AppleWebKit/537.36 (KHTML, like Gecko) Chrome/56.0.2924.87 Safari/537.36
Accept: */*
Sec-Fetch-Site: same-origin
Sec-Fetch-Mode: cors
Accept-Encoding: gzip, deflate, br
Accept-Language: en-GB,en-US;q=0.9,en;q=0.8
----
--Response 
HTTP/1.1 200 OK
Content-Length: 1450
Content-Type: application/javascript
----
--Request 
GET http://localhost:9222/devtools/workspace/UISourceCode.js
Host: localhost:9222
Host: localhost:9222
Connection: keep-alive
Origin: http://localhost:9222
User-Agent: Mozilla/5.0 (Windows NT 10.0; WOW64) AppleWebKit/537.36 (KHTML, like Gecko) Chrome/56.0.2924.87 Safari/537.36
Accept: */*
Sec-Fetch-Site: same-origin
Sec-Fetch-Mode: cors
Accept-Encoding: gzip, deflate, br
Accept-Language: en-GB,en-US;q=0.9,en;q=0.8
----
--Response 
HTTP/1.1 200 OK
Content-Length: 11165
Content-Type: application/javascript
----
--Request 
GET http://localhost:9222/devtools/workspace/WorkspaceImpl.js
Host: localhost:9222
Host: localhost:9222
Connection: keep-alive
Origin: http://localhost:9222
User-Agent: Mozilla/5.0 (Windows NT 10.0; WOW64) AppleWebKit/537.36 (KHTML, like Gecko) Chrome/56.0.2924.87 Safari/537.36
Accept: */*
Sec-Fetch-Site: same-origin
Sec-Fetch-Mode: cors
Accept-Encoding: gzip, deflate, br
Accept-Language: en-GB,en-US;q=0.9,en;q=0.8
----
--Response 
HTTP/1.1 200 OK
Content-Length: 5265
Content-Type: application/javascript
----
--Request 
GET http://localhost:9222/devtools/bindings/LiveLocation.js
Host: localhost:9222
Host: localhost:9222
Connection: keep-alive
Origin: http://localhost:9222
User-Agent: Mozilla/5.0 (Windows NT 10.0; WOW64) AppleWebKit/537.36 (KHTML, like Gecko) Chrome/56.0.2924.87 Safari/537.36
Accept: */*
Sec-Fetch-Site: same-origin
Sec-Fetch-Mode: cors
Accept-Encoding: gzip, deflate, br
Accept-Language: en-GB,en-US;q=0.9,en;q=0.8
----
--Response 
HTTP/1.1 200 OK
Content-Length: 896
Content-Type: application/javascript
----
--Request 
GET http://localhost:9222/devtools/bindings/ResourceMapping.js
Host: localhost:9222
Host: localhost:9222
Connection: keep-alive
Origin: http://localhost:9222
User-Agent: Mozilla/5.0 (Windows NT 10.0; WOW64) AppleWebKit/537.36 (KHTML, like Gecko) Chrome/56.0.2924.87 Safari/537.36
Accept: */*
Sec-Fetch-Site: same-origin
Sec-Fetch-Mode: cors
Accept-Encoding: gzip, deflate, br
Accept-Language: en-GB,en-US;q=0.9,en;q=0.8
----
--Response 
HTTP/1.1 200 OK
Content-Length: 9672
Content-Type: application/javascript
----
--Request 
GET http://localhost:9222/devtools/bindings/BlackboxManager.js
Host: localhost:9222
Host: localhost:9222
Connection: keep-alive
Origin: http://localhost:9222
User-Agent: Mozilla/5.0 (Windows NT 10.0; WOW64) AppleWebKit/537.36 (KHTML, like Gecko) Chrome/56.0.2924.87 Safari/537.36
Accept: */*
Sec-Fetch-Site: same-origin
Sec-Fetch-Mode: cors
Accept-Encoding: gzip, deflate, br
Accept-Language: en-GB,en-US;q=0.9,en;q=0.8
----
--Response 
HTTP/1.1 200 OK
Content-Length: 7323
Content-Type: application/javascript
----
--Request 
GET http://localhost:9222/devtools/bindings/BreakpointManager.js
Host: localhost:9222
Host: localhost:9222
Connection: keep-alive
Origin: http://localhost:9222
User-Agent: Mozilla/5.0 (Windows NT 10.0; WOW64) AppleWebKit/537.36 (KHTML, like Gecko) Chrome/56.0.2924.87 Safari/537.36
Accept: */*
Sec-Fetch-Site: same-origin
Sec-Fetch-Mode: cors
Accept-Encoding: gzip, deflate, br
Accept-Language: en-GB,en-US;q=0.9,en;q=0.8
----
--Response 
HTTP/1.1 200 OK
Content-Length: 17743
Content-Type: application/javascript
----

