--Request 
GET http://10.10.30.102:8111/cgi-bin/findflight?outboundFlight=button0&hidden_outboundFlight_button0=000%7C0%7C05-27-2021&hidden_outboundFlight_button1=001%7C0%7C05-27-2021&hidden_outboundFlight_button2=002%7C0%7C05-27-2021&hidden_outboundFlight_button3=003%7C0%7C05-27-2021&numPassengers=1&advanceDiscount=&seatType=Coach&seatPref=None&reserveFlights.x=62&reserveFlights.y=13
Host: 10.10.30.102:8111
Upgrade-Insecure-Requests: 1
User-Agent: Mozilla/5.0 (Windows NT 10.0; Win64; x64) AppleWebKit/537.36 (KHTML, like Gecko) Chrome/79.0.3945.130 Safari/537.36
Accept: text/html,application/xhtml+xml,application/xml;q=0.9,image/webp,image/apng,*/*;q=0.8,application/signed-exchange;v=b3;q=0.9
Referer: http://10.10.30.102:8111/cgi-bin/findflight?depart=Acapulco&departDate=05-27-2021&arrive=Acapulco&returnDate=05-28-2021&numPassengers=1&seatPref=None&seatType=Coach&findFlights.x=72&findFlights.y=11
Accept-Encoding: gzip, deflate
Accept-Language: en-GB,en-US;q=0.9,en;q=0.8
Cookie: SL_Cookie=a1
----
--Response 
HTTP/1.1 200 OK
Content-length: 0000004304
Connection: Keep-Alive
Content-type: text/html
----
--Request 
GET http://10.10.30.102:8111/tours/Merc10-dev/images/banner_animated.gif
Host: 10.10.30.102:8111
User-Agent: Mozilla/5.0 (Windows NT 10.0; Win64; x64) AppleWebKit/537.36 (KHTML, like Gecko) Chrome/79.0.3945.130 Safari/537.36
Accept: image/webp,image/apng,image/*,*/*;q=0.8
Referer: http://10.10.30.102:8111/cgi-bin/findflight?outboundFlight=button0&hidden_outboundFlight_button0=000%7C0%7C05-27-2021&hidden_outboundFlight_button1=001%7C0%7C05-27-2021&hidden_outboundFlight_button2=002%7C0%7C05-27-2021&hidden_outboundFlight_button3=003%7C0%7C05-27-2021&numPassengers=1&advanceDiscount=&seatType=Coach&seatPref=None&reserveFlights.x=62&reserveFlights.y=13
Accept-Encoding: gzip, deflate
Accept-Language: en-GB,en-US;q=0.9,en;q=0.8
Cookie: SL_Cookie=a1
----
--Response 
HTTP/1.1 200 OK
Content-Length: 0000016522
Content-Type: image/gif
Connection: Keep-Alive
Date: Wed, 26-May-2021 13:27:22 IST
----
--Request 
GET http://10.10.30.102:8111/tours/Merc10-dev/images/sun_swede.gif
Host: 10.10.30.102:8111
User-Agent: Mozilla/5.0 (Windows NT 10.0; Win64; x64) AppleWebKit/537.36 (KHTML, like Gecko) Chrome/79.0.3945.130 Safari/537.36
Accept: image/webp,image/apng,image/*,*/*;q=0.8
Referer: http://10.10.30.102:8111/cgi-bin/findflight?outboundFlight=button0&hidden_outboundFlight_button0=000%7C0%7C05-27-2021&hidden_outboundFlight_button1=001%7C0%7C05-27-2021&hidden_outboundFlight_button2=002%7C0%7C05-27-2021&hidden_outboundFlight_button3=003%7C0%7C05-27-2021&numPassengers=1&advanceDiscount=&seatType=Coach&seatPref=None&reserveFlights.x=62&reserveFlights.y=13
Accept-Encoding: gzip, deflate
Accept-Language: en-GB,en-US;q=0.9,en;q=0.8
Cookie: SL_Cookie=a1
----
--Response 
HTTP/1.1 200 OK
Content-Length: 0000004125
Content-Type: image/gif
Connection: Keep-Alive
Date: Wed, 26-May-2021 13:27:22 IST
----
--Request 
GET http://10.10.30.102:8111/tours/Merc10-dev/images/flights.gif
Host: 10.10.30.102:8111
User-Agent: Mozilla/5.0 (Windows NT 10.0; Win64; x64) AppleWebKit/537.36 (KHTML, like Gecko) Chrome/79.0.3945.130 Safari/537.36
Accept: image/webp,image/apng,image/*,*/*;q=0.8
Referer: http://10.10.30.102:8111/cgi-bin/findflight?outboundFlight=button0&hidden_outboundFlight_button0=000%7C0%7C05-27-2021&hidden_outboundFlight_button1=001%7C0%7C05-27-2021&hidden_outboundFlight_button2=002%7C0%7C05-27-2021&hidden_outboundFlight_button3=003%7C0%7C05-27-2021&numPassengers=1&advanceDiscount=&seatType=Coach&seatPref=None&reserveFlights.x=62&reserveFlights.y=13
Accept-Encoding: gzip, deflate
Accept-Language: en-GB,en-US;q=0.9,en;q=0.8
Cookie: SL_Cookie=a1
----
--Response 
HTTP/1.1 200 OK
Content-Length: 0000001519
Content-Type: image/gif
Connection: Keep-Alive
Date: Wed, 26-May-2021 13:27:22 IST
----
--Request 
GET http://10.10.30.102:8111/tours/Merc10-dev/images/home.gif
Host: 10.10.30.102:8111
User-Agent: Mozilla/5.0 (Windows NT 10.0; Win64; x64) AppleWebKit/537.36 (KHTML, like Gecko) Chrome/79.0.3945.130 Safari/537.36
Accept: image/webp,image/apng,image/*,*/*;q=0.8
Referer: http://10.10.30.102:8111/cgi-bin/findflight?outboundFlight=button0&hidden_outboundFlight_button0=000%7C0%7C05-27-2021&hidden_outboundFlight_button1=001%7C0%7C05-27-2021&hidden_outboundFlight_button2=002%7C0%7C05-27-2021&hidden_outboundFlight_button3=003%7C0%7C05-27-2021&numPassengers=1&advanceDiscount=&seatType=Coach&seatPref=None&reserveFlights.x=62&reserveFlights.y=13
Accept-Encoding: gzip, deflate
Accept-Language: en-GB,en-US;q=0.9,en;q=0.8
Cookie: SL_Cookie=a1
----
--Response 
HTTP/1.1 200 OK
Content-Length: 0000001268
Content-Type: image/gif
Connection: Keep-Alive
Date: Wed, 26-May-2021 13:27:22 IST
----
--Request 
GET http://10.10.30.102:8111/tours/Merc10-dev/images/signoff.gif
Host: 10.10.30.102:8111
User-Agent: Mozilla/5.0 (Windows NT 10.0; Win64; x64) AppleWebKit/537.36 (KHTML, like Gecko) Chrome/79.0.3945.130 Safari/537.36
Accept: image/webp,image/apng,image/*,*/*;q=0.8
Referer: http://10.10.30.102:8111/cgi-bin/findflight?outboundFlight=button0&hidden_outboundFlight_button0=000%7C0%7C05-27-2021&hidden_outboundFlight_button1=001%7C0%7C05-27-2021&hidden_outboundFlight_button2=002%7C0%7C05-27-2021&hidden_outboundFlight_button3=003%7C0%7C05-27-2021&numPassengers=1&advanceDiscount=&seatType=Coach&seatPref=None&reserveFlights.x=62&reserveFlights.y=13
Accept-Encoding: gzip, deflate
Accept-Language: en-GB,en-US;q=0.9,en;q=0.8
Cookie: SL_Cookie=a1
----
--Response 
HTTP/1.1 200 OK
Content-Length: 0000001260
Content-Type: image/gif
Connection: Keep-Alive
Date: Wed, 26-May-2021 13:27:22 IST
----
--Request 
GET http://10.10.30.102:8111/tours/images/splash_creditcard.gif
Host: 10.10.30.102:8111
User-Agent: Mozilla/5.0 (Windows NT 10.0; Win64; x64) AppleWebKit/537.36 (KHTML, like Gecko) Chrome/79.0.3945.130 Safari/537.36
Accept: image/webp,image/apng,image/*,*/*;q=0.8
Referer: http://10.10.30.102:8111/cgi-bin/findflight?outboundFlight=button0&hidden_outboundFlight_button0=000%7C0%7C05-27-2021&hidden_outboundFlight_button1=001%7C0%7C05-27-2021&hidden_outboundFlight_button2=002%7C0%7C05-27-2021&hidden_outboundFlight_button3=003%7C0%7C05-27-2021&numPassengers=1&advanceDiscount=&seatType=Coach&seatPref=None&reserveFlights.x=62&reserveFlights.y=13
Accept-Encoding: gzip, deflate
Accept-Language: en-GB,en-US;q=0.9,en;q=0.8
Cookie: SL_Cookie=a1
----
--Response 
HTTP/1.1 200 OK
Content-Length: 0000002707
Content-Type: image/gif
Connection: Keep-Alive
Date: Wed, 26-May-2021 13:27:22 IST
----
--Request 
GET http://10.10.30.102:8111/tours/images/startover.gif
Host: 10.10.30.102:8111
User-Agent: Mozilla/5.0 (Windows NT 10.0; Win64; x64) AppleWebKit/537.36 (KHTML, like Gecko) Chrome/79.0.3945.130 Safari/537.36
Accept: image/webp,image/apng,image/*,*/*;q=0.8
Referer: http://10.10.30.102:8111/cgi-bin/findflight?outboundFlight=button0&hidden_outboundFlight_button0=000%7C0%7C05-27-2021&hidden_outboundFlight_button1=001%7C0%7C05-27-2021&hidden_outboundFlight_button2=002%7C0%7C05-27-2021&hidden_outboundFlight_button3=003%7C0%7C05-27-2021&numPassengers=1&advanceDiscount=&seatType=Coach&seatPref=None&reserveFlights.x=62&reserveFlights.y=13
Accept-Encoding: gzip, deflate
Accept-Language: en-GB,en-US;q=0.9,en;q=0.8
Cookie: SL_Cookie=a1
----
--Response 
HTTP/1.1 200 OK
Content-Length: 0000001455
Content-Type: image/gif
Connection: Keep-Alive
Date: Wed, 26-May-2021 13:27:22 IST
----
--Request 
GET http://10.10.30.102:8111/tours/images/purchaseflight.gif
Host: 10.10.30.102:8111
User-Agent: Mozilla/5.0 (Windows NT 10.0; Win64; x64) AppleWebKit/537.36 (KHTML, like Gecko) Chrome/79.0.3945.130 Safari/537.36
Accept: image/webp,image/apng,image/*,*/*;q=0.8
Referer: http://10.10.30.102:8111/cgi-bin/findflight?outboundFlight=button0&hidden_outboundFlight_button0=000%7C0%7C05-27-2021&hidden_outboundFlight_button1=001%7C0%7C05-27-2021&hidden_outboundFlight_button2=002%7C0%7C05-27-2021&hidden_outboundFlight_button3=003%7C0%7C05-27-2021&numPassengers=1&advanceDiscount=&seatType=Coach&seatPref=None&reserveFlights.x=62&reserveFlights.y=13
Accept-Encoding: gzip, deflate
Accept-Language: en-GB,en-US;q=0.9,en;q=0.8
Cookie: SL_Cookie=a1
----
--Response 
HTTP/1.1 200 OK
Content-Length: 0000001541
Content-Type: image/gif
Connection: Keep-Alive
Date: Wed, 26-May-2021 13:27:22 IST
----
--Request 
GET http://10.10.30.102:8111/tours/vep/images/velocigen.gif
Host: 10.10.30.102:8111
User-Agent: Mozilla/5.0 (Windows NT 10.0; Win64; x64) AppleWebKit/537.36 (KHTML, like Gecko) Chrome/79.0.3945.130 Safari/537.36
Accept: image/webp,image/apng,image/*,*/*;q=0.8
Referer: http://10.10.30.102:8111/cgi-bin/findflight?outboundFlight=button0&hidden_outboundFlight_button0=000%7C0%7C05-27-2021&hidden_outboundFlight_button1=001%7C0%7C05-27-2021&hidden_outboundFlight_button2=002%7C0%7C05-27-2021&hidden_outboundFlight_button3=003%7C0%7C05-27-2021&numPassengers=1&advanceDiscount=&seatType=Coach&seatPref=None&reserveFlights.x=62&reserveFlights.y=13
Accept-Encoding: gzip, deflate
Accept-Language: en-GB,en-US;q=0.9,en;q=0.8
Cookie: SL_Cookie=a1
----
--Response 
HTTP/1.1 200 OK
Content-Length: 0000002018
Content-Type: image/gif
Connection: Keep-Alive
Date: Wed, 26-May-2021 13:27:22 IST
----

