
--Response 
HTTP/1.1 204
status: 204
access-control-allow-origin: *
date: Fri, 21 May 2021 08:06:17 GMT
server-timing: cdn-cache; desc=MISS
server-timing: edge; dur=230
server-timing: origin; dur=42
fwdhst: origin-gcp-us-central1-ecs.kohls.com
akamai-request-id2: 96.17.182.36:5c2f36dd
----

--Response 
HTTP/1.1 200
status: 200
content-type: image/svg+xml
accept-ranges: bytes
content-encoding: gzip
etag: \"609c2d71-10d\"
last-modified: Thu, 20 May 2021 22:38:11 GMT
server: Akamai Resource Optimizer
x-origin-cc: max-age=86400
x-origin-cc: max-age=86400
x-origin-cc: max-age=86400
x-origin-cc: max-age=86400
x-origin-ttl: Fri, 21 May 2021 22:38:11 GMT
x-origin-ttl: Fri, 21 May 2021 22:38:11 GMT
x-origin-ttl: Fri, 21 May 2021 22:38:11 GMT
x-origin-ttl: Fri, 21 May 2021 22:38:11 GMT
content-length: 208
cache-control: max-age=86400
expires: Sat, 22 May 2021 08:06:17 GMT
date: Fri, 21 May 2021 08:06:17 GMT
vary: Accept-Encoding
set-cookie: _dyid_server=7656119531360184738; expires=Sat, 21-May-2022 08:06:17 GMT; path=/; domain=.kohls.com; secure
server-timing: cdn-cache; desc=HIT
server-timing: edge; dur=149
server-timing: dtRpid;desc=\"-1445764980\"
content-security-policy: block-all-mixed-content; frame-ancestors https://testzuiweb.kohls.zootweb.com https://testapplynow.kohls.zootweb.com 'self';
x-frame-options: SAMEORIGIN
strict-transport-security: max-age=15768000 ; preload
----

--Response 
HTTP/1.1 200
status: 200
content-type: image/webp
content-length: 1972
access-control-allow-origin: *
last-modified: Mon, 14 Oct 2019 02:50:04 GMT
etag: \"2fd38c901edbd5cd6f3ed26a881532ce\"
timing-allow-origin: *
server: Unknown
strict-transport-security: max-age=31536000; includeSubDomains
expires: Fri, 28 May 2021 08:06:17 GMT
date: Fri, 21 May 2021 08:06:17 GMT
----

--Response 
HTTP/1.1 200
status: 200
content-type: image/webp
content-length: 9656
access-control-allow-origin: *
last-modified: Mon, 14 Oct 2019 16:21:24 GMT
etag: \"1fa49f459fc6c2973ddb42a26b6a935f\"
timing-allow-origin: *
server: Unknown
expires: Fri, 28 May 2021 08:06:17 GMT
date: Fri, 21 May 2021 08:06:17 GMT
----

--Response 
HTTP/1.1 200
status: 200
date: Fri, 21 May 2021 08:06:19 GMT
content-type: image/png; charset=utf-8
content-length: 95
cf-cache-status: DYNAMIC
cf-request-id: 0a2f8f14350000397241380000000001
expect-ct: max-age=604800, report-uri=\"https://report-uri.cloudflare.com/cdn-cgi/beacon/expect-ct\"
server: cloudflare
cf-ray: 652c4e005c343972-MAA
alt-svc: h3-27=\":443\"; ma=86400, h3-28=\":443\"; ma=86400, h3-29=\":443\"; ma=86400
----

--Response 
HTTP/1.1 302
status: 302
p3p: policyref=\"https://googleads.g.doubleclick.net/pagead/gcn_p3p_.xml\", CP=\"CURa ADMa DEVa TAIo PSAo PSDo OUR IND UNI PUR INT DEM STA PRE COM NAV OTC NOI DSP COR\"
timing-allow-origin: *
cross-origin-resource-policy: cross-origin
date: Fri, 21 May 2021 08:06:23 GMT
pragma: no-cache
expires: Fri, 01 Jan 1990 00:00:00 GMT
cache-control: no-cache, must-revalidate
follow-only-when-prerender-shown: 1
strict-transport-security: max-age=21600
location: https://8632166.fls.doubleclick.net/activityi;dc_pre=COaVlMmo2vACFUaGaAod14UA_Q;src=8632166;type=landi0;cat=pdpta0;ord=4144957925322;gtm=2od5c1;auiddc=608256523.1621584295;u1=3833748;u10=https%3A%2F%2Fwww.kohls.com%2Fproduct%2Fprd-3833748%2Fwomens-lee-legendary-straight-leg-jeans.jsp%3Fcolor%3Dvista%26prdpv%3D1;u11=Women's%20Lee%C2%AE%20Legendary%20Straight-Leg%20Jeans;u13=bottoms;u2=Women's%20Lee%C2%AE%20Legendary%20Straight-Leg%20Jeans;u23=New%20Customer;u24=;u25=196815f0-9900-44f0-adaf-570fe8cace1a;u3=30.00;~oref=https%3A%2F%2Fwww.kohls.com%2Fproduct%2Fprd-3833748%2Fwomens-lee-legendary-straight-leg-jeans.jsp%3Fcolor%3DVista%26prdPV%3D1?
content-type: text/html; charset=UTF-8
x-content-type-options: nosniff
server: cafe
content-length: 0
x-xss-protection: 0
alt-svc: h3-29=\":443\"; ma=2592000,h3-T051=\":443\"; ma=2592000,h3-Q050=\":443\"; ma=2592000,h3-Q046=\":443\"; ma=2592000,h3-Q043=\":443\"; ma=2592000,quic=\":443\"; ma=2592000; v=\"46,43\"
----

--Response 
HTTP/1.1 200
status: 200
accept-ranges: bytes
content-type: application/x-javascript
etag: \"76ec4e573021c58c940627400b14e574:1621528998.531868\"
last-modified: Thu, 20 May 2021 16:43:18 GMT
server: AkamaiNetStorage
vary: Accept-Encoding
content-encoding: gzip
content-length: 299
cache-control: max-age=3600
expires: Fri, 21 May 2021 09:06:23 GMT
date: Fri, 21 May 2021 08:06:23 GMT
access-control-allow-origin: https://www.kohls.com
timing-allow-origin: *
----

