--Request 
POST https://c.clicktale.net/events?v=10.8.6&str=1715&di=2338&dc=4026&fl=4029&sr=11&mdh=8569&pn=6&re=1&uu=bb1a9eb8-c26c-afeb-ed35-b32d19e0d329&sn=1&lv=1621584625&lhd=1621584625&hd=1621584683&pid=2399&eu=%5B%5B1%2C836%2C0%2C0%2C1148%5D%2C%5B2%2C5228%2C1127%2C468%2C0%2C%22div%23bd_rec_PersistentBag%3Ediv%3Aeq(0)%3Ediv%3Aeq(1)%3Ediv%3Aeq(0)%3Ediv%3Aeq(0)%22%2C22656%2C23885%5D%2C%5B6%2C5244%2C1059%2C443%2C%22div%23bd_rec_PersistentBag%3Ediv%3Aeq(0)%3Ediv%3Aeq(1)%3Ediv%3Aeq(0)%3Ediv%3Aeq(0)%3Ea%3Aeq(7)%3Ediv%3Aeq(0)%3Ediv%3Aeq(0)%3Eimg%3Aeq(0)%22%2C%22%22%5D%2C%5B7%2C5318%2C973%2C333%2C%22div%23bd_rec_PersistentBag%3Ediv%3Aeq(0)%3Ediv%3Aeq(1)%3Ediv%3Aeq(0)%3Ediv%3Aeq(0)%3Ea%3Aeq(7)%3Ediv%3Aeq(0)%3Ediv%3Aeq(0)%3Eimg%3Aeq(0)%22%5D%2C%5B2%2C5643%2C799%2C257%2C0%2C%22div%23persistent_bar_container%3Ediv%3Aeq(1)%3Ediv%3Aeq(0)%3Ediv%3Aeq(0)%3Ediv%3Aeq(1)%3Eul%3Aeq(0)%22%2C19293%2C56879%5D%2C%5B6%2C5655%2C768%2C236%2C%22div%23persistent_bar_container%3Ediv%3Aeq(1)%3Ediv%3Aeq(0)%3Ediv%3Aeq(0)%3Ediv%3Aeq(1)%3Eul%3Aeq(0)%3Eli%3Aeq(1)%3Espan%3Aeq(2)%3Ea%3Aeq(0)%22%2C%22%22%5D%2C%5B7%2C5673%2C762%2C233%2C%22div%23persistent_bar_container%3Ediv%3Aeq(1)%3Ediv%3Aeq(0)%3Ediv%3Aeq(0)%3Ediv%3Aeq(1)%3Eul%3Aeq(0)%3Eli%3Aeq(1)%3Espan%3Aeq(2)%3Ea%3Aeq(0)%22%5D%2C%5B6%2C6022%2C713%2C223%2C%22div%23persistent_bar_container%3Ediv%3Aeq(1)%3Ediv%3Aeq(0)%3Ediv%3Aeq(0)%3Ediv%3Aeq(0)%3Ediv%3Aeq(0)%3Ediv%3Aeq(1)%3Ea%3Aeq(0)%22%2C%22%22%5D%2C%5B2%2C6046%2C712%2C222%2C0%2C%22div%23persistent_bar_container%3Ediv%3Aeq(1)%3Ediv%3Aeq(0)%3Ediv%3Aeq(0)%3Ediv%3Aeq(0)%3Ediv%3Aeq(0)%3Ediv%3Aeq(1)%3Ea%3Aeq(0)%22%2C37501%2C64079%5D%2C%5B7%2C6202%2C689%2C216%2C%22div%23persistent_bar_container%3Ediv%3Aeq(1)%3Ediv%3Aeq(0)%3Ediv%3Aeq(0)%3Ediv%3Aeq(0)%3Ediv%3Aeq(0)%3Ediv%3Aeq(1)%3Ea%3Aeq(0)%22%5D%2C%5B6%2C6204%2C689%2C216%2C%22div%23persistent_bar_container%3Ediv%3Aeq(1)%3Ediv%3Aeq(0)%3Ediv%3Aeq(0)%3Ediv%3Aeq(0)%3Ediv%3Aeq(0)%3Ediv%3Aeq(1)%3Ea%3Aeq(0)%3Espan%3Aeq(0)%22%2C%22%22%5D%2C%5B7%2C6444%2C690%2C217%2C%22div%23persistent_bar_container%3Ediv%3Aeq(1)%3Ediv%3Aeq(0)%3Ediv%3Aeq(0)%3Ediv%3Aeq(0)%3Ediv%3Aeq(0)%3Ediv%3Aeq(1)%3Ea%3Aeq(0)%3Espan%3Aeq(0)%22%5D%2C%5B6%2C6447%2C690%2C217%2C%22div%23persistent_bar_container%3Ediv%3Aeq(1)%3Ediv%3Aeq(0)%3Ediv%3Aeq(0)%3Ediv%3Aeq(0)%3Ediv%3Aeq(0)%3Ediv%3Aeq(1)%3Ea%3Aeq(0)%22%2C%22%22%5D%2C%5B2%2C6449%2C690%2C217%2C0%2C%22%22%2C21481%2C60438%5D%2C%5B7%2C6720%2C623%2C219%2C%22div%23persistent_bar_container%3Ediv%3Aeq(1)%3Ediv%3Aeq(0)%3Ediv%3Aeq(0)%3Ediv%3Aeq(0)%3Ediv%3Aeq(0)%3Ediv%3Aeq(1)%3Ea%3Aeq(0)%22%5D%2C%5B6%2C6840%2C259%2C97%2C%22input%23search%22%2C%22%22%5D%2C%5B2%2C6851%2C259%2C97%2C0%2C%22input%23search%22%2C2973%2C61067%5D%2C%5B2%2C7255%2C262%2C93%2C0%2C%22%22%2C3378%2C55109%5D%2C%5B7%2C7308%2C378%2C107%2C%22input%23search%22%5D%2C%5B6%2C7387%2C678%2C201%2C%22div%23persistent_bar_container%3Ediv%3Aeq(1)%3Ediv%3Aeq(0)%3Ediv%3Aeq(0)%3Ediv%3Aeq(0)%3Ediv%3Aeq(0)%3Ediv%3Aeq(1)%3Ea%3Aeq(0)%22%2C%22%22%5D%2C%5B7%2C7421%2C731%2C225%2C%22div%23persistent_bar_container%3Ediv%3Aeq(1)%3Ediv%3Aeq(0)%3Ediv%3Aeq(0)%3Ediv%3Aeq(0)%3Ediv%3Aeq(0)%3Ediv%3Aeq(1)%3Ea%3Aeq(0)%22%5D%2C%5B2%2C7656%2C605%2C185%2C0%2C%22ul%23sliderSection%3Eli%3Aeq(0)%22%2C58846%2C23873%5D%2C%5B6%2C7856%2C660%2C191%2C%22div%23persistent_bar_container%3Ediv%3Aeq(1)%3Ediv%3Aeq(0)%3Ediv%3Aeq(0)%3Ediv%3Aeq(0)%3Ediv%3Aeq(0)%3Ediv%3Aeq(1)%3Ea%3Aeq(0)%22%2C%22%22%5D%2C%5B7%2C7927%2C714%2C203%2C%22div%23persistent_bar_container%3Ediv%3Aeq(1)%3Ediv%3Aeq(0)%3Ediv%3Aeq(0)%3Ediv%3Aeq(0)%3Ediv%3Aeq(0)%3Ediv%3Aeq(1)%3Ea%3Aeq(0)%22%5D%2C%5B6%2C7935%2C714%2C203%2C%22div%23persistent_bar_container%3Ediv%3Aeq(1)%3Ediv%3Aeq(0)%3Ediv%3Aeq(0)%3Ediv%3Aeq(0)%3Ediv%3Aeq(0)%3Ediv%3Aeq(1)%3Ea%3Aeq(0)%3Espan%3Aeq(0)%22%2C%22%22%5D%2C%5B2%2C8059%2C725%2C204%2C0%2C%22div%23persistent_bar_container%3Ediv%3Aeq(1)%3Ediv%3Aeq(0)%3Ediv%3Aeq(0)%3Ediv%3Aeq(0)%3Ediv%3Aeq(0)%3Ediv%3Aeq(1)%3Ea%3Aeq(0)%3Espan%3Aeq(0)%22%2C47289%2C8738%5D%2C%5B2%2C8459%2C720%2C212%2C0%2C%22%22%2C43566%2C43690%5D%2C%5B3%2C8549%2C720%2C212%2C%22div%23persistent_bar_container%3Ediv%3Aeq(1)%3Ediv%3Aeq(0)%3Ediv%3Aeq(0)%3Ediv%3Aeq(0)%3Ediv%3Aeq(0)%3Ediv%3Aeq(1)%3Ea%3Aeq(0)%3Espan%3Aeq(0)%22%2C%22%22%5D%2C%5B12%2C8557%2C%22input%23addtobagID%22%5D%2C%5B4%2C8776%2C720%2C212%2C%22div%23persistent_bar_container%3Ediv%3Aeq(1)%3Ediv%3Aeq(0)%3Ediv%3Aeq(0)%3Ediv%3Aeq(0)%3Ediv%3Aeq(0)%3Ediv%3Aeq(1)%3Ea%3Aeq(0)%3Espan%3Aeq(0)%22%2C%22%22%5D%2C%5B5%2C8824%2C720%2C212%2C%22div%23persistent_bar_container%3Ediv%3Aeq(1)%3Ediv%3Aeq(0)%3Ediv%3Aeq(0)%3Ediv%3Aeq(0)%3Ediv%3Aeq(0)%3Ediv%3Aeq(1)%3Ea%3Aeq(0)%3Espan%3Aeq(0)%22%2C%22%22%5D%5D
Host: c.clicktale.net
Host: c.clicktale.net
Connection: keep-alive
Content-Length: 0
Origin: https://www.kohls.com
User-Agent: Mozilla/5.0 (Windows NT 10.0; WOW64) AppleWebKit/537.36 (KHTML, like Gecko) Chrome/56.0.2924.87 Safari/537.36
Content-Type: text/plain;charset=UTF-8
Accept: */*
Sec-Fetch-Site: cross-site
Sec-Fetch-Mode: no-cors
Referer: https://www.kohls.com/product/prd-3847510/womens-apt-9-tummy-control-shorts.jsp?color=Medium%20Wash&prdPV=1
Accept-Encoding: gzip, deflate, br
Accept-Language: en-GB,en-US;q=0.9,en;q=0.8
----
 POSTDATA 
--Response 
HTTP/1.1 204
status: 204
date: Fri, 21 May 2021 08:11:33 GMT
timing-allow-origin: *
cache-control: no-cache, no-store, must-revalidate, pre-check=0, post-check=0
pragma: no-cache
expires: Sun, 24 Oct 1982 23:00:00 GMT
access-control-allow-origin: *
access-control-allow-methods: GET, POST, OPTIONS
access-control-allow-headers: Access-Control-Expose-Headers, Content-Type, Content-Compression, X-Requested-With
content-disposition: inline
----

