{
  "x-version": 62,
  "adobe-flash-player": {
    "mime_types": [
      "application/futuresplash",
      "application/x-shockwave-flash"
    ],
    "versions": [
      {
        "version": "32.0.0.466",
        "status": "requires_authorization",
        "reference": "https://www.adobe.com/products/flashplayer/end-of-life.html"
      }
    ],
    "lang": "en-US",
    "name": "Adobe Flash Player",
    "help_url": "https://support.google.com/chrome/?p=plugin_flash",
    "url": "https://www.adobe.com/products/flashplayer/end-of-life.html",
    "displayurl": true,
    "group_name_matcher": "*Shockwave Flash*"
  },
  "google-chrome-pdf": {
    "mime_types": [
    ],
    "versions": [
      {
        "version": "0",
        "status": "fully_trusted",
        "comment": "Google Chrome PDF Viewer has no version information."
      }
    ],
    "name": "Chrome PDF Viewer",
    "group_name_matcher": "*Chrome PDF Viewer*"
  },
  "chromium-pdf": {
    "mime_types": [
    ],
    "versions": [
      {
        "version": "0",
        "status": "fully_trusted",
        "comment": "Chromium PDF Viewer has no version information."
      }
    ],
    "name": "Chromium PDF Viewer",
    "group_name_matcher": "*Chromium PDF Viewer*"
  },
  "google-chrome-pdf-plugin": {
    "mime_types": [
    ],
    "versions": [
      {
        "version": "0",
        "status": "fully_trusted",
        "comment": "Google Chrome PDF Plugin has no version information."
      }
    ],
    "name": "Chrome PDF Plugin",
    "group_name_matcher": "*Chrome PDF Plugin*"
  },
  "chromium-pdf-plugin": {
    "mime_types": [
    ],
    "versions": [
      {
        "version": "0",
        "status": "fully_trusted",
        "comment": "Chromium PDF Plugin has no version information."
      }
    ],
    "name": "Chromium PDF Plugin",
    "group_name_matcher": "*Chromium PDF Plugin*"
  }
}
