--Request 
POST https://tr.snapchat.com/p
Host: tr.snapchat.com
Host: tr.snapchat.com
Connection: keep-alive
Content-Length: 889
Cache-Control: max-age=0
Origin: https://www.kohls.com
Upgrade-Insecure-Requests: 1
Content-Type: application/x-www-form-urlencoded
User-Agent: Mozilla/5.0 (Windows NT 10.0; WOW64) AppleWebKit/537.36 (KHTML, like Gecko) Chrome/56.0.2924.87 Safari/537.36
Sec-Fetch-User: ?1
Accept: text/html,application/xhtml+xml,application/xml;q=0.9,image/webp,image/apng,*/*;q=0.8,application/signed-exchange;v=b3;q=0.9
Sec-Fetch-Site: cross-site
Sec-Fetch-Mode: nested-navigate
Referer: https://www.kohls.com/product/prd-3847510/womens-apt-9-tummy-control-shorts.jsp?color=Medium%20Wash&prdPV=1
Accept-Encoding: gzip, deflate, br
Accept-Language: en-GB,en-US;q=0.9,en;q=0.8
Cookie: sc_at=v2|H4sIAAAAAAAAAE3GwQ3AMAgDwImQYmow6TaRSqbI8Pn2Xhfcm+wyBdqYGba+KZvrgXepqTzgeJGOKKbr/DouuRBjBUAAAAA=
----
 POSTDATA [key: "pid"
value: "8e9bd9e0-8284-4dbd-ab20-145759728098"
, key: "ev"
value: "ADD_CART"
, key: "pl"
value: "https://www.kohls.com/product/prd-3847510/womens-apt-9-tummy-control-shorts.jsp?color=Medium%20Wash&prdPV=1"
, key: "ts"
value: "1621584684162"
, key: "rf"
value: "https://www.kohls.com/catalog/sale-womens-denim-shorts-bottoms-clothing.jsp?CN=Promotions:Sale+Gender:Womens+Material:Denim+Product:Shorts+Category:Bottoms+Department:Clothing+Assortment:Lowest%20Prices%20of%20the%20Season&BL=y&icid=wms-maylps-1699shorts-denim&pfm=internal%20campaign%20p13n_control%20visual%20nav%20p13n&kls_sbp=09167193449239534971532002446042350327"
, key: "v"
value: "1.5"
, key: "if"
value: "false"
, key: "bt"
value: "__LIVE__"
, key: "e_cur"
value: "USD"
, key: "e_pr"
value: "19.99"
, key: "e_ic"
value: "bottoms"
, key: "e_iids"
value: "48974175"
, key: "u_hem"
value: "FFF9461b9887d4b1b437f2f60f044e8a957eff84399c8e8bfca6a655ee067680dc0"
, key: "u_c1"
value: "c6cec876-d9dd-42fb-8bff-4ab56c19a992"
, key: "m_sl"
value: "6097"
, key: "m_rd"
value: "35048"
, key: "m_pi"
value: "2346"
, key: "m_pl"
value: "4037"
, key: "m_ic"
value: "0"
]
--Response 
HTTP/1.1 200
status: 200
server: nginx/1.17.3
date: Fri, 21 May 2021 08:11:24 GMT
content-type: text/html
content-length: 0
access-control-allow-origin: *
cache-control: no-cache, no-transform
strict-transport-security: max-age=31536000; includeSubDomains; preload
via: 1.1 google
alt-svc: h3-Q050=\":443\"; ma=2592000,h3-Q046=\":443\"; ma=2592000,h3-Q043=\":443\"; ma=2592000,quic=\":443\"; ma=2592000; v=\"46,43\"
----

