--Request 
POST https://async-px.dynamicyield.com/uia?cnst=1&_=1621937628430
Host: async-px.dynamicyield.com
Origin: https://www.kohls.com
User-Agent: Mozilla/5.0 (Windows NT 10.0; WOW64) AppleWebKit/537.36 (KHTML, like Gecko) Chrome/56.0.2924.87 Safari/537.36
Content-Type: application/x-www-form-urlencoded
Accept: */*
Sec-Fetch-Site: cross-site
Sec-Fetch-Mode: cors
Referer: https://www.kohls.com/sale-event/mens-clothing.jsp?icid=hpmf-dept-men
Accept-Encoding: gzip, deflate, br
Accept-Language: en-GB,en-US;q=0.9,en;q=0.8
----
 POSTDATA msn=webserve-cc95353.use&id=-3265109393214222885&se=8776374&cl=dk.w.c.ms.&rf=internal&trf=0&p=1&sub=www.kohls.com&sd=&url=https%3A%2F%2Fwww.kohls.com%2Fsale-event%2Fmens-clothing.jsp%3Ficid%3Dhpmf-dept-men&title=Men's%20Clothing%3A%20Explore%20Clothes%20For%20Men%20%7C%20Kohl's&lay=def&ses=7efee5a80754536c90c96997e6ecc8b0&aud=1408117.1362540.1362545&svars=&gv=&exps=%5B%5B%221067036%22%2C%229863190%22%2C%2225792075%22%2C0%2Cnull%2Cnull%2C%22-4899145934616091816%22%2C%222%22%2C%223%22%5D%2C%5B%221096558%22%2C%2210092862%22%2C%2226047526%22%2C0%2Cnull%2Cnull%2C%22-4899145934145173509%22%2C%221%22%2Cnull%5D%5D&lts=15%3A43&ctx=&lpInfo=false&expSes=11660&br=Other&tsrc=Referral&geoData=&feedProps%5Bcategories%5D=&feedProps%5Bkeywords%5D=&cookieInfo=0.0.0&reqts=1621937628420&rri=5045486&nocks=false
--Response 
HTTP/1.1 200
status: 200
date: Tue, 25 May 2021 10:13:49 GMT
content-length: 0
access-control-allow-origin: *
access-control-allow-methods: POST, GET, OPTIONS
access-control-allow-headers: Content-Type, Authorization, Content-Length, X-Requested-With
cache-control: no-cache, no-store, must-revalidate
pragma: no-cache
expires: 0
----
--Request 
GET https://async-px.dynamicyield.com/var?cnst=1&_=131427&msn=webserve-cc95353.use&uid=-3265109393214222885&sec=8776374&t=ri&e=1096558&p=1&ve=10092862&va=%5B26047526%5D&ses=7efee5a80754536c90c96997e6ecc8b0&expSes=11660&aud=1408117.1362540.1362545&expVisitId=-4899145934145173509&mech=1&smech=null&eri=1&tsrc=Referral&reqts=1621937627444&rri=3895910
Host: async-px.dynamicyield.com
Origin: https://www.kohls.com
User-Agent: Mozilla/5.0 (Windows NT 10.0; WOW64) AppleWebKit/537.36 (KHTML, like Gecko) Chrome/56.0.2924.87 Safari/537.36
Accept: */*
Sec-Fetch-Site: cross-site
Sec-Fetch-Mode: cors
Referer: https://www.kohls.com/sale-event/mens-clothing.jsp?icid=hpmf-dept-men
Accept-Encoding: gzip, deflate, br
Accept-Language: en-GB,en-US;q=0.9,en;q=0.8
----
--Response 
HTTP/1.1 200
status: 200
date: Tue, 25 May 2021 10:13:49 GMT
content-length: 0
access-control-allow-origin: *
access-control-allow-methods: POST, GET, OPTIONS
access-control-allow-headers: Content-Type, Authorization, Content-Length, X-Requested-With
cache-control: no-cache, no-store, must-revalidate
pragma: no-cache
expires: 0
----

