--Request 
GET http://10.10.30.41:8080/cgi-bin/welcome
Host: 10.10.30.41:8080
Accept: text/html,application/xhtml+xml,application/xml;q=0.9,image/webp,image/apng,*/*;q=0.8
Upgrade-Insecure-Requests: 1
Referer: http://10.10.30.41:8080/cgi-bin/findflight?firstName=Tiger&lastName=Scott&address1=4261+Stevenson+Blvd.&address2=Fremont%2C+CA+94538&pass1=Scott+Tiger&creditCard=222&expDate=12455&oldCCOption=&numPassengers=1&seatType=First&seatPref=None&outboundFlight=002%7C0%7C01-01-2021&advanceDiscount=&buyFlights.x=79&buyFlights.y=10&.cgifields=saveCC
User-Agent: Mozilla/5.0 (Windows NT 10.0; Win64; x64) AppleWebKit/537.36 (KHTML, like Gecko) Chrome/69.0.3497.12 Safari/537.36
Accept-Encoding: gzip, deflate
Accept-Language: en-us
----
--Response 
HTTP/1.1 200 OK
Connection: Keep-Alive
Content-type: text/html
Content-length: 0000002957
----
--Request 
GET http://10.10.30.41:8080/tours/Merc10-dev/images/banner_animated.gif
Host: 10.10.30.41:8080
Referer: http://10.10.30.41:8080/cgi-bin/welcome
User-Agent: Mozilla/5.0 (Windows NT 10.0; Win64; x64) AppleWebKit/537.36 (KHTML, like Gecko) Chrome/69.0.3497.12 Safari/537.36
Accept-Encoding: gzip, deflate
Accept-Language: en-us
Accept: image/webp,image/apng,image/*,*/*;q=0.8
----
--Response 
HTTP/1.1 200 OK
Connection: Keep-Alive
Content-Length: 16522
Content-Type: image/gif
----
--Request 
GET http://10.10.30.41:8080/tours/Merc10-dev/images/sun_swede.gif
Host: 10.10.30.41:8080
Referer: http://10.10.30.41:8080/cgi-bin/welcome
User-Agent: Mozilla/5.0 (Windows NT 10.0; Win64; x64) AppleWebKit/537.36 (KHTML, like Gecko) Chrome/69.0.3497.12 Safari/537.36
Accept-Encoding: gzip, deflate
Accept-Language: en-us
Accept: image/webp,image/apng,image/*,*/*;q=0.8
----
--Response 
HTTP/1.1 200 OK
Connection: Keep-Alive
Content-Length: 4125
Content-Type: image/gif
----
--Request 
GET http://10.10.30.41:8080/tours/Merc10-dev/images/login.gif
Host: 10.10.30.41:8080
Referer: http://10.10.30.41:8080/cgi-bin/welcome
User-Agent: Mozilla/5.0 (Windows NT 10.0; Win64; x64) AppleWebKit/537.36 (KHTML, like Gecko) Chrome/69.0.3497.12 Safari/537.36
Accept-Encoding: gzip, deflate
Accept-Language: en-us
Accept: image/webp,image/apng,image/*,*/*;q=0.8
----
--Response 
HTTP/1.1 200 OK
Connection: Keep-Alive
Content-Length: 1323
Content-Type: image/gif
----
--Request 
GET http://10.10.30.41:8080/tours/images/banner_merctur.jpg
Host: 10.10.30.41:8080
Referer: http://10.10.30.41:8080/cgi-bin/welcome
User-Agent: Mozilla/5.0 (Windows NT 10.0; Win64; x64) AppleWebKit/537.36 (KHTML, like Gecko) Chrome/69.0.3497.12 Safari/537.36
Accept-Encoding: gzip, deflate
Accept-Language: en-us
Accept: image/webp,image/apng,image/*,*/*;q=0.8
----
--Response 
HTTP/1.1 200 OK
Connection: Keep-Alive
Content-Length: 22548
Content-Type: image/jpeg
----
--Request 
GET http://10.10.30.41:8080/tours/vep/images/velocigen.gif
Host: 10.10.30.41:8080
Referer: http://10.10.30.41:8080/cgi-bin/welcome
User-Agent: Mozilla/5.0 (Windows NT 10.0; Win64; x64) AppleWebKit/537.36 (KHTML, like Gecko) Chrome/69.0.3497.12 Safari/537.36
Accept-Encoding: gzip, deflate
Accept-Language: en-us
Accept: image/webp,image/apng,image/*,*/*;q=0.8
----
--Response 
HTTP/1.1 200 OK
Connection: Keep-Alive
Content-Length: 2018
Content-Type: image/gif
----

