--Request 
POST https://play.google.com/log?format=json&hasfast=true&authuser=0
Host: play.google.com
Host: play.google.com
Connection: keep-alive
Content-Length: 1528
Authorization: SAPISIDHASH 9d2231cb21a5d87db5e2378f9c5f35c29a338813
Origin: https://mail.google.com
X-Goog-AuthUser: 0
User-Agent: Mozilla/5.0 (Windows NT 10.0; Win64; x64) AppleWebKit/537.36 (KHTML, like Gecko) Chrome/79.0.3945.130 Safari/537.36
Content-Type: application/x-www-form-urlencoded;charset=UTF-8
Accept: */*
Sec-Fetch-Site: same-site
Sec-Fetch-Mode: cors
Referer: https://mail.google.com/mail/u/0/
Accept-Encoding: gzip, deflate, br
Accept-Language: en-GB,en-US;q=0.9,en;q=0.8
Cookie: SID=8wdD23M0zT1muB_G7zm1RcdpXcTV9pgu899MrjEHx4F9koQYO2nUhhv57bJP9jOa-xXwCQ.; __Secure-3PSID=8wdD23M0zT1muB_G7zm1RcdpXcTV9pgu899MrjEHx4F9koQYA-wfYnEQ-ysFwqZqC3qmBw.; HSID=ARsC0xTZAuXrWMsnv; SSID=AcVA6-GGICXqf9J2j; APISID=YJ2-WvqJsfDZ_6LX/Aw6EB3te0F5GcNF_4; SAPISID=eZPEKcNhzxFHpS8e/AXrnV3TZ36Wk7edFa; __Secure-3PAPISID=eZPEKcNhzxFHpS8e/AXrnV3TZ36Wk7edFa; 1P_JAR=2021-04-28-06; SEARCH_SAMESITE=CgQIuZIB; NID=214=Atokn4Q0yZ25GhTZ0XijMI0V-LFxghRKeweF5LkHOyn-q7mDEKj5k3YK3WToFskS25eBOSFJdzjSYHxnrhwXOzAYkaSFdjVHwAwBZEgAzS9qSzi1kIaTqF0rsQjFxRWrSW-6OUYKFsLMQ_jcZWJ-DuOfdICtr2YjqCqONVISBjjuGWXDN4P79gWIBVUBHMXSg5EshyeoWIsy78ZLcQ; SIDCC=AJi4QfGxacZNiZMdeVo-pirRQNA86_9u4OoboL5rr1wPwUg-Zokp9HS6P_izUVsdy5rlwO1z; __Secure-3PSIDCC=AJi4QfFm6EgS8woqYdn1WxWygOkUa2uVZvc3dZ0BGUBQD6mQVXel5_ftD8i5HQkAo_B5DsrXZw
----
 POSTDATA [[1,null,null,null,null,null,null,null,null,null,[null,null,null,null,"en"]],893,[["1619592190942",null,[],null,null,null,null,"[\"1619592185925\",[[null,null,[[\"668\",\"1\"]],\"6377561628952101238\"]],null,null,\"[[null,null,null,370149053,null,25,\\\"gmail_fe_210421.06_p2\\\",7,null,null,null,null,null,null,null,[6,2,9,4],8192,0,\\\"iv.os\\\"],null,null,null,null,null,null,null,[1,1,0,0,6,null,0,[1,1]]]\"]",null,null,null,null,null,null,-19800,[null,[],null,"[[],[],[7113,7766,7518,7433,7465,7594,7677,7514,7782,7753,7424,7057,7416,7758,7628,7682,7030,7546,7496,7158,6623,7137,5192,6456,6318,7798,7418,7407,5020,7468,7446,7164,7189,6807,5001,6162,6587,7500,5499,6455,8202316,8203183,8203161,8203028,8203691,8202193,8202009,8202484,8201523,8202805,8203287,8203359,8203555,8202610,8203883,8203699,8203378,8202855,8203222,8203363,8202578,8203587,8203298,8203550,8203570,8202965,8202124,45717508,8202813,8202257,8202891,8203044,8203388,8203582,8203464,8203424,8203244,8202563,8203312,8203310,8203295,8203311,8203291,8203609,8202123,8202721,8203455,45779046,8202126,8203514,8203270,8203664,8202463,45775010,8203292,8203421,45772160,8202709,8203103,8202737,8203643,8202918,8200010,45751720,8202511,8203695,8203075,8203178,8203297,45769960,8203347,8203757,8203451,8202753,8203586,8203381,8202924,8203596,8203427,8203385,8203239,8203543,8202125,8202953,8203054,8203611,45772005,8203624,8202323,8202843,45704154],[]]"],null,null,null,[],7,null,null,null,null,null,[]]],"1619592200946",[],null,null,null,null,null,null,null,null,0]
--Response 
HTTP/1.1 200
status: 200
access-control-allow-origin: https://mail.google.com
access-control-allow-credentials: true
access-control-allow-headers: X-Playlog-Web
content-type: text/plain; charset=UTF-8
content-encoding: gzip
date: Wed, 28 Apr 2021 06:43:22 GMT
server: Playlog
cache-control: private
content-length: 131
x-xss-protection: 0
x-frame-options: SAMEORIGIN
set-cookie: SIDCC=AJi4QfGPE2pqiq6qmw6AjcFLALBuGMYagpPZs2V6-mPEX7rX1T3EHixFf37teeYma-FbHs1J; expires=Thu, 28-Apr-2022 06:43:22 GMT; path=/; domain=.google.com; priority=high
set-cookie: __Secure-3PSIDCC=AJi4QfEcZdxKf_sqpM8uCu_x18ACKIXbptEUYs8mOzHIy6LdYgldHdySeRMgYxhEy7xOTg_mAg; expires=Thu, 28-Apr-2022 06:43:22 GMT; path=/; domain=.google.com; Secure; HttpOnly; priority=high; SameSite=none
alt-svc: h3-29=\":443\"; ma=2592000,h3-T051=\":443\"; ma=2592000,h3-Q050=\":443\"; ma=2592000,h3-Q046=\":443\"; ma=2592000,h3-Q043=\":443\"; ma=2592000,quic=\":443\"; ma=2592000; v=\"46,43\"
expires: Wed, 28 Apr 2021 06:43:22 GMT
----
--Request 
GET https://cello.client-channel.google.com/client-channel/channel/bind?authuser=0&ctype=cello&gsessionid=JSdZrBHiWiZZXlHB--Q00u3S_e-7h2a1q-4EIikmCjE&sw=true&VER=8&RID=rpc&SID=2B5847E73F3DE61&CI=0&AID=11&TYPE=xmlhttp&zx=cfr5vke4xajq&t=1
Host: cello.client-channel.google.com
Host: cello.client-channel.google.com
Connection: keep-alive
Authorization: SAPISIDHASH 1619591990_7bc2ab06d9c15da921d1835b243ae20d4a471eb6
X-Origin: https://drive.google.com
X-Goog-AuthUser: 0
User-Agent: Mozilla/5.0 (Windows NT 10.0; Win64; x64) AppleWebKit/537.36 (KHTML, like Gecko) Chrome/79.0.3945.130 Safari/537.36
Accept: */*
Sec-Fetch-Site: same-origin
Sec-Fetch-Mode: cors
Referer: https://cello.client-channel.google.com/client-channel/js/1606551176-sharedchannelmain_bin.js?ctype=cello&authuser=0
Accept-Encoding: gzip, deflate, br
Accept-Language: en-GB,en-US;q=0.9,en;q=0.8
Cookie: SID=8wdD23M0zT1muB_G7zm1RcdpXcTV9pgu899MrjEHx4F9koQYO2nUhhv57bJP9jOa-xXwCQ.; __Secure-3PSID=8wdD23M0zT1muB_G7zm1RcdpXcTV9pgu899MrjEHx4F9koQYA-wfYnEQ-ysFwqZqC3qmBw.; HSID=ARsC0xTZAuXrWMsnv; SSID=AcVA6-GGICXqf9J2j; APISID=YJ2-WvqJsfDZ_6LX/Aw6EB3te0F5GcNF_4; SAPISID=eZPEKcNhzxFHpS8e/AXrnV3TZ36Wk7edFa; __Secure-3PAPISID=eZPEKcNhzxFHpS8e/AXrnV3TZ36Wk7edFa; 1P_JAR=2021-04-28-06; SEARCH_SAMESITE=CgQIuZIB; NID=214=Atokn4Q0yZ25GhTZ0XijMI0V-LFxghRKeweF5LkHOyn-q7mDEKj5k3YK3WToFskS25eBOSFJdzjSYHxnrhwXOzAYkaSFdjVHwAwBZEgAzS9qSzi1kIaTqF0rsQjFxRWrSW-6OUYKFsLMQ_jcZWJ-DuOfdICtr2YjqCqONVISBjjuGWXDN4P79gWIBVUBHMXSg5EshyeoWIsy78ZLcQ; SIDCC=AJi4QfGPE2pqiq6qmw6AjcFLALBuGMYagpPZs2V6-mPEX7rX1T3EHixFf37teeYma-FbHs1J; __Secure-3PSIDCC=AJi4QfEcZdxKf_sqpM8uCu_x18ACKIXbptEUYs8mOzHIy6LdYgldHdySeRMgYxhEy7xOTg_mAg
----
--Response 
HTTP/1.1 200
status: 200
cache-control: no-cache, no-store, max-age=0, must-revalidate
pragma: no-cache
expires: Mon, 01 Jan 1990 00:00:00 GMT
date: Wed, 28 Apr 2021 06:43:35 GMT
content-type: text/plain; charset=utf-8
x-content-type-options: nosniff
x-xss-protection: 1; mode=block
server: GSE
set-cookie: SIDCC=AJi4QfGz8-e7MYPSSHdAZxoZWnFXoublUyAJtBOu-oqPmhCBx4KT1UrS6wNYjXOpGnIhZU-W; expires=Thu, 28-Apr-2022 06:43:35 GMT; path=/; domain=.google.com; priority=high
set-cookie: __Secure-3PSIDCC=AJi4QfFcJwQcGl6IX0_9l1hetxhHKMU5g0a7G_e2ygkG0_kNVVhGLURLtHBqT5mqI-LGhsJGLg; expires=Thu, 28-Apr-2022 06:43:35 GMT; path=/; domain=.google.com; Secure; HttpOnly; priority=high; SameSite=none
alt-svc: h3-29=\":443\"; ma=2592000,h3-T051=\":443\"; ma=2592000,h3-Q050=\":443\"; ma=2592000,h3-Q046=\":443\"; ma=2592000,h3-Q043=\":443\"; ma=2592000,quic=\":443\"; ma=2592000; v=\"46,43\"
----

