
--Response 
HTTP/1.1 200
status: 200
ede-bundle_params: {\"channelId\":\"WebStore\",\"pageId\":\"PDP\",\"executedInfoList\":[{\"placementId\":\"PersistentBag\",\"departmentName\":\"\",\"category\":\"\",\"subCategory\":\"\",\"bundleId\":\"1301\",\"placementRevision\":\"1614981054070\",\"bundleRevision\":\"1616527135491\",\"kiraRevision\":\"1588621576130\",\"uuid\":\"733d418c-7101-41a1-a6d4-ce345755dd2a\",\"infoMeta\":{\"type\":\"FlatRec\"},\"infoPayload\":{\"executedAlgorithmsInfo\":{\"executedAlgorithmInfoList\":[{\"algorithmId\":\"282\",\"ccpParametersUsed\":[\"productNumbers\"],\"isPersonalized\":false}],\"contextBasedOptimized\":false,\"autoOptimized\":false,\"optimizedMetric\":\"None\"},\"executedRulesInfo\":{\"executedRuleInfoList\":[{\"ruleId\":\"283\",\"ruleType\":\"DO_NOT_RECOMMEND\"},{\"ruleId\":\"1\",\"ruleType\":\"BURY\"}],\"backfillDisabledFromRule\":false},\"isAb\":false,\"abTestId\":\"\",\"currentAbVariationId\":\"\",\"recGenerationCycleStatus\":{\"recGenerationCycleMask\":71468256854080,\"requestId\":\"dea2eec2-9082-4ad2-bbdb-27355cd3bed4\"}}}]}
access-control-allow-origin: *
access-control-expose-headers: EDE-AB_VAR_PARAMS, EDE-BUNDLE_PARAMS, Content-Type
content-type: application/json
vary: Accept-Encoding
content-encoding: gzip
date: Fri, 21 May 2021 08:06:26 GMT
content-length: 1841
server-timing: cdn-cache; desc=MISS
server-timing: edge; dur=283
server-timing: origin; dur=37
fwdhst: origin-ede-gcp-central-blue.kohls.com
set-cookie: akacd_EDE_GCP=2177452799~rv=88~id=63e75162591c067117eb415ac002f603; path=/; Expires=Mon, 31 Dec 2038 23:59:59 GMT; Secure; SameSite=None
akamai-request-id2: 96.17.182.36:5c2f8204
----

--Response 
HTTP/1.1 200
status: 200
p3p: policyref=\"https://www.googleadservices.com/pagead/p3p.xml\", CP=\"NOI DEV PSA PSD IVA IVD OTP OUR OTR IND OTC\"
timing-allow-origin: *
cross-origin-resource-policy: cross-origin
date: Fri, 21 May 2021 08:06:26 GMT
pragma: no-cache
expires: Fri, 01 Jan 1990 00:00:00 GMT
cache-control: no-cache, no-store, must-revalidate
content-type: image/gif
x-content-type-options: nosniff
server: cafe
content-length: 42
x-xss-protection: 0
alt-svc: h3-29=\":443\"; ma=2592000,h3-T051=\":443\"; ma=2592000,h3-Q050=\":443\"; ma=2592000,h3-Q046=\":443\"; ma=2592000,h3-Q043=\":443\"; ma=2592000,quic=\":443\"; ma=2592000; v=\"46,43\"
----

--Response 
HTTP/1.1 200
status: 200
p3p: policyref=\"https://www.googleadservices.com/pagead/p3p.xml\", CP=\"NOI DEV PSA PSD IVA IVD OTP OUR OTR IND OTC\"
timing-allow-origin: *
cross-origin-resource-policy: cross-origin
date: Fri, 21 May 2021 08:06:26 GMT
pragma: no-cache
expires: Fri, 01 Jan 1990 00:00:00 GMT
cache-control: no-cache, no-store, must-revalidate
content-type: image/gif
x-content-type-options: nosniff
server: cafe
content-length: 42
x-xss-protection: 0
alt-svc: h3-29=\":443\"; ma=2592000,h3-T051=\":443\"; ma=2592000,h3-Q050=\":443\"; ma=2592000,h3-Q046=\":443\"; ma=2592000,h3-Q043=\":443\"; ma=2592000,quic=\":443\"; ma=2592000; v=\"46,43\"
----

