--Request 
POST https://www.kohls.com/clientlibs/58a664a3fno1917698e839c90363183
Host: www.kohls.com
Host: www.kohls.com
Connection: keep-alive
Content-Length: 1836
Origin: https://www.kohls.com
User-Agent: Mozilla/5.0 (Windows NT 10.0; WOW64) AppleWebKit/537.36 (KHTML, like Gecko) Chrome/56.0.2924.87 Safari/537.36
Content-Type: text/plain;charset=UTF-8
Accept: */*
Sec-Fetch-Site: same-origin
Sec-Fetch-Mode: cors
Referer: https://www.kohls.com/_sec/cp_challenge/ak-challenge-3-4.htm
Accept-Encoding: gzip, deflate, br
Accept-Language: en-GB,en-US;q=0.9,en;q=0.8
Cookie: bm_sz=E77C41F4F702E4645A0F3D98C8B1293E~YAAQ1bYRYG4j+Tx5AQAA2Yz5jQu47gb0ph9Mht3atroeozkn/PyFq+TlXw+DKAOwcjvgNwpu4bodgHMq8lQS7V5i+L2a2DSA9hyYDGvH0+GDaA0xQQ/bVE/vQaM59CJKENkfvno6gqgoPXjY0k74lwsZ2SVuMj6xsQxhnhzlYR88MSBWXg5stjs3ghGKS3Gt86wq/sKtn5/sUrOwtmL99agrghadpFa86XuTv2Mi5ManjxdO5MxTdsICXFgpT7N+0LrhyWa+7CCMl1bbOuNEbjPjsqIqVDvKOQ==; AKA_RV2=27; AKA_CNC2=True; akacd_www-kohls-com-mosaic-p2=2177452799~rv=92~id=5d8af311760db533457008a0afffe1cb; check=true; AMCVS_F0EF5E09512D2CD20A490D4D%40AdobeOrg=1; s_ecid=MCMID%7C09167193449239534971532002446042350327; mboxEdgeCluster=31; mosaic=gcpb; _dy_csc_ses=t; _dy_c_exps=; _dycnst=dg; _dyid=-531424509594998037; _dyjsession=cc0470ee4dc37902999660c85d4d519b; dy_fs_page=www.kohls.com; _dycst=dk.w.c.ms.; X-SESSIONID=c68333f4-b7d4-42dd-be5f-49d1eb509125; VisitorId=c68333f4-b7d4-42dd-be5f-49d1eb509125; _dy_geo=IN.AS.IN_UP.IN_UP_Noida; _dy_df_geo=India..Noida; _dyid_server=-531424509594998037; kohls_klbd_cookie=407557130.16970.0000; spa=3; s_cc=true; aam_uuid=04008972383028020332047544168878754783; _fbp=fb.1.1621584621541.1873967168; _pin_unauth=dWlkPU9XSXhZemcxT1dJdFlqZGpZaTAwTURJM0xXRm1NVFl0WkRJMk1Ua3pPVGhqTm1OaQ; _cs_c=1; CavVI=001000944465067639001; _gcl_au=1.1.1723257403.1621584626; _scid=c6cec876-d9dd-42fb-8bff-4ab56c19a992; SignalSpring2016=A; WRIgnore=true; WRUID=3301609095856292; __gads=ID=6d5c4b26c54ba8fd:T=1621584627:S=ALNI_MZDAnLU6mXriOnAWQnWMY6pXGf3Uw; _sctr=1|1621535400000; _li_dcdm_c=.kohls.com; _lc2_fpi=0b10d8358f40--01f66zkj520w2ekqxg68j6fva2; btpdb.4DPyaxM.dGZjLjYyMTAxMDM=REFZUw; btpdb.4DPyaxM.dGZjLjYyMTAxMTA=REFZUw; btpdb.4DPyaxM.dGZjLjYyMDYyMTU=REFZUw; btpdb.4DPyaxM.Y3VzdG9tZXIgfCBzaWduYWwgMXN0IHBhcnR5IGlkIC0gc2Vzc2lvbg=MjMxMDcwMjIyNDcwOTgxNTI5Mg; btpdb.4DPyaxM.Y3VzdG9tZXIgfCBzaWduYWwgMXN0IHBhcnR5IGlkIC0gMzY1IGRheXM=MjkyMDk4Nzg5NTEyODA5NDg3Ng; _ga=GA1.2.701370283.1621584626; _gid=GA1.2.296178419.1621584629; _gat=1; _mibhv=anon-1621584629063-1263971716_8212; SignalUniversalID=XKSQisThGCcAOEoQppT7cmBHjqCVvwY7MTKoBSCinfc%3D; IR_gbd=kohls.com; kls_p=true; at_check=true; AMCV_F0EF5E09512D2CD20A490D4D%40AdobeOrg=-1124106680%7CMCIDTS%7C18769%7CMCMID%7C09167193449239534971532002446042350327%7CMCAAMLH-1622189433%7C12%7CMCAAMB-1622189433%7CRKhpRz8krg2tLO6pguXWp5olkAcUniQYPHaMWWgdJ3xzPWQmdj0y%7CMCOPTOUT-1621591833s%7CNONE%7CMCAID%7CNONE%7CMCSYNCSOP%7C411-18776%7CvVersion%7C5.2.0; _dy_c_att_exps=; pdpUrl=; evarRefinementValues=; s_fid=18DEF5EE2AF1E3D6-2CCF2C22577F7031; s_stv=non-search; s_vi=[CS]v1|3053B57D099868A8-6000036C6F7A2E0B[CE]; visualnavCheck=false; productnum=3; CavNV=4679792254911359661-33333-233050250666-0-9-0-1-145-28142-26567; mbox=session#10174acdb3644a9694a52790c5fc2327#1621586477|PC#10174acdb3644a9694a52790c5fc2327.31_0#1684829453; _dy_ses_load_seq=16308%3A1621584652735; _dy_soct=561158.1083346.1621584618*546795.1053981.1621584652; dtCookie=v_4_srv_3_sn_8FAF61896F9FA90DDB925B43F6364903_perc_100000_ol_0_mul_1_app-3Aea7c4b59f27d43eb_1_rcs-3Acss_1; akavpau_www=1621584953~id=f12266858570df782728ff2043574f22; _dyfs=1621584653115; _dy_lu_ses=cc0470ee4dc37902999660c85d4d519b%3A1621584653117; _dy_toffset=0; _cs_cvars=%7B%221%22%3A%5B%22Page%20Name%22%2C%22pdp%20(3847510)%20women's%20apt.%209%C2%AE%20tummy%20control%20shorts%22%5D%2C%222%22%3A%5B%22Department%20Name%22%2C%22clothing%22%5D%2C%223%22%3A%5B%22Category%20Name%22%2C%22bottoms%22%5D%2C%224%22%3A%5B%22Subcategory%20Name%22%2C%22shorts%22%5D%2C%225%22%3A%5B%22PMP%20Page%20Name%22%2C%22sale%20womens%20denim%20shorts%20-%20bottoms%2C%20clothing%20%7C%20kohl's%22%5D%7D; _cs_id=bb1a9eb8-c26c-afeb-ed35-b32d19e0d329.1621584625.1.1621584655.1621584625.1588866862.1655748625644.Lax.0; _cs_s=5.1; SSP_AB_FITPREDICTOR_20210520=3-feature; _sp_ses.fb07=*; _uetsid=fdce5dc0ba0b11ebb694f78bbcad10ea; _uetvid=fdcf3810ba0b11eb8504894104a43503; __CT_Data=gpv=5&ckp=tld&dm=kohls.com&apv_24_www47=5&cpv_24_www47=5&rpv_24_www47=5; crl8.fpcuid=068c684e-15f8-4262-85ea-f4ff070a5cd0; SK_SS=%7B%7D; SK_SS_MOD=%7B%7D; gpv_v9=pdp%20%283847510%29%20women%27s%20apt.%209%C2%AE%20tummy%20control%20shorts; BVBRANDID=30ad36b4-f9e4-49a0-b82f-eb2d5eb1dcf2; BVBRANDSID=29cbbe58-b9ad-4706-bcf2-bfd7cc883804; BVImplredesign=9025_10_0; CavSF=2,,1:2:100,1621584660368,0|,,,,1,,,1,,,,,,0; CavNVC=001000944465067639001-2-233050578-5; s_sq=%5B%5BB%5D%5D; IR_5349=1621584666022%7C385561%7C1621584629212%7C%7C; IR_PI=01f550ea-ba0c-11eb-89b6-42010a246323%7C1621671066022; _sp_id.fb07=72028309-cc2a-4832-8135-6de250f61d86.1621584655.1.1621584667.1621584655.c4e07d0e-f557-44da-9ca2-f969cd55b9f7; bm_sv=FDDDF4C47CDE750BA7C06FABD19509F2~n9DLDJKO1gvL0Den9WuzgbciZrcuF2xKOn8gc3xGTK8qbNPMhShU3oXfFcz3oO5uMAusLC0zIKHeWK1+2qgXy6HKp8BahggV7HVBSBIFSMe3pZZiXmzBu6lkwI+qLcz5uYzl/qw+3hLgPhRLI/HeHnpFY7tE7lAPqOvrbDuIRbU=; ak_bmsc=82B3275D2F29EE9CFC5032EB5841E1B5~000000000000000000000000000000~YAAQTQVaaLOhJnh5AQAAb2z6jQtUAsWzQrGUut5Vg1LKvFMiuA4iBI1Q/yniGv9Oxmzw5Y1iIRmtW5xrY5RqEKeUbfKyD+s+H7JsdGSVEpFmA1F64AyGb5X+qtRRFVtdkkEScoZV5h/Q469o87WLmsvks5lBdAd6/gG/ailLM7nigvvZm2FRJUNqIwYdVJ4rP6OFBxIRSpA9f1FZb8v8s68nox1XzwFq8ahIZVfmfTpjGAH2psMgnEgvdE1sNJR7JySoc6cixg87cJE6LP42fdC3GeRK5h2PxYuD5HhFJLYToX+yuv1PWH4yTBmxFE0RP+7I3tSirJjBet3nFcxgwBI4tYsiPYHctXBMZP7JTLA+S6n/euaK+Ly5nd2lurgnbFftN1vBELEXH5Hh1XEF/XaSB3W+jp2LUOCr4nfGEVLg9/1PIzxMhWqK+x8Ia94s7kWdGf6aEFsN1ZYQbIWGL1wUY259PLvtw+mp7qvIZ3E+/ZNHfHvWsqNUwBpZmESL; RT=\"z=1&dm=kohls.com&si=b7226e5b-2095-4987-bfdf-e92d643ccadb&ss=koy1ly93&sl=6&tt=hsc&bcn=%2F%2F684fc538.akstat.io%2F&ld=1bpd\"; _abck=0186C3C90A935CC98B4B0862B079D340~-1~YAAQTQVaaPChJnh5AQAAfoH6jQWizVH57KCbW27W3q5LObcjIPNkMLx5Z9fNXDWiutANsO0g+Ea1rDj1gwGOzwsW3udnb93kPmmjP+da/aACV+EmDPjX2Vx5xvUEf2NyVJRSKOUz0gLudncAp6RfirkBb3x4Qcdj1h27+o5iFWArHnBF8zVBc3cQLA6wq9Uq49SmS3KFpZtvbQQo38Wq2w2XQSZicENnzoA5eJRmgzvYuSz7YGb8qt1W9S0pd0UQ8rzeI6b8H+5xqaCLX2RwH6EQlT/8o1owJpiaa8cDICIlnOHtBG+zPHrtEYqYnJch7C5xKDefKUgEnutjHmC9PjuaHT9ef5CzIX85HG5e2GJb3vnP8f9zKAM8nWoXMUVD1tyYVp6oQmIJOfc7TFk9I/V9TKdAyoHwqacROrrr/1IaRA==~-1~||||-1~-1; sec_cpt=F864C98E455F2B43EA7E2C3571D49DC5~2~YAAQTQVaaPGhJnh5AQAAfoH6jQVfASl2YBWeYaFihF6RmZFbocpcZ2ZUzTpIxpylfP54YoA6Enqyp4v7OQbjNF9l3Q5UWH2csia4fnbpKpOWgzZBotSvMCciem6D4r366klJcBBjYrq9XcH8jwpkA5EPDxXFoIGl1GhLexdt53SKYmpWg+Lolajt46+Oj28VmwuiSVuSkTksEWI2vEfo2Bfu7vTnsnPCiMCULlkRzXn2JHxXmeuMXwR1ZgU66qXBiFMbqx/BV9MN5plFgzei0/yx2YoliTt7uy+nqUDFvaXJ/bLFNQfbR9nq39FQAi7bD4rbZ9ixGdcRwE41qZg224zfPGEczaGGffTjm1HEpi63g9wXAj78IdJ0tQ4Mi/EnRWYKF3cM+CBpyftYP/fbs5dhkMKDZ8oMjPEG5HmQlPak/WjJZO/rCdvHzUCqqRlFt0zFRpBZ9Ue8AaSvWQGUYxOjNaOe3saiW0pIPDrgIXOSLyf2UQ7FVszlUDQgxvgwI66Kbnak3cBC6Jb4XPwY18SG+bI38/VLENca8JbrVbNATxk8PTpmvscjJV5J0H3ePQfH1kuS1w==
----
 POSTDATA {"sensor_data":"7a74G7m23Vrp0o5c9256551.7-1,2,-94,-100,Mozilla/5.0 (Windows NT 10.0; WOW64) AppleWebKit/537.36 (KHTML, like Gecko) Chrome/56.0.2924.87 Safari/537.36,uaend,12147,20030107,en-GB,Gecko,0,0,0,0,398986,4671225,1366,728,1366,768,320,105,1366,,cpen:0,i1:0,dm:0,cwen:0,non:1,opc:0,fc:0,sc:0,wrc:1,isc:0,vib:1,bat:1,x11:0,x12:1,7918,0.03679987818,810792335618.5,0,loc:-1,2,-94,-101,do_en,dm_en,t_en-1,2,-94,-105,-1,2,-94,-102,-1,2,-94,-108,-1,2,-94,-110,-1,2,-94,-117,-1,2,-94,-111,-1,2,-94,-109,-1,2,-94,-114,-1,2,-94,-103,-1,2,-94,-112,https://www.kohls.com/_sec/cp_challenge/ak-challenge-3-4.htm-1,2,-94,-115,1,32,32,0,0,0,0,3580,0,1621584671237,16,17347,0,0,2891,0,0,3581,0,0,0186C3C90A935CC98B4B0862B079D340~-1~YAAQTQVaaPChJnh5AQAAfoH6jQWizVH57KCbW27W3q5LObcjIPNkMLx5Z9fNXDWiutANsO0g+Ea1rDj1gwGOzwsW3udnb93kPmmjP+da/aACV+EmDPjX2Vx5xvUEf2NyVJRSKOUz0gLudncAp6RfirkBb3x4Qcdj1h27+o5iFWArHnBF8zVBc3cQLA6wq9Uq49SmS3KFpZtvbQQo38Wq2w2XQSZicENnzoA5eJRmgzvYuSz7YGb8qt1W9S0pd0UQ8rzeI6b8H+5xqaCLX2RwH6EQlT/8o1owJpiaa8cDICIlnOHtBG+zPHrtEYqYnJch7C5xKDefKUgEnutjHmC9PjuaHT9ef5CzIX85HG5e2GJb3vnP8f9zKAM8nWoXMUVD1tyYVp6oQmIJOfc7TFk9I/V9TKdAyoHwqacROrrr/1IaRA==~-1~||||-1~-1,39901,381,334070382,30261693,PiZtE,28071,97,0,-1-1,2,-94,-106,8,2-1,2,-94,-119,25,27,28,27,52,16,11,6,6,5,8,5,9,670,-1,2,-94,-122,0,0,0,0,1,0,0-1,2,-94,-123,-1,2,-94,-124,-1,2,-94,-126,-1,2,-94,-127,00300044040300043000-1,2,-94,-70,1454252292;895908107;dis;;true;true;true;-330;true;24;24;true;false;-1-1,2,-94,-80,5338-1,2,-94,-116,14013657-1,2,-94,-118,91397-1,2,-94,-129,761dce9b6cc5ba52748f74b440e76b754a828348d6b3f6d8687d78e1934fa763,1,7c535402e0cd5007e5c52235cf614eef4ac0185d6ea016852e12d8dc73a502ca,Google Inc.,ANGLE (Intel(R) UHD Graphics 620 Direct3D11 vs_5_0 ps_5_0),3b5cf29d4c89f7b742b60fa4e9f3f62571beee69aead81c92fec0d2e9a78cdde,29-1,2,-94,-121,;3;15;0"}
--Response 
HTTP/1.1 201
status: 201
content-length: 17
date: Fri, 21 May 2021 08:11:15 GMT
set-cookie: _dyid_server=-531424509594998037; expires=Sat, 21-May-2022 08:11:15 GMT; path=/; domain=.kohls.com; secure
set-cookie: _abck=0186C3C90A935CC98B4B0862B079D340~-1~YAAQTQVaaPihJnh5AQAAsYL6jQVFIsFt6Xj1KU690R30HOt0/5kct78vEbXDRl7QZYh+fyA35vdZ09LcBAb4c0p9DF+qnfTEZvbJiFR3aPrF+TtQly+YMaeFam3F6LN90YyewrUnuKBaEbm6DC1e73v275iVp0Vv1lX5RdcNh+116xz4BARyiZS6LFKOi8rG2f44+fINMSAhsngf3A/5Fj0C+P1XBFWidFiV9VkxQ7JFHgiprU2GAbkE1DSLYRAHImII6bwW029rpdDpHEwcQxKErrnbNiRl6xvhV9EmSvSvavFOcZtDVfLm+vfLcriA5R9AvqliPWLMWhBSNCJyGAE00RLzxo8/OxpBR4fNajbR/ckVRJmiCvjT9GybZgZqN38tXF+K7HZ5tj8luNn+vNrxdz3JvLgz4A2SDhPGBNbyxw==~-1~-1~-1; Domain=.kohls.com; Path=/; Expires=Sat, 21 May 2022 08:11:15 GMT; Max-Age=31536000; Secure
content-type: application/json
vary: Origin
access-control-allow-credentials: true
access-control-allow-origin: https://www.kohls.com
access-control-allow-headers: Content-Type
content-security-policy: block-all-mixed-content; frame-ancestors https://testzuiweb.kohls.zootweb.com https://testapplynow.kohls.zootweb.com 'self';
content-security-policy: default-src https: 'unsafe-inline' 'unsafe-eval' data: blob:; img-src https: http: 'unsafe-inline' 'unsafe-eval' data: blob:; frame-ancestors 'self';
content-security-policy: block-all-mixed-content; frame-ancestors 'self';
x-frame-options: SAMEORIGIN
x-frame-options: SAMEORIGIN
x-frame-options: SAMEORIGIN
strict-transport-security: max-age=15768000 ; preload
----

