--Request 
POST https://mail.google.com/sync/u/0/i/s?hl=en&c=17
Host: mail.google.com
Host: mail.google.com
Connection: keep-alive
Content-Length: 77
Origin: https://mail.google.com
X-Google-BTD: 1
X-Framework-Xsrf-Token: AKwhgQoAeRB1R--DnxSE2rzi_fHyJZuGDQ:1619590590512
X-Gmail-BTAI: {\"3\":{\"6\":0,\"10\":1,\"13\":1,\"15\":0,\"16\":1,\"17\":1,\"18\":0,\"19\":1,\"22\":1,\"23\":1,\"24\":1,\"25\":1,\"26\":1,\"27\":1,\"28\":1,\"29\":0,\"30\":1,\"31\":1,\"32\":1,\"33\":1,\"34\":1,\"35\":0,\"36\":1,\"37\":\"en\",\"38\":\"Mozilla/5.0 (Windows NT 10.0; Win64; x64) AppleWebKit/537.36 (KHTML, like Gecko) Chrome/79.0.3945.130 Safari/537.36\",\"39\":1,\"40\":0,\"41\":25,\"43\":0,\"44\":1,\"45\":0,\"46\":1,\"47\":1,\"48\":1,\"49\":1,\"50\":1,\"52\":1,\"53\":1,\"54\":0,\"55\":1,\"56\":1,\"57\":0,\"58\":0,\"60\":0,\"61\":0,\"62\":0,\"63\":0,\"64\":0},\"5\":\"3ea5edf7c4\",\"7\":25,\"8\":\"gmail_fe_210421.06_p2\",\"9\":1,\"10\":5,\"11\":\"\",\"12\":19800000,\"13\":\"+05:30\",\"14\":1,\"16\":370149053,\"17\":\"\",\"18\":\"\",\"19\":\"1619592355277\",\"21\":\"2285421\"}
User-Agent: Mozilla/5.0 (Windows NT 10.0; Win64; x64) AppleWebKit/537.36 (KHTML, like Gecko) Chrome/79.0.3945.130 Safari/537.36
Content-Type: application/json
Accept: */*
Sec-Fetch-Site: same-origin
Sec-Fetch-Mode: cors
Referer: https://mail.google.com/mail/u/0/
Accept-Encoding: gzip, deflate, br
Accept-Language: en-GB,en-US;q=0.9,en;q=0.8
Cookie: COMPASS=bigtop-sync=CrMBAAlriVdio4GYdE47hft4CVj9nIujGJRC2gE-l2x4iYOuytBxj0hXh54zqXse7KdnGBnQcXUA3ktNfGfBWzsHovoAsX1feek9600QrcA5T9nTDX7iW5-FLxzD_GyGcYbbhFVyaofbPA0hUY30y_LPJDfn9K7oHEYmmKQqEXxnMo2k3NNtq-qvy7IlbDCBQ8EKaEKJqjdkUedencZKEnMeFQgdIl0mvhvcjmOy4oc8g1t7OtAQ3qGkhAYaxgEACWuJV9cp6bwm13H9YhubfmwRijKJmSJLRM1CcmbxHU9-HlzU0MqijZ20NLyszP1NMaRi2yezF1nJZ3VUe1PiGxj4AguZ4eHkA0Pb_zTCw6YrBZlkU15C6b97tcNiHnOSfgJkM2cM_1qAAfp9O_yAR4PiMt_RWgPN6_g20ti4vYekfoJ_nt3WHrvqGdIU8BXqJlOxroKDLi0Uem2H11CExVwdW5uY9p04znPNHQUjSh8aEI2RXYoWfjtdfhQ_4e_a8u8mTJE; SID=8wdD23M0zT1muB_G7zm1RcdpXcTV9pgu899MrjEHx4F9koQYO2nUhhv57bJP9jOa-xXwCQ.; __Secure-3PSID=8wdD23M0zT1muB_G7zm1RcdpXcTV9pgu899MrjEHx4F9koQYA-wfYnEQ-ysFwqZqC3qmBw.; HSID=ARsC0xTZAuXrWMsnv; SSID=AcVA6-GGICXqf9J2j; APISID=YJ2-WvqJsfDZ_6LX/Aw6EB3te0F5GcNF_4; SAPISID=eZPEKcNhzxFHpS8e/AXrnV3TZ36Wk7edFa; __Secure-3PAPISID=eZPEKcNhzxFHpS8e/AXrnV3TZ36Wk7edFa; OSID=8wdD21cKUsamKkGJ6HJXSnsPg4UPBk157jsau9hrY1GSizlJQlAwBdRVAXQcJeKakWcVfA.; __Secure-OSID=8wdD21cKUsamKkGJ6HJXSnsPg4UPBk157jsau9hrY1GSizlJ9bONwH7jlYcy7-LQuRTP6w.; 1P_JAR=2021-04-28-06; SEARCH_SAMESITE=CgQIuZIB; NID=214=Atokn4Q0yZ25GhTZ0XijMI0V-LFxghRKeweF5LkHOyn-q7mDEKj5k3YK3WToFskS25eBOSFJdzjSYHxnrhwXOzAYkaSFdjVHwAwBZEgAzS9qSzi1kIaTqF0rsQjFxRWrSW-6OUYKFsLMQ_jcZWJ-DuOfdICtr2YjqCqONVISBjjuGWXDN4P79gWIBVUBHMXSg5EshyeoWIsy78ZLcQ; __Host-GMAIL_SCH_GMN=1; __Host-GMAIL_SCH_GMS=1; __Host-GMAIL_SCH_GML=1; SIDCC=AJi4QfFRTIGK6FR5KSd-SfM590lJ56WYBbgd-WC327NdxVgD38HHLssoqCtDgToH33RegFUE; __Secure-3PSIDCC=AJi4QfFQZuyxUGM-aAv9ehy0-GIKqTHF44F4lwc2Fh7UzMr0Pr8wvhTgMGqXoistn4F8FwV21g
----
 POSTDATA {"3":{"1":1,"2":"2285421","5":{"2":0},"7":1},"4":{"2":0,"4":0,"5":258},"5":2}
--Response 
HTTP/1.1 200
status: 200
content-type: application/json; charset=UTF-8
x-content-type-options: nosniff
content-disposition: attachment; filename=\"response.txt\"
cache-control: no-cache, no-store, max-age=0, must-revalidate
content-encoding: gzip
x-goog-server-latency: 55
date: Wed, 28 Apr 2021 06:45:56 GMT
x-frame-options: SAMEORIGIN
content-security-policy: frame-ancestors 'self'
x-xss-protection: 1; mode=block
server: GSE
set-cookie: SIDCC=AJi4QfHmjdz8QHyurpy_-9mtcmrUgMAbN04J_sKB3KeTmPxEHSfy7e1FnGLaRg5EV0dlOYw8; expires=Thu, 28-Apr-2022 06:45:56 GMT; path=/; domain=.google.com; priority=high
set-cookie: __Secure-3PSIDCC=AJi4QfE_19nSVptOIvxVOdnB74bF2Jd5DLD6s842Os3RMiM1S19e7Nkxr2_-VehwcK0IVPde-Q; expires=Thu, 28-Apr-2022 06:45:56 GMT; path=/; domain=.google.com; Secure; HttpOnly; priority=high; SameSite=none
alt-svc: clear
expires: Wed, 28 Apr 2021 06:45:56 GMT
----

