
--Response 
HTTP/1.1 204
status: 204
access-control-allow-origin: *
date: Fri, 21 May 2021 07:37:16 GMT
server-timing: cdn-cache; desc=MISS
server-timing: edge; dur=216
server-timing: origin; dur=41
fwdhst: origin-gcp-us-central1-ecs.kohls.com
akamai-request-id2: 104.77.173.149:58e6c6a4
----

