--Request 
GET https://ssl.gstatic.com/support/realtime/operatorParams
Host: ssl.gstatic.com
Host: ssl.gstatic.com
Connection: keep-alive
Origin: https://drive.google.com
User-Agent: Mozilla/5.0 (Windows NT 10.0; Win64; x64) AppleWebKit/537.36 (KHTML, like Gecko) Chrome/79.0.3945.130 Safari/537.36
Accept: */*
Sec-Fetch-Site: cross-site
Sec-Fetch-Mode: cors
Referer: https://drive.google.com/drive/my-drive
Accept-Encoding: gzip, deflate, br
Accept-Language: en-GB,en-US;q=0.9,en;q=0.8
----
--Response 
HTTP/1.1 200
status: 200
accept-ranges: bytes
vary: Accept-Encoding
content-encoding: gzip
content-type: application/json
access-control-allow-origin: *
cross-origin-resource-policy: cross-origin
content-length: 430
date: Wed, 28 Apr 2021 06:38:42 GMT
expires: Wed, 28 Apr 2021 06:43:42 GMT
last-modified: Tue, 27 Apr 2021 17:07:16 GMT
x-content-type-options: nosniff
server: sffe
x-xss-protection: 0
cache-control: public, max-age=300
age: 67
alt-svc: h3-29=\":443\"; ma=2592000,h3-T051=\":443\"; ma=2592000,h3-Q050=\":443\"; ma=2592000,h3-Q046=\":443\"; ma=2592000,h3-Q043=\":443\"; ma=2592000,quic=\":443\"; ma=2592000; v=\"46,43\"
----
--Request 
GET https://ssl.gstatic.com/docs/common/viewer/v3/v-sprite35.svg
Host: ssl.gstatic.com
Host: ssl.gstatic.com
Connection: keep-alive
User-Agent: Mozilla/5.0 (Windows NT 10.0; Win64; x64) AppleWebKit/537.36 (KHTML, like Gecko) Chrome/79.0.3945.130 Safari/537.36
Accept: image/webp,image/apng,image/*,*/*;q=0.8
Sec-Fetch-Site: cross-site
Sec-Fetch-Mode: no-cors
Referer: https://drive.google.com/_/drive_fe/_/ss/k=drive_fe.main.TU1p8w7Em-0.L.W.O/am=hM8AcqSwQ3LXgugIKCAU/d=0/ct=zgms/rs=AFB8gszwcnavBz0xaEYc_fKOMywsCuOX1A
Accept-Encoding: gzip, deflate, br
Accept-Language: en-GB,en-US;q=0.9,en;q=0.8
----
--Response 
HTTP/1.1 200
status: 200
accept-ranges: bytes
vary: Accept-Encoding, Origin
content-encoding: gzip
content-type: image/svg+xml
cross-origin-resource-policy: cross-origin
content-length: 10011
date: Mon, 26 Apr 2021 18:14:48 GMT
expires: Tue, 26 Apr 2022 18:14:48 GMT
last-modified: Fri, 05 Feb 2021 19:15:00 GMT
x-content-type-options: nosniff
server: sffe
x-xss-protection: 0
cache-control: public, max-age=31536000
age: 131101
alt-svc: h3-29=\":443\"; ma=2592000,h3-T051=\":443\"; ma=2592000,h3-Q050=\":443\"; ma=2592000,h3-Q046=\":443\"; ma=2592000,h3-Q043=\":443\"; ma=2592000,quic=\":443\"; ma=2592000; v=\"46,43\"
----

