
--Response 
HTTP/1.1 200
status: 200
content-type: application/json
content-length: 1040
date: Fri, 21 May 2021 08:17:27 GMT
x-amzn-requestid: ccafb811-da66-4e4d-b2ab-bd0316212cb5
x-amz-apigw-id: fq3nwFhLvHcFzew=
x-amzn-trace-id: Root=1-60a76c97-26d344003bec233c69a972b8
x-cache: Miss from cloudfront
via: 1.1 8ae1228303a81d51353490d58d5c6a52.cloudfront.net (CloudFront)
x-amz-cf-pop: BAH53-C1
x-amz-cf-id: oQe4KKJq3-jfXzRn7JIv4gQ03K1z0EBM2gMicMSzqO-YyUFrzPTNrg==
----

--Response 
HTTP/1.1 302
status: 302
p3p: policyref=\"https://googleads.g.doubleclick.net/pagead/gcn_p3p_.xml\", CP=\"CURa ADMa DEVa TAIo PSAo PSDo OUR IND UNI PUR INT DEM STA PRE COM NAV OTC NOI DSP COR\"
timing-allow-origin: *
cross-origin-resource-policy: cross-origin
date: Fri, 21 May 2021 08:17:28 GMT
pragma: no-cache
expires: Fri, 01 Jan 1990 00:00:00 GMT
cache-control: no-cache, must-revalidate
follow-only-when-prerender-shown: 1
strict-transport-security: max-age=21600
location: https://8632166.fls.doubleclick.net/activityi;dc_pre=CPW2s4ar2vACFVONcAodPEgNaQ;src=8632166;type=landi0;cat=unive0;ord=3196309079341;gtm=2od5c1;auiddc=1885231748.1621585018;u1=not%20set;u10=https%3A%2F%2Fwww.kohls.com%2Fsale-event%2Fdenim.jsp;u11=N%2FA;u13=not%20set;u2=%25AdOps_PDP_All_ProductName%25;u23=New%20Customer;u24=89552655867376930334316022663672800555;u25=d64ec31a-62cb-4949-954e-5859e4a2f695;u5=%25AdOps_Cart_All_NumberOfItems%25;~oref=https%3A%2F%2Fwww.kohls.com%2Fsale-event%2Fdenim.jsp%3F%26searchTerm%3Djeans%26submit-search%3Dweb-regular?
content-type: text/html; charset=UTF-8
x-content-type-options: nosniff
server: cafe
content-length: 0
x-xss-protection: 0
alt-svc: h3-29=\":443\"; ma=2592000,h3-T051=\":443\"; ma=2592000,h3-Q050=\":443\"; ma=2592000,h3-Q046=\":443\"; ma=2592000,h3-Q043=\":443\"; ma=2592000,quic=\":443\"; ma=2592000; v=\"46,43\"
----

--Response 
HTTP/1.1 200
status: 200
x-amz-id-2: uUbDn8+Q5tkj0pFqfNPF5Ih3GxAu29F4KvEUHxpS2+k3W4zncAavCV3hJQ2qO0HOEo/poLxZtLg=
x-amz-request-id: DE0BF3GE69YRSXP9
last-modified: Tue, 11 May 2021 11:12:11 GMT
etag: \"8e875da52683952a3bd75193bf4f00d2\"
content-encoding: br
x-amz-version-id: UyOuedM6zGS1oW_m7hzsr2F4yTuf89wT
accept-ranges: bytes
content-type: application/javascript;charset=utf-8
content-length: 43726
server: AmazonS3
cache-control: max-age=600
expires: Fri, 21 May 2021 08:27:28 GMT
date: Fri, 21 May 2021 08:17:28 GMT
access-control-allow-origin: *
----

--Response 
HTTP/1.1 200
status: 200
accept-ranges: bytes
content-type: application/x-javascript
etag: \"76ec4e573021c58c940627400b14e574:1621528998.531868\"
last-modified: Thu, 20 May 2021 16:43:18 GMT
server: AkamaiNetStorage
vary: Accept-Encoding
content-encoding: gzip
content-length: 294
cache-control: max-age=3600
expires: Fri, 21 May 2021 09:17:28 GMT
date: Fri, 21 May 2021 08:17:28 GMT
access-control-allow-origin: https://www.kohls.com
timing-allow-origin: *
----

