--Request 
GET http://10.10.30.102:8111/cgi-bin/login?userSession=75893.0884568651DQADHfApHDHfcDtccpfAttcf&username=&password=&login.x=36&login.y=2&JSFormSubmit=off
Host: 10.10.30.102:8111
Upgrade-Insecure-Requests: 1
User-Agent: Mozilla/5.0 (Windows NT 10.0; Win64; x64) AppleWebKit/537.36 (KHTML, like Gecko) Chrome/79.0.3945.130 Safari/537.36
Accept: text/html,application/xhtml+xml,application/xml;q=0.9,image/webp,image/apng,*/*;q=0.8,application/signed-exchange;v=b3;q=0.9
Referer: http://10.10.30.102:8111/tours/index.html
Accept-Encoding: gzip, deflate
Accept-Language: en-GB,en-US;q=0.9,en;q=0.8
Cookie: SL_Cookie=a1
----
--Response 
HTTP/1.1 200 OK
Content-length: 0000002664
Connection: Keep-Alive
Content-type: text/html
----
--Request 
GET http://10.10.30.102:8111/tours/Merc10-dev/images/banner_animated.gif
Host: 10.10.30.102:8111
User-Agent: Mozilla/5.0 (Windows NT 10.0; Win64; x64) AppleWebKit/537.36 (KHTML, like Gecko) Chrome/79.0.3945.130 Safari/537.36
Accept: image/webp,image/apng,image/*,*/*;q=0.8
Referer: http://10.10.30.102:8111/cgi-bin/login?userSession=75893.0884568651DQADHfApHDHfcDtccpfAttcf&username=&password=&login.x=36&login.y=2&JSFormSubmit=off
Accept-Encoding: gzip, deflate
Accept-Language: en-GB,en-US;q=0.9,en;q=0.8
Cookie: SL_Cookie=a1
----
--Response 
HTTP/1.1 200 OK
Content-Length: 0000016522
Content-Type: image/gif
Connection: Keep-Alive
Date: Wed, 26-May-2021 13:27:16 IST
----
--Request 
GET http://10.10.30.102:8111/tours/Merc10-dev/images/sun_swede.gif
Host: 10.10.30.102:8111
User-Agent: Mozilla/5.0 (Windows NT 10.0; Win64; x64) AppleWebKit/537.36 (KHTML, like Gecko) Chrome/79.0.3945.130 Safari/537.36
Accept: image/webp,image/apng,image/*,*/*;q=0.8
Referer: http://10.10.30.102:8111/cgi-bin/login?userSession=75893.0884568651DQADHfApHDHfcDtccpfAttcf&username=&password=&login.x=36&login.y=2&JSFormSubmit=off
Accept-Encoding: gzip, deflate
Accept-Language: en-GB,en-US;q=0.9,en;q=0.8
Cookie: SL_Cookie=a1
----
--Response 
HTTP/1.1 200 OK
Content-Length: 0000004125
Content-Type: image/gif
Connection: Keep-Alive
Date: Wed, 26-May-2021 13:27:16 IST
----
--Request 
GET http://10.10.30.102:8111/tours/Merc10-dev/images/flights.gif
Host: 10.10.30.102:8111
User-Agent: Mozilla/5.0 (Windows NT 10.0; Win64; x64) AppleWebKit/537.36 (KHTML, like Gecko) Chrome/79.0.3945.130 Safari/537.36
Accept: image/webp,image/apng,image/*,*/*;q=0.8
Referer: http://10.10.30.102:8111/cgi-bin/login?userSession=75893.0884568651DQADHfApHDHfcDtccpfAttcf&username=&password=&login.x=36&login.y=2&JSFormSubmit=off
Accept-Encoding: gzip, deflate
Accept-Language: en-GB,en-US;q=0.9,en;q=0.8
Cookie: SL_Cookie=a1
----
--Response 
HTTP/1.1 200 OK
Content-Length: 0000001519
Content-Type: image/gif
Connection: Keep-Alive
Date: Wed, 26-May-2021 13:27:16 IST
----
--Request 
GET http://10.10.30.102:8111/tours/Merc10-dev/images/home.gif
Host: 10.10.30.102:8111
User-Agent: Mozilla/5.0 (Windows NT 10.0; Win64; x64) AppleWebKit/537.36 (KHTML, like Gecko) Chrome/79.0.3945.130 Safari/537.36
Accept: image/webp,image/apng,image/*,*/*;q=0.8
Referer: http://10.10.30.102:8111/cgi-bin/login?userSession=75893.0884568651DQADHfApHDHfcDtccpfAttcf&username=&password=&login.x=36&login.y=2&JSFormSubmit=off
Accept-Encoding: gzip, deflate
Accept-Language: en-GB,en-US;q=0.9,en;q=0.8
Cookie: SL_Cookie=a1
----
--Response 
HTTP/1.1 200 OK
Content-Length: 0000001268
Content-Type: image/gif
Connection: Keep-Alive
Date: Wed, 26-May-2021 13:27:16 IST
----
--Request 
GET http://10.10.30.102:8111/tours/Merc10-dev/images/signoff.gif
Host: 10.10.30.102:8111
User-Agent: Mozilla/5.0 (Windows NT 10.0; Win64; x64) AppleWebKit/537.36 (KHTML, like Gecko) Chrome/79.0.3945.130 Safari/537.36
Accept: image/webp,image/apng,image/*,*/*;q=0.8
Referer: http://10.10.30.102:8111/cgi-bin/login?userSession=75893.0884568651DQADHfApHDHfcDtccpfAttcf&username=&password=&login.x=36&login.y=2&JSFormSubmit=off
Accept-Encoding: gzip, deflate
Accept-Language: en-GB,en-US;q=0.9,en;q=0.8
Cookie: SL_Cookie=a1
----
--Response 
HTTP/1.1 200 OK
Content-Length: 0000001260
Content-Type: image/gif
Connection: Keep-Alive
Date: Wed, 26-May-2021 13:27:16 IST
----
--Request 
GET http://10.10.30.102:8111/tours/images/banner_merctur.jpg
Host: 10.10.30.102:8111
User-Agent: Mozilla/5.0 (Windows NT 10.0; Win64; x64) AppleWebKit/537.36 (KHTML, like Gecko) Chrome/79.0.3945.130 Safari/537.36
Accept: image/webp,image/apng,image/*,*/*;q=0.8
Referer: http://10.10.30.102:8111/cgi-bin/login?userSession=75893.0884568651DQADHfApHDHfcDtccpfAttcf&username=&password=&login.x=36&login.y=2&JSFormSubmit=off
Accept-Encoding: gzip, deflate
Accept-Language: en-GB,en-US;q=0.9,en;q=0.8
Cookie: SL_Cookie=a1
----
--Response 
HTTP/1.1 200 OK
Content-Length: 0000022548
Content-Type: image/jpeg
Connection: Keep-Alive
Date: Wed, 26-May-2021 13:27:16 IST
----
--Request 
GET http://10.10.30.102:8111/tours/vep/images/velocigen.gif
Host: 10.10.30.102:8111
User-Agent: Mozilla/5.0 (Windows NT 10.0; Win64; x64) AppleWebKit/537.36 (KHTML, like Gecko) Chrome/79.0.3945.130 Safari/537.36
Accept: image/webp,image/apng,image/*,*/*;q=0.8
Referer: http://10.10.30.102:8111/cgi-bin/login?userSession=75893.0884568651DQADHfApHDHfcDtccpfAttcf&username=&password=&login.x=36&login.y=2&JSFormSubmit=off
Accept-Encoding: gzip, deflate
Accept-Language: en-GB,en-US;q=0.9,en;q=0.8
Cookie: SL_Cookie=a1
----
--Response 
HTTP/1.1 200 OK
Content-Length: 0000002018
Content-Type: image/gif
Connection: Keep-Alive
Date: Wed, 26-May-2021 13:27:16 IST
----

