
--Response 
HTTP/1.1 204
status: 204
access-control-allow-origin: *
date: Fri, 21 May 2021 07:36:19 GMT
server-timing: cdn-cache; desc=MISS
server-timing: edge; dur=219
server-timing: origin; dur=39
fwdhst: origin-gcp-us-central1-ecs.kohls.com
akamai-request-id2: 104.77.173.149:58e536a7
----

--Response 
HTTP/1.1 200
status: 200
access-control-allow-origin: *
last-modified: Tue, 28 Jul 2020 21:55:43 GMT
etag: \"523d95b90b23326014bd521f70726906\"
server: Unknown
strict-transport-security: max-age=31536000; includeSubDomains
content-type: image/png
content-length: 33044
timing-allow-origin: *
expires: Thu, 27 May 2021 02:52:53 GMT
date: Fri, 21 May 2021 07:36:19 GMT
----

--Response 
HTTP/1.1 200
status: 200
access-control-allow-origin: *
last-modified: Tue, 28 Jul 2020 21:55:48 GMT
etag: \"9c568f232c2c29b0981c0ceb5ba1473c\"
server: Unknown
strict-transport-security: max-age=31536000; includeSubDomains
content-type: image/webp
content-length: 7466
timing-allow-origin: *
expires: Thu, 27 May 2021 02:52:53 GMT
date: Fri, 21 May 2021 07:36:19 GMT
----

--Response 
HTTP/1.1 200
status: 200
access-control-allow-origin: *
last-modified: Tue, 28 Jul 2020 21:56:00 GMT
etag: \"cb49664a26db33a1ef206a2bf39b73a5\"
server: Unknown
strict-transport-security: max-age=31536000; includeSubDomains
content-type: image/webp
content-length: 9252
timing-allow-origin: *
expires: Thu, 27 May 2021 02:52:53 GMT
date: Fri, 21 May 2021 07:36:19 GMT
----

--Response 
HTTP/1.1 200
status: 200
access-control-allow-origin: *
last-modified: Tue, 28 Jul 2020 21:55:53 GMT
etag: \"828dc4a0e1e6cebfe68e189404dc8f81\"
server: Unknown
strict-transport-security: max-age=31536000; includeSubDomains
content-type: image/png
content-length: 37123
timing-allow-origin: *
expires: Thu, 27 May 2021 02:52:53 GMT
date: Fri, 21 May 2021 07:36:19 GMT
----

--Response 
HTTP/1.1 200
status: 200
access-control-allow-origin: *
last-modified: Tue, 28 Jul 2020 21:55:58 GMT
etag: \"4977f24d77e68d30051c1fbcf872a5de\"
server: Unknown
strict-transport-security: max-age=31536000; includeSubDomains
content-type: image/png
content-length: 34873
timing-allow-origin: *
expires: Thu, 27 May 2021 02:52:53 GMT
date: Fri, 21 May 2021 07:36:19 GMT
----

--Response 
HTTP/1.1 200
status: 200
access-control-allow-origin: *
last-modified: Tue, 28 Jul 2020 21:55:54 GMT
etag: \"9c86299e48f89ce3a6971979f8bee1c1\"
server: Unknown
strict-transport-security: max-age=31536000; includeSubDomains
content-type: image/webp
content-length: 9014
timing-allow-origin: *
expires: Thu, 27 May 2021 02:52:53 GMT
date: Fri, 21 May 2021 07:36:19 GMT
----

--Response 
HTTP/1.1 200
status: 200
access-control-allow-origin: *
last-modified: Tue, 28 Jul 2020 21:56:18 GMT
etag: \"bac1cf8032a915f765ee21f13c5e6e78\"
server: Unknown
strict-transport-security: max-age=31536000; includeSubDomains
content-type: image/webp
content-length: 15518
timing-allow-origin: *
expires: Thu, 27 May 2021 02:52:54 GMT
date: Fri, 21 May 2021 07:36:19 GMT
----

--Response 
HTTP/1.1 200
status: 200
content-type: application/javascript
accept-ranges: bytes
content-encoding: br
etag: \"609c2d58-3b98a\"
last-modified: Thu, 20 May 2021 22:44:09 GMT
server: Akamai Resource Optimizer
x-origin-cc: max-age=86400
x-origin-cc: max-age=86400
x-origin-cc: max-age=86400
x-origin-cc: max-age=86400
x-origin-ttl: Fri, 21 May 2021 22:44:07 GMT
x-origin-ttl: Fri, 21 May 2021 22:44:07 GMT
x-origin-ttl: Fri, 21 May 2021 22:44:07 GMT
x-origin-ttl: Fri, 21 May 2021 22:44:07 GMT
content-length: 75723
cache-control: max-age=86400
expires: Sat, 22 May 2021 07:36:08 GMT
date: Fri, 21 May 2021 07:36:08 GMT
server-timing: cdn-cache; desc=HIT
server-timing: edge; dur=30
server-timing: dtRpid;desc=\"278381305\"
content-security-policy: block-all-mixed-content; frame-ancestors https://testzuiweb.kohls.zootweb.com https://testapplynow.kohls.zootweb.com 'self';
x-frame-options: SAMEORIGIN
----

--Response 
HTTP/1.1 200
status: 200
content-type: application/javascript
accept-ranges: bytes
content-encoding: br
etag: \"609c2d63-50ed\"
last-modified: Tue, 18 May 2021 21:04:05 GMT
server: Akamai Resource Optimizer
x-origin-cc: max-age=86400
x-origin-cc: max-age=86400
x-origin-cc: max-age=86400
x-origin-cc: max-age=86400
x-origin-cc: max-age=86400
x-origin-cc: max-age=86400
x-origin-cc: max-age=86400
x-origin-ttl: Wed, 19 May 2021 21:04:04 GMT
x-origin-ttl: Wed, 19 May 2021 21:04:04 GMT
x-origin-ttl: Wed, 19 May 2021 21:04:04 GMT
x-origin-ttl: Wed, 19 May 2021 21:04:04 GMT
x-origin-ttl: Wed, 19 May 2021 21:04:04 GMT
x-origin-ttl: Wed, 19 May 2021 21:04:04 GMT
x-origin-ttl: Wed, 19 May 2021 21:04:04 GMT
content-length: 4859
cache-control: max-age=86400
expires: Sat, 22 May 2021 07:36:08 GMT
date: Fri, 21 May 2021 07:36:08 GMT
server-timing: cdn-cache; desc=HIT
server-timing: edge; dur=3
server-timing: dtRpid;desc=\"1195704123\"
content-security-policy: block-all-mixed-content; frame-ancestors https://testzuiweb.kohls.zootweb.com https://testapplynow.kohls.zootweb.com 'self';
x-frame-options: SAMEORIGIN
----

--Response 
HTTP/1.1 200
status: 200
content-type: application/javascript
accept-ranges: bytes
content-encoding: br
etag: \"609c2d71-123e5\"
last-modified: Wed, 19 May 2021 16:04:40 GMT
server: Akamai Resource Optimizer
x-origin-cc: max-age=86400
x-origin-cc: max-age=86400
x-origin-cc: max-age=86400
x-origin-cc: max-age=86400
x-origin-ttl: Thu, 20 May 2021 16:04:39 GMT
x-origin-ttl: Thu, 20 May 2021 16:04:39 GMT
x-origin-ttl: Thu, 20 May 2021 16:04:39 GMT
x-origin-ttl: Thu, 20 May 2021 16:04:39 GMT
content-length: 23116
cache-control: max-age=86400
expires: Sat, 22 May 2021 07:36:09 GMT
date: Fri, 21 May 2021 07:36:09 GMT
server-timing: cdn-cache; desc=HIT
server-timing: edge; dur=1
server-timing: dtRpid;desc=\"-1370300397\"
content-security-policy: block-all-mixed-content; frame-ancestors https://testzuiweb.kohls.zootweb.com https://testapplynow.kohls.zootweb.com 'self';
x-frame-options: SAMEORIGIN
----

--Response 
HTTP/1.1 200
status: 200
content-type: application/javascript
accept-ranges: bytes
content-encoding: br
etag: \"609c2d63-9906d\"
last-modified: Tue, 18 May 2021 21:32:15 GMT
server: Akamai Resource Optimizer
x-origin-cc: max-age=0, no-cache, no-store
x-origin-cc: max-age=0, no-cache, no-store
x-origin-cc: max-age=0, no-cache, no-store
x-origin-cc: max-age=0, no-cache, no-store
x-origin-cc: max-age=0, no-cache, no-store
x-origin-ttl: Tue, 18 May 2021 21:32:12 GMT
x-origin-ttl: Tue, 18 May 2021 21:32:12 GMT
x-origin-ttl: Tue, 18 May 2021 21:32:12 GMT
x-origin-ttl: Tue, 18 May 2021 21:32:12 GMT
x-origin-ttl: Tue, 18 May 2021 21:32:12 GMT
content-length: 126287
expires: Fri, 21 May 2021 07:36:19 GMT
cache-control: max-age=0, no-cache, no-store
pragma: no-cache
date: Fri, 21 May 2021 07:36:19 GMT
set-cookie: _dyid_server=6440147674919822059; expires=Sat, 21-May-2022 07:36:19 GMT; path=/; domain=.kohls.com; secure
server-timing: cdn-cache; desc=HIT
server-timing: edge; dur=1
server-timing: dtRpid;desc=\"-1934340071\"
content-security-policy: block-all-mixed-content; frame-ancestors https://testzuiweb.kohls.zootweb.com https://testapplynow.kohls.zootweb.com 'self';
x-frame-options: SAMEORIGIN
strict-transport-security: max-age=15768000 ; preload
----

--Response 
HTTP/1.1 200
status: 200
content-type: application/javascript
accept-ranges: bytes
content-encoding: br
etag: \"609c2d71-2615\"
last-modified: Tue, 18 May 2021 21:06:50 GMT
server: Akamai Resource Optimizer
x-origin-cc: max-age=86400
x-origin-cc: max-age=86400
x-origin-cc: max-age=86400
x-origin-cc: max-age=86400
x-origin-ttl: Wed, 19 May 2021 21:06:50 GMT
x-origin-ttl: Wed, 19 May 2021 21:06:50 GMT
x-origin-ttl: Wed, 19 May 2021 21:06:50 GMT
x-origin-ttl: Wed, 19 May 2021 21:06:50 GMT
content-length: 2231
cache-control: max-age=86400
expires: Sat, 22 May 2021 07:36:19 GMT
date: Fri, 21 May 2021 07:36:19 GMT
set-cookie: _dyid_server=6440147674919822059; expires=Sat, 21-May-2022 07:36:19 GMT; path=/; domain=.kohls.com; secure
server-timing: cdn-cache; desc=HIT
server-timing: edge; dur=2
server-timing: dtRpid;desc=\"1032816171\"
content-security-policy: block-all-mixed-content; frame-ancestors https://testzuiweb.kohls.zootweb.com https://testapplynow.kohls.zootweb.com 'self';
x-frame-options: SAMEORIGIN
strict-transport-security: max-age=15768000 ; preload
----

--Response 
HTTP/1.1 200
status: 200
content-type: text/html
last-modified: Wed, 12 May 2021 19:33:05 GMT
etag: \"609c2d71-156c:dtagent10215210506134511XIC4\"
x-oneagent-js-injection: true
x-ruxit-js-agent: true
x-akamai-transformed: 9 - 0 pmb=mTOE,3mRUM,2
vary: Accept-Encoding
content-encoding: gzip
cache-control: max-age=86400
expires: Sat, 22 May 2021 07:36:09 GMT
date: Fri, 21 May 2021 07:36:09 GMT
content-length: 1351
server-timing: cdn-cache; desc=HIT
server-timing: edge; dur=13
server-timing: dtRpid;desc=\"-683508080\"
content-security-policy: block-all-mixed-content; frame-ancestors https://testzuiweb.kohls.zootweb.com https://testapplynow.kohls.zootweb.com 'self';
content-security-policy: default-src https: 'unsafe-inline' 'unsafe-eval' data: blob:; img-src https: http: 'unsafe-inline' 'unsafe-eval' data: blob:; frame-ancestors 'self';
content-security-policy: block-all-mixed-content; frame-ancestors 'self';
x-frame-options: SAMEORIGIN
x-frame-options: SAMEORIGIN
x-frame-options: SAMEORIGIN
----

