
--Response 
HTTP/1.1 200
status: 200
date: Fri, 21 May 2021 07:36:27 GMT
content-type: application/json;charset=UTF-8
vary: origin,access-control-request-method,access-control-request-headers,accept-encoding
x-request-id: 8ee84bb40085943a2041079dba6d503d
access-control-allow-credentials: true
access-control-allow-origin: https://www.kohls.com
content-encoding: gzip
----

--Response 
HTTP/1.1 301
status: 301
server: AkamaiGHost
content-length: 0
location: https://media.kohlsimg.com/is/image/kohls/JeansProductGuide-20141215-1735827
cache-control: private, max-age=0
expires: Fri, 21 May 2021 07:36:27 GMT
date: Fri, 21 May 2021 07:36:27 GMT
----

--Response 
HTTP/1.1 301
status: 301
server: AkamaiGHost
content-length: 0
location: https://media.kohlsimg.com/is/image/kohls/JeansProductGuide-20141215-1811911
cache-control: private, max-age=0
expires: Fri, 21 May 2021 07:36:27 GMT
date: Fri, 21 May 2021 07:36:27 GMT
----

--Response 
HTTP/1.1 301
status: 301
server: AkamaiGHost
content-length: 0
location: https://media.kohlsimg.com/is/image/kohls/JeansProductGuide-20141215-1716124
cache-control: private, max-age=0
expires: Fri, 21 May 2021 07:36:27 GMT
date: Fri, 21 May 2021 07:36:27 GMT
----

--Response 
HTTP/1.1 301
status: 301
server: AkamaiGHost
content-length: 0
location: https://media.kohlsimg.com/is/image/kohls/JeansProductGuide-20141215-1716153
cache-control: private, max-age=0
expires: Fri, 21 May 2021 07:36:27 GMT
date: Fri, 21 May 2021 07:36:27 GMT
----

--Response 
HTTP/1.1 301
status: 301
server: AkamaiGHost
content-length: 0
location: https://media.kohlsimg.com/is/image/kohls/JeansProductGuide-20141215-1734847_Barham
cache-control: private, max-age=0
expires: Fri, 21 May 2021 07:36:27 GMT
date: Fri, 21 May 2021 07:36:27 GMT
----

--Response 
HTTP/1.1 301
status: 301
server: AkamaiGHost
content-length: 0
location: https://media.kohlsimg.com/is/image/kohls/JeansProductGuide-20141215-1755110
cache-control: private, max-age=0
expires: Fri, 21 May 2021 07:36:27 GMT
date: Fri, 21 May 2021 07:36:27 GMT
----

--Response 
HTTP/1.1 301
status: 301
server: AkamaiGHost
content-length: 0
location: https://media.kohlsimg.com/is/image/kohls/JeansProductGuide-20141215-1730526
cache-control: private, max-age=0
expires: Fri, 21 May 2021 07:36:27 GMT
date: Fri, 21 May 2021 07:36:27 GMT
----

--Response 
HTTP/1.1 301
status: 301
server: AkamaiGHost
content-length: 0
location: https://media.kohlsimg.com/is/image/kohls/JeansProductGuide-20141215-1817071
cache-control: private, max-age=0
expires: Fri, 21 May 2021 07:36:27 GMT
date: Fri, 21 May 2021 07:36:27 GMT
----

