--Request 
GET http://wpad/wpad.dat
Host: wpad
Host: wpad
Connection: keep-alive
User-Agent: Mozilla/5.0 (Windows NT 10.0; WOW64) AppleWebKit/537.36 (KHTML, like Gecko) Chrome/79.0.3945.130 Safari/537.36
Accept-Encoding: gzip, deflate
Accept-Language: en-US,en;q=0.9
----
--Response 
HTTP/1.1 200 OK
Date: Tue, 23 Mar 2021 21:01:38 GMT
Content-Length: 0
----

