
--Response 
HTTP/1.1 200
status: 200
p3p: policyref=\"https://www.googleadservices.com/pagead/p3p.xml\", CP=\"NOI DEV PSA PSD IVA IVD OTP OUR OTR IND OTC\"
timing-allow-origin: *
cross-origin-resource-policy: cross-origin
access-control-allow-origin: *
content-type: application/json; charset=UTF-8
x-content-type-options: nosniff
content-disposition: attachment; filename=\"f.txt\"
content-encoding: gzip
date: Fri, 21 May 2021 07:37:09 GMT
server: cafe
cache-control: private
content-length: 6986
x-xss-protection: 0
alt-svc: h3-29=\":443\"; ma=2592000,h3-T051=\":443\"; ma=2592000,h3-Q050=\":443\"; ma=2592000,h3-Q046=\":443\"; ma=2592000,h3-Q043=\":443\"; ma=2592000,quic=\":443\"; ma=2592000; v=\"46,43\"
----

--Response 
HTTP/1.1 200
status: 200
accept-ranges: bytes
content-type: application/x-javascript
etag: \"76ec4e573021c58c940627400b14e574:1621528998.531868\"
last-modified: Thu, 20 May 2021 16:43:18 GMT
server: AkamaiNetStorage
vary: Accept-Encoding
content-encoding: gzip
cache-control: max-age=3600
expires: Fri, 21 May 2021 08:37:09 GMT
date: Fri, 21 May 2021 07:37:09 GMT
content-length: 299
access-control-allow-origin: https://www.kohls.com
timing-allow-origin: *
----

--Response 
HTTP/1.1 302
status: 302
p3p: policyref=\"https://googleads.g.doubleclick.net/pagead/gcn_p3p_.xml\", CP=\"CURa ADMa DEVa TAIo PSAo PSDo OUR IND UNI PUR INT DEM STA PRE COM NAV OTC NOI DSP COR\"
location: https://s.thebrighttag.com/cs?tp=gcms&gdpr=0&btt=GWAwtOwHOyK5Psg2mVwOPOK-wEQPX9FV4rPxwGWSF6A&google_gid=CAESENC5JwCUxXq-mU1Gvgg8epQ&google_cver=1
date: Fri, 21 May 2021 07:37:09 GMT
pragma: no-cache
expires: Fri, 01 Jan 1990 00:00:00 GMT
cache-control: no-cache, must-revalidate
cross-origin-resource-policy: cross-origin
content-type: text/html; charset=UTF-8
server: HTTP server (unknown)
content-length: 358
x-xss-protection: 0
alt-svc: h3-29=\":443\"; ma=2592000,h3-T051=\":443\"; ma=2592000,h3-Q050=\":443\"; ma=2592000,h3-Q046=\":443\"; ma=2592000,h3-Q043=\":443\"; ma=2592000,quic=\":443\"; ma=2592000; v=\"46,43\"
----

--Response 
HTTP/1.1 302
status: 302
date: Fri, 21 May 2021 07:37:09 GMT
content-type: text/html
content-length: 289
location: https://s.thebrighttag.com/cs?tp=tBLcuKl&btt=GWAwtOwHOyK5Psg2mVwOPOK-wEQPX9FV4rPxwGWSF6A&uid=39b7b682-b183-48f1-a9f9-71eee4300ca4
cache-control: private,no-cache, must-revalidate
pragma: no-cache
x-aspnet-version: 4.0.30319
set-cookie: TDID=39b7b682-b183-48f1-a9f9-71eee4300ca4; domain=.adsrvr.org; expires=Sat, 21-May-2022 07:37:09 GMT; path=/; secure; SameSite=None
set-cookie: TDCPM=CAESEgoDYWFtEgsIpsCyxaSNzjkQBRIVCgZzaWduYWwSCwiq-6reqI3OORAFGAEgASgCMgsIqvOti7-NzjkQBTgBWgZzaWduYWxgAg..; domain=.adsrvr.org; expires=Sat, 21-May-2022 07:37:09 GMT; path=/; secure; SameSite=None
p3p: CP=\"NOI DSP COR CUR ADMo DEVo PSAo PSDo OUR SAMo BUS UNI NAV\"
----

--Response 
HTTP/1.1 200 OK
Date: Fri, 21 May 2021 07:37:09 GMT
Expires: Fri, 21 May 2021 07:37:09 GMT
Pragma: no-cache
Cache-Control: no-cache, private, must-revalidate
Content-Type: image/gif
Accept-Ranges: bytes
Content-Length: 43
Server: ATS
Age: 0
Connection: keep-alive
Strict-Transport-Security: max-age=31536000
Expect-CT: max-age=31536000, report-uri=\"http://csp.yahoo.com/beacon/csp?src=yahoocom-expect-ct-report-only\"
X-Frame-Options: DENY
X-Content-Type-Options: nosniff
X-XSS-Protection: 1; mode=block
Referrer-Policy: strict-origin-when-cross-origin
Set-Cookie: A3=d=AQABBO1ip2ACEDFgy9t5ly_Iwk8JCjMyHRwFEgEBAQG0qGCxYAAAAAAA_SMAAAcI7WKnYDMyHRw&S=AQAAAh1L-t9XEoEo6iKbtmY9rKs; Expires=Sat, 21 May 2022 13:37:09 GMT; Max-Age=31557600; Domain=.yahoo.com; Path=/; SameSite=None; Secure; HttpOnly
Set-Cookie: B=1o79i6dgaeond&b=3&s=1u; Expires=Sat, 21 May 2022 13:37:09 GMT; Max-Age=31557600; Domain=.yahoo.com; Path=/
Set-Cookie: GUC=AQEBAQFgqLRgsUIc4gSC; Expires=Sat, 21 May 2022 13:37:09 GMT; Max-Age=31557600; Domain=.yahoo.com; Path=/; Secure
----

--Response 
HTTP/1.1 200
status: 200
access-control-allow-origin: *
last-modified: Thu, 01 Aug 2019 19:44:17 GMT
etag: \"10f185853ee2fedcd07577715de5b6b6\"
server: Unknown
strict-transport-security: max-age=31536000; includeSubDomains
content-type: image/png
content-length: 4431
timing-allow-origin: *
expires: Tue, 25 May 2021 01:41:51 GMT
date: Fri, 21 May 2021 07:37:09 GMT
----

--Response 
HTTP/1.1 200
status: 200
accept-ranges: bytes
vary: Accept-Encoding
content-encoding: gzip
content-type: text/javascript
content-length: 6437
date: Fri, 21 May 2021 07:37:09 GMT
expires: Fri, 21 May 2021 07:37:09 GMT
cache-control: private, max-age=3000
etag: \"1616005470650935\"
x-content-type-options: nosniff
server: sffe
x-xss-protection: 0
alt-svc: h3-29=\":443\"; ma=2592000,h3-T051=\":443\"; ma=2592000,h3-Q050=\":443\"; ma=2592000,h3-Q046=\":443\"; ma=2592000,h3-Q043=\":443\"; ma=2592000,quic=\":443\"; ma=2592000; v=\"46,43\"
----

--Response 
HTTP/1.1 200
status: 200
accept-ranges: bytes
vary: Accept-Encoding
content-encoding: gzip
content-type: text/html
cross-origin-resource-policy: cross-origin
content-length: 5022
date: Sun, 16 May 2021 02:52:51 GMT
expires: Mon, 16 May 2022 02:52:51 GMT
last-modified: Wed, 20 Jan 2021 19:23:06 GMT
x-content-type-options: nosniff
server: sffe
x-xss-protection: 0
cache-control: public, max-age=31536000
age: 449058
alt-svc: h3-29=\":443\"; ma=2592000,h3-T051=\":443\"; ma=2592000,h3-Q050=\":443\"; ma=2592000,h3-Q046=\":443\"; ma=2592000,h3-Q043=\":443\"; ma=2592000,quic=\":443\"; ma=2592000; v=\"46,43\"
----

--Response 
HTTP/1.1 200 OK
Date: Fri, 21 May 2021 07:37:09 GMT
Expires: Fri, 21 May 2021 07:37:09 GMT
Pragma: no-cache
Cache-Control: no-cache, private, must-revalidate
Content-Type: image/gif
Accept-Ranges: bytes
Content-Length: 43
Server: ATS
Age: 0
Connection: keep-alive
Strict-Transport-Security: max-age=31536000
Expect-CT: max-age=31536000, report-uri=\"http://csp.yahoo.com/beacon/csp?src=yahoocom-expect-ct-report-only\"
X-Frame-Options: DENY
X-Content-Type-Options: nosniff
X-XSS-Protection: 1; mode=block
Referrer-Policy: strict-origin-when-cross-origin
Set-Cookie: A3=d=AQABBO1ip2ACEDFgy9t5ly_Iwk8JCjMyHRwFEgEBAQG0qGCxYAAAAAAA_SMAAAcI7WKnYDMyHRw&S=AQAAAh1L-t9XEoEo6iKbtmY9rKs; Expires=Sat, 21 May 2022 13:37:09 GMT; Max-Age=31557600; Domain=.yahoo.com; Path=/; SameSite=None; Secure; HttpOnly
Set-Cookie: B=1o79i6dgaeond&b=3&s=1u; Expires=Sat, 21 May 2022 13:37:09 GMT; Max-Age=31557600; Domain=.yahoo.com; Path=/
Set-Cookie: GUC=AQEBAQFgqLRgsUIc4gSC; Expires=Sat, 21 May 2022 13:37:09 GMT; Max-Age=31557600; Domain=.yahoo.com; Path=/; Secure
----

--Response 
HTTP/1.1 200 OK
Date: Fri, 21 May 2021 07:37:09 GMT
Expires: Fri, 21 May 2021 07:37:09 GMT
Pragma: no-cache
Cache-Control: no-cache, private, must-revalidate
Content-Type: image/gif
Accept-Ranges: bytes
Content-Length: 43
Server: ATS
Age: 0
Connection: keep-alive
Strict-Transport-Security: max-age=31536000
Expect-CT: max-age=31536000, report-uri=\"http://csp.yahoo.com/beacon/csp?src=yahoocom-expect-ct-report-only\"
X-Frame-Options: DENY
X-Content-Type-Options: nosniff
X-XSS-Protection: 1; mode=block
Referrer-Policy: strict-origin-when-cross-origin
Set-Cookie: A3=d=AQABBO1ip2ACEDFgy9t5ly_Iwk8JCjMyHRwFEgEBAQG0qGCxYAAAAAAA_SMAAAcI7WKnYDMyHRw&S=AQAAAh1L-t9XEoEo6iKbtmY9rKs; Expires=Sat, 21 May 2022 13:37:09 GMT; Max-Age=31557600; Domain=.yahoo.com; Path=/; SameSite=None; Secure; HttpOnly
Set-Cookie: B=1o79i6dgaeond&b=3&s=1u; Expires=Sat, 21 May 2022 13:37:09 GMT; Max-Age=31557600; Domain=.yahoo.com; Path=/
Set-Cookie: GUC=AQEBAQFgqLRgsUIc4gSC; Expires=Sat, 21 May 2022 13:37:09 GMT; Max-Age=31557600; Domain=.yahoo.com; Path=/; Secure
----

--Response 
HTTP/1.1 200
status: 200
expires: Fri, 21 May 2021 07:37:09 GMT
date: Fri, 21 May 2021 07:37:09 GMT
cache-control: private, max-age=300
content-type: text/html; charset=utf-8
content-security-policy: script-src 'nonce-03Bz0ihsEI/Afbn3509S8g' 'unsafe-inline' 'strict-dynamic' https: http: 'unsafe-eval';object-src 'none';base-uri 'self';report-uri https://csp.withgoogle.com/csp/recaptcha/1
content-encoding: gzip
x-content-type-options: nosniff
x-xss-protection: 1; mode=block
content-length: 513
server: GSE
alt-svc: h3-29=\":443\"; ma=2592000,h3-T051=\":443\"; ma=2592000,h3-Q050=\":443\"; ma=2592000,h3-Q046=\":443\"; ma=2592000,h3-Q043=\":443\"; ma=2592000,quic=\":443\"; ma=2592000; v=\"46,43\"
----

--Response 
HTTP/1.1 200
status: 200
accept-ranges: bytes
content-type: application/x-javascript
etag: \"76ec4e573021c58c940627400b14e574:1621528998.531868\"
last-modified: Thu, 20 May 2021 16:43:18 GMT
server: AkamaiNetStorage
vary: Accept-Encoding
content-encoding: gzip
cache-control: max-age=3600
expires: Fri, 21 May 2021 08:37:09 GMT
date: Fri, 21 May 2021 07:37:09 GMT
content-length: 395
access-control-allow-origin: https://www.kohls.com
timing-allow-origin: *
----

--Response 
HTTP/1.1 200
status: 200
p3p: policyref=\"https://googleads.g.doubleclick.net/pagead/gcn_p3p_.xml\", CP=\"CURa ADMa DEVa TAIo PSAo PSDo OUR IND UNI PUR INT DEM STA PRE COM NAV OTC NOI DSP COR\"
timing-allow-origin: *
cross-origin-resource-policy: cross-origin
date: Fri, 21 May 2021 07:37:09 GMT
expires: Fri, 21 May 2021 07:37:09 GMT
cache-control: private, max-age=0
strict-transport-security: max-age=21600
content-type: text/html; charset=UTF-8
x-content-type-options: nosniff
content-encoding: gzip
server: cafe
content-length: 521
x-xss-protection: 0
alt-svc: h3-29=\":443\"; ma=2592000,h3-T051=\":443\"; ma=2592000,h3-Q050=\":443\"; ma=2592000,h3-Q046=\":443\"; ma=2592000,h3-Q043=\":443\"; ma=2592000,quic=\":443\"; ma=2592000; v=\"46,43\"
----

--Response 
HTTP/1.1 200
status: 200
accept-ranges: bytes
content-type: application/x-javascript
etag: \"76ec4e573021c58c940627400b14e574:1621528998.531868\"
last-modified: Thu, 20 May 2021 16:43:18 GMT
server: AkamaiNetStorage
vary: Accept-Encoding
content-encoding: gzip
cache-control: max-age=3600
expires: Fri, 21 May 2021 08:37:09 GMT
date: Fri, 21 May 2021 07:37:09 GMT
content-length: 291
access-control-allow-origin: https://www.kohls.com
timing-allow-origin: *
----

--Response 
HTTP/1.1 200
status: 200
content-type: application/x-javascript
server: Apache/1.3.34 (Unix) mod_perl/1.29
last-modified: Fri, 12 Feb 2021 20:02:18 GMT
accept-ranges: bytes
x-varnish: 1714763044 1714674085
via: 1.1 varnish, 1.1 abc43fc98eafbe076f1468e675dd51ee.cloudfront.net (CloudFront)
access-control-allow-origin: *
content-encoding: gzip
date: Fri, 21 May 2021 00:37:01 GMT
etag: \"961c468a9d160d9d-815-6026deca\"
x-cache: Hit from cloudfront
x-amz-cf-pop: BOM50-C1
x-amz-cf-id: mL6tKrrdge0Hvi9jlGmJE1zBESPZjVFn0HaGAG8izy60dWO-e3599g==
age: 51457
----

--Response 
HTTP/1.1 200
status: 200
content-length: 0000000314
content-type: text/plain
access-control-allow-origin: https://www.kohls.com
timing-allow-origin: *
access-control-allow-credentials: true
access-control-allow-methods: POST, PUT, DELETE, GET, OPTIONS
access-control-request-headers: *
access-control-allow-headers: Origin, X-Requested-With, Content-Type, Accept, Authorization, Content-Encoding
access-control-max-age: 300
expires: Fri, 21 May 2021 07:37:09 GMT
cache-control: max-age=0, no-cache, no-store
pragma: no-cache
date: Fri, 21 May 2021 07:37:09 GMT
set-cookie: Cavisson_Netvision=1279906826.20480.0000; expires=Fri, 21-May-2021 08:17:09 GMT; path=/; Httponly; Secure
----

--Response 
HTTP/1.1 200
status: 200
accept-ranges: bytes
content-type: application/x-javascript
etag: \"76ec4e573021c58c940627400b14e574:1621528998.531868\"
last-modified: Thu, 20 May 2021 16:43:18 GMT
server: AkamaiNetStorage
vary: Accept-Encoding
content-encoding: gzip
cache-control: max-age=3600
expires: Fri, 21 May 2021 08:37:09 GMT
date: Fri, 21 May 2021 07:37:09 GMT
content-length: 517
access-control-allow-origin: https://www.kohls.com
timing-allow-origin: *
----

