
--Response 
HTTP/1.1 200 OK
Access-Control-Allow-Credentials: true
Access-Control-Allow-Origin: https://www.kohls.com
Cache-Control: no-cache,no-store,must-revalidate,max-age=0,proxy-revalidate,no-transform,private
content-encoding: gzip
Content-Type: application/json;charset=utf-8
DCS: dcs-prod-ind1-2-v006-0de88a92a.edge-ind1.demdex.com 6.2.1.20210514105329-PR_1432-SNAPSHOT
Expires: Thu, 01 Jan 1970 00:00:00 UTC
P3P: policyref=\"/w3c/p3p.xml\", CP=\"NOI NID CURa ADMa DEVa PSAa PSDa OUR SAMa BUS PUR COM NAV INT\"
Pragma: no-cache
set-cookie: demdex=71429088129042532550393988433173938227; Max-Age=15552000; Expires=Wed, 17 Nov 2021 08:04:48 GMT; Path=/; Domain=.demdex.net
Strict-Transport-Security: max-age=31536000; includeSubDomains
Vary: Origin
X-TID: te4pO2KIQJY=
Content-Length: 2309
Connection: keep-alive
----

--Response 
HTTP/1.1 200
status: 200
content-type: image/webp
content-length: 20386
access-control-allow-origin: *
last-modified: Fri, 07 May 2021 16:03:51 GMT
etag: \"b0c61cade0def8f6e9d3e83e0cef5602\"
timing-allow-origin: *
server: Unknown
expires: Wed, 26 May 2021 05:01:48 GMT
date: Fri, 21 May 2021 08:04:48 GMT
----

--Response 
HTTP/1.1 200
status: 200
content-type: image/jpeg
content-length: 87728
access-control-allow-origin: *
last-modified: Fri, 07 May 2021 16:03:58 GMT
etag: \"dd1792e50d9d41f74fd16ffa5bbef473\"
timing-allow-origin: *
server: Unknown
strict-transport-security: max-age=31536000; includeSubDomains
expires: Wed, 26 May 2021 05:01:36 GMT
date: Fri, 21 May 2021 08:04:48 GMT
----

--Response 
HTTP/1.1 200 OK
Accept-Ranges: bytes
Cache-Control: no-cache,no-store,must-revalidate,max-age=0,proxy-revalidate,no-transform,private
content-encoding: gzip
Content-Type: text/html;charset=UTF-8
date: Fri, 21 May 2021 08:04:48 GMT
DCS: dcs-prod-ind1-1-v006-0476ce80f.edge-ind1.demdex.com 6.2.1.20210514105329-PR_1432-SNAPSHOT
Expires: Thu, 01 Jan 1970 00:00:00 UTC
last-modified: Thu, 20 May 2021 09:09:57 GMT
P3P: policyref=\"/w3c/p3p.xml\", CP=\"NOI NID CURa ADMa DEVa PSAa PSDa OUR SAMa BUS PUR COM NAV INT\"
Pragma: no-cache
Strict-Transport-Security: max-age=31536000; includeSubDomains
vary: accept-encoding
X-TID: ok3Xvw3LTc8=
Content-Length: 2791
Connection: keep-alive
----

--Response 
HTTP/1.1 200
status: 200
content-type: image/webp
content-length: 46046
access-control-allow-origin: *
last-modified: Fri, 07 May 2021 16:03:35 GMT
etag: \"b6861f473e1a2b3f1f3b8e10c82130a2\"
timing-allow-origin: *
server: Unknown
strict-transport-security: max-age=31536000; includeSubDomains
expires: Wed, 26 May 2021 05:03:04 GMT
date: Fri, 21 May 2021 08:04:48 GMT
----

--Response 
HTTP/1.1 200
status: 200
content-type: image/webp
content-length: 3702
access-control-allow-origin: *
last-modified: Mon, 10 May 2021 14:28:48 GMT
etag: \"a305cd78928c673204b6b3ab4fa3c136\"
timing-allow-origin: *
server: Unknown
strict-transport-security: max-age=31536000; includeSubDomains
expires: Wed, 26 May 2021 05:01:47 GMT
date: Fri, 21 May 2021 08:04:48 GMT
----

--Response 
HTTP/1.1 200
status: 200
content-type: image/webp
content-length: 3302
access-control-allow-origin: *
last-modified: Mon, 10 May 2021 14:28:28 GMT
etag: \"b462ce4a11aebc403d6a287e0580507d\"
timing-allow-origin: *
server: Unknown
expires: Wed, 26 May 2021 05:01:47 GMT
date: Fri, 21 May 2021 08:04:48 GMT
----

--Response 
HTTP/1.1 200
status: 200
content-type: image/webp
content-length: 4240
access-control-allow-origin: *
last-modified: Mon, 10 May 2021 14:28:32 GMT
etag: \"3c4dae4080d3da0df097fd8ec2cf8271\"
timing-allow-origin: *
server: Unknown
strict-transport-security: max-age=31536000; includeSubDomains
expires: Wed, 26 May 2021 05:01:47 GMT
date: Fri, 21 May 2021 08:04:48 GMT
----

--Response 
HTTP/1.1 200
status: 200
content-type: image/webp
content-length: 4312
access-control-allow-origin: *
last-modified: Mon, 10 May 2021 14:28:36 GMT
etag: \"00b5dbd02f088ca3f92a0dcf08a96564\"
timing-allow-origin: *
server: Unknown
strict-transport-security: max-age=31536000; includeSubDomains
expires: Wed, 26 May 2021 05:01:47 GMT
date: Fri, 21 May 2021 08:04:48 GMT
----

--Response 
HTTP/1.1 200
status: 200
content-type: image/webp
content-length: 3304
access-control-allow-origin: *
last-modified: Mon, 10 May 2021 14:28:36 GMT
etag: \"d0cf53a28bf3890ad00ebcc67ced399d\"
timing-allow-origin: *
server: Unknown
strict-transport-security: max-age=31536000; includeSubDomains
expires: Wed, 26 May 2021 05:01:47 GMT
date: Fri, 21 May 2021 08:04:48 GMT
----

--Response 
HTTP/1.1 200
status: 200
content-type: image/webp
content-length: 3330
access-control-allow-origin: *
last-modified: Mon, 10 May 2021 14:28:24 GMT
etag: \"f5526ce262d869f94d4159a88fcd0d74\"
timing-allow-origin: *
server: Unknown
strict-transport-security: max-age=31536000; includeSubDomains
expires: Wed, 26 May 2021 05:01:47 GMT
date: Fri, 21 May 2021 08:04:48 GMT
----

--Response 
HTTP/1.1 200
status: 200
content-type: image/webp
content-length: 3276
access-control-allow-origin: *
last-modified: Mon, 10 May 2021 14:28:47 GMT
etag: \"608ed43f0560ce61bc57b060ac7b915f\"
timing-allow-origin: *
server: Unknown
expires: Wed, 26 May 2021 05:01:47 GMT
date: Fri, 21 May 2021 08:04:48 GMT
----

--Response 
HTTP/1.1 200
status: 200
content-type: image/webp
content-length: 3242
access-control-allow-origin: *
last-modified: Mon, 10 May 2021 14:28:23 GMT
etag: \"56861fbf13059de448b49a9cadbdcf69\"
timing-allow-origin: *
server: Unknown
strict-transport-security: max-age=31536000; includeSubDomains
expires: Wed, 26 May 2021 05:01:47 GMT
date: Fri, 21 May 2021 08:04:48 GMT
----

--Response 
HTTP/1.1 200
status: 200
content-type: image/webp
content-length: 9026
access-control-allow-origin: *
last-modified: Mon, 10 May 2021 16:36:28 GMT
etag: \"67963d423286d1c1b810f281d3eddec5\"
timing-allow-origin: *
server: Unknown
expires: Wed, 26 May 2021 05:01:55 GMT
date: Fri, 21 May 2021 08:04:48 GMT
----

--Response 
HTTP/1.1 200
status: 200
content-type: image/webp
content-length: 12692
access-control-allow-origin: *
last-modified: Mon, 10 May 2021 16:36:32 GMT
etag: \"7dce2b32b2ac2da4a0c491e4bd9cb25d\"
timing-allow-origin: *
server: Unknown
expires: Wed, 26 May 2021 05:01:55 GMT
date: Fri, 21 May 2021 08:04:48 GMT
----

--Response 
HTTP/1.1 200
status: 200
content-type: image/webp
content-length: 10084
access-control-allow-origin: *
last-modified: Mon, 10 May 2021 16:36:28 GMT
etag: \"2b633c79fa80bb8c15045e6cce5d05f6\"
timing-allow-origin: *
server: Unknown
expires: Wed, 26 May 2021 05:03:04 GMT
date: Fri, 21 May 2021 08:04:48 GMT
----

--Response 
HTTP/1.1 200
status: 200
content-type: image/webp
content-length: 12560
access-control-allow-origin: *
last-modified: Mon, 10 May 2021 16:36:19 GMT
etag: \"99a2f165f346938eb764dcd58f46a24c\"
timing-allow-origin: *
server: Unknown
strict-transport-security: max-age=31536000; includeSubDomains
expires: Wed, 26 May 2021 05:03:04 GMT
date: Fri, 21 May 2021 08:04:48 GMT
----

--Response 
HTTP/1.1 200
status: 200
content-type: image/webp
content-length: 14336
access-control-allow-origin: *
last-modified: Mon, 10 May 2021 16:36:19 GMT
etag: \"2ecf2d86ad2b71b40bf283ddbaf56eef\"
timing-allow-origin: *
server: Unknown
expires: Wed, 26 May 2021 05:03:04 GMT
date: Fri, 21 May 2021 08:04:48 GMT
----

--Response 
HTTP/1.1 200
status: 200
content-type: image/webp
content-length: 7124
access-control-allow-origin: *
last-modified: Mon, 10 May 2021 16:36:19 GMT
etag: \"445fcb428831b6fa15dd0d6acc98b5a1\"
timing-allow-origin: *
server: Unknown
strict-transport-security: max-age=31536000; includeSubDomains
expires: Wed, 26 May 2021 05:01:55 GMT
date: Fri, 21 May 2021 08:04:48 GMT
----

--Response 
HTTP/1.1 200
status: 200
content-type: image/png
content-length: 4914
access-control-allow-origin: *
last-modified: Tue, 11 May 2021 14:22:28 GMT
etag: \"846ca255033cd232393cbcff7f122978\"
timing-allow-origin: *
server: Unknown
expires: Wed, 26 May 2021 05:01:55 GMT
date: Fri, 21 May 2021 08:04:48 GMT
----

--Response 
HTTP/1.1 200
status: 200
content-type: image/webp
content-length: 5798
access-control-allow-origin: *
last-modified: Mon, 10 May 2021 16:36:44 GMT
etag: \"f60686272418fedc7b63ff3701fae100\"
timing-allow-origin: *
server: Unknown
strict-transport-security: max-age=31536000; includeSubDomains
expires: Wed, 26 May 2021 05:01:55 GMT
date: Fri, 21 May 2021 08:04:48 GMT
----

--Response 
HTTP/1.1 200
status: 200
content-type: image/webp
content-length: 10368
access-control-allow-origin: *
last-modified: Mon, 10 May 2021 16:36:31 GMT
etag: \"9cf1022d3390525279ae0fb3f8bb183c\"
timing-allow-origin: *
server: Unknown
strict-transport-security: max-age=31536000; includeSubDomains
expires: Wed, 26 May 2021 05:03:04 GMT
date: Fri, 21 May 2021 08:04:48 GMT
----

--Response 
HTTP/1.1 200
status: 200
content-type: image/webp
content-length: 11220
access-control-allow-origin: *
last-modified: Mon, 10 May 2021 16:36:29 GMT
etag: \"c4cc3655448bd4b7d6ccd30325cd9eb1\"
timing-allow-origin: *
server: Unknown
expires: Wed, 26 May 2021 05:03:04 GMT
date: Fri, 21 May 2021 08:04:48 GMT
----

--Response 
HTTP/1.1 200
status: 200
content-type: image/png
content-length: 4942
access-control-allow-origin: *
last-modified: Tue, 11 May 2021 14:22:29 GMT
etag: \"209c52864cf996ae1644b59bc384db8c\"
timing-allow-origin: *
server: Unknown
expires: Wed, 26 May 2021 05:03:04 GMT
date: Fri, 21 May 2021 08:04:48 GMT
----

--Response 
HTTP/1.1 200
status: 200
content-type: image/webp
content-length: 11142
access-control-allow-origin: *
last-modified: Mon, 10 May 2021 16:36:15 GMT
etag: \"3daecefcc0a9955d4ae9a8b335907dbe\"
timing-allow-origin: *
server: Unknown
strict-transport-security: max-age=31536000; includeSubDomains
expires: Wed, 26 May 2021 05:03:04 GMT
date: Fri, 21 May 2021 08:04:48 GMT
----

--Response 
HTTP/1.1 200
status: 200
access-control-allow-origin: *
last-modified: Wed, 28 Apr 2021 18:29:12 GMT
etag: \"32780174b690333193884e7970e1683a\"
server: Unknown
strict-transport-security: max-age=31536000; includeSubDomains
content-type: image/webp
content-length: 3618
timing-allow-origin: *
expires: Tue, 25 May 2021 19:30:28 GMT
date: Fri, 21 May 2021 08:04:48 GMT
----

--Response 
HTTP/1.1 200
status: 200
access-control-allow-origin: *
last-modified: Wed, 28 Apr 2021 18:29:17 GMT
etag: \"3facaab0b439c51eaec71d0137b66f2f\"
server: Unknown
strict-transport-security: max-age=31536000; includeSubDomains
content-type: image/webp
content-length: 2772
timing-allow-origin: *
expires: Tue, 25 May 2021 19:36:13 GMT
date: Fri, 21 May 2021 08:04:48 GMT
----

--Response 
HTTP/1.1 200
status: 200
access-control-allow-origin: *
last-modified: Wed, 28 Apr 2021 18:29:15 GMT
etag: \"90be173dac0356555b3523fd1af677f4\"
server: Unknown
strict-transport-security: max-age=31536000; includeSubDomains
content-type: image/webp
content-length: 4702
timing-allow-origin: *
expires: Tue, 25 May 2021 19:32:21 GMT
date: Fri, 21 May 2021 08:04:48 GMT
----

--Response 
HTTP/1.1 200
status: 200
access-control-allow-origin: *
last-modified: Wed, 28 Apr 2021 18:29:14 GMT
etag: \"ba52258172bcd94a65c9fbd4a1dd988c\"
server: Unknown
content-type: image/webp
content-length: 3326
timing-allow-origin: *
expires: Tue, 25 May 2021 19:36:15 GMT
date: Fri, 21 May 2021 08:04:48 GMT
----

--Response 
HTTP/1.1 200
status: 200
access-control-allow-origin: *
last-modified: Wed, 28 Apr 2021 18:29:11 GMT
etag: \"072a1568c78e4d55cc2e02191b075d53\"
server: Unknown
content-type: image/webp
content-length: 4312
timing-allow-origin: *
strict-transport-security: max-age=31536000; includeSubDomains
expires: Tue, 25 May 2021 19:32:22 GMT
date: Fri, 21 May 2021 08:04:48 GMT
----

--Response 
HTTP/1.1 200
status: 200
access-control-allow-origin: *
last-modified: Wed, 28 Apr 2021 18:29:14 GMT
etag: \"9a6e7de6074b2edc2622d4bf3517b9fc\"
server: Unknown
strict-transport-security: max-age=31536000; includeSubDomains
content-type: image/webp
content-length: 2574
timing-allow-origin: *
expires: Tue, 25 May 2021 19:30:27 GMT
date: Fri, 21 May 2021 08:04:48 GMT
----

--Response 
HTTP/1.1 200
status: 200
access-control-allow-origin: *
last-modified: Wed, 28 Apr 2021 18:29:11 GMT
etag: \"dd5acd72b122787d70d98510bfba27fb\"
server: Unknown
strict-transport-security: max-age=31536000; includeSubDomains
content-type: image/webp
content-length: 5068
timing-allow-origin: *
expires: Tue, 25 May 2021 19:32:21 GMT
date: Fri, 21 May 2021 08:04:48 GMT
----

--Response 
HTTP/1.1 200
status: 200
access-control-allow-origin: *
last-modified: Wed, 28 Apr 2021 18:29:15 GMT
etag: \"7503acbee94a1f52115e7574cb971bd5\"
server: Unknown
strict-transport-security: max-age=31536000; includeSubDomains
content-type: image/webp
content-length: 4374
timing-allow-origin: *
expires: Tue, 25 May 2021 19:30:28 GMT
date: Fri, 21 May 2021 08:04:48 GMT
----

--Response 
HTTP/1.1 200
status: 200
content-type: image/webp
content-length: 44202
access-control-allow-origin: *
last-modified: Wed, 05 May 2021 19:51:01 GMT
etag: \"19f5e5f832966d165400b4a69aa8dcb6\"
timing-allow-origin: *
server: Unknown
strict-transport-security: max-age=31536000; includeSubDomains
expires: Mon, 24 May 2021 04:59:48 GMT
date: Fri, 21 May 2021 08:04:48 GMT
----

--Response 
HTTP/1.1 200
status: 200
content-type: image/webp
content-length: 94108
access-control-allow-origin: *
last-modified: Tue, 11 May 2021 13:05:46 GMT
etag: \"6992935d080861c4e36d1c93db8ba52f\"
timing-allow-origin: *
server: Unknown
expires: Wed, 26 May 2021 05:02:31 GMT
date: Fri, 21 May 2021 08:04:48 GMT
----

--Response 
HTTP/1.1 200
status: 200
content-type: image/webp
content-length: 33214
access-control-allow-origin: *
last-modified: Tue, 11 May 2021 13:05:58 GMT
etag: \"0703d2b478dd1606ea1548d54c64b8c4\"
timing-allow-origin: *
server: Unknown
strict-transport-security: max-age=31536000; includeSubDomains
expires: Wed, 26 May 2021 05:02:32 GMT
date: Fri, 21 May 2021 08:04:48 GMT
----

--Response 
HTTP/1.1 200
status: 200
access-control-allow-origin: *
last-modified: Wed, 28 Apr 2021 20:39:50 GMT
etag: \"042bd51dcc0843aefa6f7d3118e83d5e\"
server: Unknown
strict-transport-security: max-age=31536000; includeSubDomains
content-type: image/webp
content-length: 7322
timing-allow-origin: *
expires: Tue, 25 May 2021 19:30:28 GMT
date: Fri, 21 May 2021 08:04:48 GMT
----

--Response 
HTTP/1.1 200
status: 200
content-type: image/jpeg
content-length: 72302
access-control-allow-origin: *
last-modified: Thu, 06 May 2021 17:28:08 GMT
etag: \"64652af6e8dc1854c73fd8b2bafe6bae\"
timing-allow-origin: *
server: Unknown
expires: Mon, 24 May 2021 04:59:49 GMT
date: Fri, 21 May 2021 08:04:48 GMT
----

--Response 
HTTP/1.1 200
status: 200
access-control-allow-origin: *
last-modified: Wed, 28 Apr 2021 20:40:37 GMT
etag: \"3adcb4106d395b19b41061d82f676613\"
server: Unknown
strict-transport-security: max-age=31536000; includeSubDomains
content-type: image/webp
content-length: 10036
timing-allow-origin: *
expires: Tue, 25 May 2021 19:30:28 GMT
date: Fri, 21 May 2021 08:04:48 GMT
----

--Response 
HTTP/1.1 200
status: 200
access-control-allow-origin: *
last-modified: Wed, 28 Apr 2021 20:39:43 GMT
etag: \"427133d5c2218021d049d2d625742fed\"
server: Unknown
strict-transport-security: max-age=31536000; includeSubDomains
content-type: image/webp
content-length: 9022
timing-allow-origin: *
expires: Tue, 25 May 2021 19:30:28 GMT
date: Fri, 21 May 2021 08:04:48 GMT
----

--Response 
HTTP/1.1 200
status: 200
access-control-allow-origin: *
last-modified: Wed, 28 Apr 2021 20:39:35 GMT
etag: \"3f5b31faca17c5d9068adea5285e1ff5\"
server: Unknown
strict-transport-security: max-age=31536000; includeSubDomains
content-type: image/webp
content-length: 8774
timing-allow-origin: *
expires: Tue, 25 May 2021 19:30:28 GMT
date: Fri, 21 May 2021 08:04:48 GMT
----

--Response 
HTTP/1.1 200
status: 200
access-control-allow-origin: *
last-modified: Mon, 22 Mar 2021 18:02:10 GMT
etag: \"11923d1a4caa925496b55e29e6d02278\"
server: Unknown
strict-transport-security: max-age=31536000; includeSubDomains
content-type: image/jpeg
content-length: 141965
timing-allow-origin: *
expires: Sat, 22 May 2021 08:14:03 GMT
date: Fri, 21 May 2021 08:04:48 GMT
----

--Response 
HTTP/1.1 200
status: 200
xserver: anedge-59b67c66b9-btgv5
access-control-allow-origin: https://www.kohls.com
access-control-allow-credentials: true
x-c: main-1471.Ib5710b.M0-493
date: Fri, 21 May 2021 08:04:48 GMT
p3p: CP=\"This is not a P3P policy\"
server: jag
set-cookie: s_ecid=MCMID%7C76403998605952159830891476251030620443; Path=/; Domain=kohls.com; Max-Age=63072000; Expires=Sun, 21 May 2023 08:04:04 GMT; SameSite=Lax;
vary: Origin
content-type: application/x-javascript;charset=utf-8
content-length: 48
strict-transport-security: max-age=31536000; includeSubDomains
cache-control: no-cache, no-store, max-age=0, no-transform, private
x-xss-protection: 1; mode=block
x-content-type-options: nosniff
----

--Response 
HTTP/1.1 200
status: 200
access-control-allow-origin: *
last-modified: Wed, 28 Apr 2021 20:00:51 GMT
etag: \"373a789fc65d7fa6b42234b9fd4c2d72\"
server: Unknown
strict-transport-security: max-age=31536000; includeSubDomains
content-type: image/webp
content-length: 9432
timing-allow-origin: *
expires: Tue, 25 May 2021 19:30:28 GMT
date: Fri, 21 May 2021 08:04:48 GMT
----

--Response 
HTTP/1.1 200
status: 200
access-control-allow-origin: *
last-modified: Wed, 28 Apr 2021 20:00:44 GMT
etag: \"0e2904bf6652586ff79c93f85de5e946\"
server: Unknown
content-type: image/webp
content-length: 25032
timing-allow-origin: *
strict-transport-security: max-age=31536000; includeSubDomains
expires: Tue, 25 May 2021 19:30:28 GMT
date: Fri, 21 May 2021 08:04:48 GMT
----

--Response 
HTTP/1.1 200
status: 200
access-control-allow-origin: *
last-modified: Thu, 17 Dec 2020 17:46:25 GMT
etag: \"c8b49167d67c72d6cb15fbba71572e8b\"
server: Unknown
strict-transport-security: max-age=31536000; includeSubDomains
content-type: image/webp
content-length: 3880
timing-allow-origin: *
expires: Thu, 27 May 2021 02:10:24 GMT
date: Fri, 21 May 2021 08:04:48 GMT
----

--Response 
HTTP/1.1 200
status: 200
access-control-allow-origin: *
last-modified: Wed, 28 Apr 2021 18:41:03 GMT
etag: \"ad9b3981f949fc0d99703ebeaa14b5e1\"
server: Unknown
strict-transport-security: max-age=31536000; includeSubDomains
content-type: image/webp
content-length: 93560
timing-allow-origin: *
expires: Tue, 25 May 2021 19:30:28 GMT
date: Fri, 21 May 2021 08:04:48 GMT
----

--Response 
HTTP/1.1 200
status: 200
content-type: application/javascript
accept-ranges: bytes
content-encoding: br
etag: \"609c2d58-3b98a\"
last-modified: Thu, 20 May 2021 22:44:09 GMT
server: Akamai Resource Optimizer
x-origin-cc: max-age=86400
x-origin-cc: max-age=86400
x-origin-cc: max-age=86400
x-origin-cc: max-age=86400
x-origin-ttl: Fri, 21 May 2021 22:44:07 GMT
x-origin-ttl: Fri, 21 May 2021 22:44:07 GMT
x-origin-ttl: Fri, 21 May 2021 22:44:07 GMT
x-origin-ttl: Fri, 21 May 2021 22:44:07 GMT
content-length: 75723
cache-control: max-age=86400
expires: Sat, 22 May 2021 08:04:48 GMT
date: Fri, 21 May 2021 08:04:48 GMT
set-cookie: _dyid_server=Dynamic Yield; expires=Sat, 21-May-2022 08:04:48 GMT; path=/; domain=.kohls.com; secure
server-timing: cdn-cache; desc=HIT
server-timing: edge; dur=1
server-timing: dtRpid;desc=\"278381305\"
content-security-policy: block-all-mixed-content; frame-ancestors https://testzuiweb.kohls.zootweb.com https://testapplynow.kohls.zootweb.com 'self';
x-frame-options: SAMEORIGIN
strict-transport-security: max-age=15768000 ; preload
----

--Response 
HTTP/1.1 200
status: 200
content-type: application/javascript
accept-ranges: bytes
content-encoding: br
etag: \"609c2d63-9906d\"
last-modified: Tue, 18 May 2021 21:32:15 GMT
server: Akamai Resource Optimizer
x-origin-cc: max-age=0, no-cache, no-store
x-origin-cc: max-age=0, no-cache, no-store
x-origin-cc: max-age=0, no-cache, no-store
x-origin-cc: max-age=0, no-cache, no-store
x-origin-cc: max-age=0, no-cache, no-store
x-origin-cc: max-age=0, no-cache, no-store
x-origin-ttl: Tue, 18 May 2021 21:32:12 GMT
x-origin-ttl: Tue, 18 May 2021 21:32:12 GMT
x-origin-ttl: Tue, 18 May 2021 21:32:12 GMT
x-origin-ttl: Tue, 18 May 2021 21:32:12 GMT
x-origin-ttl: Tue, 18 May 2021 21:32:12 GMT
x-origin-ttl: Tue, 18 May 2021 21:32:12 GMT
content-length: 126287
expires: Fri, 21 May 2021 08:04:48 GMT
cache-control: max-age=0, no-cache, no-store
pragma: no-cache
date: Fri, 21 May 2021 08:04:48 GMT
set-cookie: _dyid_server=Dynamic Yield; expires=Sat, 21-May-2022 08:04:48 GMT; path=/; domain=.kohls.com; secure
server-timing: cdn-cache; desc=HIT
server-timing: edge; dur=1
server-timing: dtRpid;desc=\"-1934340071\"
content-security-policy: block-all-mixed-content; frame-ancestors https://testzuiweb.kohls.zootweb.com https://testapplynow.kohls.zootweb.com 'self';
x-frame-options: SAMEORIGIN
strict-transport-security: max-age=15768000 ; preload
----

--Response 
HTTP/1.1 200
status: 200
access-control-allow-origin: *
last-modified: Wed, 28 Apr 2021 18:40:47 GMT
etag: \"a57094bfbcf7beac5328f3d1787919e3\"
server: Unknown
strict-transport-security: max-age=31536000; includeSubDomains
content-type: image/webp
content-length: 4698
timing-allow-origin: *
expires: Tue, 25 May 2021 19:30:28 GMT
date: Fri, 21 May 2021 08:04:48 GMT
----

--Response 
HTTP/1.1 200
status: 200
access-control-allow-origin: *
last-modified: Wed, 28 Apr 2021 16:41:22 GMT
etag: \"4d22a72796bde23e96f559a3f45af636\"
server: Unknown
content-type: image/webp
content-length: 13002
timing-allow-origin: *
strict-transport-security: max-age=31536000; includeSubDomains
expires: Tue, 25 May 2021 19:32:21 GMT
date: Fri, 21 May 2021 08:04:48 GMT
----

--Response 
HTTP/1.1 200
status: 200
access-control-allow-origin: *
last-modified: Wed, 13 May 2020 14:50:35 GMT
etag: \"1885dcd9bdbf93b19c11fb5a2e65fd5d\"
server: Unknown
strict-transport-security: max-age=31536000; includeSubDomains
content-type: image/webp
content-length: 1042
timing-allow-origin: *
expires: Tue, 25 May 2021 05:42:44 GMT
date: Fri, 21 May 2021 08:04:48 GMT
----

--Response 
HTTP/1.1 200
status: 200
content-type: image/webp
content-length: 6266
access-control-allow-origin: *
last-modified: Thu, 06 May 2021 20:25:50 GMT
etag: \"7ce0d16089ab2ca17794d1e4d0c39397\"
timing-allow-origin: *
server: Unknown
strict-transport-security: max-age=31536000; includeSubDomains
expires: Mon, 24 May 2021 04:59:48 GMT
date: Fri, 21 May 2021 08:04:48 GMT
----

