--Request 
POST https://ing-district.clicktale.net/ctn_v2/wr/?3301609570255062&24&11&29&0&8&8&subsid=233441&msgsize=120
Host: ing-district.clicktale.net
Host: ing-district.clicktale.net
Connection: keep-alive
Content-Length: 9951
Origin: https://www.kohls.com
User-Agent: Mozilla/5.0 (Windows NT 10.0; WOW64) AppleWebKit/537.36 (KHTML, like Gecko) Chrome/56.0.2924.87 Safari/537.36
Content-Type: text/plain
Accept: */*
Sec-Fetch-Site: cross-site
Sec-Fetch-Mode: cors
Referer: https://www.kohls.com/product/prd-3847510/womens-apt-9-tummy-control-shorts.jsp?color=Medium%20Wash&prdPV=1
Accept-Encoding: gzip, deflate, br
Accept-Language: en-GB,en-US;q=0.9,en;q=0.8
----
 POSTDATA qcm_buffer_timing_fix&17971&9EYzP_([{"type":1,"attribute":{"attributeName":"data-attached","attributeValue":"true","id":"DIV1685"}},{"type":0,"addedNodes":[],"removedNodes":[{"id":"DIV1723"}]},{"type":0,"addedNodes":[],"removedNodes":[{"id":"DIV1724"}]},{"type":0,"addedNodes":[],"removedNodes":[{"id":"DIV1725"}]},{"type":0,"addedNodes":[{"nodeType":1,"id":"DIV3385","type":1,"parentNode":"DIV1722","tagName":"DIV","attributes":{"class":"fp-logo"}}],"removedNodes":[]},{"type":0,"addedNodes":[{"nodeType":1,"id":"DIV3386","type":1,"parentNode":"DIV1722","tagName":"DIV","attributes":{"class":"fp-prediction"},"childNodes":[{"nodeType":3,"id":"#text10547","textContent":"Item runs"}]}],"removedNodes":[]},{"type":0,"addedNodes":[{"nodeType":1,"id":"DIV3387","type":1,"parentNode":"DIV1722","tagName":"DIV","attributes":{"class":"fp-recommendation"},"childNodes":[{"nodeType":3,"id":"#text10548","textContent":"True to size"}]}],"removedNodes":[]}])&8B7P_([{"type":1,"attribute":{"attributeName":"nvsensitive","attributeValue":"","id":"INPUT7"}},{"type":1,"attribute":{"attributeName":"nvsensitive","attributeValue":"","id":"DIV17"}}])&jP_([{"type":0,"addedNodes":[{"nodeType":1,"id":"SCRIPT221","type":1,"nextSibling":"SCRIPT217","tagName":"SCRIPT"}],"removedNodes":[]}])&CP_([{"type":1,"attribute":{"attributeName":"nvsensitive","attributeValue":"","id":"INPUT7"}},{"type":1,"attribute":{"attributeName":"nvsensitive","attributeValue":"","id":"DIV17"}}])&lP_([{"type":1,"attribute":{"attributeName":"style","attributeValue":"opacity: 0.999013;","id":"IMG81"}}])&mZOS8BtWS8keAP_([{"type":1,"attribute":{"attributeName":"nvsensitive","attributeValue":"","id":"INPUT7"}},{"type":1,"attribute":{"attributeName":"nvsensitive","attributeValue":"","id":"DIV17"}}])&kP_([{"type":0,"addedNodes":[{"nodeType":1,"id":"LINK28","type":1,"parentNode":"HEAD1","tagName":"LINK","attributes":{"rel":"prefetch","href":"https://e049aa8501426082437e9d44cec68943.safeframe.googlesyndication.com/safeframe/1-0-38/html/container.html"}}],"removedNodes":[]},{"type":0,"addedNodes":[{"nodeType":1,"id":"LINK29","type":1,"parentNode":"HEAD1","tagName":"LINK","attributes":{"rel":"prefetch","href":"https://tpc.googlesyndication.com/safeframe/1-0-38/html/container.html"}}],"removedNodes":[]}])&77P_([{"type":1,"attribute":{"attributeName":"nvsensitive","attributeValue":"","id":"INPUT7"}},{"type":1,"attribute":{"attributeName":"nvsensitive","attributeValue":"","id":"DIV17"}}])&8BmP_([{"type":1,"attribute":{"attributeName":"style","attributeValue":"display: none;","id":"DIV33"}},{"type":1,"attribute":{"attributeName":"style","attributeValue":"text-align: center; display: none;","id":"DIV221"}},{"type":1,"attribute":{"attributeName":"style","attributeValue":"text-align: center; display: none;","id":"DIV252"}},{"type":1,"attribute":{"attributeName":"style","attributeValue":"display: none;","id":"DIV261"}},{"type":1,"attribute":{"attributeName":"style","attributeValue":"display: none;","id":"DIV263"}},{"type":1,"attribute":{"attributeName":"style","attributeValue":"display: none;","id":"DIV265"}}])&8BCP_(%5B%7B%22type%22%3A1%2C%22attribute%22%3A%7B%22attributeName%22%3A%22style%22%2C%22attributeValue%22%3A%22opacity%3A%200%3B%22%2C%22id%22%3A%22IMG81%22%7D%7D%2C%7B%22type%22%3A1%2C%22attribute%22%3A%7B%22attributeName%22%3A%22src%22%2C%22attributeValue%22%3A%22https%3A%2F%2Fmedia.kohlsimg.com%2Fis%2Fimage%2Fkohls%2F3047073_Rose_Dye%3Fwid%3D300%26hei%3D300%26op_sharpen%3D1%22%2C%22id%22%3A%22IMG81%22%7D%7D%2C%7B%22type%22%3A1%2C%22attribute%22%3A%7B%22attributeName%22%3A%22style%22%2C%22attributeValue%22%3A%22display%3A%20none%3B%22%2C%22id%22%3A%22DIV2417%22%7D%7D%2C%7B%22type%22%3A1%2C%22attribute%22%3A%7B%22attributeName%22%3A%22style%22%2C%22attributeValue%22%3A%22opacity%3A%200%3B%22%2C%22id%22%3A%22IMG83%22%7D%7D%2C%7B%22type%22%3A1%2C%22attribute%22%3A%7B%22attributeName%22%3A%22src%22%2C%22attributeValue%22%3A%22https%3A%2F%2Fmedia.kohlsimg.com%2Fis%2Fimage%2Fkohls%2F3047068_New_White%3Fwid%3D300%26hei%3D300%26op_sharpen%3D1%22%2C%22id%22%3A%22IMG83%22%7D%7D%2C%7B%22type%22%3A1%2C%22attribute%22%3A%7B%22attributeName%22%3A%22style%22%2C%22attributeValue%22%3A%22display%3A%20none%3B%22%2C%22id%22%3A%22DIV2457%22%7D%7D%2C%7B%22type%22%3A1%2C%22attribute%22%3A%7B%22attributeName%22%3A%22style%22%2C%22attributeValue%22%3A%22opacity%3A%200%3B%22%2C%22id%22%3A%22IMG96%22%7D%7D%2C%7B%22type%22%3A1%2C%22attribute%22%3A%7B%22attributeName%22%3A%22src%22%2C%22attributeValue%22%3A%22https%3A%2F%2Fmedia.kohlsimg.com%2Fis%2Fimage%2Fkohls%2F3047073_Rose_Dye%3Fwid%3D300%26hei%3D300%26op_sharpen%3D1%22%2C%22id%22%3A%22IMG96%22%7D%7D%2C%7B%22type%22%3A1%2C%22attribute%22%3A%7B%22attributeName%22%3A%22style%22%2C%22attributeValue%22%3A%22display%3A%20none%3B%22%2C%22id%22%3A%22DIV2717%22%7D%7D%2C%7B%22type%22%3A1%2C%22attribute%22%3A%7B%22attributeName%22%3A%22style%22%2C%22attributeValue%22%3A%22opacity%3A%200%3B%22%2C%22id%22%3A%22IMG98%22%7D%7D%2C%7B%22type%22%3A1%2C%22attribute%22%3A%7B%22attributeName%22%3A%22src%22%2C%22attributeValue%22%3A%22https%3A%2F%2Fmedia.kohlsimg.com%2Fis%2Fimage%2Fkohls%2F3047068_New_White%3Fwid%3D300%26hei%3D300%26op_sharpen%3D1%22%2C%22id%22%3A%22IMG98%22%7D%7D%2C%7B%22type%22%3A1%2C%22attribute%22%3A%7B%22attributeName%22%3A%22style%22%2C%22attributeValue%22%3A%22display%3A%20none%3B%22%2C%22id%22%3A%22DIV2757%22%7D%7D%5D)&8D6P_([{"type":0,"addedNodes":[{"nodeType":1,"id":"SCRIPT224","type":1,"nextSibling":"SCRIPT221","tagName":"SCRIPT"}],"removedNodes":[]}])&8BRP_([{"type":1,"attribute":{"attributeName":"nvsensitive","attributeValue":"","id":"INPUT7"}},{"type":1,"attribute":{"attributeName":"nvsensitive","attributeValue":"","id":"DIV17"}}])&8BVP_(%5B%7B%22type%22%3A0%2C%22addedNodes%22%3A%5B%7B%22nodeType%22%3A1%2C%22id%22%3A%22SCRIPT225%22%2C%22type%22%3A1%2C%22parentNode%22%3A%22HEAD1%22%2C%22tagName%22%3A%22SCRIPT%22%7D%5D%2C%22removedNodes%22%3A%5B%5D%7D%2C%7B%22type%22%3A1%2C%22attribute%22%3A%7B%22attributeName%22%3A%22src%22%2C%22attributeValue%22%3A%22https%3A%2F%2Fscontent.webcollage.net%2Fkohls%2Fmosaic-board-meta%3Fird%3Dtrue%26channel-product-id%3D3847510%22%2C%22id%22%3A%22SCRIPT225%22%7D%7D%5D)&8B0P_([{"type":1,"attribute":{"attributeName":"nvsensitive","attributeValue":"","id":"INPUT7"}},{"type":1,"attribute":{"attributeName":"nvsensitive","attributeValue":"","id":"DIV17"}}])&8BmZOT8CpWT9DDvAP_([{"type":1,"attribute":{"attributeName":"data-google-query-id","attributeValue":"CKvx_NCp2vACFSEYtwAd3GABdQ","id":"DIV221"}},{"type":1,"attribute":{"attributeName":"data-google-query-id","attributeValue":"CKzx_NCp2vACFSEYtwAd3GABdQ","id":"DIV252"}},{"type":1,"attribute":{"attributeName":"data-google-query-id","attributeValue":"CK7x_NCp2vACFSEYtwAd3GABdQ","id":"DIV263"}},{"type":1,"attribute":{"attributeName":"data-google-query-id","attributeValue":"CK_x_NCp2vACFSEYtwAd3GABdQ","id":"DIV265"}}])&8ByP_([{"type":1,"attribute":{"attributeName":"style","attributeValue":"","id":"DIV33"}},{"type":1,"attribute":{"attributeName":"style","attributeValue":"","id":"DIV261"}}])&zP_([{"type":1,"attribute":{"attributeName":"style","attributeValue":"border: 0pt none; width: 300px; height: 0px; display: inline-block;","id":"DIV3391"}}])&8BCP_([{"type":1,"attribute":{"attributeName":"style","attributeValue":"border: 0pt none;","id":"DIV3388"}},{"type":1,"attribute":{"attributeName":"style","attributeValue":"border: 0pt none; display: inline-block;","id":"DIV3391"}}])&wZOU8CJWU9C0XAP_([{"type":1,"attribute":{"attributeName":"nvsensitive","attributeValue":"","id":"INPUT7"}},{"type":1,"attribute":{"attributeName":"nvsensitive","attributeValue":"","id":"DIV17"}}])&77P_([{"type":0,"addedNodes":[{"nodeType":1,"id":"SCRIPT226","type":1,"nextSibling":"SCRIPT224","tagName":"SCRIPT"}],"removedNodes":[]}])&FP_([{"type":1,"attribute":{"attributeName":"nvsensitive","attributeValue":"","id":"INPUT7"}},{"type":1,"attribute":{"attributeName":"nvsensitive","attributeValue":"","id":"DIV17"}}])&lP_([{"type":0,"addedNodes":[],"removedNodes":[{"id":"#text1978"}]},{"type":0,"addedNodes":[{"nodeType":1,"id":"DIV3394","type":1,"parentNode":"DIV291","tagName":"DIV","attributes":{"id":"sec-text-container"},"childNodes":[{"nodeType":1,"id":"IFRAME12","tagName":"IFRAME","attributes":{"id":"sec-text-if","src":"/_sec/cp_challenge/crypto_message-3-4.htm","class":"custmsg","frameborder":"0","scrolling":"yes"}}]}],"removedNodes":[]},{"type":0,"addedNodes":[{"nodeType":1,"id":"DIV3395","type":1,"parentNode":"DIV291","tagName":"DIV","attributes":{"id":"sec-if-container"},"childNodes":[{"nodeType":1,"id":"IFRAME13","tagName":"IFRAME","attributes":{"id":"sec-cpt-if","frameborder":"0","scrolling":"no","class":"crypto","data-hostname":"","data-duration":"5","src":"/_sec/cp_challenge/ak-challenge-3-4.htm"}}]}],"removedNodes":[]},{"type":1,"attribute":{"attributeName":"style","attributeValue":"display: block;","id":"DIV290"}}])&vP_([{"type":1,"attribute":{"attributeName":"nvsensitive","attributeValue":"","id":"INPUT7"}},{"type":1,"attribute":{"attributeName":"nvsensitive","attributeValue":"","id":"DIV17"}}])&8BDP_([{"type":1,"attribute":{"attributeName":"class","attributeValue":"add-to-bag-pdp","id":"DIV1714"}},{"type":1,"attribute":{"attributeName":"value","attributeValue":"Add to cart","id":"INPUT42"}},{"type":1,"attribute":{"attributeName":"class","attributeValue":"pdp-error","id":"DIV100"}},{"type":0,"addedNodes":[{"nodeType":3,"id":"#text10549","type":1,"parentNode":"P6","textContent":"Sorry, something went wrong. Please try again."}],"removedNodes":[]},{"type":0,"addedNodes":[],"removedNodes":[{"id":"SCRIPT16"}]},{"type":0,"addedNodes":[{"nodeType":1,"id":"SCRIPT227","type":1,"nextSibling":"SCRIPT226","tagName":"SCRIPT"}],"removedNodes":[]}])&8B2P_([{"type":1,"attribute":{"attributeName":"nvsensitive","attributeValue":"","id":"INPUT7"}},{"type":1,"attribute":{"attributeName":"nvsensitive","attributeValue":"","id":"DIV17"}}])&kqcm_buffer_timing_fix&20161&F
--Response 
HTTP/1.1 200
status: 200
date: Fri, 21 May 2021 08:11:11 GMT
content-type: text/plain; charset=UTF-8
content-length: 1
access-control-allow-origin: *
----

