
--Response 
HTTP/1.1 200
status: 200
x-cavnv: 4633419195311544647_33333_9_0
correlation-id: webstore::f1d3bbd0-b803-11eb-af56-7925700dfe02::1621361264::us-central1-f::cprod-blue-snbui-prod-r1l4::2402:e280:212e:139:dae:99ec:7dca:ca1d
content-type: application/json; charset=utf-8
content-encoding: gzip
content-length: 45
cache-control: max-age=86400
expires: Sat, 22 May 2021 07:36:30 GMT
date: Fri, 21 May 2021 07:36:30 GMT
vary: Accept-Encoding
set-cookie: _dyid_server=6440147674919822059; expires=Sat, 21-May-2022 07:36:30 GMT; path=/; domain=.kohls.com; secure
set-cookie: mosaic=gcpb; expires=Sun, 20-Jun-2021 07:36:30 GMT; path=/; secure
server-timing: cdn-cache; desc=HIT
server-timing: edge; dur=1
content-security-policy: block-all-mixed-content; frame-ancestors https://testzuiweb.kohls.zootweb.com https://testapplynow.kohls.zootweb.com 'self';
x-frame-options: SAMEORIGIN
strict-transport-security: max-age=15768000 ; preload
----

--Response 
HTTP/1.1 200
status: 200
xserver: anedge-59b67c66b9-kgbg4
access-control-allow-origin: *
x-c: main-1471.Ib5710b.M0-493
date: Fri, 21 May 2021 07:36:30 GMT
expires: Thu, 20 May 2021 07:36:30 GMT
last-modified: Sat, 22 May 2021 07:36:30 GMT
pragma: no-cache
p3p: CP=\"This is not a P3P policy\"
server: jag
set-cookie: s_vi=[CS]v1|3053B175BA7DF942-600006ECB012BDA4[CE]; Path=/; Domain=kohls.com; Max-Age=63072000; Expires=Sun, 21 May 2023 07:36:36 GMT;
etag: 3482322097120444416-4622039347148941042
vary: *
content-type: application/x-javascript;charset=utf-8
content-length: 111
strict-transport-security: max-age=31536000; includeSubDomains
cache-control: no-cache, no-store, max-age=0, no-transform, private
x-xss-protection: 1; mode=block
x-content-type-options: nosniff
----

--Response 
HTTP/1.1 200 OK
Server: nginx
Content-Type: application/javascript
Last-Modified: Thu, 13 May 2021 15:37:02 GMT
Accept-Ranges: bytes
P3P: CP=NOI DSP COR NID
Content-Encoding: gzip
Content-Length: 12525
Cache-Control: public, max-age=14400
Date: Fri, 21 May 2021 07:36:11 GMT
Vary: Accept-Encoding
----

--Response 
HTTP/1.1 200
status: 200
content-type: application/x-javascript
accept-ranges: bytes
content-encoding: br
etag: \"3e1bae4f628051743954c920ce1003b7:1599603569.572484\"
last-modified: Tue, 08 Sep 2020 22:22:50 GMT
server: Akamai Resource Optimizer
x-origin-ttl: Wed, 09 Sep 2020 22:22:49 GMT
x-origin-ttl: Wed, 09 Sep 2020 22:22:49 GMT
x-origin-ttl: Wed, 09 Sep 2020 22:22:49 GMT
x-origin-ttl: Wed, 09 Sep 2020 22:22:49 GMT
x-origin-ttl: Wed, 09 Sep 2020 22:22:49 GMT
x-origin-ttl: Wed, 09 Sep 2020 22:22:49 GMT
x-origin-ttl: Wed, 09 Sep 2020 22:22:49 GMT
x-origin-ttl: Wed, 09 Sep 2020 22:22:49 GMT
x-origin-ttl: Wed, 09 Sep 2020 22:22:49 GMT
x-origin-ttl: Wed, 09 Sep 2020 22:22:49 GMT
x-origin-ttl: Wed, 09 Sep 2020 22:22:49 GMT
x-origin-ttl: Wed, 09 Sep 2020 22:22:49 GMT
x-origin-ttl: Wed, 09 Sep 2020 22:22:49 GMT
x-origin-ttl: Wed, 09 Sep 2020 22:22:49 GMT
x-origin-ttl: Wed, 09 Sep 2020 22:22:49 GMT
x-origin-ttl: Wed, 09 Sep 2020 22:22:49 GMT
content-length: 17430
x-origin-cc: max-age=86400
x-origin-cc: max-age=86400
x-origin-cc: max-age=86400
x-origin-cc: max-age=86400
x-origin-cc: max-age=86400
x-origin-cc: max-age=86400
x-origin-cc: max-age=86400
x-origin-cc: max-age=86400
x-origin-cc: max-age=86400
x-origin-cc: max-age=86400
x-origin-cc: max-age=86400
x-origin-cc: max-age=86400
x-origin-cc: max-age=86400
x-origin-cc: max-age=86400
x-origin-cc: max-age=86400
x-origin-cc: max-age=86400
expires: Fri, 21 May 2021 07:36:30 GMT
cache-control: max-age=0, no-cache, no-store
pragma: no-cache
date: Fri, 21 May 2021 07:36:30 GMT
set-cookie: _dyid_server=6440147674919822059; expires=Sat, 21-May-2022 07:36:30 GMT; path=/; domain=.kohls.com; secure
server-timing: cdn-cache; desc=HIT
server-timing: edge; dur=1
content-security-policy: block-all-mixed-content; frame-ancestors https://testzuiweb.kohls.zootweb.com https://testapplynow.kohls.zootweb.com 'self';
x-frame-options: SAMEORIGIN
strict-transport-security: max-age=15768000 ; preload
----

--Response 
HTTP/1.1 200
status: 200
content-type: text/html
content-length: 12
date: Fri, 21 May 2021 07:36:30 GMT
fwdhst: origin-ede-gcp-central-blue.kohls.com
set-cookie: akacd_EDE_GCP=2177452799~rv=28~id=b2fc86f1302c66eb48d1004b1bc770ef; path=/; Expires=Mon, 31 Dec 2038 23:59:59 GMT; Secure; SameSite=None
akamai-request-id2: 104.77.173.149:58e58818
access-control-allow-headers: X-APP-API_KEY, EDE-AB_VAR_PARAMS, Content-Type
access-control-allow-methods: GET, POST
access-control-allow-origin: *
----

--Response 
HTTP/1.1 403
status: 403
content-type: text/html; charset=UTF-8
content-encoding: br
date: Fri, 21 May 2021 07:36:32 GMT
server: gws
content-length: 1230
x-xss-protection: 0
x-frame-options: SAMEORIGIN
alt-svc: h3-29=\":443\"; ma=2592000,h3-T051=\":443\"; ma=2592000,h3-Q050=\":443\"; ma=2592000,h3-Q046=\":443\"; ma=2592000,h3-Q043=\":443\"; ma=2592000,quic=\":443\"; ma=2592000; v=\"46,43\"
----

--Response 
HTTP/1.1 403
status: 403
content-type: text/html; charset=UTF-8
content-encoding: br
date: Fri, 21 May 2021 07:36:32 GMT
server: gws
content-length: 1200
x-xss-protection: 0
x-frame-options: SAMEORIGIN
alt-svc: h3-29=\":443\"; ma=2592000,h3-T051=\":443\"; ma=2592000,h3-Q050=\":443\"; ma=2592000,h3-Q046=\":443\"; ma=2592000,h3-Q043=\":443\"; ma=2592000,quic=\":443\"; ma=2592000; v=\"46,43\"
----

--Response 
HTTP/1.1 200 OK
Date: Fri, 21 May 2021 07:36:31 GMT
Connection: close
Cache-Control: no-cache, no-store
Content-Type: text/html
Server: prod-xre-app49.lhr11
Pragma: no-cache
X-HW: 1621582591.dop020.lo4.shc,1621582591.dop020.lo4.t,1621582591.cds022.lo4.sc,1621582591.cds022.lo4.p
----

--Response 
HTTP/1.1 200
status: 200
cache-control: private,max-age=1800
content-length: 8911
content-type: application/javascript
content-encoding: gzip
last-modified: Fri, 21 May 2021 00:51:47 GMT
accept-ranges: bytes
etag: \"8013f579db4dd71:0\"
vary: Accept-Encoding
set-cookie: MUID=3D60CF6A727966AE3E39DF547318674C; domain=.bing.com; expires=Wed, 15-Jun-2022 07:36:31 GMT; path=/; SameSite=None; Secure;
set-cookie: MR=0; domain=bat.bing.com; expires=Fri, 28-May-2021 07:36:31 GMT; path=/; SameSite=None; Secure;
access-control-allow-origin: *
x-cache: CONFIG_NOCACHE
x-msedge-ref: Ref A: A8828F6CD6894713B4B95C2B48A2EC87 Ref B: DEL01EDGE0213 Ref C: 2021-05-21T07:36:31Z
date: Fri, 21 May 2021 07:36:30 GMT
----

--Response 
HTTP/1.1 200
status: 200
accept-ranges: bytes
content-type: application/x-javascript
etag: \"76ec4e573021c58c940627400b14e574:1621528998.531868\"
last-modified: Thu, 20 May 2021 16:43:18 GMT
server: AkamaiNetStorage
vary: Accept-Encoding
content-encoding: gzip
cache-control: max-age=3600
expires: Fri, 21 May 2021 08:36:31 GMT
date: Fri, 21 May 2021 07:36:31 GMT
content-length: 442
access-control-allow-origin: https://www.kohls.com
timing-allow-origin: *
----

--Response 
HTTP/1.1 200
status: 200
access-control-allow-origin: *
last-modified: Mon, 20 Jul 2020 18:50:50 GMT
etag: \"2df061c59bf2164346b98b1cf0b957da\"
server: Unknown
strict-transport-security: max-age=31536000; includeSubDomains
content-type: image/webp
content-length: 120
timing-allow-origin: *
expires: Fri, 28 May 2021 07:09:47 GMT
date: Fri, 21 May 2021 07:36:31 GMT
----

--Response 
HTTP/1.1 200
status: 200
access-control-allow-origin: *
last-modified: Wed, 24 Mar 2021 13:50:26 GMT
etag: \"d395f7723177d11a82831e675b60b2b7\"
server: Unknown
strict-transport-security: max-age=31536000; includeSubDomains
content-type: image/webp
content-length: 110
timing-allow-origin: *
expires: Fri, 21 May 2021 12:02:41 GMT
date: Fri, 21 May 2021 07:36:31 GMT
----

--Response 
HTTP/1.1 200
status: 200
access-control-allow-origin: *
last-modified: Thu, 08 Oct 2020 13:51:48 GMT
etag: \"2f08e974bce18b1371cabce2b997dd4e\"
server: Unknown
strict-transport-security: max-age=31536000; includeSubDomains
content-type: image/webp
content-length: 122
timing-allow-origin: *
expires: Fri, 21 May 2021 12:02:41 GMT
date: Fri, 21 May 2021 07:36:31 GMT
----

--Response 
HTTP/1.1 200
status: 200
content-type: image/webp
content-length: 80
access-control-allow-origin: *
last-modified: Tue, 02 Mar 2021 15:50:35 GMT
etag: \"389e387715377273432637f2cc6336b2\"
timing-allow-origin: *
server: Unknown
expires: Fri, 21 May 2021 12:02:42 GMT
date: Fri, 21 May 2021 07:36:31 GMT
----

--Response 
HTTP/1.1 200
status: 200
access-control-allow-origin: *
last-modified: Thu, 26 Mar 2020 13:20:26 GMT
etag: \"fec16182cf5b2fb2869ba163366e47d5\"
server: Unknown
strict-transport-security: max-age=31536000; includeSubDomains
content-type: image/webp
content-length: 2196
timing-allow-origin: *
expires: Fri, 28 May 2021 07:09:47 GMT
date: Fri, 21 May 2021 07:36:31 GMT
----

