
--Response 
HTTP/1.1 204
status: 204
access-control-allow-credentials: true
access-control-allow-origin: https://www.kohls.com
cache-control: no-cache, no-store, must-revalidate
date: Fri, 21 May 2021 08:05:30 GMT
----

--Response 
HTTP/1.1 200
status: 200
content-type: application/javascript
accept-ranges: bytes
content-encoding: br
etag: \"609c2f24-d777\"
last-modified: Thu, 20 May 2021 23:32:52 GMT
server: Akamai Resource Optimizer
x-origin-cc: max-age=86400
x-origin-cc: max-age=86400
x-origin-cc: max-age=86400
x-origin-ttl: Fri, 21 May 2021 23:32:52 GMT
x-origin-ttl: Fri, 21 May 2021 23:32:52 GMT
x-origin-ttl: Fri, 21 May 2021 23:32:52 GMT
content-length: 18055
cache-control: max-age=86400
expires: Sat, 22 May 2021 08:05:31 GMT
date: Fri, 21 May 2021 08:05:31 GMT
set-cookie: _dyid_server=7656119531360184738; expires=Sat, 21-May-2022 08:05:31 GMT; path=/; domain=.kohls.com; secure
server-timing: cdn-cache; desc=HIT
server-timing: edge; dur=2
content-security-policy: block-all-mixed-content; frame-ancestors https://testzuiweb.kohls.zootweb.com https://testapplynow.kohls.zootweb.com 'self';
x-frame-options: SAMEORIGIN
strict-transport-security: max-age=15768000 ; preload
----

--Response 
HTTP/1.1 200
status: 200
content-type: image/gif
content-length: 13138
last-modified: Wed, 12 May 2021 19:33:05 GMT
etag: \"609c2d71-3352\"
accept-ranges: bytes
cache-control: max-age=86400
expires: Sat, 22 May 2021 08:05:31 GMT
date: Fri, 21 May 2021 08:05:31 GMT
set-cookie: _dyid_server=7656119531360184738; expires=Sat, 21-May-2022 08:05:31 GMT; path=/; domain=.kohls.com; secure
set-cookie: mosaic=gcpb; expires=Sun, 20-Jun-2021 08:05:31 GMT; path=/; secure
server-timing: cdn-cache; desc=HIT
server-timing: edge; dur=8
server-timing: dtRpid;desc=\"-1546669304\"
content-security-policy: block-all-mixed-content; frame-ancestors https://testzuiweb.kohls.zootweb.com https://testapplynow.kohls.zootweb.com 'self';
x-frame-options: SAMEORIGIN
strict-transport-security: max-age=15768000 ; preload
----

--Response 
HTTP/1.1 200
status: 200
access-control-allow-origin: *
last-modified: Fri, 12 Apr 2019 10:42:28 GMT
etag: \"c0f544a5173166d59dfe1a948fbd2461\"
server: Unknown
strict-transport-security: max-age=31536000; includeSubDomains
timing-allow-origin: *
content-type: image/webp
content-length: 1462
expires: Thu, 27 May 2021 14:00:10 GMT
date: Fri, 21 May 2021 08:05:31 GMT
----

--Response 
HTTP/1.1 200
status: 200
access-control-allow-origin: *
last-modified: Fri, 12 Apr 2019 10:45:35 GMT
etag: \"3ee4fd20101fd7718e3a6dc9d225957a\"
server: Unknown
strict-transport-security: max-age=31536000; includeSubDomains
timing-allow-origin: *
content-type: image/webp
content-length: 1692
expires: Thu, 27 May 2021 14:00:10 GMT
date: Fri, 21 May 2021 08:05:31 GMT
----

--Response 
HTTP/1.1 200
status: 200
access-control-allow-origin: *
last-modified: Wed, 11 Mar 2020 19:14:55 GMT
etag: \"49194406feabb57b4f400e4a062bafea\"
server: Unknown
strict-transport-security: max-age=31536000; includeSubDomains
content-type: image/webp
content-length: 2124
timing-allow-origin: *
expires: Wed, 26 May 2021 11:52:19 GMT
date: Fri, 21 May 2021 08:05:31 GMT
----

--Response 
HTTP/1.1 200
status: 200
access-control-allow-origin: *
last-modified: Fri, 07 Jun 2019 17:20:53 GMT
etag: \"d5769882bf8d37e8c5414c4d292e0d7f\"
server: Unknown
strict-transport-security: max-age=31536000; includeSubDomains
content-type: image/webp
content-length: 1516
timing-allow-origin: *
expires: Thu, 27 May 2021 14:00:10 GMT
date: Fri, 21 May 2021 08:05:31 GMT
----

--Response 
HTTP/1.1 200
status: 200
access-control-allow-origin: *
last-modified: Mon, 21 Oct 2019 20:51:12 GMT
etag: \"674970aaec79b81caee9f10a7f287539\"
server: Unknown
strict-transport-security: max-age=31536000; includeSubDomains
content-type: image/webp
content-length: 2060
timing-allow-origin: *
expires: Wed, 26 May 2021 11:52:19 GMT
date: Fri, 21 May 2021 08:05:31 GMT
----

--Response 
HTTP/1.1 200
status: 200
content-type: image/png
content-length: 675
last-modified: Wed, 12 May 2021 19:40:19 GMT
etag: \"609c2f23-2a3\"
accept-ranges: bytes
cache-control: max-age=86400
expires: Sat, 22 May 2021 08:05:31 GMT
date: Fri, 21 May 2021 08:05:31 GMT
set-cookie: _dyid_server=7656119531360184738; expires=Sat, 21-May-2022 08:05:31 GMT; path=/; domain=.kohls.com; secure
set-cookie: mosaic=gcpb; expires=Sun, 20-Jun-2021 08:05:31 GMT; path=/; secure
server-timing: cdn-cache; desc=HIT
server-timing: edge; dur=23
server-timing: dtRpid;desc=\"-337757333\"
content-security-policy: block-all-mixed-content; frame-ancestors https://testzuiweb.kohls.zootweb.com https://testapplynow.kohls.zootweb.com 'self';
x-frame-options: SAMEORIGIN
strict-transport-security: max-age=15768000 ; preload
----

--Response 
HTTP/1.1 200
status: 200
content-type: image/png
content-length: 68
last-modified: Wed, 12 May 2021 19:40:19 GMT
etag: \"609c2f23-44\"
accept-ranges: bytes
cache-control: max-age=86400
expires: Sat, 22 May 2021 08:05:31 GMT
date: Fri, 21 May 2021 08:05:31 GMT
set-cookie: _dyid_server=7656119531360184738; expires=Sat, 21-May-2022 08:05:31 GMT; path=/; domain=.kohls.com; secure
set-cookie: mosaic=gcpb; expires=Sun, 20-Jun-2021 08:05:31 GMT; path=/; secure
server-timing: cdn-cache; desc=HIT
server-timing: edge; dur=70
server-timing: dtRpid;desc=\"1135885052\"
content-security-policy: block-all-mixed-content; frame-ancestors https://testzuiweb.kohls.zootweb.com https://testapplynow.kohls.zootweb.com 'self';
x-frame-options: SAMEORIGIN
strict-transport-security: max-age=15768000 ; preload
----

--Response 
HTTP/1.1 200
status: 200
content-type: image/png
content-length: 2761
last-modified: Wed, 12 May 2021 19:40:19 GMT
etag: \"609c2f23-ac9\"
accept-ranges: bytes
cache-control: max-age=86400
expires: Sat, 22 May 2021 08:05:31 GMT
date: Fri, 21 May 2021 08:05:31 GMT
set-cookie: _dyid_server=7656119531360184738; expires=Sat, 21-May-2022 08:05:31 GMT; path=/; domain=.kohls.com; secure
set-cookie: mosaic=gcpb; expires=Sun, 20-Jun-2021 08:05:31 GMT; path=/; secure
server-timing: cdn-cache; desc=HIT
server-timing: edge; dur=67
server-timing: dtRpid;desc=\"-389820675\"
content-security-policy: block-all-mixed-content; frame-ancestors https://testzuiweb.kohls.zootweb.com https://testapplynow.kohls.zootweb.com 'self';
x-frame-options: SAMEORIGIN
strict-transport-security: max-age=15768000 ; preload
----

--Response 
HTTP/1.1 200
status: 200
content-type: image/png
content-length: 2822
last-modified: Wed, 12 May 2021 19:40:19 GMT
etag: \"609c2f23-b06\"
accept-ranges: bytes
cache-control: max-age=86400
expires: Sat, 22 May 2021 08:05:31 GMT
date: Fri, 21 May 2021 08:05:31 GMT
set-cookie: _dyid_server=7656119531360184738; expires=Sat, 21-May-2022 08:05:31 GMT; path=/; domain=.kohls.com; secure
set-cookie: mosaic=gcpb; expires=Sun, 20-Jun-2021 08:05:31 GMT; path=/; secure
server-timing: cdn-cache; desc=HIT
server-timing: edge; dur=57
server-timing: dtRpid;desc=\"1108150732\"
content-security-policy: block-all-mixed-content; frame-ancestors https://testzuiweb.kohls.zootweb.com https://testapplynow.kohls.zootweb.com 'self';
x-frame-options: SAMEORIGIN
strict-transport-security: max-age=15768000 ; preload
----

--Response 
HTTP/1.1 200
status: 200
content-type: image/png
content-length: 5518
last-modified: Wed, 12 May 2021 19:40:19 GMT
etag: \"609c2f23-158e\"
accept-ranges: bytes
cache-control: max-age=86400
expires: Sat, 22 May 2021 08:05:31 GMT
date: Fri, 21 May 2021 08:05:31 GMT
set-cookie: _dyid_server=7656119531360184738; expires=Sat, 21-May-2022 08:05:31 GMT; path=/; domain=.kohls.com; secure
set-cookie: mosaic=gcpb; expires=Sun, 20-Jun-2021 08:05:31 GMT; path=/; secure
server-timing: cdn-cache; desc=HIT
server-timing: edge; dur=222
server-timing: dtRpid;desc=\"-618427166\"
content-security-policy: block-all-mixed-content; frame-ancestors https://testzuiweb.kohls.zootweb.com https://testapplynow.kohls.zootweb.com 'self';
x-frame-options: SAMEORIGIN
strict-transport-security: max-age=15768000 ; preload
----

--Response 
HTTP/1.1 200
status: 200
content-type: image/png
content-length: 917
last-modified: Wed, 12 May 2021 19:33:05 GMT
etag: \"609c2d71-395\"
accept-ranges: bytes
cache-control: max-age=86400
expires: Sat, 22 May 2021 08:05:31 GMT
date: Fri, 21 May 2021 08:05:31 GMT
set-cookie: _dyid_server=7656119531360184738; expires=Sat, 21-May-2022 08:05:31 GMT; path=/; domain=.kohls.com; secure
set-cookie: mosaic=gcpb; expires=Sun, 20-Jun-2021 08:05:31 GMT; path=/; secure
server-timing: cdn-cache; desc=HIT
server-timing: edge; dur=71
server-timing: dtRpid;desc=\"-218115368\"
content-security-policy: block-all-mixed-content; frame-ancestors https://testzuiweb.kohls.zootweb.com https://testapplynow.kohls.zootweb.com 'self';
x-frame-options: SAMEORIGIN
strict-transport-security: max-age=15768000 ; preload
----

--Response 
HTTP/1.1 200
status: 200
content-type: image/png
content-length: 322
last-modified: Wed, 12 May 2021 19:33:05 GMT
etag: \"609c2d71-142\"
accept-ranges: bytes
cache-control: max-age=86400
expires: Sat, 22 May 2021 08:05:31 GMT
date: Fri, 21 May 2021 08:05:31 GMT
set-cookie: _dyid_server=7656119531360184738; expires=Sat, 21-May-2022 08:05:31 GMT; path=/; domain=.kohls.com; secure
set-cookie: mosaic=gcpb; expires=Sun, 20-Jun-2021 08:05:31 GMT; path=/; secure
server-timing: cdn-cache; desc=HIT
server-timing: edge; dur=54
server-timing: dtRpid;desc=\"710000411\"
content-security-policy: block-all-mixed-content; frame-ancestors https://testzuiweb.kohls.zootweb.com https://testapplynow.kohls.zootweb.com 'self';
x-frame-options: SAMEORIGIN
strict-transport-security: max-age=15768000 ; preload
----

--Response 
HTTP/1.1 200
status: 200
content-type: image/png
content-length: 1760
last-modified: Wed, 12 May 2021 19:33:05 GMT
etag: \"609c2d71-6e0\"
accept-ranges: bytes
cache-control: max-age=86400
expires: Sat, 22 May 2021 08:05:31 GMT
date: Fri, 21 May 2021 08:05:31 GMT
set-cookie: _dyid_server=7656119531360184738; expires=Sat, 21-May-2022 08:05:31 GMT; path=/; domain=.kohls.com; secure
set-cookie: mosaic=gcpb; expires=Sun, 20-Jun-2021 08:05:31 GMT; path=/; secure
server-timing: cdn-cache; desc=HIT
server-timing: edge; dur=15
server-timing: dtRpid;desc=\"-2037668377\"
content-security-policy: block-all-mixed-content; frame-ancestors https://testzuiweb.kohls.zootweb.com https://testapplynow.kohls.zootweb.com 'self';
x-frame-options: SAMEORIGIN
strict-transport-security: max-age=15768000 ; preload
----

--Response 
HTTP/1.1 200
status: 200
content-type: image/png
content-length: 287
last-modified: Wed, 12 May 2021 19:33:05 GMT
etag: \"609c2d71-11f\"
accept-ranges: bytes
cache-control: max-age=86400
expires: Sat, 22 May 2021 08:05:31 GMT
date: Fri, 21 May 2021 08:05:31 GMT
set-cookie: _dyid_server=7656119531360184738; expires=Sat, 21-May-2022 08:05:31 GMT; path=/; domain=.kohls.com; secure
set-cookie: mosaic=gcpb; expires=Sun, 20-Jun-2021 08:05:31 GMT; path=/; secure
server-timing: cdn-cache; desc=HIT
server-timing: edge; dur=38
server-timing: dtRpid;desc=\"90575002\"
content-security-policy: block-all-mixed-content; frame-ancestors https://testzuiweb.kohls.zootweb.com https://testapplynow.kohls.zootweb.com 'self';
x-frame-options: SAMEORIGIN
strict-transport-security: max-age=15768000 ; preload
----

--Response 
HTTP/1.1 200
status: 200
access-control-allow-origin: *
last-modified: Wed, 11 Mar 2020 19:11:06 GMT
etag: \"0b72fdf5ed58cf8676b782de6a48d6ce\"
server: Unknown
strict-transport-security: max-age=31536000; includeSubDomains
content-type: image/webp
content-length: 13782
timing-allow-origin: *
expires: Wed, 26 May 2021 11:52:20 GMT
date: Fri, 21 May 2021 08:05:31 GMT
----

--Response 
HTTP/1.1 200
status: 200
access-control-allow-origin: *
last-modified: Fri, 12 Apr 2019 10:48:03 GMT
etag: \"d27959bc112092df3fe63c09f57a16da\"
server: Unknown
strict-transport-security: max-age=31536000; includeSubDomains
content-type: image/webp
content-length: 8784
timing-allow-origin: *
expires: Wed, 26 May 2021 11:52:20 GMT
date: Fri, 21 May 2021 08:05:31 GMT
----

--Response 
HTTP/1.1 200
status: 200
content-type: image/png
content-length: 2755
last-modified: Wed, 12 May 2021 19:40:19 GMT
etag: \"609c2f23-ac3\"
accept-ranges: bytes
cache-control: max-age=86400
expires: Sat, 22 May 2021 08:05:31 GMT
date: Fri, 21 May 2021 08:05:31 GMT
set-cookie: _dyid_server=7656119531360184738; expires=Sat, 21-May-2022 08:05:31 GMT; path=/; domain=.kohls.com; secure
set-cookie: mosaic=gcpb; expires=Sun, 20-Jun-2021 08:05:31 GMT; path=/; secure
server-timing: cdn-cache; desc=HIT
server-timing: edge; dur=9
server-timing: dtRpid;desc=\"-406727065\"
content-security-policy: block-all-mixed-content; frame-ancestors https://testzuiweb.kohls.zootweb.com https://testapplynow.kohls.zootweb.com 'self';
x-frame-options: SAMEORIGIN
strict-transport-security: max-age=15768000 ; preload
----

--Response 
HTTP/1.1 200
status: 200
content-type: image/svg+xml
accept-ranges: bytes
content-encoding: gzip
etag: \"609c2d71-126\"
last-modified: Tue, 18 May 2021 21:07:24 GMT
server: Akamai Resource Optimizer
x-origin-cc: max-age=86400
x-origin-cc: max-age=86400
x-origin-cc: max-age=86400
x-origin-cc: max-age=86400
x-origin-cc: max-age=86400
x-origin-cc: max-age=86400
x-origin-cc: max-age=86400
x-origin-ttl: Wed, 19 May 2021 21:07:23 GMT
x-origin-ttl: Wed, 19 May 2021 21:07:23 GMT
x-origin-ttl: Wed, 19 May 2021 21:07:23 GMT
x-origin-ttl: Wed, 19 May 2021 21:07:23 GMT
x-origin-ttl: Wed, 19 May 2021 21:07:23 GMT
x-origin-ttl: Wed, 19 May 2021 21:07:23 GMT
x-origin-ttl: Wed, 19 May 2021 21:07:23 GMT
content-length: 212
cache-control: max-age=86400
expires: Sat, 22 May 2021 08:05:31 GMT
date: Fri, 21 May 2021 08:05:31 GMT
vary: Accept-Encoding
set-cookie: _dyid_server=7656119531360184738; expires=Sat, 21-May-2022 08:05:31 GMT; path=/; domain=.kohls.com; secure
server-timing: cdn-cache; desc=HIT
server-timing: edge; dur=314
server-timing: dtRpid;desc=\"1553430330\"
content-security-policy: block-all-mixed-content; frame-ancestors https://testzuiweb.kohls.zootweb.com https://testapplynow.kohls.zootweb.com 'self';
x-frame-options: SAMEORIGIN
strict-transport-security: max-age=15768000 ; preload
----

--Response 
HTTP/1.1 200
status: 200
content-type: image/png
content-length: 182
last-modified: Wed, 12 May 2021 19:33:05 GMT
etag: \"609c2d71-b6\"
accept-ranges: bytes
cache-control: max-age=86400
expires: Sat, 22 May 2021 08:05:31 GMT
date: Fri, 21 May 2021 08:05:31 GMT
set-cookie: _dyid_server=7656119531360184738; expires=Sat, 21-May-2022 08:05:31 GMT; path=/; domain=.kohls.com; secure
set-cookie: mosaic=gcpb; expires=Sun, 20-Jun-2021 08:05:31 GMT; path=/; secure
server-timing: cdn-cache; desc=HIT
server-timing: edge; dur=7
server-timing: dtRpid;desc=\"-597962742\"
content-security-policy: block-all-mixed-content; frame-ancestors https://testzuiweb.kohls.zootweb.com https://testapplynow.kohls.zootweb.com 'self';
x-frame-options: SAMEORIGIN
strict-transport-security: max-age=15768000 ; preload
----

--Response 
HTTP/1.1 200
status: 200
content-type: image/png
content-length: 3928
last-modified: Wed, 12 May 2021 19:40:19 GMT
etag: \"609c2f23-f58\"
accept-ranges: bytes
cache-control: max-age=86400
expires: Sat, 22 May 2021 08:05:32 GMT
date: Fri, 21 May 2021 08:05:32 GMT
set-cookie: _dyid_server=7656119531360184738; expires=Sat, 21-May-2022 08:05:32 GMT; path=/; domain=.kohls.com; secure
set-cookie: mosaic=gcpb; expires=Sun, 20-Jun-2021 08:05:32 GMT; path=/; secure
server-timing: cdn-cache; desc=HIT
server-timing: edge; dur=206
server-timing: dtRpid;desc=\"-1272186320\"
content-security-policy: block-all-mixed-content; frame-ancestors https://testzuiweb.kohls.zootweb.com https://testapplynow.kohls.zootweb.com 'self';
x-frame-options: SAMEORIGIN
strict-transport-security: max-age=15768000 ; preload
----

--Response 
HTTP/1.1 200
status: 200
last-modified: Mon, 26 Apr 2021 16:10:06 GMT
etag: \"d1dbb955755ca44a0b872a64f97c471a45b14e941f69d082c19f792576ae34fb\"
content-type: application/javascript
content-encoding: gzip
content-length: 19642
expires: Fri, 21 May 2021 08:05:32 GMT
pragma: no-cache
date: Fri, 21 May 2021 08:05:32 GMT
vary: Accept-Encoding
set-cookie: _dyid_server=7656119531360184738; expires=Sat, 21-May-2022 08:05:32 GMT; path=/; domain=.kohls.com; secure
cache-control: max-age=21600
server-timing: cdn-cache; desc=HIT
server-timing: edge; dur=1
content-security-policy: block-all-mixed-content; frame-ancestors https://testzuiweb.kohls.zootweb.com https://testapplynow.kohls.zootweb.com 'self';
x-frame-options: SAMEORIGIN
strict-transport-security: max-age=15768000 ; preload
----

--Response 
HTTP/1.1 200
status: 200
last-modified: Wed, 12 May 2021 16:44:06 GMT
etag: \"85a455336c5679f86581ba35c69cc24469bd5ce3b4eaae567a7a69bc0775d19b\"
content-type: text/css
content-encoding: gzip
content-length: 610
expires: Fri, 21 May 2021 08:05:32 GMT
cache-control: max-age=0, no-cache, no-store
pragma: no-cache
date: Fri, 21 May 2021 08:05:32 GMT
vary: Accept-Encoding
set-cookie: _dyid_server=7656119531360184738; expires=Sat, 21-May-2022 08:05:32 GMT; path=/; domain=.kohls.com; secure
server-timing: cdn-cache; desc=HIT
server-timing: edge; dur=1
content-security-policy: block-all-mixed-content; frame-ancestors https://testzuiweb.kohls.zootweb.com https://testapplynow.kohls.zootweb.com 'self';
x-frame-options: SAMEORIGIN
strict-transport-security: max-age=15768000 ; preload
----

--Response 
HTTP/1.1 200
status: 200
last-modified: Wed, 12 May 2021 16:44:06 GMT
etag: \"f2b828bcd1b18ef766ba39f60bfa5b9903684457985f22ff9f80ffc632dfbb75\"
content-type: application/javascript
content-encoding: gzip
content-length: 3258
expires: Fri, 21 May 2021 08:05:32 GMT
cache-control: max-age=0, no-cache, no-store
pragma: no-cache
date: Fri, 21 May 2021 08:05:32 GMT
vary: Accept-Encoding
set-cookie: _dyid_server=7656119531360184738; expires=Sat, 21-May-2022 08:05:32 GMT; path=/; domain=.kohls.com; secure
server-timing: cdn-cache; desc=HIT
server-timing: edge; dur=1
content-security-policy: block-all-mixed-content; frame-ancestors https://testzuiweb.kohls.zootweb.com https://testapplynow.kohls.zootweb.com 'self';
x-frame-options: SAMEORIGIN
strict-transport-security: max-age=15768000 ; preload
----

--Response 
HTTP/1.1 200
status: 200
content-type: image/png
content-length: 3120
last-modified: Wed, 12 May 2021 19:33:05 GMT
etag: \"609c2d71-c30\"
accept-ranges: bytes
cache-control: max-age=86400
expires: Sat, 22 May 2021 08:05:32 GMT
date: Fri, 21 May 2021 08:05:32 GMT
set-cookie: _dyid_server=7656119531360184738; expires=Sat, 21-May-2022 08:05:32 GMT; path=/; domain=.kohls.com; secure
set-cookie: mosaic=gcpb; expires=Sun, 20-Jun-2021 08:05:32 GMT; path=/; secure
server-timing: cdn-cache; desc=HIT
server-timing: edge; dur=12
server-timing: dtRpid;desc=\"998685645\"
content-security-policy: block-all-mixed-content; frame-ancestors https://testzuiweb.kohls.zootweb.com https://testapplynow.kohls.zootweb.com 'self';
x-frame-options: SAMEORIGIN
strict-transport-security: max-age=15768000 ; preload
----

