
--Response 
HTTP/1.1 503 Service Unavailable
Server: squid/3.5.12
Mime-Version: 1.0
Date: Wed, 07 Apr 2021 13:57:55 GMT
Content-Type: text/html;charset=utf-8
Content-Length: 4082
X-Squid-Error: ERR_DNS_FAIL 0
Vary: Accept-Language
Content-Language: en-gb
X-Cache: MISS from 10.10.30.96
X-Cache-Lookup: MISS from 10.10.30.96:3128
Via: 1.1 10.10.30.96 (squid/3.5.12)
Connection: keep-alive
----

--Response 
HTTP/1.1 200 OK
Date: Wed, 07 Apr 2021 13:57:55 GMT
Server: squid/3.5.12
Mime-Version: 1.0
Content-Type: image/png
Content-Length: 11366
Last-Modified: Thu, 07 May 2020 19:19:53 GMT
Cache-Control: max-age=86400
X-Cache: HIT from 10.10.30.96
X-Cache-Lookup: HIT from 10.10.30.96:3128
Via: 1.1 10.10.30.96 (squid/3.5.12)
Connection: keep-alive
----

