--Request 
POST https://mail.google.com/sync/u/0/i/fd?hl=en&c=6
Host: mail.google.com
Host: mail.google.com
Connection: keep-alive
Content-Length: 396
Origin: https://mail.google.com
X-Google-BTD: 1
X-Framework-Xsrf-Token: AKwhgQoAeRB1R--DnxSE2rzi_fHyJZuGDQ:1619590590512
X-Gmail-BTAI: {\"3\":{\"6\":0,\"10\":1,\"13\":1,\"15\":0,\"16\":1,\"17\":1,\"18\":0,\"19\":1,\"22\":1,\"23\":1,\"24\":1,\"25\":1,\"26\":1,\"27\":1,\"28\":1,\"29\":0,\"30\":1,\"31\":1,\"32\":1,\"33\":1,\"34\":1,\"35\":0,\"36\":1,\"37\":\"en\",\"38\":\"Mozilla/5.0 (Windows NT 10.0; Win64; x64) AppleWebKit/537.36 (KHTML, like Gecko) Chrome/79.0.3945.130 Safari/537.36\",\"39\":1,\"40\":0,\"41\":25,\"43\":0,\"44\":1,\"45\":0,\"46\":1,\"47\":1,\"48\":1,\"49\":1,\"50\":1,\"52\":1,\"53\":1,\"54\":0,\"55\":1,\"56\":1,\"57\":0,\"58\":0,\"60\":0,\"61\":0,\"62\":0,\"63\":0,\"64\":0},\"5\":\"3ea5edf7c4\",\"7\":25,\"8\":\"gmail_fe_210421.06_p2\",\"9\":1,\"10\":5,\"11\":\"\",\"12\":19800000,\"13\":\"+05:30\",\"14\":1,\"16\":370149053,\"17\":\"\",\"18\":\"\",\"19\":\"1619591940128\",\"21\":\"2285366\"}
User-Agent: Mozilla/5.0 (Windows NT 10.0; Win64; x64) AppleWebKit/537.36 (KHTML, like Gecko) Chrome/79.0.3945.130 Safari/537.36
Content-Type: application/json
Accept: */*
Sec-Fetch-Site: same-origin
Sec-Fetch-Mode: cors
Referer: https://mail.google.com/mail/u/0/
Accept-Encoding: gzip, deflate, br
Accept-Language: en-GB,en-US;q=0.9,en;q=0.8
Cookie: COMPASS=bigtop-sync=CrMBAAlriVdio4GYdE47hft4CVj9nIujGJRC2gE-l2x4iYOuytBxj0hXh54zqXse7KdnGBnQcXUA3ktNfGfBWzsHovoAsX1feek9600QrcA5T9nTDX7iW5-FLxzD_GyGcYbbhFVyaofbPA0hUY30y_LPJDfn9K7oHEYmmKQqEXxnMo2k3NNtq-qvy7IlbDCBQ8EKaEKJqjdkUedencZKEnMeFQgdIl0mvhvcjmOy4oc8g1t7OtAQ3qGkhAYaxgEACWuJV9cp6bwm13H9YhubfmwRijKJmSJLRM1CcmbxHU9-HlzU0MqijZ20NLyszP1NMaRi2yezF1nJZ3VUe1PiGxj4AguZ4eHkA0Pb_zTCw6YrBZlkU15C6b97tcNiHnOSfgJkM2cM_1qAAfp9O_yAR4PiMt_RWgPN6_g20ti4vYekfoJ_nt3WHrvqGdIU8BXqJlOxroKDLi0Uem2H11CExVwdW5uY9p04znPNHQUjSh8aEI2RXYoWfjtdfhQ_4e_a8u8mTJE; SID=8wdD23M0zT1muB_G7zm1RcdpXcTV9pgu899MrjEHx4F9koQYO2nUhhv57bJP9jOa-xXwCQ.; __Secure-3PSID=8wdD23M0zT1muB_G7zm1RcdpXcTV9pgu899MrjEHx4F9koQYA-wfYnEQ-ysFwqZqC3qmBw.; HSID=ARsC0xTZAuXrWMsnv; SSID=AcVA6-GGICXqf9J2j; APISID=YJ2-WvqJsfDZ_6LX/Aw6EB3te0F5GcNF_4; SAPISID=eZPEKcNhzxFHpS8e/AXrnV3TZ36Wk7edFa; __Secure-3PAPISID=eZPEKcNhzxFHpS8e/AXrnV3TZ36Wk7edFa; OSID=8wdD21cKUsamKkGJ6HJXSnsPg4UPBk157jsau9hrY1GSizlJQlAwBdRVAXQcJeKakWcVfA.; __Secure-OSID=8wdD21cKUsamKkGJ6HJXSnsPg4UPBk157jsau9hrY1GSizlJ9bONwH7jlYcy7-LQuRTP6w.; 1P_JAR=2021-04-28-06; SEARCH_SAMESITE=CgQIuZIB; NID=214=Atokn4Q0yZ25GhTZ0XijMI0V-LFxghRKeweF5LkHOyn-q7mDEKj5k3YK3WToFskS25eBOSFJdzjSYHxnrhwXOzAYkaSFdjVHwAwBZEgAzS9qSzi1kIaTqF0rsQjFxRWrSW-6OUYKFsLMQ_jcZWJ-DuOfdICtr2YjqCqONVISBjjuGWXDN4P79gWIBVUBHMXSg5EshyeoWIsy78ZLcQ; SIDCC=AJi4QfGa9cloCgizjGTfvQgGDRM2-vryvSO8dzABbK2ZZjnTYzPpHT7stUv9moXgY4gQ_KyC; __Secure-3PSIDCC=AJi4QfFANmm8wHrStOHXO8AKCsXYxFaO-Sq58q9kFEh5bJQPuRVOMy06M_ttbPT3LW9MQWNGjQ
----
 POSTDATA {"1":[{"1":"thread-f:1670192958183104061","3":["msg-f:1670192958183104061","msg-f:1670193400903471421"]},{"1":"thread-f:1669487694589599445","3":["msg-f:1669487694589599445"]},{"1":"thread-f:1668936936159725380","3":["msg-f:1668936936159725380"]},{"1":"thread-f:1668312532308976902","3":["msg-f:1668312532308976902"]},{"1":"thread-f:1668310523549721514","3":["msg-f:1668310523549721514"]}],"2":2}
--Response 
HTTP/1.1 200
status: 200
content-type: application/json; charset=UTF-8
x-content-type-options: nosniff
content-disposition: attachment; filename=\"response.txt\"
cache-control: no-cache, no-store, max-age=0, must-revalidate
content-encoding: gzip
x-goog-server-latency: 160
date: Wed, 28 Apr 2021 06:39:01 GMT
x-frame-options: SAMEORIGIN
content-security-policy: frame-ancestors 'self'
x-xss-protection: 1; mode=block
server: GSE
set-cookie: SIDCC=AJi4QfHPfAOXGSnhjfcDknxdrMSD7bnUARcuVEOtWjML6e351Jxr394ASj7MrwWHrqDKDzOR; expires=Thu, 28-Apr-2022 06:39:01 GMT; path=/; domain=.google.com; priority=high
set-cookie: __Secure-3PSIDCC=AJi4QfED1vAQAELJb8t5DSJhpRKsdtUCZ_52svzdmF8K64x2ZmaVimcQLz4culsfppnhU_FySA; expires=Thu, 28-Apr-2022 06:39:01 GMT; path=/; domain=.google.com; Secure; HttpOnly; priority=high; SameSite=none
alt-svc: clear
expires: Wed, 28 Apr 2021 06:39:01 GMT
----

