
--Response 
HTTP/1.1 200
status: 200
content-length: 0000000001
content-type: text/plain
access-control-allow-origin: https://www.kohls.com
timing-allow-origin: *
access-control-allow-credentials: true
access-control-allow-methods: POST, PUT, DELETE, GET, OPTIONS
access-control-request-headers: *
access-control-allow-headers: Origin, X-Requested-With, Content-Type, Accept, Authorization, Content-Encoding
access-control-max-age: 300
expires: Fri, 21 May 2021 08:06:33 GMT
cache-control: max-age=0, no-cache, no-store
pragma: no-cache
date: Fri, 21 May 2021 08:06:33 GMT
set-cookie: Cavisson_Netvision=21616650.20480.0000; expires=Fri, 21-May-2021 08:46:32 GMT; path=/; Httponly; Secure
----

--Response 
HTTP/1.1 200
status: 200
date: Fri, 21 May 2021 08:06:39 GMT
content-type: image/png; charset=utf-8
content-length: 95
cf-cache-status: DYNAMIC
cf-request-id: 0a2f8f625b000039775b2a6000000001
expect-ct: max-age=604800, report-uri=\"https://report-uri.cloudflare.com/cdn-cgi/beacon/expect-ct\"
server: cloudflare
cf-ray: 652c4e7d5bee3977-MAA
alt-svc: h3-27=\":443\"; ma=86400, h3-28=\":443\"; ma=86400, h3-29=\":443\"; ma=86400
----

