
--Response 
HTTP/1.1 204
status: 204
cache-control: no-store, no-cache, must-revalidate, post-check=0, pre-check=0
pragma: no-cache
expires: Fri, 21 May 2021 08:05:42 GMT
p3p: policyref=\"/w3c/p3p.xml\", CP=\"ALL BUS LEG DSP COR ADM CUR DEV PSA OUR NAV INT\"
set-cookie: brwsr=38bf4dbd-ba0b-11eb-a1f4-42010a24631e; Domain=.sjv.io; Path=/; Secure; Max-Age=62208000; Expires=Thu, 11 May 2023 08:05:42 GMT; HttpOnly
content-length: 0
date: Fri, 21 May 2021 08:05:42 GMT
via: 1.1 google
alt-svc: clear
----

