--Request 
POST https://ing-district.clicktale.net/ctn_v2/wr/?3301609570255062&24&11&15&0&4&8&subsid=233441&msgsize=120
Host: ing-district.clicktale.net
Host: ing-district.clicktale.net
Connection: keep-alive
Content-Length: 9853
Origin: https://www.kohls.com
User-Agent: Mozilla/5.0 (Windows NT 10.0; WOW64) AppleWebKit/537.36 (KHTML, like Gecko) Chrome/56.0.2924.87 Safari/537.36
Content-Type: text/plain
Accept: */*
Sec-Fetch-Site: cross-site
Sec-Fetch-Mode: cors
Referer: https://www.kohls.com/product/prd-3847510/womens-apt-9-tummy-control-shorts.jsp?color=Medium%20Wash&prdPV=1
Accept-Encoding: gzip, deflate, br
Accept-Language: en-GB,en-US;q=0.9,en;q=0.8
----
 POSTDATA qcm_buffer_timing_fix&9726&9CX+P_(%5B%7B%22type%22%3A0%2C%22addedNodes%22%3A%5B%7B%22nodeType%22%3A8%2C%22id%22%3A%22%23comment112%22%2C%22type%22%3A1%2C%22parentNode%22%3A%22BODY1%22%7D%5D%2C%22removedNodes%22%3A%5B%5D%7D%2C%7B%22type%22%3A0%2C%22addedNodes%22%3A%5B%7B%22nodeType%22%3A3%2C%22id%22%3A%22%23text2101%22%2C%22type%22%3A1%2C%22parentNode%22%3A%22BODY1%22%2C%22textContent%22%3A%22%5Cn%20%22%7D%5D%2C%22removedNodes%22%3A%5B%5D%7D%2C%7B%22type%22%3A0%2C%22addedNodes%22%3A%5B%7B%22nodeType%22%3A1%2C%22id%22%3A%22IMG25%22%2C%22type%22%3A1%2C%22parentNode%22%3A%22BODY1%22%2C%22tagName%22%3A%22IMG%22%2C%22attributes%22%3A%7B%22src%22%3A%22https%3A%2F%2Flogin.dotomi.com%2Fucm%2FUCMController%3Fdtm_com%3D28%26dtm_cid%3D2683%26dtm_cmagic%3D8420d3%26dtm_fid%3D101%26dtm_format%3D6%26cli_promo_id%3D5%26dtm_email_hash%3DN%2FA%26dtm_user_id%3Dc68333f4-b7d4-42dd-be5f-49d1eb509125%26dtmc_department%3Dclothing%26dtmc_category%3Dbottoms%26dtmc_sub_category%3Dshorts%26dtmc_product_id%3D3847510%22%2C%22width%22%3A%221%22%2C%22height%22%3A%221%22%2C%22border%22%3A%220%22%2C%22style%22%3A%22display%3Anone%3B%22%7D%7D%5D%2C%22removedNodes%22%3A%5B%5D%7D%2C%7B%22type%22%3A0%2C%22addedNodes%22%3A%5B%7B%22nodeType%22%3A3%2C%22id%22%3A%22%23text2102%22%2C%22type%22%3A1%2C%22parentNode%22%3A%22BODY1%22%2C%22textContent%22%3A%22%20%5Cn%20%22%7D%5D%2C%22removedNodes%22%3A%5B%5D%7D%2C%7B%22type%22%3A0%2C%22addedNodes%22%3A%5B%7B%22nodeType%22%3A8%2C%22id%22%3A%22%23comment113%22%2C%22type%22%3A1%2C%22parentNode%22%3A%22BODY1%22%7D%5D%2C%22removedNodes%22%3A%5B%5D%7D%5D)&VP_([{"type":1,"attribute":{"attributeName":"nvsensitive","attributeValue":"","id":"INPUT7"}},{"type":1,"attribute":{"attributeName":"nvsensitive","attributeValue":"","id":"DIV17"}}])&GP_([{"type":0,"addedNodes":[{"nodeType":1,"id":"SCRIPT191","type":1,"parentNode":"HEAD1","tagName":"SCRIPT"}],"removedNodes":[]}])&BP_([{"type":1,"attribute":{"attributeName":"nvsensitive","attributeValue":"","id":"INPUT7"}},{"type":1,"attribute":{"attributeName":"nvsensitive","attributeValue":"","id":"DIV17"}}])&HP_([{"type":0,"addedNodes":[{"nodeType":1,"id":"STYLE24","type":1,"nextSibling":"LINK24","tagName":"STYLE","attributes":{"type":"text/css"},"childNodes":[{"nodeType":3,"id":"#text2103","textContent":".tfc-cfg-widget,.tfc-cfg-core {display: none}"}]}],"removedNodes":[]},{"type":1,"attribute":{"attributeName":"data-styleid-private","attributeValue":"3847510","id":"DIV159"}}])&nP_([{"type":1,"attribute":{"attributeName":"nvsensitive","attributeValue":"","id":"INPUT7"}},{"type":1,"attribute":{"attributeName":"nvsensitive","attributeValue":"","id":"DIV17"}}])&EP_([{"type":0,"addedNodes":[{"nodeType":1,"id":"STYLE25","type":1,"parentNode":"HEAD1","tagName":"STYLE","attributes":{"data-emotion":""},"childNodes":[{"nodeType":3,"id":"#text2104","textContent":""}]}],"removedNodes":[]},{"type":0,"addedNodes":[],"removedNodes":[{"id":"IMG24"}]}])&79P_([{"type":1,"attribute":{"attributeName":"nvsensitive","attributeValue":"","id":"INPUT7"}},{"type":1,"attribute":{"attributeName":"nvsensitive","attributeValue":"","id":"DIV17"}}])&FP_([{"type":0,"addedNodes":[{"nodeType":1,"id":"SCRIPT192","type":1,"nextSibling":"SCRIPT190","tagName":"SCRIPT"}],"removedNodes":[]}])&8BJP_([{"type":1,"attribute":{"attributeName":"nvsensitive","attributeValue":"","id":"INPUT7"}},{"type":1,"attribute":{"attributeName":"nvsensitive","attributeValue":"","id":"DIV17"}}])&GZOGdWG9GLDAP_([{"type":1,"attribute":{"attributeName":"nvsensitive","attributeValue":"","id":"INPUT7"}},{"type":1,"attribute":{"attributeName":"nvsensitive","attributeValue":"","id":"DIV17"}}])&JZOHPWH9C++AP_([{"type":1,"attribute":{"attributeName":"nvsensitive","attributeValue":"","id":"INPUT7"}},{"type":1,"attribute":{"attributeName":"nvsensitive","attributeValue":"","id":"DIV17"}}])&TP_([{"type":0,"addedNodes":[{"nodeType":1,"id":"SCRIPT193","type":1,"nextSibling":"SCRIPT192","tagName":"SCRIPT"}],"removedNodes":[]}])&SP_([{"type":1,"attribute":{"attributeName":"nvsensitive","attributeValue":"","id":"INPUT7"}},{"type":1,"attribute":{"attributeName":"nvsensitive","attributeValue":"","id":"DIV17"}}])&GP_([{"type":0,"addedNodes":[],"removedNodes":[{"id":"SCRIPT190"}]}])&hP_([{"type":0,"addedNodes":[{"nodeType":1,"id":"SCRIPT194","type":1,"parentNode":"BODY1","tagName":"SCRIPT"}],"removedNodes":[]}])&jP_([{"type":1,"attribute":{"attributeName":"nvsensitive","attributeValue":"","id":"INPUT7"}},{"type":1,"attribute":{"attributeName":"nvsensitive","attributeValue":"","id":"DIV17"}}])&GP_([{"type":0,"addedNodes":[{"nodeType":1,"id":"SCRIPT195","type":1,"parentNode":"HEAD1","tagName":"SCRIPT"}],"removedNodes":[]}])&JP_([{"type":1,"attribute":{"attributeName":"nvsensitive","attributeValue":"","id":"INPUT7"}},{"type":1,"attribute":{"attributeName":"nvsensitive","attributeValue":"","id":"DIV17"}}])&IP_([{"type":0,"addedNodes":[{"nodeType":1,"id":"SCRIPT196","type":1,"nextSibling":"SCRIPT193","tagName":"SCRIPT"}],"removedNodes":[]}])&8BDP_([{"type":1,"attribute":{"attributeName":"nvsensitive","attributeValue":"","id":"INPUT7"}},{"type":1,"attribute":{"attributeName":"nvsensitive","attributeValue":"","id":"DIV17"}}])&OP_([{"type":0,"addedNodes":[{"nodeType":1,"id":"SCRIPT197","type":1,"nextSibling":"SCRIPT196","tagName":"SCRIPT"}],"removedNodes":[]}])&QP_([{"type":1,"attribute":{"attributeName":"nvsensitive","attributeValue":"","id":"INPUT7"}},{"type":1,"attribute":{"attributeName":"nvsensitive","attributeValue":"","id":"DIV17"}}])&xP_([{"type":0,"addedNodes":[{"nodeType":1,"id":"LINK25","type":1,"parentNode":"HEAD1","tagName":"LINK","attributes":{"media":"only x","rel":"stylesheet","type":"text/css","href":"https://s3.amazonaws.com/nv-p1-s3-assets-01/233441/24/CSS/https/display.ugc.bazaarvoice.com/static/Kohls/redesign/1292/9025_10_0/en_US/stylesheets/screen.css"}}],"removedNodes":[]}])&QP_([{"type":1,"attribute":{"attributeName":"nvsensitive","attributeValue":"","id":"INPUT7"}},{"type":1,"attribute":{"attributeName":"nvsensitive","attributeValue":"","id":"DIV17"}}])&iZOI8FUWI9KWFBP_([{"type":1,"attribute":{"attributeName":"nvsensitive","attributeValue":"","id":"INPUT7"}},{"type":1,"attribute":{"attributeName":"nvsensitive","attributeValue":"","id":"DIV17"}}])&8BHP_([{"type":1,"attribute":{"attributeName":"class","attributeValue":"fp-root fp-site-language-en","id":"DIV372"}}])&8BRP_([{"type":1,"attribute":{"attributeName":"data-attached","attributeValue":"true","id":"DIV372"}},{"type":0,"addedNodes":[{"nodeType":1,"id":"DIV409","type":1,"parentNode":"DIV372","tagName":"DIV","attributes":{"class":"fp-element","role":"widget"},"childNodes":[{"nodeType":1,"id":"DIV410","tagName":"DIV","attributes":{"class":"fp-logo-container"},"childNodes":[{"nodeType":1,"id":"DIV411","tagName":"DIV","attributes":{"class":"fp-logo"}},{"nodeType":1,"id":"DIV412","tagName":"DIV","attributes":{"class":"fp-logo-text","tabindex":"0","role":"button"},"childNodes":[{"nodeType":3,"id":"#text2360","textContent":"Fit Predictor"}]}]},{"nodeType":1,"id":"DIV413","tagName":"DIV","attributes":{"class":"fp-info-container"},"childNodes":[{"nodeType":1,"id":"DIV414","tagName":"DIV","attributes":{"class":"fp-cta"},"childNodes":[{"nodeType":3,"id":"#text2361","textContent":"Calculate your size"}]}]}]}],"removedNodes":[]},{"type":0,"addedNodes":[{"id":"DIV411","type":0,"parentNode":"DIV410"}],"removedNodes":[]},{"type":0,"addedNodes":[{"id":"DIV412","type":0,"parentNode":"DIV410"}],"removedNodes":[]},{"type":0,"addedNodes":[{"id":"DIV414","type":0,"parentNode":"DIV413"}],"removedNodes":[]}])&sP_([{"type":1,"attribute":{"attributeName":"nvsensitive","attributeValue":"","id":"INPUT7"}},{"type":1,"attribute":{"attributeName":"nvsensitive","attributeValue":"","id":"DIV17"}}])&JP_([{"type":0,"addedNodes":[{"nodeType":1,"id":"SCRIPT198","type":1,"nextSibling":"SCRIPT197","tagName":"SCRIPT"}],"removedNodes":[]}])&EP_([{"type":1,"attribute":{"attributeName":"nvsensitive","attributeValue":"","id":"INPUT7"}},{"type":1,"attribute":{"attributeName":"nvsensitive","attributeValue":"","id":"DIV17"}}])&GP_([{"type":0,"addedNodes":[{"nodeType":1,"id":"SCRIPT199","type":1,"nextSibling":"SCRIPT198","tagName":"SCRIPT"}],"removedNodes":[]}])&LP_([{"type":1,"attribute":{"attributeName":"nvsensitive","attributeValue":"","id":"INPUT7"}},{"type":1,"attribute":{"attributeName":"nvsensitive","attributeValue":"","id":"DIV17"}}])&MP_([{"type":0,"addedNodes":[{"nodeType":1,"id":"SCRIPT200","type":1,"nextSibling":"SCRIPT199","tagName":"SCRIPT"}],"removedNodes":[]}])&DP_([{"type":1,"attribute":{"attributeName":"nvsensitive","attributeValue":"","id":"INPUT7"}},{"type":1,"attribute":{"attributeName":"nvsensitive","attributeValue":"","id":"DIV17"}}])&NP_([{"type":1,"attribute":{"attributeName":"media","attributeValue":"all","id":"LINK25"}}])&2P_([{"type":0,"addedNodes":[],"removedNodes":[{"id":"DIV409"}]},{"type":0,"addedNodes":[{"nodeType":1,"id":"DIV415","type":1,"parentNode":"DIV372","tagName":"DIV","attributes":{"class":"fp-sud-prediction fp-detailed","role":"button","tabindex":"0","title":"Fit Predictor"},"childNodes":[{"nodeType":1,"id":"DIV416","tagName":"DIV","attributes":{"class":"fp-logo"}},{"nodeType":1,"id":"DIV417","tagName":"DIV","attributes":{"class":"fp-prediction"},"childNodes":[{"nodeType":3,"id":"#text2362","textContent":"Item runs"}]},{"nodeType":1,"id":"DIV418","tagName":"DIV","attributes":{"class":"fp-recommendation"},"childNodes":[{"nodeType":3,"id":"#text2363","textContent":"True to size"}]}]}],"removedNodes":[]}])&8DVP_([{"type":1,"attribute":{"attributeName":"nvsensitive","attributeValue":"","id":"INPUT7"}},{"type":1,"attribute":{"attributeName":"nvsensitive","attributeValue":"","id":"DIV17"}}])&TP_([{"type":0,"addedNodes":[{"nodeType":1,"id":"SCRIPT201","type":1,"parentNode":"BODY1","tagName":"SCRIPT"}],"removedNodes":[]}])&8Brqcm_buffer_timing_fix&11315&F
--Response 
HTTP/1.1 200
status: 200
date: Fri, 21 May 2021 08:11:03 GMT
content-type: text/plain; charset=UTF-8
content-length: 1
access-control-allow-origin: *
----
--Request 
GET https://network.bazaarvoice.com/st.gif?loadId=970468168939e84903c&BVBRANDID=30ad36b4-f9e4-49a0-b82f-eb2d5eb1dcf2&BVBRANDSID=29cbbe58-b9ad-4706-bcf2-bfd7cc883804&BVCRL8ID=068c684e-15f8-4262-85ea-f4ff070a5cd0&tz=-330&sourceVersion=3.13.4&magpieJsVersion=3.13.4&source=bv-loader&environment=prod&client=Kohls&dc=9025_10_0&host=www.kohls.com&r_batch=!((bvProduct:ReviewHighlights,bvProductVersion:%273.2.6%27,cl:Impression,collectionId:235,collectionName:satisfaction,contentId:%27178560159-sr:0:63%27,contentType:Snippet,deploymentZone:redesign,displaySegment:baseline,locale:en_US,productId:%273847510%27,type:UGC))&_=n8dsqk
Host: network.bazaarvoice.com
Host: network.bazaarvoice.com
Connection: keep-alive
User-Agent: Mozilla/5.0 (Windows NT 10.0; WOW64) AppleWebKit/537.36 (KHTML, like Gecko) Chrome/56.0.2924.87 Safari/537.36
Accept: image/webp,image/apng,image/*,*/*;q=0.8
Sec-Fetch-Site: cross-site
Sec-Fetch-Mode: no-cors
Referer: https://www.kohls.com/product/prd-3847510/womens-apt-9-tummy-control-shorts.jsp?color=Medium%20Wash&prdPV=1
Accept-Encoding: gzip, deflate, br
Accept-Language: en-GB,en-US;q=0.9,en;q=0.8
Cookie: BVID=81c8a423-0718-4041-8398-2c2fe72e82a4; BVSID=60667580-3504-4924-97f1-2729a9464056
----
--Response 
HTTP/1.1 200 OK
Cache-Control: no-cache, no-transform, must-revalidate, max-age=0
Content-Type: image/gif
Date: Fri, 21 May 2021 08:11:03 GMT
Expires: -1
P3P: policyref=\"/w3c/p3p.xml\", CP=\"ADMa OUR IND DSP NON COR\"
Server: nginx/1.12.1
Set-Cookie: BVID=81c8a423-0718-4041-8398-2c2fe72e82a4;Version=1;Domain=.network.bazaarvoice.com;Max-Age=31536000;Expires=Sat, 21 May 2022 08:11:03 GMT;Secure;SameSite=None
Set-Cookie: BVSID=60667580-3504-4924-97f1-2729a9464056;Version=1;Domain=.network.bazaarvoice.com;Max-Age=1800;Expires=Fri, 21 May 2021 08:41:03 GMT;Secure;SameSite=None
Content-Length: 43
Connection: keep-alive
----
--Request 
GET https://media.kohlsimg.com/is/image/kohls/3847510_Potassium?wid=600&hei=600&op_sharpen=1
Host: media.kohlsimg.com
Host: media.kohlsimg.com
Connection: keep-alive
User-Agent: Mozilla/5.0 (Windows NT 10.0; WOW64) AppleWebKit/537.36 (KHTML, like Gecko) Chrome/56.0.2924.87 Safari/537.36
Accept: image/webp,image/apng,image/*,*/*;q=0.8
Sec-Fetch-Site: cross-site
Sec-Fetch-Mode: no-cors
Referer: https://www.kohls.com/product/prd-3847510/womens-apt-9-tummy-control-shorts.jsp?color=Medium%20Wash&prdPV=1
Accept-Encoding: gzip, deflate, br
Accept-Language: en-GB,en-US;q=0.9,en;q=0.8
----
--Response 
HTTP/1.1 200
status: 200
content-type: image/webp
content-length: 34606
access-control-allow-origin: *
last-modified: Fri, 13 Sep 2019 20:21:37 GMT
etag: \"3085623d4b03884de911ef4fa48e0b00\"
timing-allow-origin: *
server: Unknown
expires: Fri, 28 May 2021 08:11:03 GMT
date: Fri, 21 May 2021 08:11:03 GMT
----

