--Request 
GET https://kohls.sspinc.io/ssp.json?origin=https%3A%2F%2Fwww.kohls.com&lang=en
Host: kohls.sspinc.io
Host: kohls.sspinc.io
Connection: keep-alive
Accept: application/json
Origin: https://www.kohls.com
User-Agent: Mozilla/5.0 (Windows NT 10.0; WOW64) AppleWebKit/537.36 (KHTML, like Gecko) Chrome/56.0.2924.87 Safari/537.36
Sec-Fetch-Site: cross-site
Sec-Fetch-Mode: cors
Referer: https://www.kohls.com/product/prd-3847510/womens-apt-9-tummy-control-shorts.jsp?color=Medium%20Wash&prdPV=1
Accept-Encoding: gzip, deflate, br
Accept-Language: en-GB,en-US;q=0.9,en;q=0.8
----
 POSTDATA [key: "pid"
value: "8e9bd9e0-8284-4dbd-ab20-145759728098"
, key: "ev"
value: "PAGE_VIEW"
, key: "pl"
value: "https://www.kohls.com/product/prd-3847510/womens-apt-9-tummy-control-shorts.jsp?color=Medium%20Wash&prdPV=1"
, key: "ts"
value: "1621584655302"
, key: "rf"
value: "https://www.kohls.com/catalog/sale-womens-denim-shorts-bottoms-clothing.jsp?CN=Promotions:Sale+Gender:Womens+Material:Denim+Product:Shorts+Category:Bottoms+Department:Clothing+Assortment:Lowest%20Prices%20of%20the%20Season&BL=y&icid=wms-maylps-1699shorts-denim&pfm=internal%20campaign%20p13n_control%20visual%20nav%20p13n&kls_sbp=09167193449239534971532002446042350327"
, key: "v"
value: "1.5"
, key: "if"
value: "false"
, key: "bt"
value: "__LIVE__"
, key: "e_iids"
value: "3847510"
, key: "u_hem"
value: "FFF9461b9887d4b1b437f2f60f044e8a957eff84399c8e8bfca6a655ee067680dc0"
, key: "u_c1"
value: "c6cec876-d9dd-42fb-8bff-4ab56c19a992"
, key: "m_sl"
value: "6097"
, key: "m_rd"
value: "6188"
, key: "m_pi"
value: "2346"
, key: "m_pl"
value: "4037"
, key: "m_ic"
value: "0"
]
--Response 
HTTP/1.1 200
status: 200
content-type: application/json; charset=utf-8
content-length: 981
access-control-allow-methods: GET
access-control-allow-origin: https://www.kohls.com
access-control-max-age: 86400
content-encoding: gzip
last-modified: Wed, 19 May 2021 20:27:53 GMT
referrer-policy: strict-origin-when-cross-origin
x-content-type-options: nosniff
x-download-options: noopen
x-frame-options: SAMEORIGIN
x-permitted-cross-domain-policies: none
x-request-id: b5780c7bf8dd611c6242967d9878a732
x-runtime: 0.016495
x-xss-protection: 1; mode=block
cache-control: max-age=300, public
date: Thu, 20 May 2021 20:30:27 GMT
vary: Origin
x-cache: Hit from cloudfront
via: 1.1 f6e498d7eaa45ffddd4c21217a739464.cloudfront.net (CloudFront)
x-amz-cf-pop: DEL54-C2
x-amz-cf-id: f6sSzMvnyIadnXu1qBxTqzsQ9GH-u3FEZfZSKlG3Bv9pq4x_2OaakA==
age: 42028
----
--Request 
GET https://www.google-analytics.com/collect?v=1&_v=j90&a=1615674330&t=pageview&_s=1&dl=https%3A%2F%2Fwww.kohls.com%2Fproduct%2Fprd-3847510%2Fwomens-apt-9-tummy-control-shorts.jsp%3Fcolor%3DMedium%2520Wash%26prdPV%3D1&ul=en-gb&de=UTF-8&dt=Women%27s%20Apt.%209%C2%AE%20Tummy%20Control%20Shorts&sd=24-bit&sr=1366x768&vp=1349x607&je=0&_u=QCCAgAAB~&jid=&gjid=&cid=701370283.1621584626&tid=UA-45121696-1&_gid=296178419.1621584629&cd2=c68333f4-b7d4-42dd-be5f-49d1eb509125&cd4=&z=1122326926
Host: www.google-analytics.com
Host: www.google-analytics.com
Connection: keep-alive
User-Agent: Mozilla/5.0 (Windows NT 10.0; WOW64) AppleWebKit/537.36 (KHTML, like Gecko) Chrome/56.0.2924.87 Safari/537.36
Accept: image/webp,image/apng,image/*,*/*;q=0.8
Sec-Fetch-Site: cross-site
Sec-Fetch-Mode: no-cors
Referer: https://www.kohls.com/product/prd-3847510/womens-apt-9-tummy-control-shorts.jsp?color=Medium%20Wash&prdPV=1
Accept-Encoding: gzip, deflate, br
Accept-Language: en-GB,en-US;q=0.9,en;q=0.8
----
--Response 
HTTP/1.1 200
status: 200
access-control-allow-origin: *
date: Fri, 21 May 2021 02:55:06 GMT
pragma: no-cache
expires: Mon, 01 Jan 1990 00:00:00 GMT
last-modified: Sun, 17 May 1998 03:00:00 GMT
x-content-type-options: nosniff
content-type: image/gif
cross-origin-resource-policy: cross-origin
server: Golfe2
content-length: 35
age: 18950
cache-control: no-cache, no-store, must-revalidate
alt-svc: h3-29=\":443\"; ma=2592000,h3-T051=\":443\"; ma=2592000,h3-Q050=\":443\"; ma=2592000,h3-Q046=\":443\"; ma=2592000,h3-Q043=\":443\"; ma=2592000,quic=\":443\"; ma=2592000; v=\"46,43\"
----
--Request 
GET https://googleads.g.doubleclick.net/pagead/viewthroughconversion/1071871169/?random=1621584655360&cv=9&fst=1621584655360&num=1&bg=ffffff&guid=ON&resp=GooglemKTybQhCsO&eid=2505059651&u_h=768&u_w=1366&u_ah=728&u_aw=1366&u_cd=24&u_his=6&u_tz=330&u_java=false&u_nplug=0&u_nmime=0&gtm=2oa5c1&sendb=1&ig=1&data=event%3Dgtag.config&frm=0&url=https%3A%2F%2Fwww.kohls.com%2Fproduct%2Fprd-3847510%2Fwomens-apt-9-tummy-control-shorts.jsp%3Fcolor%3DMedium%2520Wash%26prdPV%3D1&ref=https%3A%2F%2Fwww.kohls.com%2Fcatalog%2Fsale-womens-denim-shorts-bottoms-clothing.jsp%3FCN%3DPromotions%3ASale%2BGender%3AWomens%2BMaterial%3ADenim%2BProduct%3AShorts%2BCategory%3ABottoms%2BDepartment%3AClothing%2BAssortment%3ALowest%2520Prices%2520of%2520the%2520Season%26BL%3Dy%26icid%3Dwms-maylps-1699shorts-denim%26pfm%3Dinternal%2520campaign%2520p13n_control%2520visual%2520nav%2520p13n%26kls_sbp%3D09167193449239534971532002446042350327&tiba=Women%27s%20Apt.%209%C2%AE%20Tummy%20Control%20Shorts&hn=www.googleadservices.com&async=1&rfmt=3&fmt=4
Host: googleads.g.doubleclick.net
Host: googleads.g.doubleclick.net
Connection: keep-alive
User-Agent: Mozilla/5.0 (Windows NT 10.0; WOW64) AppleWebKit/537.36 (KHTML, like Gecko) Chrome/56.0.2924.87 Safari/537.36
Accept: */*
Sec-Fetch-Site: cross-site
Sec-Fetch-Mode: no-cors
Referer: https://www.kohls.com/product/prd-3847510/womens-apt-9-tummy-control-shorts.jsp?color=Medium%20Wash&prdPV=1
Accept-Encoding: gzip, deflate, br
Accept-Language: en-GB,en-US;q=0.9,en;q=0.8
Cookie: IDE=AHWqTUlwtFXWlepPSol2-_r3cvMYCm969rCVr9K8gObQkUEuwIu9w2bDDCY2OmMegg4
----
--Response 
HTTP/1.1 200
status: 200
p3p: policyref=\"https://googleads.g.doubleclick.net/pagead/gcn_p3p_.xml\", CP=\"CURa ADMa DEVa TAIo PSAo PSDo OUR IND UNI PUR INT DEM STA PRE COM NAV OTC NOI DSP COR\"
timing-allow-origin: *
cross-origin-resource-policy: cross-origin
date: Fri, 21 May 2021 08:10:56 GMT
pragma: no-cache
expires: Fri, 01 Jan 1990 00:00:00 GMT
cache-control: no-cache, must-revalidate
content-type: text/javascript; charset=UTF-8
x-content-type-options: nosniff
content-disposition: attachment; filename=\"f.txt\"
content-encoding: gzip
server: cafe
content-length: 1374
x-xss-protection: 0
alt-svc: h3-29=\":443\"; ma=2592000,h3-T051=\":443\"; ma=2592000,h3-Q050=\":443\"; ma=2592000,h3-Q046=\":443\"; ma=2592000,h3-Q043=\":443\"; ma=2592000,quic=\":443\"; ma=2592000; v=\"46,43\"
----
--Request 
GET https://googleads.g.doubleclick.net/pagead/viewthroughconversion/1018012790/?random=1621584655364&cv=9&fst=1621584655364&num=1&bg=ffffff&guid=ON&resp=GooglemKTybQhCsO&eid=2505059650&u_h=768&u_w=1366&u_ah=728&u_aw=1366&u_cd=24&u_his=6&u_tz=330&u_java=false&u_nplug=0&u_nmime=0&gtm=2oa5c1&sendb=1&ig=1&data=event%3Dgtag.config&frm=0&url=https%3A%2F%2Fwww.kohls.com%2Fproduct%2Fprd-3847510%2Fwomens-apt-9-tummy-control-shorts.jsp%3Fcolor%3DMedium%2520Wash%26prdPV%3D1&ref=https%3A%2F%2Fwww.kohls.com%2Fcatalog%2Fsale-womens-denim-shorts-bottoms-clothing.jsp%3FCN%3DPromotions%3ASale%2BGender%3AWomens%2BMaterial%3ADenim%2BProduct%3AShorts%2BCategory%3ABottoms%2BDepartment%3AClothing%2BAssortment%3ALowest%2520Prices%2520of%2520the%2520Season%26BL%3Dy%26icid%3Dwms-maylps-1699shorts-denim%26pfm%3Dinternal%2520campaign%2520p13n_control%2520visual%2520nav%2520p13n%26kls_sbp%3D09167193449239534971532002446042350327&tiba=Women%27s%20Apt.%209%C2%AE%20Tummy%20Control%20Shorts&hn=www.googleadservices.com&async=1&rfmt=3&fmt=4
Host: googleads.g.doubleclick.net
Host: googleads.g.doubleclick.net
Connection: keep-alive
User-Agent: Mozilla/5.0 (Windows NT 10.0; WOW64) AppleWebKit/537.36 (KHTML, like Gecko) Chrome/56.0.2924.87 Safari/537.36
Accept: */*
Sec-Fetch-Site: cross-site
Sec-Fetch-Mode: no-cors
Referer: https://www.kohls.com/product/prd-3847510/womens-apt-9-tummy-control-shorts.jsp?color=Medium%20Wash&prdPV=1
Accept-Encoding: gzip, deflate, br
Accept-Language: en-GB,en-US;q=0.9,en;q=0.8
Cookie: IDE=AHWqTUlwtFXWlepPSol2-_r3cvMYCm969rCVr9K8gObQkUEuwIu9w2bDDCY2OmMegg4
----
--Response 
HTTP/1.1 200
status: 200
p3p: policyref=\"https://googleads.g.doubleclick.net/pagead/gcn_p3p_.xml\", CP=\"CURa ADMa DEVa TAIo PSAo PSDo OUR IND UNI PUR INT DEM STA PRE COM NAV OTC NOI DSP COR\"
timing-allow-origin: *
cross-origin-resource-policy: cross-origin
date: Fri, 21 May 2021 08:10:56 GMT
pragma: no-cache
expires: Fri, 01 Jan 1990 00:00:00 GMT
cache-control: no-cache, must-revalidate
content-type: text/javascript; charset=UTF-8
x-content-type-options: nosniff
content-disposition: attachment; filename=\"f.txt\"
content-encoding: gzip
server: cafe
content-length: 1375
x-xss-protection: 0
alt-svc: h3-29=\":443\"; ma=2592000,h3-T051=\":443\"; ma=2592000,h3-Q050=\":443\"; ma=2592000,h3-Q046=\":443\"; ma=2592000,h3-Q043=\":443\"; ma=2592000,quic=\":443\"; ma=2592000; v=\"46,43\"
----
--Request 
GET https://kohls.sspinc.io/lib/4.39.5/fitpredictor.en.min.js
Host: kohls.sspinc.io
Host: kohls.sspinc.io
Connection: keep-alive
User-Agent: Mozilla/5.0 (Windows NT 10.0; WOW64) AppleWebKit/537.36 (KHTML, like Gecko) Chrome/56.0.2924.87 Safari/537.36
Accept: */*
Sec-Fetch-Site: cross-site
Sec-Fetch-Mode: no-cors
Referer: https://www.kohls.com/product/prd-3847510/womens-apt-9-tummy-control-shorts.jsp?color=Medium%20Wash&prdPV=1
Accept-Encoding: gzip, deflate, br
Accept-Language: en-GB,en-US;q=0.9,en;q=0.8
----
--Response 
HTTP/1.1 200
status: 200
content-type: application/javascript; charset=utf-8
content-length: 131221
date: Tue, 11 May 2021 13:27:22 GMT
last-modified: Tue, 11 May 2021 09:37:19 GMT
etag: \"cb838996b87662e64a9b09b451e888d2\"
cache-control: max-age=31536000
content-encoding: gzip
accept-ranges: bytes
server: AmazonS3
x-cache: Hit from cloudfront
via: 1.1 54f59a5b818386671ef8f1ff3025548e.cloudfront.net (CloudFront)
x-amz-cf-pop: DEL54-C2
x-amz-cf-id: 7AcZDjMcDAwAJJipja6hY7uqIy8s-AcxB5Vq5s7XPVntDB7sNaExrg==
age: 845015
----

