Z:\git\leadbot\src\main\java\com\leadbot\controller\LeadAgentController.java
Z:\git\leadbot\src\main\java\com\leadbot\commons\DataFromJson.java
Z:\git\leadbot\src\main\java\com\leadbot\button\InnerButton.java
Z:\git\leadbot\src\main\java\com\leadbot\commons\MailService.java
Z:\git\leadbot\src\main\java\com\leadbot\response\ContextData.java
Z:\git\leadbot\src\main\java\com\leadbot\button\Facebook.java
Z:\git\leadbot\src\main\java\com\leadbot\serviceimpl\AgeIntentImpl.java
Z:\git\leadbot\src\main\java\com\leadbot\serviceimpl\AnnualIncomeIntentImpl.java
Z:\git\leadbot\src\main\java\com\leadbot\AgentApplication.java
Z:\git\leadbot\src\main\java\com\leadbot\response\LeadAgentResponse.java
Z:\git\leadbot\src\main\java\com\leadbot\serviceimpl\WelcomeYesIntentImpl.java
Z:\git\leadbot\src\main\java\com\leadbot\response\InnerContextData.java
Z:\git\leadbot\src\main\java\com\leadbot\commons\SmokeAPICall.java
Z:\git\leadbot\src\main\java\com\leadbot\serviceimpl\WelcomeIntentImpl.java
Z:\git\leadbot\src\main\java\com\leadbot\service\MobileNumberIntent.java
Z:\git\leadbot\src\main\java\com\leadbot\service\WelcomeIntent.java
Z:\git\leadbot\src\main\java\com\leadbot\response\WebhookResponse.java
Z:\git\leadbot\src\main\java\com\leadbot\service\AgeIntent.java
Z:\git\leadbot\src\main\java\com\leadbot\button\Button.java
Z:\git\leadbot\src\main\java\com\leadbot\service\AnnualIncomeIntent.java
Z:\git\leadbot\src\main\java\com\leadbot\service\SmokeIntent.java
Z:\git\leadbot\src\main\java\com\leadbot\button\InnerData.java
Z:\git\leadbot\src\main\java\com\leadbot\service\WelcomeYesIntent.java
Z:\git\leadbot\src\main\java\com\leadbot\commons\GetLeadService.java
Z:\git\leadbot\src\main\java\com\leadbot\serviceimpl\GenderIntentImpl.java
Z:\git\leadbot\src\main\java\com\leadbot\service\GenderIntent.java
Z:\git\leadbot\src\main\java\com\leadbot\commons\CreateLeadService.java
Z:\git\leadbot\src\main\java\com\leadbot\serviceimpl\MobileNumberIntentImpl.java
Z:\git\leadbot\src\main\java\com\leadbot\serviceimpl\SmokeIntentImpl.java
