<svg width="635" height="200" viewBox="0 0 635 200" fill="none" xmlns="http://www.w3.org/2000/svg">
<g opacity="0.579009">
<path d="M125.51 118.067V118.102H91.5779V118.067L94.9711 104.583H122.117L125.51 118.067Z" fill="#CCD1D9"/>
<path d="M152.622 97.8229C152.622 101.541 149.568 104.583 145.836 104.583H71.2187C67.4842 104.583 64.4324 101.541 64.4324 97.8229V91.0632H152.622V97.8229Z" fill="#E6E9ED"/>
<path d="M150.925 47.1288V91.0631H66.1338V47.1288C66.1338 43.4106 69.184 40.3691 72.9202 40.3691H144.139C147.872 40.3691 150.925 43.4106 150.925 47.1288Z" fill="#5D9CEC"/>
<path d="M103.434 91.0666H93.3027L103.519 40.3726H113.652L103.434 91.0666Z" fill="#87BCF4"/>
<path d="M110.227 91.0666H106.889L117.106 40.3726H123.936H120.445L110.227 91.0666Z" fill="#87BCF4"/>
<path d="M128.856 121.495H88.3685C86.493 121.495 84.9753 119.984 84.9753 118.115C84.9753 116.247 86.493 114.735 88.3685 114.735H128.856C130.732 114.735 132.25 116.247 132.25 118.115C132.25 119.984 130.729 121.495 128.856 121.495Z" fill="#E6E9ED"/>
<path d="M71.2734 114.729C73.1407 114.729 74.6666 116.25 74.6666 118.108V121.488C74.6666 123.346 73.1407 124.868 71.2734 124.868H23.7589C21.8933 124.868 20.3657 124.861 20.3657 124.851C20.3657 124.842 20.3657 123.313 20.3657 121.455V118.108C20.3657 116.25 21.8933 114.729 23.7589 114.729H71.2734Z" fill="#E6E9ED"/>
<path d="M13.5726 132.111V135.656V149.835V153.38V167.559V171.104V174.648V178.193C13.5726 179.168 12.045 179.966 10.1794 179.966H6.78625C4.92066 179.966 3.39307 179.168 3.39307 178.193V123.247C3.39307 122.272 4.92066 121.475 6.78625 121.475H10.1794C12.045 121.475 13.5726 122.272 13.5726 123.247V132.111Z" fill="#F7C292"/>
<path d="M183.228 118.102H162.869C162.869 112.491 167.416 107.962 173.049 107.962C178.682 107.962 183.228 112.491 183.228 118.102Z" fill="#E6E9ED"/>
<path d="M206.984 118.102C208.85 118.102 210.377 119.623 210.377 121.481V124.861C210.377 126.719 208.85 128.241 206.984 128.241H200.198C198.332 128.241 195.277 128.241 193.411 128.241H159.48C157.614 128.241 154.559 128.241 152.693 128.241H16.9659C15.1003 128.241 12.0451 128.241 10.1796 128.241H3.39318C1.52759 128.241 0 126.719 0 124.861V121.481C0 119.623 1.52759 118.102 3.39318 118.102H10.1796H16.9659H54.2909H61.0773H91.5828H98.3692H125.515H132.301H162.873H169.659H183.232H190.018H206.984Z" fill="#FFD2A6"/>
<path d="M156.086 155.28H206.997V178.935H156.086V155.28Z" fill="#F7C292"/>
<path d="M156.086 128.241H206.997V151.897H156.086V128.241Z" fill="#F7C292"/>
<path d="M181.548 143.447C179.673 143.447 178.139 141.935 178.139 140.067C178.139 138.198 179.638 136.688 181.512 136.688H181.548C183.422 136.688 184.942 138.198 184.942 140.067C184.942 141.935 183.422 143.447 181.548 143.447Z" fill="#CC9D6E"/>
<path d="M181.712 170.911C179.836 170.911 178.302 169.399 178.302 167.531C178.302 165.661 179.801 164.151 181.675 164.151H181.712C183.585 164.151 185.105 165.661 185.105 167.531C185.105 169.399 183.585 170.911 181.712 170.911Z" fill="#CC9D6E"/>
<path d="M156.086 151.896H206.997V155.276H156.086V151.896Z" fill="#EFB381"/>
<path fill-rule="evenodd" clip-rule="evenodd" d="M64.6065 96.1361H152.622V47.1287C152.622 42.4683 148.818 38.6792 144.139 38.6792H72.9205C68.2399 38.6792 64.4375 42.4683 64.4375 47.1287V94.4462L64.6065 96.1361ZM149.229 92.7564H67.8307V47.1288C67.8307 44.3332 70.1138 42.0591 72.9205 42.0591H144.139C146.946 42.0591 149.229 44.3332 149.229 47.1288V92.7564Z" fill="#E6E9ED"/>
<path d="M108.637 101.189C106.759 101.189 105.227 99.6777 105.227 97.8095C105.227 95.9397 106.726 94.4297 108.598 94.4297H108.637C110.509 94.4297 112.03 95.9397 112.03 97.8095C112.03 99.6777 110.505 101.189 108.637 101.189Z" fill="#CCD1D9"/>
</g>
<rect x="529.245" y="52.8301" width="105.66" height="134.906" fill="#BDD8D7"/>
<path d="M582.547 53.7734V186.792" stroke="#9ABCBB" stroke-linecap="square"/>
<path fill-rule="evenodd" clip-rule="evenodd" d="M590.094 135.849C591.396 135.849 592.452 134.793 592.452 133.491C592.452 132.188 591.396 131.132 590.094 131.132C588.791 131.132 587.735 132.188 587.735 133.491C587.735 134.793 588.791 135.849 590.094 135.849Z" fill="#9ABCBB"/>
<path fill-rule="evenodd" clip-rule="evenodd" d="M574.056 135.849C575.359 135.849 576.415 134.793 576.415 133.491C576.415 132.188 575.359 131.132 574.056 131.132C572.754 131.132 571.698 132.188 571.698 133.491C571.698 134.793 572.754 135.849 574.056 135.849Z" fill="#9ABCBB"/>
<path d="M140.64 184.906H548.039C549.141 184.906 550.187 185.52 550.897 186.585L554.806 192.453C556.099 194.393 555.902 197.289 554.366 198.922C553.711 199.618 552.882 200 552.025 200H136.654C134.646 200 133.019 197.945 133.019 195.409C133.019 194.327 133.321 193.281 133.873 192.453L137.782 186.585C138.492 185.52 139.538 184.906 140.64 184.906Z" fill="#AE8976"/>
<path d="M140.988 177.358H547.691C549.014 177.358 550.269 178.096 551.12 179.374L554.806 184.906C556.099 186.846 555.902 189.742 554.366 191.374C553.711 192.071 552.882 192.453 552.025 192.453H136.654C134.646 192.453 133.019 190.397 133.019 187.862C133.019 186.78 133.321 185.733 133.873 184.906L137.559 179.374C138.41 178.096 139.665 177.358 140.988 177.358Z" fill="#BC9480"/>
<path d="M208.282 177.354C205.949 167.009 204.717 156.245 204.717 145.193C204.717 65.0053 269.551 0 349.528 0C429.505 0 494.34 65.0053 494.34 145.193C494.34 156.245 493.108 167.009 490.775 177.354H208.282Z" fill="#032C64"/>
<path d="M232.591 177.353C229.795 167.11 228.302 156.326 228.302 145.193C228.302 78.0651 282.577 23.647 349.528 23.647C416.48 23.647 470.755 78.0651 470.755 145.193C470.755 156.326 469.262 167.11 466.466 177.353H232.591Z" fill="#05377A"/>
<path d="M258.277 177.354C254.749 167.29 252.83 156.466 252.83 145.193C252.83 91.6477 296.123 48.2402 349.528 48.2402C402.933 48.2402 446.226 91.6477 446.226 145.193C446.226 156.466 444.307 167.29 440.779 177.354H258.277H258.277Z" fill="#063E89"/>
<path d="M281.714 177.354C277.106 167.603 274.528 156.7 274.528 145.193C274.528 103.663 308.107 69.9956 349.528 69.9956C390.95 69.9956 424.528 103.663 424.528 145.193C424.528 156.7 421.951 167.603 417.343 177.354L281.714 177.354L281.714 177.354Z" fill="#0D59C6"/>
<path d="M332.456 178.171H294.97C290.906 178.171 287.611 174.877 287.611 170.813V150.138C287.611 143.503 293.033 138.124 299.722 138.124H320.346C327.034 138.124 332.456 143.503 332.456 150.138V178.171Z" fill="#39C9A7"/>
<path d="M311.592 147.135C309.768 147.135 308.29 145.609 308.29 143.728V142.974C308.29 141.093 309.768 139.568 311.592 139.568C313.416 139.568 314.894 141.093 314.894 142.974V143.728C314.894 145.609 313.416 147.135 311.592 147.135Z" fill="#E2AA9F"/>
<path d="M295.191 124.184C295.191 134.844 303.653 143.485 314.091 143.485C324.529 143.485 332.991 134.844 332.991 124.184C332.991 113.525 324.529 104.884 314.091 104.884C303.653 104.884 295.191 113.525 295.191 124.184Z" fill="#E8AE9F"/>
<path d="M295.191 124.303C295.191 119.61 296.837 115.311 299.572 111.969C296.691 123.82 297.868 137.046 312.285 143.485C302.694 142.555 295.191 134.323 295.191 124.303Z" fill="#E2AA9F"/>
<path d="M313.568 131.22C313.568 132.522 314.624 133.578 315.926 133.578C317.229 133.578 318.285 132.522 318.285 131.22C318.285 129.917 317.229 128.861 315.926 128.861C314.624 128.861 313.568 129.917 313.568 131.22Z" fill="white"/>
<path d="M323.68 131.22C323.68 132.522 324.736 133.578 326.038 133.578C327.341 133.578 328.397 132.522 328.397 131.22C328.397 129.917 327.341 128.861 326.038 128.861C324.736 128.861 323.68 129.917 323.68 131.22Z" fill="white"/>
<path d="M314.511 131.691C314.511 132.733 315.356 133.578 316.398 133.578C317.44 133.578 318.285 132.733 318.285 131.691C318.285 130.65 317.44 129.805 316.398 129.805C315.356 129.805 314.511 130.65 314.511 131.691Z" fill="#202020"/>
<path d="M324.623 131.691C324.623 132.733 325.468 133.578 326.51 133.578C327.552 133.578 328.397 132.733 328.397 131.691C328.397 130.65 327.552 129.805 326.51 129.805C325.468 129.805 324.623 130.65 324.623 131.691Z" fill="#202020"/>
<path d="M319.027 135.601C319.027 136.815 320.105 137.799 321.434 137.799C322.764 137.799 323.842 136.815 323.842 135.601H319.027Z" fill="#A58476"/>
<rect x="287.611" y="145.291" width="9.58554" height="30.295" rx="4.79277" fill="#2FA689"/>
<path d="M313.629 172.602C313.629 175.264 311.471 177.422 308.809 177.422H292.431C289.769 177.422 287.611 175.264 287.611 172.602C287.611 169.94 289.769 167.782 292.431 167.782H308.809C311.471 167.782 313.629 169.94 313.629 172.602Z" fill="#2FA689"/>
<path d="M317.961 177.422H307.471C306.749 176.381 306.326 175.115 306.326 173.749C306.326 170.2 309.186 167.323 312.716 167.323C316.245 167.323 319.106 170.2 319.106 173.749C319.106 175.115 318.683 176.381 317.961 177.422Z" fill="#F7B9A9"/>
<rect x="302.293" y="176.962" width="52.9487" height="1.37704" rx="0.688522" fill="#50678C"/>
<path d="M318.859 178.34H355.211C355.927 178.34 356.566 177.89 356.809 177.216L364.01 157.203C364.327 156.321 363.869 155.348 362.987 155.03C362.803 154.964 362.608 154.93 362.412 154.93H326.06C325.344 154.93 324.705 155.379 324.463 156.053L317.261 176.067C316.944 176.949 317.402 177.922 318.284 178.239C318.469 178.306 318.663 178.34 318.859 178.34Z" fill="#577098"/>
<path d="M318.317 177.433L363.049 155.79C363.274 155.681 363.369 155.411 363.26 155.186C363.184 155.029 363.026 154.93 362.852 154.93H326.06C325.344 154.93 324.705 155.379 324.463 156.053L317.148 176.382C316.989 176.823 317.218 177.309 317.659 177.468C317.874 177.545 318.111 177.533 318.317 177.433Z" fill="#50678C"/>
<path d="M341.941 168.923C342.661 169.156 343.53 168.467 343.882 167.382C344.234 166.298 343.937 165.229 343.217 164.996C342.497 164.762 341.628 165.451 341.276 166.536C340.924 167.62 341.221 168.689 341.941 168.923Z" fill="white"/>
<path d="M372.813 146.435H372.813C370.515 146.435 368.653 148.315 368.653 150.636V174.796C368.653 176.954 370.385 178.703 372.522 178.703C374.658 178.703 376.391 176.954 376.391 174.796V154.331C376.391 151.176 375.003 148.35 372.813 146.435Z" fill="#5B34EA"/>
<path d="M356.547 167.226C357.456 165.254 359.801 164.389 361.782 165.294L374.345 170.98C376.477 171.954 377.411 174.463 376.432 176.584V176.584C375.591 178.408 373.423 179.208 371.591 178.37L358.488 172.438C356.506 171.532 355.637 169.199 356.547 167.226Z" fill="#0063DB"/>
<path d="M361.344 167.516C361.344 170.13 359.227 172.249 356.616 172.249C354.004 172.249 351.887 170.13 351.887 167.516C351.887 164.903 354.004 162.784 356.616 162.784C359.227 162.784 361.344 164.903 361.344 167.516Z" fill="#F7B9A9"/>
<path d="M407.773 178.273H369.083V153.878C369.083 148.104 373.761 143.423 379.531 143.423H397.325C403.095 143.423 407.773 148.104 407.773 153.878V178.273Z" fill="#6E4BEC"/>
<path d="M386.923 153.319C384.667 153.319 382.839 151.498 382.839 149.251V148.351C382.839 146.105 384.667 144.284 386.923 144.284C389.179 144.284 391.007 146.105 391.007 148.351V149.251C391.007 151.498 389.179 153.319 386.923 153.319Z" fill="#E2AA9F"/>
<path d="M404.196 146.004H404.196C401.898 146.004 400.035 147.885 400.035 150.205V174.366C400.035 176.523 401.767 178.273 403.904 178.273C406.041 178.273 407.773 176.523 407.773 174.366V153.901C407.773 150.746 406.386 147.919 404.196 146.004Z" fill="#5B34EA"/>
<path d="M387.499 166.796C388.409 164.824 390.753 163.959 392.735 164.864L405.298 170.55C407.429 171.524 408.363 174.033 407.385 176.154C406.544 177.978 404.376 178.778 402.544 177.94L389.44 172.007C387.458 171.102 386.589 168.769 387.499 166.796Z" fill="#5B34EA"/>
<path d="M383.539 178.638H361.638C360.279 178.638 359.06 177.8 358.573 176.531L353.523 163.368C352.874 161.675 353.72 159.776 355.413 159.126C355.788 158.983 356.187 158.909 356.589 158.909H378.489C379.849 158.909 381.068 159.747 381.555 161.016L386.604 174.179C387.254 175.872 386.408 177.771 384.715 178.42C384.339 178.564 383.941 178.638 383.539 178.638Z" fill="#3F4C70"/>
<path d="M385.713 177.232L355.619 160.966C355.087 160.678 354.889 160.014 355.176 159.483C355.367 159.129 355.737 158.909 356.139 158.909H379.994C380.447 158.909 380.853 159.188 381.016 159.611L387.255 175.877C387.472 176.442 387.19 177.075 386.626 177.291C386.328 177.405 385.994 177.384 385.713 177.232Z" fill="black" fill-opacity="0.13"/>
<path d="M370.915 168.429C371.256 169.563 370.787 170.687 369.868 170.939C368.949 171.19 367.927 170.475 367.586 169.34C367.246 168.206 367.714 167.083 368.634 166.831C369.553 166.579 370.575 167.295 370.915 168.429Z" fill="#F8F6F6"/>
<path d="M392.297 167.086C392.297 169.7 390.18 171.819 387.568 171.819C384.956 171.819 382.839 169.7 382.839 167.086C382.839 164.473 384.956 162.354 387.568 162.354C390.18 162.354 392.297 164.473 392.297 167.086Z" fill="#F7B9A9"/>
<path d="M402.724 127.417C402.724 138.438 393.777 147.372 382.74 147.372C371.703 147.372 362.755 138.438 362.755 127.417C362.755 116.396 371.703 107.462 382.74 107.462C393.777 107.462 402.724 116.396 402.724 127.417Z" fill="#F7B9A9"/>
<path d="M402.724 127.417C402.724 122.558 400.983 118.107 398.093 114.646C401.138 126.917 399.894 140.612 384.655 147.279C394.793 146.316 402.724 137.793 402.724 127.417Z" fill="#E2AA9F"/>
<path d="M382.19 132.642C382.19 133.997 381.092 135.094 379.738 135.094C378.383 135.094 377.285 133.997 377.285 132.642C377.285 131.287 378.383 130.189 379.738 130.189C381.092 130.189 382.19 131.287 382.19 132.642Z" fill="white"/>
<path d="M370.943 132.642C370.943 133.997 369.845 135.094 368.49 135.094C367.137 135.094 366.038 133.997 366.038 132.642C366.038 131.287 367.137 130.189 368.49 130.189C369.845 130.189 370.943 131.287 370.943 132.642Z" fill="white"/>
<path d="M381.829 133.299C381.829 134.446 380.899 135.374 379.754 135.374C378.607 135.374 377.678 134.446 377.678 133.299C377.678 132.152 378.607 131.223 379.754 131.223C380.899 131.223 381.829 132.152 381.829 133.299Z" fill="#202020"/>
<path d="M370.582 133.299C370.582 134.446 369.653 135.374 368.506 135.374C367.361 135.374 366.431 134.446 366.431 133.299C366.431 132.152 367.361 131.223 368.506 131.223C369.653 131.223 370.582 132.152 370.582 133.299Z" fill="#202020"/>
<path d="M376.329 137.664C376.329 139.005 375.24 140.092 373.897 140.092C372.554 140.092 371.466 139.005 371.466 137.664H376.329Z" fill="#A58476"/>
<path d="M364.668 118.894C364.688 118.898 367.069 117.012 371.809 113.236L371.809 113.236C372.299 112.846 373.01 112.914 373.416 113.39C381.13 122.426 391.017 127.604 403.077 128.922C403.098 128.551 403.081 128.177 403.11 127.803C404.021 116.353 394.888 107.462 382.74 107.462C373.465 106.919 367.297 111.894 364.668 118.894Z" fill="#202020"/>
<path d="M398.721 127.91C398.721 129.112 397.745 130.087 396.54 130.087C395.336 130.087 394.359 129.112 394.359 127.91C394.359 126.707 395.336 125.732 396.54 125.732C397.745 125.732 398.721 126.707 398.721 127.91Z" fill="#F7B9A9"/>
<path d="M438.263 71.7365C434.047 70.8503 430.751 67.5463 429.868 63.3191C429.759 62.8002 429.303 62.4285 428.774 62.4285C428.245 62.4285 427.788 62.8002 427.68 63.3192C426.796 67.5463 423.501 70.8503 419.285 71.7363C418.767 71.8451 418.396 72.3028 418.396 72.8331C418.396 73.3634 418.767 73.8212 419.285 73.9299C423.501 74.8161 426.796 78.12 427.68 82.3472C427.788 82.8661 428.244 83.2379 428.773 83.2379C429.302 83.2379 429.759 82.8662 429.867 82.3472C430.751 78.12 434.047 74.8161 438.263 73.9301C438.78 73.8214 439.151 73.3637 439.151 72.8333C439.151 72.303 438.78 71.8453 438.263 71.7365Z" fill="white"/>
<path d="M258.546 125.652C254.33 124.766 251.034 121.462 250.151 117.235C250.042 116.716 249.586 116.344 249.057 116.344C248.528 116.344 248.071 116.716 247.963 117.235C247.079 121.462 243.784 124.766 239.568 125.652C239.05 125.761 238.679 126.218 238.679 126.749C238.679 127.279 239.05 127.737 239.568 127.845C243.784 128.732 247.079 132.036 247.962 136.263C248.071 136.782 248.527 137.153 249.056 137.153C249.585 137.153 250.042 136.782 250.15 136.263C251.034 132.036 254.329 128.732 258.545 127.846C259.063 127.737 259.434 127.279 259.434 126.749C259.434 126.219 259.063 125.761 258.546 125.652Z" fill="white"/>
<path d="M341.206 16.9383C339.769 16.6765 338.646 15.7003 338.345 14.4514C338.308 14.2981 338.152 14.1882 337.972 14.1882C337.791 14.1882 337.636 14.2981 337.599 14.4514C337.297 15.7003 336.174 16.6765 334.737 16.9383C334.56 16.9704 334.434 17.1057 334.434 17.2623C334.434 17.419 334.56 17.5543 334.737 17.5864C336.174 17.8482 337.297 18.8244 337.599 20.0733C337.636 20.2266 337.791 20.3365 337.972 20.3365C338.152 20.3365 338.307 20.2267 338.344 20.0733C338.646 18.8244 339.769 17.8482 341.206 17.5864C341.383 17.5543 341.509 17.4191 341.509 17.2624C341.509 17.1057 341.383 16.9705 341.206 16.9383Z" fill="white"/>
<path d="M470.452 153.619C469.015 153.357 467.891 152.381 467.59 151.132C467.553 150.978 467.397 150.869 467.217 150.869C467.037 150.869 466.881 150.978 466.844 151.132C466.543 152.381 465.419 153.357 463.982 153.619C463.806 153.651 463.679 153.786 463.679 153.943C463.679 154.099 463.806 154.235 463.982 154.267C465.419 154.529 466.543 155.505 466.844 156.754C466.881 156.907 467.037 157.017 467.217 157.017C467.397 157.017 467.553 156.907 467.59 156.754C467.891 155.505 469.015 154.529 470.452 154.267C470.628 154.235 470.755 154.1 470.755 153.943C470.755 153.786 470.628 153.651 470.452 153.619Z" fill="white"/>
<path d="M382.244 54.3009C380.807 54.0391 379.684 53.0629 379.382 51.8139C379.345 51.6606 379.19 51.5508 379.009 51.5508C378.829 51.5508 378.673 51.6606 378.636 51.8139C378.335 53.0629 377.212 54.039 375.775 54.3008C375.598 54.333 375.472 54.4682 375.472 54.6249C375.472 54.7816 375.598 54.9168 375.775 54.9489C377.212 55.2108 378.335 56.1869 378.636 57.4358C378.673 57.5892 378.829 57.699 379.009 57.699C379.19 57.699 379.345 57.5892 379.382 57.4358C379.684 56.1869 380.807 55.2108 382.244 54.949C382.421 54.9169 382.547 54.7816 382.547 54.6249C382.547 54.4683 382.421 54.333 382.244 54.3009Z" fill="white"/>
<path d="M445.924 120.513C444.486 120.251 443.363 119.275 443.062 118.026C443.025 117.873 442.869 117.763 442.689 117.763C442.508 117.763 442.353 117.873 442.316 118.026C442.014 119.275 440.891 120.251 439.454 120.513C439.277 120.545 439.151 120.68 439.151 120.837C439.151 120.993 439.277 121.129 439.454 121.161C440.891 121.423 442.014 122.399 442.316 123.648C442.353 123.801 442.508 123.911 442.689 123.911C442.869 123.911 443.025 123.801 443.062 123.648C443.363 122.399 444.486 121.423 445.924 121.161C446.1 121.129 446.226 120.994 446.226 120.837C446.226 120.68 446.1 120.545 445.924 120.513Z" fill="white"/>
<path d="M288.848 51.4632C287.411 51.2014 286.287 50.2252 285.986 48.9763C285.949 48.823 285.794 48.7131 285.613 48.7131C285.433 48.7131 285.277 48.823 285.24 48.9763C284.939 50.2252 283.816 51.2014 282.378 51.4632C282.202 51.4953 282.075 51.6306 282.075 51.7872C282.075 51.9439 282.202 52.0792 282.378 52.1113C283.816 52.3731 284.939 53.3493 285.24 54.5982C285.277 54.7515 285.433 54.8614 285.613 54.8614C285.793 54.8614 285.949 54.7516 285.986 54.5982C286.287 53.3493 287.411 52.3731 288.848 52.1114C289.025 52.0792 289.151 51.944 289.151 51.7873C289.151 51.6306 289.025 51.4954 288.848 51.4632Z" fill="white"/>
<path d="M398.532 23.945C396.04 23.4214 394.093 21.469 393.571 18.9711C393.507 18.6645 393.237 18.4448 392.925 18.4448C392.612 18.4448 392.342 18.6645 392.278 18.9712C391.756 21.469 389.809 23.4213 387.317 23.9449C387.012 24.0092 386.792 24.2797 386.792 24.593C386.792 24.9064 387.012 25.1769 387.317 25.2411C389.809 25.7648 391.756 27.7171 392.278 30.215C392.342 30.5216 392.612 30.7413 392.924 30.7413C393.237 30.7413 393.507 30.5217 393.571 30.215C394.093 27.7171 396.04 25.7648 398.532 25.2413C398.837 25.177 399.057 24.9065 399.057 24.5931C399.057 24.2798 398.837 24.0093 398.532 23.945Z" fill="white"/>
<path d="M340.041 72.1853C337.55 71.6616 335.602 69.7093 335.08 67.2114C335.016 66.9047 334.746 66.6851 334.434 66.6851C334.121 66.6851 333.852 66.9047 333.787 67.2114C333.265 69.7093 331.318 71.6616 328.827 72.1851C328.521 72.2494 328.302 72.5199 328.302 72.8333C328.302 73.1466 328.521 73.4171 328.827 73.4814C331.318 74.005 333.265 75.9573 333.787 78.4552C333.851 78.7619 334.121 78.9816 334.434 78.9816C334.746 78.9816 335.016 78.7619 335.08 78.4552C335.602 75.9573 337.55 74.005 340.041 73.4815C340.347 73.4172 340.566 73.1468 340.566 72.8334C340.566 72.52 340.347 72.2495 340.041 72.1853Z" fill="white"/>
<path d="M512.417 40.5762H506.973C506.372 40.5762 505.885 41.0577 505.885 41.6516V70.688H513.506V41.6516C513.506 41.0577 513.018 40.5762 512.417 40.5762Z" fill="#FF9675"/>
<path d="M509.695 40.5762H506.973C506.372 40.5762 505.885 41.0577 505.885 41.6516V70.688H509.695V40.5762Z" fill="#EF6678"/>
<path d="M477.609 36.2744H471.047C470.446 36.2744 469.958 36.7559 469.958 37.3498V70.688H478.698V37.3498C478.698 36.7559 478.21 36.2744 477.609 36.2744Z" fill="#EF6678"/>
<path d="M477.609 36.2744H474.313V70.688H478.698V37.3498C478.698 36.7559 478.21 36.2744 477.609 36.2744Z" fill="#FA744A"/>
<path d="M465.604 85.7439C465.199 85.7439 464.817 85.5197 464.63 85.1495L459.187 74.3953C458.918 73.8639 459.136 73.218 459.673 72.9523C460.21 72.6876 460.865 72.9019 461.134 73.4333L464.515 80.1132V73.9143C464.515 73.3204 465.002 72.8389 465.604 72.8389C466.206 72.8389 466.692 73.3204 466.692 73.9143V84.6685C466.692 85.1674 466.345 85.6006 465.854 85.715C465.771 85.7345 465.687 85.7439 465.604 85.7439Z" fill="#868491"/>
<path d="M513.535 85.7439C513.452 85.7439 513.368 85.7345 513.285 85.715C512.794 85.6005 512.446 85.1674 512.446 84.6685V73.9143C512.446 73.3204 512.933 72.8389 513.535 72.8389C514.137 72.8389 514.624 73.3204 514.624 73.9143V80.1132L518.005 73.4333C518.275 72.9019 518.927 72.6876 519.465 72.9523C520.003 73.2181 520.221 73.8639 519.952 74.3953L514.509 85.1495C514.322 85.5197 513.94 85.7439 513.535 85.7439Z" fill="#868491"/>
<path d="M488.466 36.2744H486.288C485.687 36.2744 485.2 36.7559 485.2 37.3498V70.688H489.554V37.3498C489.554 36.7559 489.067 36.2744 488.466 36.2744Z" fill="#9EA2B3"/>
<path d="M504.796 36.2744H502.618C502.017 36.2744 501.53 36.7559 501.53 37.3498V70.688H505.884V37.3498C505.884 36.7559 505.397 36.2744 504.796 36.2744Z" fill="#93D5F4"/>
<path d="M468.87 39.501H466.692C466.091 39.501 465.604 39.9825 465.604 40.5764V70.5706C465.604 70.6356 465.657 70.6883 465.723 70.6883H469.958V40.5764C469.958 39.9825 469.471 39.501 468.87 39.501Z" fill="#FFBD66"/>
<path d="M464.515 42.7271H461.249C460.648 42.7271 460.16 43.2086 460.16 43.8025V70.6881H465.604V43.8025C465.604 43.2086 465.116 42.7271 464.515 42.7271Z" fill="#66DBB0"/>
<path d="M517.86 38.4253H514.594C513.993 38.4253 513.505 38.9068 513.505 39.5007V70.688H518.949V39.5007C518.949 38.9068 518.461 38.4253 517.86 38.4253Z" fill="#9EA2B3"/>
<path d="M500.441 33.0483H494.998C494.397 33.0483 493.909 33.5299 493.909 34.1238V70.6882H501.53V34.1238C501.53 33.5299 501.042 33.0483 500.441 33.0483Z" fill="#FFBD66"/>
<path d="M492.82 40.5762H490.643C490.042 40.5762 489.554 41.0577 489.554 41.6516V70.688H493.909V41.6516C493.909 41.0577 493.421 40.5762 492.82 40.5762Z" fill="#66DBB0"/>
<path d="M484.111 38.4253H479.756C479.155 38.4253 478.667 38.9068 478.667 39.5007V70.688H485.2V39.5007C485.2 38.9068 484.712 38.4253 484.111 38.4253Z" fill="#93D5F4"/>
<path d="M523.363 74.9897H455.805C455.204 74.9897 454.717 74.5082 454.717 73.9143V71.7634C454.717 71.1695 455.204 70.688 455.805 70.688H523.363C523.964 70.688 524.452 71.1695 524.452 71.7634V73.9143C524.452 74.5082 523.964 74.9897 523.363 74.9897Z" fill="#E6BE8A"/>
<rect x="469.958" y="39.501" width="4.35471" height="2.15085" fill="#9EA2B3"/>
<rect x="474.313" y="39.501" width="4.35471" height="2.15085" fill="#B7B6BD"/>
<rect x="469.958" y="65.311" width="4.35471" height="2.15085" fill="#9EA2B3"/>
<rect x="474.313" y="65.311" width="4.35471" height="2.15085" fill="#B7B6BD"/>
<rect x="491.762" y="43.8027" width="2.17737" height="2.15084" fill="#66C6AE"/>
<rect x="491.762" y="64.2356" width="2.17737" height="2.15085" fill="#66C6AE"/>
<rect x="505.885" y="43.8027" width="3.81036" height="2.15084" fill="#FFBD66"/>
<rect x="505.885" y="64.2356" width="3.81036" height="2.15085" fill="#FFBD66"/>
<rect x="509.695" y="43.8027" width="3.81039" height="2.15084" fill="#FFE166"/>
<rect x="509.695" y="64.2356" width="3.81039" height="2.15085" fill="#FFE166"/>
<path d="M478.667 39.5007V70.688H481.934V38.4253H479.756C479.155 38.4253 478.667 38.9068 478.667 39.5007Z" fill="#66C3E0"/>
<path d="M465.604 70.6883H467.781V39.501H466.692C466.091 39.501 465.604 39.9825 465.604 40.5764V70.6883Z" fill="#FF9675"/>
<path d="M460.16 70.6881H462.882V42.7271H461.112C460.587 42.7271 460.16 43.1482 460.16 43.6678V70.6881Z" fill="#66C6AE"/>
<path d="M485.2 70.688H487.377V36.2744H486.288C485.687 36.2744 485.2 36.7559 485.2 37.3498V70.688Z" fill="#9E99A6"/>
<path d="M489.554 70.688H491.732V40.5762H490.643C490.042 40.5762 489.554 41.0577 489.554 41.6516V70.688Z" fill="#66C6AE"/>
<rect x="489.554" y="43.8027" width="2.17734" height="2.15084" fill="#9EA2B3"/>
<rect x="489.554" y="64.2356" width="2.17734" height="2.15085" fill="#9EA2B3"/>
<path d="M493.909 70.6882H497.72V33.0483H494.998C494.397 33.0483 493.909 33.5299 493.909 34.1238V70.6882Z" fill="#FF9675"/>
<path d="M503.707 36.2744H502.618C502.017 36.2744 501.53 36.7559 501.53 37.3498V70.688H503.707V36.2744Z" fill="#66C3E0"/>
<path d="M516.257 38.4253H514.594C513.993 38.4253 513.505 38.9068 513.505 39.5007V70.688H516.257V38.4253Z" fill="#9E99A6"/>
<path d="M454.717 72.8389V73.9143C454.717 74.5082 455.204 74.9897 455.805 74.9897H523.363C523.964 74.9897 524.452 74.5082 524.452 73.9143V72.8389H454.717Z" fill="#C9A07C"/>
<path d="M13.7106 117.924H32.5156C33.3148 117.924 33.9622 117.291 33.9622 116.509C33.9622 115.727 33.3148 115.094 32.5156 115.094H13.7106C12.9114 115.094 12.264 115.727 12.264 116.509C12.264 117.291 12.9114 117.924 13.7106 117.924Z" fill="#B2B5C8"/>
<path d="M20.5307 111.898C20.5307 110.303 21.8415 109.01 23.4583 109.01C25.0752 109.01 26.386 110.303 26.386 111.898C26.386 113.494 25.0752 114.787 23.4583 114.787C21.8415 114.787 20.5307 113.494 20.5307 111.898Z" fill="#868BA5"/>
<path d="M6.62446 98.1774C6.62446 96.5822 7.93528 95.2888 9.5521 95.2888C11.1689 95.2888 12.4797 96.5822 12.4797 98.1774C12.4797 99.7727 11.1689 101.066 9.5521 101.066C7.93528 101.066 6.62446 99.7727 6.62446 98.1774Z" fill="#868BA5"/>
<path d="M39.5556 86.0551L40.5659 87.0653L30.4613 97.1699L29.451 96.1596C26.6608 93.3695 26.6608 88.8452 29.451 86.055C32.2411 83.2649 36.7654 83.2649 39.5556 86.0551Z" fill="#B2B5C8"/>
<path d="M38.2286 88.6792C39.0477 90.1508 38.7513 91.9643 37.3293 93.1825C35.9081 94.4014 33.7924 94.6555 32.0754 93.9533L38.2286 88.6792Z" fill="#ECBA16"/>
<path d="M9.73528 95.5597L22.6131 84.0044C22.7938 84.45 23.0689 84.8696 23.4481 85.2285L24.5203 86.2324L11.9086 97.573C11.6305 96.5768 10.7971 95.7997 9.73528 95.5597Z" fill="#B2B5C8"/>
<path d="M11.9133 98.9951L22.5093 108.926C22.3063 108.97 22.1122 109.035 21.9278 109.116C21.9122 109.123 21.8981 109.132 21.8825 109.139C21.7114 109.218 21.5501 109.31 21.3992 109.417C21.3895 109.423 21.3813 109.431 21.3724 109.437C21.2163 109.551 21.0735 109.678 20.9434 109.818C20.9427 109.819 20.9419 109.82 20.9419 109.82C20.8066 109.967 20.6891 110.125 20.588 110.296C20.4527 110.525 20.3434 110.769 20.2794 111.032L9.82176 100.998C10.8471 100.734 11.6463 99.9701 11.9133 98.9951Z" fill="#B2B5C8"/>
<path d="M23.6746 80.2782C25.052 78.9008 27.2843 78.9008 28.6618 80.2782L32.0754 83.7293C30.9272 84.041 29.8411 84.6413 28.9396 85.5426C28.0375 86.4447 27.4373 87.5308 27.1256 88.6791L23.6746 85.2654C22.2971 83.8879 22.2971 81.6556 23.6746 80.2782Z" fill="#868BA5"/>
<path d="M401.485 139.483C398.137 139.483 395.422 136.769 395.422 133.421C395.422 130.073 398.137 127.358 401.485 127.358C404.833 127.358 407.547 130.073 407.547 133.421C407.547 136.769 404.833 139.483 401.485 139.483Z" fill="#202020"/>
<path d="M400.571 146.127C397.865 146.127 395.672 143.933 395.672 141.227C395.672 138.521 397.865 136.327 400.571 136.327C403.277 136.327 405.471 138.521 405.471 141.227C405.471 143.933 403.277 146.127 400.571 146.127Z" fill="#202020"/>
<path d="M396.585 152.771C393.879 152.771 391.685 150.577 391.685 147.871C391.685 145.165 393.879 142.971 396.585 142.971C399.291 142.971 401.485 145.165 401.485 147.871C401.485 150.577 399.291 152.771 396.585 152.771Z" fill="#202020"/>
<path d="M391.893 159.871C389.187 159.871 386.994 157.677 386.994 154.971C386.994 152.265 389.187 150.071 391.893 150.071C394.599 150.071 396.793 152.265 396.793 154.971C396.793 157.677 394.599 159.871 391.893 159.871Z" fill="#202020"/>
<path d="M383.962 161.199C387.409 162.985 384.917 161.698 387.699 163.109C390.108 164.355 387.159 162.86 392.682 165.684C394.384 162.362 393.803 158.667 391.395 157.421C388.986 156.217 385.665 157.878 383.962 161.199Z" fill="#202020"/>
<path d="M393.18 158.874L389.236 156.881C388.821 156.674 388.322 156.84 388.115 157.255C387.907 157.67 388.073 158.169 388.488 158.376L392.433 160.369C392.848 160.577 393.347 160.411 393.554 159.996C393.762 159.58 393.596 159.082 393.18 158.874Z" fill="#7B10D9"/>
<rect x="377.359" y="126.415" width="4.71698" height="1.4151" rx="0.70755" fill="#202020"/>
<rect x="366.038" y="126.415" width="4.71698" height="1.4151" rx="0.70755" fill="#202020"/>
<rect x="324.528" y="124.528" width="4.71701" height="1.41509" rx="0.707546" fill="#202020"/>
<rect x="314.151" y="124.528" width="4.71698" height="1.41509" rx="0.707546" fill="#202020"/>
<ellipse cx="303.774" cy="123.585" rx="2.8302" ry="2.83019" fill="#E8AE9F"/>
<path fill-rule="evenodd" clip-rule="evenodd" d="M321.268 101.738C327.153 103.298 335.294 107.895 334.891 112.613C334.73 114.332 333.481 115.492 332.916 116.091C327.475 121.209 316.472 116.651 315.021 116.091C312.965 115.212 309.66 113.493 306.315 110.054C306.436 111.853 306.436 116.331 303.776 121.009C300.874 126.127 296.521 128.446 294.949 129.245C293.538 125.767 292.974 121.889 293.739 118.011C294.062 116.291 294.949 112.453 297.972 108.735C298.657 107.895 300.47 105.776 303.453 104.017C311.272 99.2194 319.857 101.378 321.268 101.738Z" fill="#202020"/>
</svg>
