<svg width="16" height="10" viewBox="0 0 16 10" fill="none" xmlns="http://www.w3.org/2000/svg">
<path d="M6.34061 1.73531C7.13322 0.557245 8.86674 0.557243 9.65936 1.73531L15.0059 9.68178H0.99411L6.34061 1.73531Z" fill="white"/>
</svg>
