<svg width="170" height="130" viewBox="0 0 170 130" fill="none" xmlns="http://www.w3.org/2000/svg">
<circle cx="114.242" cy="54.9905" r="54.9905" fill="#E7FCFE"/>
<path d="M127.47 28.0024H3.51155C1.57218 28.0024 0 29.5751 0 31.5151V102.026C0 103.966 1.57218 105.539 3.51155 105.539H127.47C129.409 105.539 130.982 103.966 130.982 102.026V31.5151C130.982 29.5751 129.409 28.0024 127.47 28.0024Z" fill="#C9C9C9"/>
<path d="M121.509 105.539H4.22406C3.70022 105.535 3.18271 105.424 2.70276 105.214C2.22281 105.004 1.79038 104.699 1.43155 104.317C1.07272 103.935 0.794933 103.485 0.614958 102.993C0.434983 102.501 0.356548 101.977 0.384386 101.454C1.57585 78.1991 2.76382 54.9432 3.9483 31.6862C3.99548 30.6997 4.418 29.7687 5.12929 29.0838C5.84058 28.3989 6.78678 28.012 7.77401 28.0024L125.537 28.1491C126.063 28.1529 126.583 28.2638 127.065 28.4752C127.547 28.6865 127.98 28.9938 128.34 29.3784C128.699 29.7629 128.976 30.2166 129.154 30.7119C129.333 31.2071 129.408 31.7334 129.376 32.2588C128.031 55.4647 126.69 78.6717 125.352 101.88C125.297 102.865 124.87 103.792 124.155 104.472C123.441 105.152 122.495 105.534 121.509 105.539V105.539Z" fill="#E8E8E8"/>
<path d="M119.288 101.286H10.6914C9.67906 101.282 8.70953 100.877 7.99371 100.161C7.2779 99.4454 6.87373 98.4755 6.86914 97.4629V35.9706C6.86913 35.4672 6.9686 34.9688 7.16181 34.5039C7.35503 34.0391 7.63819 33.6171 7.99501 33.2621C8.35184 32.9071 8.77529 32.6262 9.24102 32.4354C9.70674 32.2447 10.2056 32.1479 10.7088 32.1507H119.288C120.301 32.1507 121.272 32.5531 121.988 33.2695C122.704 33.9859 123.106 34.9575 123.106 35.9706V97.4629C123.107 97.9649 123.008 98.462 122.817 98.9258C122.625 99.3897 122.344 99.8112 121.989 100.166C121.635 100.521 121.213 100.803 120.75 100.995C120.286 101.187 119.789 101.286 119.288 101.286V101.286Z" fill="#E3FFCA"/>
<path d="M118.869 37.3079H72.9463V96.4328H118.869V37.3079Z" fill="white"/>
<path d="M67.2223 37.3079H21.2998V96.4328H67.2223V37.3079Z" fill="white"/>
<path d="M49.9155 55.8804H25.6279C25.1992 55.8804 24.7882 55.71 24.4851 55.4069C24.182 55.1037 24.0117 54.6925 24.0117 54.2637V41.9694C24.0126 41.541 24.1832 41.1303 24.4861 40.8273C24.789 40.5243 25.1995 40.3537 25.6279 40.3528H49.9155C50.343 40.3546 50.7522 40.5258 51.0538 40.8288C51.3554 41.1317 51.5247 41.5419 51.5247 41.9694V54.2637C51.5247 54.6913 51.3554 55.1014 51.0538 55.4044C50.7522 55.7074 50.343 55.8785 49.9155 55.8804V55.8804Z" fill="#E0E0E0"/>
<path d="M112.352 66.467H78.9716C78.079 66.467 77.3555 67.1908 77.3555 68.0837V80.3675C77.3555 81.2603 78.079 81.9842 78.9716 81.9842H112.352C113.245 81.9842 113.968 81.2603 113.968 80.3675V68.0837C113.968 67.1908 113.245 66.467 112.352 66.467Z" fill="#E8E8E8"/>
<path d="M50.1983 65.5697H35.5377C34.9823 65.5697 34.4496 65.349 34.0568 64.9561C33.664 64.5632 33.4434 64.0303 33.4434 63.4747V63.4747C33.4434 62.919 33.664 62.3861 34.0568 61.9933C34.4496 61.6004 34.9823 61.3796 35.5377 61.3796H50.1983C50.7507 61.3842 51.279 61.607 51.668 61.9994C52.057 62.3918 52.2752 62.922 52.2752 63.4747V63.4747C52.2752 64.0273 52.057 64.5575 51.668 64.9499C51.279 65.3423 50.7507 65.5651 50.1983 65.5697V65.5697ZM52.2752 88.8488C52.2706 88.2992 52.0504 87.7735 51.6618 87.3848C51.2733 86.9962 50.7477 86.7758 50.1983 86.7713H35.5377C34.9853 86.7713 34.4552 86.9896 34.0629 87.3787C33.6706 87.7678 33.448 88.2962 33.4434 88.8488V88.8488C33.4434 89.4045 33.664 89.9374 34.0568 90.3302C34.4496 90.7231 34.9823 90.9439 35.5377 90.9439H50.1983C50.7507 90.9393 51.279 90.7165 51.668 90.3241C52.057 89.9317 52.2752 89.4015 52.2752 88.8488ZM105.332 88.8488C105.328 88.2962 105.105 87.7678 104.713 87.3787C104.321 86.9896 103.791 86.7713 103.238 86.7713H88.5775C88.0251 86.7713 87.495 86.9896 87.1027 87.3787C86.7105 87.7678 86.4878 88.2962 86.4832 88.8488V88.8488C86.4832 89.4045 86.7038 89.9374 87.0966 90.3302C87.4894 90.7231 88.0221 90.9439 88.5775 90.9439H103.238C103.791 90.9402 104.32 90.7178 104.71 90.3253C105.1 89.9328 105.319 89.4021 105.319 88.8488H105.332Z" fill="#80C343"/>
<path d="M17.5371 38.2333C17.5371 38.3259 17.5003 38.4147 17.4349 38.4802C17.3694 38.5457 17.2806 38.5824 17.188 38.5824H8.98511C8.89253 38.5824 8.80375 38.5457 8.73829 38.4802C8.67282 38.4147 8.63605 38.3259 8.63605 38.2333C8.63605 38.1407 8.67282 38.0519 8.73829 37.9864C8.80375 37.9209 8.89253 37.8841 8.98511 37.8841H17.1811C17.2275 37.8832 17.2736 37.8915 17.3168 37.9087C17.3599 37.9258 17.3993 37.9514 17.4324 37.9839C17.4656 38.0164 17.4919 38.0552 17.5099 38.098C17.5279 38.1408 17.5371 38.1868 17.5371 38.2333V38.2333ZM14.2839 40.3597H9.00605C8.90607 40.3597 8.81018 40.3994 8.73948 40.4702C8.66879 40.5409 8.62907 40.6368 8.62907 40.7368V40.7368C8.62907 40.8368 8.66879 40.9328 8.73948 41.0035C8.81018 41.0742 8.90607 41.1139 9.00605 41.1139H14.2839C14.3838 41.1139 14.4797 41.0742 14.5504 41.0035C14.6211 40.9328 14.6608 40.8368 14.6608 40.7368V40.7368C14.6599 40.6371 14.6199 40.5417 14.5494 40.4712C14.4789 40.4007 14.3836 40.3606 14.2839 40.3597V40.3597ZM14.6608 43.415C14.6599 43.3091 14.6172 43.2078 14.542 43.1333C14.4669 43.0587 14.3653 43.0169 14.2594 43.0169H9.02351C8.97066 43.0164 8.91825 43.0265 8.86934 43.0465C8.82043 43.0665 8.77599 43.0961 8.73862 43.1335C8.70125 43.1709 8.6717 43.2153 8.65169 43.2642C8.63168 43.3132 8.62162 43.3656 8.62209 43.4184V43.4184C8.62208 43.471 8.63249 43.5231 8.65271 43.5716C8.67292 43.6201 8.70255 43.6641 8.73987 43.7012C8.77719 43.7382 8.82147 43.7674 8.87015 43.7872C8.91884 43.807 8.97096 43.817 9.02351 43.8165H14.2594C14.3659 43.8165 14.468 43.7742 14.5433 43.6989C14.6185 43.6236 14.6608 43.5215 14.6608 43.415V43.415ZM65.4911 43.8514C65.4911 43.7938 65.4797 43.7368 65.4576 43.6836C65.4354 43.6304 65.403 43.5821 65.3621 43.5416C65.3212 43.501 65.2727 43.4689 65.2193 43.4472C65.166 43.4254 65.1089 43.4145 65.0513 43.415H54.007C53.9494 43.4145 53.8923 43.4254 53.8389 43.4472C53.7856 43.4689 53.7371 43.501 53.6962 43.5416C53.6553 43.5821 53.6229 43.6304 53.6007 43.6836C53.5786 43.7368 53.5672 43.7938 53.5672 43.8514V43.8514C53.5667 43.9093 53.5778 43.9667 53.5997 44.0203C53.6216 44.0739 53.654 44.1226 53.695 44.1636C53.7359 44.2045 53.7846 44.2369 53.8381 44.2588C53.8917 44.2808 53.9491 44.2918 54.007 44.2914H65.0513C65.1092 44.2918 65.1666 44.2808 65.2201 44.2588C65.2737 44.2369 65.3224 44.2045 65.3633 44.1636C65.4042 44.1226 65.4366 44.0739 65.4586 44.0203C65.4805 43.9667 65.4916 43.9093 65.4911 43.8514ZM65.4911 47.3047C65.492 47.2464 65.4813 47.1884 65.4596 47.1342C65.438 47.08 65.4057 47.0307 65.3648 46.9891C65.3238 46.9475 65.275 46.9145 65.2212 46.8919C65.1674 46.8694 65.1096 46.8578 65.0513 46.8578H54.007C53.8903 46.8578 53.7785 46.9041 53.696 46.9866C53.6135 47.0691 53.5672 47.181 53.5672 47.2977V47.2977C53.5667 47.3556 53.5778 47.4131 53.5997 47.4666C53.6216 47.5202 53.654 47.5689 53.695 47.6099C53.7359 47.6508 53.7846 47.6832 53.8381 47.7051C53.8917 47.7271 53.9491 47.7381 54.007 47.7377H65.0513C65.1086 47.7381 65.1654 47.7273 65.2185 47.7058C65.2716 47.6843 65.32 47.6525 65.3608 47.6123C65.4017 47.5721 65.4342 47.5243 65.4566 47.4715C65.4789 47.4187 65.4906 47.362 65.4911 47.3047V47.3047ZM65.4911 50.758C65.4911 50.6413 65.4448 50.5294 65.3623 50.4469C65.2798 50.3644 65.1679 50.318 65.0513 50.318H54.007C53.8903 50.318 53.7785 50.3644 53.696 50.4469C53.6135 50.5294 53.5672 50.6413 53.5672 50.758V50.758C53.5667 50.8159 53.5778 50.8733 53.5997 50.9269C53.6216 50.9805 53.654 51.0292 53.695 51.0701C53.7359 51.1111 53.7846 51.1435 53.8381 51.1654C53.8917 51.1874 53.9491 51.1984 54.007 51.198H65.0513C65.1092 51.1984 65.1666 51.1874 65.2201 51.1654C65.2737 51.1435 65.3224 51.1111 65.3633 51.0701C65.4042 51.0292 65.4366 50.9805 65.4586 50.9269C65.4805 50.8733 65.4916 50.8159 65.4911 50.758ZM63.4386 71.5476C63.4386 71.4309 63.3923 71.319 63.3098 71.2365C63.2273 71.154 63.1154 71.1076 62.9988 71.1076H24.452C24.3354 71.1076 24.2235 71.154 24.141 71.2365C24.0585 71.319 24.0122 71.4309 24.0122 71.5476V71.5476C24.0113 71.6061 24.0219 71.6642 24.0436 71.7186C24.0652 71.773 24.0974 71.8226 24.1383 71.8644C24.1792 71.9063 24.228 71.9397 24.2818 71.9626C24.3356 71.9855 24.3935 71.9976 24.452 71.998H62.9988C63.0573 71.9976 63.1152 71.9855 63.169 71.9626C63.2228 71.9397 63.2716 71.9063 63.3125 71.8644C63.3534 71.8226 63.3856 71.773 63.4072 71.7186C63.4289 71.6642 63.4395 71.6061 63.4386 71.5476V71.5476ZM116.587 58.7296C116.587 58.6717 116.576 58.6142 116.554 58.5606C116.532 58.5071 116.5 58.4584 116.459 58.4174C116.418 58.3765 116.369 58.3441 116.316 58.3221C116.262 58.3002 116.205 58.2891 116.147 58.2896H77.5895C77.5311 58.2882 77.4729 58.2986 77.4185 58.3201C77.3642 58.3416 77.3147 58.3738 77.273 58.4149C77.2313 58.4559 77.1983 58.5049 77.1759 58.559C77.1535 58.6131 77.1423 58.6711 77.1428 58.7296V58.7296C77.1428 58.8462 77.1891 58.9581 77.2716 59.0406C77.3541 59.1232 77.4659 59.1695 77.5826 59.1695H116.133C116.192 59.1714 116.25 59.1614 116.305 59.1401C116.36 59.1188 116.411 59.0867 116.453 59.0457C116.495 59.0047 116.529 58.9555 116.552 58.9012C116.575 58.8469 116.587 58.7885 116.587 58.7296V58.7296ZM63.4386 75.6853C63.4386 75.5686 63.3923 75.4567 63.3098 75.3742C63.2273 75.2917 63.1154 75.2453 62.9988 75.2453H24.452C24.3354 75.2453 24.2235 75.2917 24.141 75.3742C24.0585 75.4567 24.0122 75.5686 24.0122 75.6853V75.6853C24.0131 75.8017 24.0597 75.913 24.142 75.9953C24.2243 76.0776 24.3356 76.1243 24.452 76.1252H62.9988C63.1152 76.1243 63.2265 76.0776 63.3088 75.9953C63.3911 75.913 63.4377 75.8017 63.4386 75.6853ZM63.4386 79.8229C63.4377 79.7065 63.3911 79.5951 63.3088 79.5128C63.2265 79.4305 63.1152 79.3839 62.9988 79.383H24.452C24.3356 79.3839 24.2243 79.4305 24.142 79.5128C24.0597 79.5951 24.0131 79.7065 24.0122 79.8229V79.8229C24.0122 79.9396 24.0585 80.0515 24.141 80.134C24.2235 80.2165 24.3354 80.2629 24.452 80.2629H62.9988C63.0566 80.2629 63.1138 80.2515 63.1671 80.2294C63.2205 80.2073 63.269 80.1749 63.3098 80.134C63.3506 80.0932 63.383 80.0447 63.4051 79.9913C63.4272 79.9379 63.4386 79.8807 63.4386 79.8229V79.8229ZM97.7827 42.2522C97.7818 42.1358 97.7352 42.0244 97.6529 41.9421C97.5706 41.8598 97.4593 41.8132 97.3429 41.8123H77.5895C77.5312 41.8113 77.4733 41.822 77.4191 41.8437C77.3649 41.8654 77.3156 41.8977 77.274 41.9386C77.2324 41.9796 77.1994 42.0284 77.1769 42.0822C77.1544 42.1361 77.1427 42.1939 77.1428 42.2522V42.2522C77.1423 42.3101 77.1533 42.3675 77.1753 42.4211C77.1972 42.4747 77.2296 42.5234 77.2705 42.5644C77.3115 42.6053 77.3601 42.6377 77.4137 42.6596C77.4673 42.6816 77.5247 42.6926 77.5826 42.6922H97.3359C97.3943 42.6931 97.4522 42.6824 97.5064 42.6607C97.5606 42.639 97.6099 42.6068 97.6514 42.5658C97.693 42.5249 97.7261 42.4761 97.7486 42.4222C97.7711 42.3684 97.7827 42.3106 97.7827 42.2522V42.2522ZM95.6604 54.4103C95.6609 54.3524 95.6498 54.295 95.6279 54.2414C95.606 54.1878 95.5736 54.1391 95.5327 54.0982C95.4917 54.0572 95.443 54.0249 95.3895 54.0029C95.3359 53.981 95.2785 53.9699 95.2206 53.9704H77.5895C77.5311 53.969 77.4729 53.9793 77.4185 54.0009C77.3642 54.0224 77.3147 54.0546 77.273 54.0957C77.2313 54.1367 77.1983 54.1857 77.1759 54.2398C77.1535 54.2938 77.1423 54.3518 77.1428 54.4103V54.4103C77.1428 54.527 77.1891 54.6389 77.2716 54.7214C77.3541 54.8039 77.4659 54.8503 77.5826 54.8503H95.2136C95.272 54.8512 95.3299 54.8405 95.3841 54.8188C95.4383 54.7971 95.4876 54.7649 95.5292 54.7239C95.5707 54.683 95.6038 54.6342 95.6263 54.5803C95.6488 54.5265 95.6604 54.4687 95.6604 54.4103V54.4103ZM92.2745 46.3794C92.275 46.3215 92.264 46.2641 92.242 46.2105C92.2201 46.1569 92.1877 46.1082 92.1468 46.0673C92.1058 46.0263 92.0572 45.9939 92.0036 45.972C91.95 45.9501 91.8926 45.939 91.8347 45.9395H77.5895C77.5299 45.938 77.4705 45.9488 77.4152 45.9711C77.3599 45.9935 77.3097 46.027 77.2678 46.0696C77.2259 46.1121 77.1932 46.1628 77.1717 46.2185C77.1502 46.2742 77.1403 46.3337 77.1428 46.3934C77.1428 46.451 77.1542 46.508 77.1763 46.5612C77.1984 46.6144 77.2309 46.6627 77.2718 46.7032C77.3127 46.7438 77.3612 46.7759 77.4145 46.7976C77.4679 46.8194 77.525 46.8303 77.5826 46.8298H91.8277C91.8859 46.8312 91.9438 46.821 91.9979 46.7997C92.0521 46.7784 92.1014 46.7464 92.1431 46.7058C92.1847 46.6651 92.2178 46.6165 92.2404 46.5629C92.2629 46.5092 92.2746 46.4516 92.2745 46.3934V46.3794ZM100.341 50.5171C100.342 50.4592 100.331 50.4018 100.309 50.3482C100.287 50.2946 100.254 50.2459 100.214 50.2049C100.173 50.164 100.124 50.1316 100.07 50.1097C100.017 50.0877 99.9594 50.0767 99.9015 50.0771H77.5895C77.5299 50.0756 77.4705 50.0864 77.4152 50.1088C77.3599 50.1312 77.3097 50.1647 77.2678 50.2072C77.2259 50.2498 77.1932 50.3005 77.1717 50.3562C77.1502 50.4119 77.1403 50.4714 77.1428 50.531V50.531C77.1428 50.6477 77.1891 50.7596 77.2716 50.8421C77.3541 50.9246 77.4659 50.971 77.5826 50.971H99.9015C100.018 50.971 100.13 50.9246 100.213 50.8421C100.295 50.7596 100.341 50.6477 100.341 50.531V50.5171Z" fill="#636464"/>
<path d="M107.567 77.4905C108.434 77.4905 109.138 76.318 109.138 74.8717C109.138 73.4254 108.434 72.2529 107.567 72.2529C106.699 72.2529 105.996 73.4254 105.996 74.8717C105.996 76.318 106.699 77.4905 107.567 77.4905Z" fill="#F8B9A8"/>
<path d="M107.567 76.0936C108.049 76.0936 108.44 75.4683 108.44 74.697C108.44 73.9256 108.049 73.3003 107.567 73.3003C107.085 73.3003 106.694 73.9256 106.694 74.697C106.694 75.4683 107.085 76.0936 107.567 76.0936Z" fill="#DD9887"/>
<path d="M109.487 78.014L105.822 71.2052L126.068 70.1577L125.021 74.5223L109.487 78.014Z" fill="#191919"/>
<path d="M104.736 120.089C109.354 134.625 129.519 132.53 133.359 117.994C136.316 106.8 141.038 97.2114 137.408 91.5618C136.12 89.5541 133.918 88.7475 131.666 87.6162C127.721 85.7317 123.404 84.7537 119.032 84.7537C114.66 84.7537 110.343 85.7317 106.398 87.6162C104.914 88.346 95.5523 91.1673 104.736 120.089Z" fill="#898988"/>
<path d="M112.601 82.7175H118.863V87.3615L115.722 90.7031L112.58 87.3615L112.601 82.7175Z" fill="#F8B9A8"/>
<path d="M112.6 86.0591C112.6 87.5605 118.862 87.159 118.862 86.0591V88.3252C118.898 88.758 118.843 89.1935 118.702 89.6042C118.561 90.0148 118.336 90.3917 118.042 90.7111C117.747 91.0305 117.39 91.2854 116.993 91.4597C116.595 91.6341 116.166 91.7241 115.731 91.7241C115.297 91.7241 114.868 91.6341 114.47 91.4597C114.073 91.2854 113.715 91.0305 113.421 90.7111C113.127 90.3917 112.902 90.0148 112.761 89.6042C112.62 89.1935 112.565 88.758 112.6 88.3252V86.0591Z" fill="#F8B9A8"/>
<path d="M112.601 82.4729H118.863V84.6866C116.329 85.7935 115.285 85.9052 112.601 84.6866V82.4729Z" fill="#DD9887"/>
<path d="M138.521 94.1475L140.555 108.736L131.762 108.899V94.2277C131.76 94.0849 131.815 93.9438 131.922 93.8149C134.264 91.0498 137.198 92.1178 138.419 93.885C138.476 93.9691 138.51 94.0576 138.521 94.1475Z" fill="#898988"/>
<path d="M124.061 74.1384C124.061 74.5608 124.124 74.8751 124.127 75.1859C124.135 76.8932 123.711 78.5748 122.895 80.0742C121.404 82.6651 116.919 85.4899 112.681 83.5904C109.442 82.1239 107.512 78.4471 108.175 74.6621C108.175 69.4246 109.795 64.2219 116.12 64.2219C122.235 64.2219 123.953 69.0928 124.061 74.1384Z" fill="#F8B9A8"/>
<path d="M116.538 78.0281C116.924 78.0281 117.236 77.5591 117.236 76.9806C117.236 76.4021 116.924 75.9331 116.538 75.9331C116.152 75.9331 115.84 76.4021 115.84 76.9806C115.84 77.5591 116.152 78.0281 116.538 78.0281Z" fill="#191919"/>
<path d="M110.573 78.1888C110.959 78.1888 111.271 77.7198 111.271 77.1413C111.271 76.5627 110.959 76.0938 110.573 76.0938C110.188 76.0938 109.875 76.5627 109.875 77.1413C109.875 77.7198 110.188 78.1888 110.573 78.1888Z" fill="#191919"/>
<path d="M113.945 79.5155H112.897C112.872 79.5156 112.846 79.5097 112.823 79.4982C112.8 79.4867 112.78 79.4699 112.765 79.4492C112.747 79.4294 112.735 79.4058 112.729 79.3802C112.723 79.3546 112.723 79.3279 112.73 79.3025L113.194 77.2075C113.204 77.1612 113.232 77.1208 113.272 77.0953C113.312 77.0698 113.361 77.0611 113.407 77.0713C113.453 77.0815 113.494 77.1097 113.519 77.1496C113.545 77.1896 113.553 77.238 113.543 77.2843L113.124 79.1663H113.952C113.998 79.1663 114.042 79.1847 114.075 79.2175C114.108 79.2502 114.126 79.2946 114.126 79.3409C114.126 79.3872 114.108 79.4316 114.075 79.4644C114.042 79.4971 113.998 79.5155 113.952 79.5155H113.945Z" fill="#CF836F"/>
<path d="M116.165 73.8905C116.165 73.7836 116.202 73.68 116.27 73.5977C116.339 73.5155 116.433 73.4597 116.539 73.4401C117.33 73.2602 118.152 73.2602 118.944 73.4401C119.044 73.4646 119.133 73.5225 119.197 73.6043C119.26 73.6861 119.294 73.787 119.293 73.8905C119.293 73.9516 119.281 74.0122 119.258 74.0688C119.235 74.1253 119.201 74.1767 119.158 74.2199C119.115 74.2632 119.063 74.2973 119.007 74.3205C118.95 74.3437 118.889 74.3554 118.828 74.3549H116.612C116.491 74.3513 116.377 74.3006 116.294 74.2138C116.21 74.127 116.164 74.011 116.165 73.8905V73.8905Z" fill="#CF836E"/>
<path d="M109.707 73.8835C109.706 73.7801 109.74 73.6795 109.804 73.5978C109.867 73.5161 109.956 73.4581 110.056 73.4331C110.736 73.2619 111.447 73.2619 112.126 73.4331C112.227 73.4582 112.316 73.5168 112.38 73.5992C112.443 73.6816 112.477 73.783 112.475 73.887C112.475 74.0111 112.426 74.1301 112.338 74.2178C112.25 74.3056 112.131 74.3549 112.007 74.3549H110.15C110.03 74.3494 109.916 74.2972 109.833 74.2091C109.75 74.1211 109.705 74.0043 109.707 73.8835V73.8835Z" fill="#CF836E"/>
<path d="M115.596 80.6609H111.407C111.407 81.5303 112.664 82.281 113.502 82.4067C114.339 82.5324 115.596 81.3837 115.596 80.6609Z" fill="white"/>
<path d="M110.003 70.6502C112.402 68.7123 112.677 68.0524 114 67.3156C115.134 66.6951 116.392 66.3372 117.683 66.2681C118.252 66.6581 118.785 67.0987 119.275 67.5845C120.65 68.9532 120.591 69.5922 121.795 70.6886C122.392 71.2333 123.634 72.3681 125.072 72.1307C125.419 72.038 125.753 71.9031 126.067 71.7291C127.069 71.2298 127.638 67.3645 126.416 65.4441C125.439 63.9077 122.87 63.4084 121.879 63.6982C121.879 62.127 122.053 60.2065 118.213 58.9844C113.379 57.4481 109.836 62.9999 107.742 64.0474C106.066 64.8854 104.076 63.6982 103.029 63.3491C102.331 64.7457 102.331 65.7933 103.204 66.6662C103.902 67.3645 105.068 67.5391 105.647 67.7137C103.204 68.5866 102.506 68.5866 99.8877 68.5866C100.489 69.8678 101.462 70.9384 102.68 71.6593C103.078 71.8898 105.172 73.1084 107.399 72.4275C108.045 72.2285 108.708 71.7012 110.003 70.6502Z" fill="#191919"/>
<path d="M108.614 62.1269C110.15 62.4062 111.002 62.2456 111.232 62.1269L109.487 64.3965C108.673 64.4559 106.799 64.2918 105.822 63.1744C104.844 62.0571 105.183 61.0794 105.473 60.7302C106.394 61.4394 107.471 61.9182 108.614 62.1269V62.1269Z" fill="#191919"/>
<path d="M123.257 71.1181C123.365 73.114 123.173 75.1148 122.688 77.0539C122.506 77.7823 122.281 78.4993 122.015 79.2013C122.191 79.3938 122.323 79.6226 122.402 79.8718C122.486 80.1307 122.511 80.405 122.475 80.6748C124.198 78.8816 125.357 76.6223 125.809 74.1768C126 73.0769 126.037 71.9559 125.921 70.8457L123.257 71.1181Z" fill="#191919"/>
<path d="M124.148 77.4905C125.015 77.4905 125.719 76.318 125.719 74.8717C125.719 73.4254 125.015 72.2529 124.148 72.2529C123.28 72.2529 122.577 73.4254 122.577 74.8717C122.577 76.318 123.28 77.4905 124.148 77.4905Z" fill="#F8B9A8"/>
<path d="M124.148 76.4428C124.726 76.4428 125.195 75.8175 125.195 75.0461C125.195 74.2747 124.726 73.6494 124.148 73.6494C123.569 73.6494 123.101 74.2747 123.101 75.0461C123.101 75.8175 123.569 76.4428 124.148 76.4428Z" fill="#DD9887"/>
<path d="M114.877 109.628H94.0551C93.9031 109.632 93.7537 109.588 93.6282 109.502C93.5028 109.416 93.4078 109.293 93.357 109.15L89.074 96.2721C89.0429 96.1657 89.0375 96.0535 89.0584 95.9446C89.0792 95.8358 89.1257 95.7334 89.1939 95.6461C89.2621 95.5588 89.3501 95.4889 89.4507 95.4423C89.5512 95.3958 89.6614 95.3738 89.7721 95.3783H110.304C110.451 95.3742 110.596 95.4169 110.718 95.5003C110.84 95.5838 110.932 95.7036 110.981 95.8426C112.512 100.135 114.043 104.428 115.575 108.72C115.609 108.827 115.616 108.941 115.596 109.052C115.577 109.163 115.531 109.267 115.462 109.356C115.394 109.445 115.305 109.516 115.203 109.564C115.101 109.611 114.989 109.633 114.877 109.628V109.628Z" fill="#E8E8E8"/>
<path d="M115.407 109.397C111.86 108.608 108.925 108.057 106.82 107.69C102.589 106.953 101.277 106.88 99.3359 105.787C97.3951 104.694 96.7633 103.65 93.8208 100.797C92.0755 99.1144 90.5047 97.7386 89.2236 96.6807L93.3705 109.15C93.4213 109.293 93.5163 109.416 93.6417 109.502C93.7672 109.588 93.9166 109.632 94.0686 109.628H114.876C114.976 109.628 115.074 109.607 115.165 109.568C115.256 109.528 115.339 109.47 115.407 109.397V109.397Z" fill="#D3D3D3"/>
<path d="M96.2173 111.329C98.0257 110.301 98.7628 108.185 97.8637 106.602C96.9645 105.019 94.7695 104.57 92.961 105.598C91.1526 106.626 90.4155 108.742 91.3146 110.325C92.2138 111.908 94.4088 112.357 96.2173 111.329Z" fill="#F8B9A8"/>
<path d="M113.803 110.614C114.794 108.948 113.981 106.637 111.987 105.451C109.994 104.265 107.575 104.654 106.585 106.32C105.595 107.986 106.408 110.297 108.401 111.483C110.394 112.669 112.813 112.28 113.803 110.614Z" fill="#F8B9A8"/>
<path d="M131.355 108.763H139.472V119.856L132.167 118.843L131.355 108.763Z" fill="#F8B9A8"/>
<path d="M112.89 107.681L139.473 116.542V119.717C139.473 121.649 137.507 122.958 135.724 122.214L111.132 111.942L112.89 107.681Z" fill="#F8B9A8"/>
</svg>
