<svg width="661" height="253" viewBox="0 0 661 253" fill="none" xmlns="http://www.w3.org/2000/svg">
<mask id="mask0" mask-type="alpha" maskUnits="userSpaceOnUse" x="46" y="3" width="568" height="206">
<path fill-rule="evenodd" clip-rule="evenodd" d="M613.653 3.72083H459.156V208.448H613.653V3.72083ZM200.548 3.72086H46.0508V208.448H200.548V3.72086Z" fill="#354470"/>
</mask>
<g mask="url(#mask0)">
<path fill-rule="evenodd" clip-rule="evenodd" d="M613.653 3.72083H459.156V208.448H613.653V3.72083ZM200.548 3.72086H46.0508V208.448H200.548V3.72086Z" fill="#354470"/>
<path d="M160.346 34.0556C158.232 33.5904 156.58 31.8559 156.137 29.6368C156.083 29.3643 155.854 29.1692 155.588 29.1692C155.323 29.1692 155.094 29.3643 155.04 29.6368C154.597 31.8559 152.944 33.5904 150.83 34.0555C150.571 34.1126 150.385 34.3529 150.385 34.6313C150.385 34.9097 150.571 35.15 150.83 35.2071C152.944 35.6723 154.597 37.4068 155.04 39.6259C155.094 39.8984 155.323 40.0935 155.588 40.0935C155.853 40.0935 156.082 39.8984 156.137 39.6259C156.58 37.4068 158.232 35.6723 160.346 35.2072C160.606 35.1501 160.792 34.9098 160.792 34.6314C160.792 34.353 160.606 34.1127 160.346 34.0556Z" fill="white"/>
<path d="M111.606 96.682C108.028 95.8947 105.232 92.9594 104.482 89.2039C104.39 88.7429 104.003 88.4126 103.554 88.4126C103.105 88.4126 102.717 88.7429 102.625 89.2039C101.875 92.9594 99.0791 95.8946 95.5015 96.6818C95.0622 96.7784 94.7476 97.1851 94.7476 97.6562C94.7476 98.1273 95.0622 98.534 95.5015 98.6306C99.079 99.4179 101.875 102.353 102.625 106.109C102.717 106.57 103.105 106.9 103.553 106.9C104.002 106.9 104.39 106.57 104.482 106.109C105.232 102.353 108.028 99.4179 111.606 98.6308C112.045 98.5342 112.36 98.1276 112.36 97.6564C112.36 97.1853 112.045 96.7786 111.606 96.682Z" fill="white"/>
<path d="M490.419 81.3063C489.508 77.7581 490.867 73.9385 493.88 71.5754C494.25 71.2853 494.37 70.7906 494.168 70.39C493.966 69.9894 493.496 69.7926 493.043 69.9184C489.353 70.9428 485.472 69.7709 483.156 66.9328C482.872 66.5844 482.367 66.4869 481.946 66.6994C481.526 66.9119 481.305 67.3761 481.417 67.8118C482.327 71.3599 480.969 75.1794 477.955 77.5425C477.585 77.8326 477.465 78.3273 477.668 78.7279C477.87 79.1285 478.34 79.3253 478.793 79.1995C482.483 78.1751 486.364 79.3471 488.68 82.1852C488.964 82.5337 489.469 82.6311 489.889 82.4186C490.31 82.2061 490.531 81.7419 490.419 81.3063Z" fill="white"/>
<path d="M570.142 24.6419C569.231 21.0937 570.589 17.2741 573.603 14.911C573.973 14.6209 574.093 14.1262 573.891 13.7256C573.688 13.3249 573.219 13.1282 572.766 13.254C569.076 14.2784 565.195 13.1065 562.879 10.2684C562.594 9.91993 562.089 9.82249 561.669 10.035C561.248 10.2475 561.027 10.7117 561.139 11.1473C562.05 14.6954 560.692 18.515 557.678 20.8781C557.308 21.1682 557.188 21.6629 557.39 22.0635C557.593 22.4641 558.062 22.6609 558.515 22.5351C562.205 21.5107 566.086 22.6827 568.402 25.5208C568.687 25.8692 569.192 25.9667 569.612 25.7542C570.033 25.5417 570.254 25.0774 570.142 24.6419Z" fill="white"/>
<path d="M202.181 72.1363C201.043 71.8858 200.153 70.9518 199.915 69.7569C199.885 69.6102 199.762 69.5051 199.619 69.5051C199.476 69.5051 199.353 69.6102 199.324 69.7569C199.085 70.9518 198.196 71.8858 197.057 72.1362C196.918 72.167 196.817 72.2964 196.817 72.4463C196.817 72.5962 196.917 72.7256 197.057 72.7563C198.196 73.0068 199.085 73.9408 199.324 75.1357C199.353 75.2824 199.476 75.3875 199.619 75.3875C199.762 75.3875 199.885 75.2824 199.915 75.1357C200.153 73.9408 201.043 73.0068 202.181 72.7564C202.321 72.7256 202.421 72.5962 202.421 72.4463C202.421 72.2964 202.321 72.167 202.181 72.1363Z" fill="white"/>
<path d="M162.154 84.7413C161.016 84.4908 160.126 83.5568 159.887 82.3619C159.858 82.2152 159.735 82.1101 159.592 82.1101C159.449 82.1101 159.326 82.2152 159.297 82.3619C159.058 83.5568 158.168 84.4908 157.03 84.7412C156.89 84.772 156.79 84.9014 156.79 85.0513C156.79 85.2012 156.89 85.3305 157.03 85.3613C158.168 85.6118 159.058 86.5457 159.297 87.7406C159.326 87.8874 159.449 87.9925 159.592 87.9925C159.735 87.9925 159.858 87.8874 159.887 87.7406C160.126 86.5457 161.016 85.6118 162.154 85.3614C162.294 85.3306 162.394 85.2012 162.394 85.0513C162.394 84.9014 162.294 84.772 162.154 84.7413Z" fill="white"/>
<path d="M178.166 59.5313C177.027 59.2808 176.138 58.3468 175.899 57.1519C175.87 57.0052 175.747 56.9001 175.604 56.9001C175.461 56.9001 175.338 57.0052 175.308 57.1519C175.07 58.3468 174.18 59.2808 173.042 59.5312C172.902 59.562 172.802 59.6914 172.802 59.8413C172.802 59.9912 172.902 60.1206 173.042 60.1513C174.18 60.4018 175.07 61.3358 175.308 62.5307C175.338 62.6774 175.461 62.7825 175.604 62.7825C175.746 62.7825 175.87 62.6774 175.899 62.5307C176.138 61.3358 177.027 60.4018 178.166 60.1514C178.306 60.1206 178.406 59.9913 178.406 59.8413C178.406 59.6914 178.306 59.562 178.166 59.5313Z" fill="white"/>
<path d="M202.966 8.50291C201.746 8.27031 200.793 7.40306 200.537 6.29348C200.506 6.15727 200.374 6.05969 200.221 6.05969C200.068 6.05969 199.936 6.15727 199.904 6.29349C199.649 7.40306 198.695 8.27029 197.476 8.50286C197.326 8.53141 197.219 8.65156 197.219 8.79075C197.219 8.92995 197.326 9.0501 197.476 9.07865C198.695 9.31126 199.649 10.1785 199.904 11.2881C199.936 11.4243 200.068 11.5219 200.221 11.5219C200.374 11.5219 200.506 11.4243 200.537 11.2881C200.793 10.1785 201.746 9.31126 202.966 9.07871C203.116 9.05016 203.223 8.93002 203.223 8.79081C203.223 8.65161 203.116 8.53146 202.966 8.50291Z" fill="white"/>
<path d="M319.045 97.1586C317.825 96.9259 316.872 96.0587 316.616 94.9491C316.585 94.8129 316.453 94.7153 316.3 94.7153C316.147 94.7153 316.015 94.8129 315.983 94.9491C315.728 96.0587 314.775 96.9259 313.555 97.1585C313.405 97.187 313.298 97.3072 313.298 97.4464C313.298 97.5856 313.405 97.7057 313.555 97.7343C314.774 97.9669 315.728 98.8341 315.983 99.9437C316.015 100.08 316.147 100.178 316.3 100.178C316.453 100.178 316.585 100.08 316.616 99.9437C316.872 98.8341 317.825 97.9669 319.045 97.7343C319.195 97.7058 319.302 97.5857 319.302 97.4464C319.302 97.3073 319.195 97.1871 319.045 97.1586Z" fill="white"/>
<path d="M54.8634 105.562C53.6437 105.329 52.6904 104.462 52.4348 103.352C52.4034 103.216 52.2713 103.118 52.1183 103.118C51.9653 103.118 51.8332 103.216 51.8018 103.352C51.5462 104.462 50.5929 105.329 49.3732 105.562C49.2235 105.59 49.1162 105.71 49.1162 105.849C49.1162 105.989 49.2235 106.109 49.3732 106.137C50.5929 106.37 51.5461 107.237 51.8018 108.347C51.8332 108.483 51.9652 108.581 52.1182 108.581C52.2712 108.581 52.4033 108.483 52.4347 108.347C52.6904 107.237 53.6437 106.37 54.8633 106.137C55.0131 106.109 55.1204 105.989 55.1204 105.85C55.1203 105.71 55.0131 105.59 54.8634 105.562Z" fill="white"/>
<path d="M110.901 46.7384C109.681 46.5058 108.728 45.6385 108.472 44.5289C108.441 44.3927 108.309 44.2952 108.156 44.2952C108.003 44.2952 107.871 44.3927 107.839 44.529C107.584 45.6385 106.63 46.5058 105.411 46.7383C105.261 46.7669 105.154 46.887 105.154 47.0262C105.154 47.1654 105.261 47.2856 105.411 47.3141C106.63 47.5467 107.584 48.414 107.839 49.5235C107.871 49.6597 108.003 49.7573 108.156 49.7573C108.309 49.7573 108.441 49.6598 108.472 49.5235C108.728 48.414 109.681 47.5467 110.901 47.3142C111.051 47.2856 111.158 47.1655 111.158 47.0263C111.158 46.8871 111.051 46.7669 110.901 46.7384Z" fill="white"/>
<path d="M83.0103 31.738C81.7907 31.5054 80.8374 30.6382 80.5817 29.5286C80.5503 29.3924 80.4183 29.2948 80.2653 29.2948C80.1122 29.2948 79.9802 29.3924 79.9488 29.5286C79.6931 30.6382 78.7398 31.5054 77.5202 31.738C77.3705 31.7665 77.2632 31.8867 77.2632 32.0259C77.2632 32.1651 77.3704 32.2852 77.5202 32.3138C78.7398 32.5464 79.6931 33.4136 79.9487 34.5232C79.9801 34.6594 80.1122 34.757 80.2652 34.757C80.4182 34.757 80.5503 34.6594 80.5817 34.5232C80.8373 33.4136 81.7907 32.5464 83.0103 32.3138C83.1601 32.2853 83.2673 32.1651 83.2673 32.0259C83.2673 31.8867 83.1601 31.7666 83.0103 31.738Z" fill="white"/>
<path d="M61.338 67.6195C60.1183 67.3869 59.165 66.5196 58.9094 65.4101C58.878 65.2738 58.7459 65.1763 58.5929 65.1763C58.4399 65.1763 58.3078 65.2738 58.2764 65.4101C58.0208 66.5196 57.0675 67.3869 55.8478 67.6194C55.6981 67.648 55.5908 67.7681 55.5908 67.9073C55.5908 68.0465 55.6981 68.1667 55.8478 68.1952C57.0675 68.4278 58.0207 69.2951 58.2764 70.4046C58.3078 70.5408 58.4398 70.6384 58.5928 70.6384C58.7458 70.6384 58.8779 70.5409 58.9093 70.4046C59.165 69.2951 60.1183 68.4278 61.3379 68.1953C61.4877 68.1667 61.595 68.0466 61.595 67.9074C61.5949 67.7682 61.4877 67.648 61.338 67.6195Z" fill="white"/>
<path d="M130.916 8.92344C129.696 8.69084 128.743 7.82359 128.487 6.71401C128.456 6.5778 128.324 6.48022 128.171 6.48022C128.018 6.48022 127.885 6.5778 127.854 6.71403C127.598 7.82359 126.645 8.69082 125.425 8.92339C125.276 8.95194 125.168 9.07209 125.168 9.21129C125.168 9.35048 125.276 9.47063 125.425 9.49918C126.645 9.73179 127.598 10.599 127.854 11.7086C127.885 11.8448 128.017 11.9424 128.17 11.9424C128.323 11.9424 128.456 11.8448 128.487 11.7086C128.743 10.599 129.696 9.73179 130.916 9.49924C131.065 9.47069 131.173 9.35055 131.173 9.21134C131.173 9.07215 131.065 8.95199 130.916 8.92344Z" fill="white"/>
<path d="M134.919 55.1417C133.699 54.9091 132.746 54.0418 132.49 52.9323C132.459 52.7961 132.326 52.6985 132.173 52.6985C132.02 52.6985 131.888 52.7961 131.857 52.9323C131.601 54.0418 130.648 54.9091 129.428 55.1416C129.279 55.1702 129.171 55.2904 129.171 55.4295C129.171 55.5687 129.279 55.6889 129.428 55.7174C130.648 55.95 131.601 56.8173 131.857 57.9268C131.888 58.0631 132.02 58.1607 132.173 58.1607C132.326 58.1607 132.458 58.0631 132.49 57.9268C132.746 56.8173 133.699 55.95 134.919 55.7175C135.068 55.6889 135.176 55.5688 135.176 55.4296C135.176 55.2904 135.068 55.1703 134.919 55.1417Z" fill="white"/>
<path d="M351.468 34.1334C350.248 33.9008 349.295 33.0335 349.039 31.924C349.008 31.7878 348.876 31.6902 348.723 31.6902C348.57 31.6902 348.438 31.7878 348.406 31.924C348.151 33.0335 347.197 33.9008 345.978 34.1334C345.828 34.1619 345.721 34.2821 345.721 34.4212C345.721 34.5604 345.828 34.6806 345.978 34.7091C347.197 34.9417 348.151 35.809 348.406 36.9185C348.438 37.0548 348.57 37.1524 348.723 37.1524C348.876 37.1524 349.008 37.0548 349.039 36.9185C349.295 35.809 350.248 34.9417 351.468 34.7092C351.618 34.6806 351.725 34.5605 351.725 34.4213C351.725 34.2821 351.618 34.162 351.468 34.1334Z" fill="white"/>
<path d="M582.038 118.179C581.696 116.985 582.04 115.743 582.915 115.015C583.022 114.925 583.05 114.763 582.981 114.627C582.912 114.49 582.765 114.416 582.63 114.45C581.524 114.722 580.32 114.262 579.562 113.279C579.469 113.158 579.314 113.116 579.189 113.179C579.065 113.242 579.006 113.392 579.048 113.538C579.391 114.732 579.047 115.974 578.172 116.702C578.064 116.792 578.037 116.954 578.106 117.09C578.175 117.227 578.321 117.301 578.457 117.267C579.563 116.995 580.767 117.455 581.524 118.438C581.617 118.559 581.773 118.601 581.897 118.538C582.022 118.475 582.08 118.325 582.038 118.179Z" fill="white"/>
<path d="M569.822 67.4809C569.479 66.2874 569.823 65.0454 570.698 64.3168C570.806 64.2274 570.833 64.0655 570.764 63.9289C570.695 63.7923 570.548 63.7185 570.413 63.7519C569.307 64.0242 568.103 63.5645 567.346 62.5808C567.252 62.46 567.097 62.4185 566.973 62.4813C566.848 62.544 566.79 62.694 566.832 62.8405C567.174 64.0339 566.83 65.2759 565.955 66.0045C565.848 66.0939 565.82 66.2558 565.889 66.3924C565.958 66.529 566.105 66.6028 566.24 66.5694C567.346 66.2972 568.55 66.7569 569.308 67.7405C569.401 67.8613 569.556 67.9029 569.681 67.8401C569.805 67.7773 569.864 67.6274 569.822 67.4809Z" fill="white"/>
<path d="M583.209 38.4572C582.867 37.2637 583.211 36.0217 584.086 35.2931C584.193 35.2037 584.221 35.0418 584.152 34.9052C584.083 34.7687 583.936 34.6948 583.8 34.7282C582.695 35.0005 581.491 34.5408 580.733 33.5571C580.64 33.4364 580.485 33.3948 580.36 33.4576C580.236 33.5204 580.177 33.6703 580.219 33.8168C580.562 35.0103 580.218 36.2522 579.343 36.9808C579.235 37.0703 579.208 37.2321 579.277 37.3687C579.346 37.5053 579.492 37.5791 579.628 37.5457C580.734 37.2735 581.938 37.7332 582.695 38.7169C582.788 38.8376 582.944 38.8792 583.068 38.8164C583.192 38.7536 583.251 38.6037 583.209 38.4572Z" fill="white"/>
<path d="M493.253 20.6779C492.911 19.4844 493.255 18.2424 494.13 17.5138C494.237 17.4244 494.265 17.2625 494.196 17.1259C494.127 16.9894 493.98 16.9155 493.844 16.9489C492.739 17.2212 491.535 16.7615 490.777 15.7778C490.684 15.6571 490.529 15.6155 490.404 15.6783C490.28 15.7411 490.221 15.891 490.263 16.0375C490.606 17.231 490.262 18.4729 489.387 19.2015C489.279 19.291 489.252 19.4528 489.321 19.5894C489.39 19.726 489.536 19.7998 489.672 19.7664C490.778 19.4942 491.982 19.9539 492.739 20.9376C492.832 21.0583 492.988 21.0999 493.112 21.0371C493.236 20.9743 493.295 20.8244 493.253 20.6779Z" fill="white"/>
<path d="M459.482 66.9397C459.139 65.7463 459.483 64.5043 460.358 63.7757C460.466 63.6862 460.493 63.5244 460.424 63.3878C460.355 63.2512 460.209 63.1774 460.073 63.2108C458.967 63.483 457.763 63.0233 457.006 62.0397C456.913 61.9189 456.757 61.8773 456.633 61.9401C456.509 62.0029 456.45 62.1528 456.492 62.2994C456.834 63.4928 456.49 64.7347 455.615 65.4634C455.508 65.5528 455.48 65.7147 455.549 65.8513C455.618 65.9878 455.765 66.0617 455.901 66.0282C457.006 65.756 458.21 66.2157 458.968 67.1994C459.061 67.3202 459.216 67.3617 459.341 67.2989C459.465 67.2362 459.524 67.0862 459.482 66.9397Z" fill="white"/>
<path d="M348.476 71.8706C346.362 71.4054 344.71 69.6709 344.267 67.4517C344.212 67.1793 343.984 66.9841 343.718 66.9841C343.453 66.9841 343.224 67.1793 343.17 67.4517C342.727 69.6709 341.074 71.4053 338.96 71.8705C338.701 71.9276 338.515 72.1679 338.515 72.4463C338.515 72.7246 338.701 72.965 338.96 73.0221C341.074 73.4873 342.726 75.2217 343.17 77.4409C343.224 77.7133 343.453 77.9085 343.718 77.9085C343.983 77.9085 344.212 77.7133 344.267 77.4409C344.71 75.2217 346.362 73.4873 348.476 73.0222C348.736 72.9651 348.922 72.7248 348.922 72.4464C348.922 72.168 348.736 71.9277 348.476 71.8706Z" fill="white"/>
<path d="M544.276 40.4282C543.738 38.3316 544.541 36.0745 546.322 34.6782C546.54 34.5067 546.611 34.2144 546.491 33.9777C546.372 33.741 546.094 33.6247 545.827 33.699C543.646 34.3043 541.353 33.6118 539.984 31.9348C539.816 31.7289 539.518 31.6713 539.269 31.7969C539.021 31.9224 538.89 32.1967 538.957 32.4542C539.495 34.5508 538.692 36.8078 536.911 38.2042C536.693 38.3756 536.622 38.6679 536.741 38.9046C536.861 39.1413 537.138 39.2577 537.406 39.1833C539.586 38.578 541.88 39.2705 543.248 40.9476C543.416 41.1535 543.715 41.2111 543.963 41.0855C544.212 40.9599 544.342 40.6856 544.276 40.4282Z" fill="white"/>
<path fill-rule="evenodd" clip-rule="evenodd" d="M408.444 135.776C475.855 135.776 558.115 230.435 558.115 230.435H408.444C408.444 230.435 408.24 230.149 407.866 229.607C407.492 230.149 407.288 230.435 407.288 230.435H257.617C257.617 230.435 339.877 135.777 407.288 135.777C407.481 135.777 407.673 135.777 407.864 135.779C408.056 135.777 408.25 135.776 408.444 135.776Z" fill="#A5DBCE"/>
<path fill-rule="evenodd" clip-rule="evenodd" d="M239.299 123.944C171.888 123.944 89.6284 230.435 89.6284 230.435H239.299C239.299 230.435 239.503 230.113 239.876 229.505C240.25 230.113 240.454 230.435 240.454 230.435H390.125C390.125 230.435 307.865 123.944 240.454 123.944C240.261 123.944 240.068 123.945 239.877 123.947C239.685 123.945 239.493 123.944 239.299 123.944Z" fill="#BCEBE0"/>
<g filter="url(#filter0_d)">
<path fill-rule="evenodd" clip-rule="evenodd" d="M360.204 230.435C360.204 230.435 481.579 118.685 581.044 118.685C680.509 118.685 602.421 230.435 602.421 230.435H360.204Z" fill="#9DE1D1"/>
</g>
<g filter="url(#filter1_d)">
<path fill-rule="evenodd" clip-rule="evenodd" d="M254.624 230.435C254.624 230.435 139 118.685 44.2481 118.685C-50.5042 118.685 44.2481 230.435 44.2481 230.435H254.624Z" fill="#9DE1D1"/>
</g>
</g>
<path d="M43.5512 210.882C42.6988 207.706 45.0918 204.586 48.3803 204.586L196.944 204.586C200.232 204.586 202.626 207.707 201.772 210.883L201.543 211.738C200.956 213.923 198.976 215.441 196.714 215.441H48.6098C46.3476 215.441 44.3672 213.922 43.7807 211.738L43.5512 210.882Z" fill="#DBBFAA"/>
<path d="M460.846 210.882C459.994 207.706 462.387 204.586 465.675 204.586L614.238 204.586C617.527 204.586 619.92 207.707 619.067 210.883L618.838 211.738C618.251 213.923 616.271 215.441 614.009 215.441H465.905C463.643 215.441 461.662 213.922 461.076 211.738L460.846 210.882Z" fill="#DBBFAA"/>
<path d="M194.703 5.1875H50.6226C48.3379 5.1875 46.4858 7.03405 46.4858 9.31188V202.619C46.4858 204.897 48.3379 206.744 50.6226 206.744H194.703C196.988 206.744 198.84 204.897 198.84 202.619V9.31188C198.84 7.03405 196.988 5.1875 194.703 5.1875Z" stroke="#A58476" stroke-width="5" stroke-miterlimit="10"/>
<path d="M122.663 6.09387V207.65" stroke="#A58476" stroke-width="5" stroke-miterlimit="10"/>
<path d="M46.4858 106.04C46.4858 105.693 198.84 106.04 198.84 106.04" stroke="#A58476" stroke-width="5" stroke-miterlimit="10"/>
<path d="M610.672 3.32104H466.929C464.649 3.32104 462.802 5.16877 462.802 7.44806V200.879C462.802 203.158 464.649 205.006 466.929 205.006H610.672C612.951 205.006 614.799 203.158 614.799 200.879V7.44806C614.799 5.16877 612.951 3.32104 610.672 3.32104Z" stroke="#A58476" stroke-width="5" stroke-miterlimit="10"/>
<path d="M538.8 4.22803V205.913" stroke="#A58476" stroke-width="5" stroke-miterlimit="10"/>
<path d="M462.801 104.238C462.801 103.89 614.798 104.238 614.798 104.238" stroke="#A58476" stroke-width="5" stroke-miterlimit="10"/>
<path d="M9.28915 67.396C1.30508 47.0482 3.28197 19.6569 2.67378 0.0916748H49.3237L49.3242 220.494C32.8997 221.537 -2.20816 219.144 1.07697 198.483C4.3621 177.822 36.2831 126.483 40.5411 101.439C37.0433 101.7 15.9182 84.2904 9.28915 67.396Z" fill="#FFE5CC"/>
<path d="M425.015 67.396C417.031 47.0482 419.008 19.6569 418.399 0.0916748H465.049L465.05 220.494C448.625 221.537 413.517 219.144 416.803 198.483C420.088 177.822 452.009 126.483 456.267 101.439C452.769 101.7 431.644 84.2904 425.015 67.396Z" fill="#FFE5CC"/>
<path d="M235.932 67.396C243.916 47.0482 241.939 19.6569 242.547 0.0916748H195.897L195.896 220.494C212.321 221.537 247.429 219.144 244.144 198.483C240.859 177.822 208.938 126.483 204.68 101.439C208.177 101.7 229.303 84.2904 235.932 67.396Z" fill="#FFE5CC"/>
<path d="M652.569 67.396C660.553 47.0482 658.576 19.6569 659.185 0.0916748H612.535L612.534 220.494C628.959 221.537 664.067 219.144 660.781 198.483C657.496 177.822 625.575 126.483 621.317 101.439C624.815 101.7 645.94 84.2904 652.569 67.396Z" fill="#FFE5CC"/>
<path d="M328.357 62.6684C333.185 62.6684 337.1 58.7338 337.1 53.8801C337.1 49.0264 333.185 45.0917 328.357 45.0917C323.528 45.0917 319.613 49.0264 319.613 53.8801C319.613 58.7338 323.528 62.6684 328.357 62.6684Z" fill="#FFEBAD"/>
<path d="M328.357 37.9223V3" stroke="#979797" stroke-width="3" stroke-linecap="round"/>
<path d="M318.684 39.7602L299.67 54.0158C298.855 54.6268 298.687 55.7861 299.295 56.6051C299.642 57.0733 300.189 57.3491 300.771 57.3491H356.161C357.178 57.3491 358.002 56.5207 358.002 55.4989C358.002 54.9307 357.742 54.3939 357.297 54.0432L339.325 39.8719C336.393 37.5598 332.774 36.3032 329.047 36.3032C325.312 36.3032 321.678 37.5157 318.684 39.7602Z" fill="#D8D8D8"/>
<path d="M300.069 57.2373L227.719 186.898H427.719L356.981 57.2373H300.069Z" fill="url(#paint0_linear)"/>
<path d="M170.837 241.43H484.098C485.303 241.43 486.429 242.03 487.1 243.031L490.011 247.37C491.124 249.028 490.682 251.274 489.023 252.387C488.428 252.787 487.726 253 487.009 253H167.926C165.929 253 164.311 251.381 164.311 249.384C164.311 248.667 164.524 247.966 164.924 247.37L167.835 243.031C168.506 242.03 169.632 241.43 170.837 241.43Z" fill="#AE8976"/>
<path d="M171.223 235.645H483.712C485.158 235.645 486.509 236.365 487.315 237.566L489.907 241.43C491.05 243.134 490.596 245.442 488.892 246.585C488.28 246.996 487.559 247.215 486.822 247.215H168.113C166.061 247.215 164.397 245.552 164.397 243.5C164.397 242.763 164.617 242.042 165.028 241.43L167.62 237.566C168.426 236.365 169.777 235.645 171.223 235.645Z" fill="#BC9480"/>
<path d="M307.473 235.744H249.148V202.228C249.148 193.461 256.2 186.354 264.899 186.354H291.722C300.421 186.354 307.473 193.461 307.473 202.228V235.744Z" fill="#39C9A7"/>
<path d="M333.481 235.744H295.343V216.155C295.343 210.5 299.954 205.915 305.642 205.915H323.182C328.87 205.915 333.481 210.5 333.481 216.155V235.744Z" fill="#0174FF"/>
<path d="M299.459 199.246C299.459 208.331 306.655 215.695 315.533 215.695C324.41 215.695 331.606 208.331 331.606 199.246C331.606 190.161 324.41 182.796 315.533 182.796C306.655 182.796 299.459 190.161 299.459 199.246Z" fill="#F7B9A9"/>
<path d="M299.459 199.347C299.459 195.347 300.86 191.683 303.185 188.834C300.735 198.935 301.736 210.208 313.997 215.696C305.84 214.903 299.459 207.887 299.459 199.347Z" fill="#E2AA9F"/>
<path d="M303.349 202.057C303.349 203.034 304.128 203.827 305.089 203.827C306.051 203.827 306.83 203.034 306.83 202.057C306.83 201.079 306.051 200.287 305.089 200.287C304.128 200.287 303.349 201.079 303.349 202.057Z" fill="#F7B9A9"/>
<path d="M314.66 206.602C314.66 207.655 315.514 208.509 316.567 208.509C317.62 208.509 318.474 207.655 318.474 206.602C318.474 205.549 317.62 204.695 316.567 204.695C315.514 204.695 314.66 205.549 314.66 206.602Z" fill="white"/>
<path d="M323.261 206.602C323.261 207.655 324.115 208.509 325.167 208.509C326.22 208.509 327.074 207.655 327.074 206.602C327.074 205.549 326.22 204.695 325.167 204.695C324.115 204.695 323.261 205.549 323.261 206.602Z" fill="white"/>
<path d="M315.755 206.937C315.755 207.651 316.324 208.23 317.026 208.23C317.728 208.23 318.297 207.651 318.297 206.937C318.297 206.223 317.728 205.644 317.026 205.644C316.324 205.644 315.755 206.223 315.755 206.937Z" fill="#253051"/>
<path d="M324.354 206.937C324.354 207.651 324.923 208.23 325.625 208.23C326.327 208.23 326.896 207.651 326.896 206.937C326.896 206.223 326.327 205.644 325.625 205.644C324.923 205.644 324.354 206.223 324.354 206.937Z" fill="#253051"/>
<path d="M319.73 208.976C319.73 210.011 320.647 210.85 321.778 210.85C322.909 210.85 323.825 210.011 323.825 208.976H319.73Z" fill="#BC9480"/>
<path d="M245.024 209.472C246.537 205.519 248.289 200.95 250.28 195.764C251.733 191.771 256.135 189.707 260.111 191.154C260.201 191.187 260.289 191.221 260.376 191.256C260.469 191.286 260.562 191.318 260.654 191.352C260.66 191.362 260.666 191.373 260.671 191.383C264.276 193.025 266.063 197.204 264.68 201.005L262.647 206.239C262.47 206.959 262.252 207.676 261.993 208.388L252.527 232.663C251.074 236.656 246.672 238.72 242.696 237.273C238.72 235.825 236.674 231.415 238.128 227.422L245.024 209.472Z" fill="#33B597"/>
<path d="M295.13 223.361C295.166 221.245 295.208 218.799 295.258 216.021C295.258 213.897 297.015 212.175 299.183 212.175C299.231 212.175 299.28 212.175 299.328 212.177C299.378 212.175 299.428 212.175 299.478 212.175C299.483 212.178 299.488 212.182 299.492 212.186C301.515 212.341 303.107 213.999 303.107 216.021L303.045 218.829C303.086 219.197 303.107 219.571 303.107 219.95L302.804 232.974C302.804 235.099 301.047 236.821 298.879 236.821C296.712 236.821 294.955 235.099 294.955 232.974L295.13 223.361Z" fill="#0063DB"/>
<path d="M308.319 229.986C310.435 230.022 312.882 230.064 315.659 230.114C317.783 230.114 319.506 231.871 319.506 234.038C319.506 234.087 319.505 234.136 319.503 234.184C319.505 234.234 319.506 234.284 319.506 234.334C319.502 234.339 319.498 234.344 319.494 234.348C319.339 236.371 317.681 237.963 315.659 237.963L312.852 237.901C312.484 237.942 312.109 237.963 311.73 237.963L298.706 237.66C296.582 237.66 294.859 235.903 294.859 233.735C294.859 231.568 296.582 229.811 298.706 229.811L308.319 229.986Z" fill="#0063DB"/>
<path d="M265.004 222.748C269.236 222.67 274.129 222.582 279.683 222.486C283.929 222.337 287.492 225.645 287.64 229.874C287.643 229.969 287.644 230.064 287.644 230.158C287.651 230.255 287.656 230.353 287.66 230.451C287.652 230.461 287.645 230.47 287.637 230.479C287.466 234.437 284.26 237.659 280.218 237.8L274.603 237.876C273.87 237.981 273.123 238.048 272.366 238.074L246.312 238.392C242.066 238.54 238.503 235.232 238.356 231.003C238.208 226.774 241.531 223.226 245.777 223.077L265.004 222.748Z" fill="#33B597"/>
<path d="M292.625 228.214C292.625 233.399 288.454 237.604 283.309 237.604C278.163 237.604 273.992 233.399 273.992 228.214C273.992 223.029 278.163 218.825 283.309 218.825C288.454 218.825 292.625 223.029 292.625 228.214Z" fill="#F7B9A9"/>
<path d="M280.009 204.35C275.614 204.35 272.052 200.723 272.052 196.248V194.456C272.052 189.982 275.614 186.354 280.009 186.354C284.404 186.354 287.968 189.982 287.968 194.456V196.248C287.968 200.723 284.404 204.35 280.009 204.35Z" fill="#E2AA9F"/>
<path d="M338.148 172.74L338.155 172.742C339.782 164.127 345.991 156.676 354.92 153.925C367.733 149.977 381.28 157.198 385.18 170.052C385.179 170.053 379.46 181.598 360.116 179.133C360.116 179.133 354.643 186.558 356.724 200.979C357.352 205.334 358.669 210.326 361.034 215.945C361.034 215.945 346.138 224.504 337.395 215.719C328.896 207.179 337.654 174.559 338.148 172.74Z" fill="#243050"/>
<path d="M336.652 213.991C337.957 210.583 339.467 206.643 341.184 202.17C342.437 198.728 346.226 196.945 349.646 198.19C349.723 198.218 349.799 198.247 349.874 198.278C349.954 198.304 350.034 198.331 350.113 198.36C350.118 198.369 350.123 198.378 350.128 198.387C353.229 199.8 354.764 203.402 353.571 206.679L351.818 211.193C351.665 211.813 351.477 212.431 351.254 213.046L343.093 233.979C341.839 237.422 338.05 239.204 334.63 237.959C331.209 236.714 329.453 232.914 330.706 229.471L336.652 213.991Z" fill="#593DBF"/>
<path d="M342.177 235.893H392.349V207.867C392.349 200.307 386.282 194.179 378.799 194.179H355.726C348.243 194.179 342.177 200.307 342.177 207.867V235.893Z" fill="#6E4BEC"/>
<path d="M395.794 213.991C394.49 210.583 392.979 206.643 391.262 202.17C390.009 198.728 386.22 196.945 382.8 198.19C382.723 198.218 382.647 198.247 382.572 198.278C382.492 198.304 382.413 198.331 382.333 198.36C382.328 198.369 382.323 198.378 382.318 198.387C379.217 199.8 377.683 203.402 378.875 206.679L380.629 211.193C380.782 211.813 380.969 212.431 381.193 213.046L389.354 233.979C390.607 237.422 394.396 239.204 397.816 237.959C401.237 236.714 402.994 232.914 401.741 229.471L395.794 213.991Z" fill="#593DBF"/>
<path d="M378.704 225.578C375.055 225.51 370.836 225.435 366.046 225.351C362.385 225.223 359.313 228.069 359.186 231.706C359.183 231.788 359.182 231.869 359.182 231.95C359.176 232.034 359.171 232.118 359.168 232.203C359.175 232.211 359.181 232.219 359.188 232.227C359.336 235.631 362.101 238.403 365.586 238.525L370.428 238.59C371.061 238.681 371.704 238.739 372.357 238.762L394.824 239.037C398.485 239.165 401.557 236.319 401.684 232.681C401.811 229.043 398.945 225.991 395.284 225.863L378.704 225.578Z" fill="#593DBF"/>
<path d="M354.949 230.275C354.949 234.747 358.537 238.372 362.963 238.372C367.39 238.372 370.978 234.747 370.978 230.275C370.978 225.804 367.39 222.179 362.963 222.179C358.537 222.179 354.949 225.804 354.949 230.275Z" fill="#F7B9A9"/>
<path d="M365.801 209.697C369.582 209.697 372.646 206.569 372.646 202.71V201.165C372.646 197.307 369.582 194.179 365.801 194.179C362.021 194.179 358.955 197.307 358.955 201.165V202.71C358.955 206.569 362.021 209.697 365.801 209.697Z" fill="#E2AA9F"/>
<path d="M253.574 168.084C253.574 183.057 265.618 195.196 280.475 195.196C295.333 195.196 307.377 183.057 307.377 168.084C307.377 153.111 295.333 140.973 280.475 140.973C265.618 140.973 253.574 153.111 253.574 168.084Z" fill="#F7B9A9"/>
<path d="M253.55 168.105C253.55 161.504 255.893 155.456 259.784 150.754C255.685 167.426 257.36 186.032 277.874 195.09C264.226 193.782 253.55 182.202 253.55 168.105Z" fill="#E2AA9F"/>
<path d="M253.106 167.425C253.001 172.301 254.383 176.878 256.62 180.832C267.191 179.711 267.927 160.729 267.927 160.729C291.873 163.724 305.827 163.57 307.881 148.339C308.224 145.797 308.305 143.678 307.457 141.559C307.457 141.559 307.034 139.864 304.067 140.288C297.254 141.746 291.743 142.248 285.288 140.837C285.288 140.837 282.635 140.207 280.008 140.314C264.754 140.932 253.435 152.054 253.106 167.425Z" fill="#253051"/>
<path d="M261.132 172.491C261.132 174.125 262.447 175.45 264.068 175.45C265.69 175.45 267.005 174.125 267.005 172.491C267.005 170.857 265.69 169.532 264.068 169.532C262.447 169.532 261.132 170.857 261.132 172.491Z" fill="#F7B9A9"/>
<path d="M312.082 240.672H351.123L361.335 212.175H322.294L312.082 240.672Z" fill="#577098"/>
<path d="M312.082 240.672L361.335 212.175H322.294L312.082 240.672Z" fill="#50678C"/>
<path d="M337.328 226.02C337.005 227.163 337.411 228.284 338.235 228.523C339.058 228.763 339.989 228.031 340.312 226.888C340.635 225.745 340.229 224.624 339.405 224.385C338.581 224.145 337.651 224.877 337.328 226.02Z" fill="white"/>
<path d="M385.746 178.533C385.746 191.975 374.886 202.872 361.488 202.872C348.091 202.872 337.229 191.975 337.229 178.533C337.229 165.091 348.091 154.195 361.488 154.195C374.886 154.195 385.746 165.091 385.746 178.533Z" fill="#F7B9A9"/>
<path d="M385.404 178.889C385.404 172.948 383.31 167.505 379.832 163.273C383.495 178.278 381.999 195.024 363.665 203.177C375.862 201.999 385.404 191.577 385.404 178.889Z" fill="#E2AA9F"/>
<path d="M382.986 166.544L382.98 166.547C378.925 158.788 370.825 153.492 361.488 153.492C348.09 153.492 337.229 164.389 337.229 177.831C337.231 177.832 346.049 187.187 363.833 179.13C363.833 179.13 371.221 184.618 373.414 199.022C374.077 203.372 374.266 208.533 373.634 214.604C373.634 214.604 390.362 218.4 396.175 207.423C401.825 196.752 383.986 168.137 382.986 166.544Z" fill="#243050"/>
<path d="M372.628 185.299C372.628 186.766 371.443 187.955 369.981 187.955C368.519 187.955 367.333 186.766 367.333 185.299C367.333 183.832 368.519 182.642 369.981 182.642C371.443 182.642 372.628 183.832 372.628 185.299Z" fill="#F7B9A9"/>
<path d="M325.679 197.492C330.763 197.492 335.848 196.644 332.034 189.017C329.916 184.78 322.922 176.8 312.543 179.271C303.645 181.39 297.712 186.899 296.865 194.102C296.135 200.31 298.56 205.119 300.255 206.814C300.82 206.955 302.543 206.814 304.916 205.119C307.289 203.424 309.294 196.221 308.306 193.254C313.39 194.526 321.597 197.492 325.679 197.492Z" fill="#253051"/>
<rect x="441.805" y="204.395" width="2.77972" height="8.19469" fill="#436E5B"/>
<rect x="441.805" y="204.395" width="1.38986" height="8.19469" fill="#4A9660"/>
<path d="M430.095 218.845L432.565 240.665H453.825L456.295 218.845H430.095Z" fill="#F6C38E"/>
<path d="M430.095 218.845L432.565 240.665H443.195V218.845H430.095Z" fill="#FBD2A1"/>
<rect x="426.592" y="211.192" width="33.2062" height="8.89343" fill="#F5C489"/>
<rect x="426.592" y="211.192" width="16.6031" height="8.89343" fill="#FFDBA9"/>
<path d="M450.235 192.98C447.297 192.98 444.705 194.501 443.195 196.801C441.686 194.501 439.094 192.98 436.155 192.98H432.784V197.313C432.784 201.989 436.566 205.794 441.214 205.794H441.806H444.585H445.177C449.825 205.794 453.607 201.989 453.607 197.313V192.98H450.235Z" fill="#60D384"/>
<path d="M436.155 192.98H432.784V197.313C432.784 201.989 436.566 205.794 441.214 205.794H443.195V196.801C441.686 194.501 439.094 192.98 436.155 192.98Z" fill="#96E592"/>
<path fill-rule="evenodd" clip-rule="evenodd" d="M284.985 179.966C286.205 179.899 287.188 178.842 287.086 177.652C287.018 176.462 285.934 175.503 284.714 175.602C283.495 175.668 282.512 176.726 282.614 177.916C282.681 179.106 283.732 180.032 284.985 179.966Z" fill="white"/>
<path fill-rule="evenodd" clip-rule="evenodd" d="M285.155 180.164C286.171 180.098 286.984 179.238 286.917 178.246C286.849 177.255 285.968 176.461 284.951 176.528C283.935 176.594 283.122 177.453 283.189 178.445C283.257 179.437 284.138 180.23 285.155 180.164Z" fill="#253051"/>
<path fill-rule="evenodd" clip-rule="evenodd" d="M298.538 179.205C299.758 179.139 300.741 178.081 300.639 176.891C300.571 175.701 299.487 174.742 298.267 174.842C297.047 174.908 296.065 175.965 296.166 177.156C296.268 178.346 297.318 179.271 298.538 179.205Z" fill="white"/>
<path fill-rule="evenodd" clip-rule="evenodd" d="M298.674 179.404C299.691 179.337 300.504 178.478 300.436 177.486C300.368 176.495 299.487 175.701 298.471 175.767C297.454 175.833 296.641 176.693 296.709 177.685C296.743 178.676 297.658 179.47 298.674 179.404Z" fill="#253051"/>
<path fill-rule="evenodd" clip-rule="evenodd" d="M286.239 184.131C286.239 186.643 288.306 188.593 290.813 188.593C293.388 188.593 295.387 186.577 295.387 184.131H286.239Z" fill="#A58476"/>
<path fill-rule="evenodd" clip-rule="evenodd" d="M296.539 170.081L302.435 171.371C302.74 171.47 303.011 171.635 303.112 171.9L303.18 172.032C303.282 172.23 303.18 172.428 302.977 172.495C302.909 172.495 302.841 172.561 302.773 172.495L296.607 171.933C296.133 171.9 295.794 171.602 295.658 171.205L295.557 170.776C295.455 170.445 295.692 170.015 296.133 169.949C296.268 170.048 296.438 170.048 296.539 170.081Z" fill="#243051"/>
<path fill-rule="evenodd" clip-rule="evenodd" d="M287.222 171.04L281.089 172.891C280.784 172.991 280.479 173.222 280.411 173.519L280.378 173.685C280.276 173.883 280.378 174.081 280.649 174.115C280.682 174.115 280.818 174.148 280.852 174.115L287.323 173.057C287.764 172.991 288.17 172.693 288.272 172.296L288.374 171.834C288.475 171.437 288.137 171.106 287.73 171.073C287.459 170.974 287.323 170.974 287.222 171.04Z" fill="#243051"/>
<path fill-rule="evenodd" clip-rule="evenodd" d="M357.246 192.018C356.303 192.132 355.408 191.46 355.326 190.541C355.218 189.626 355.92 188.75 356.868 188.661C357.811 188.546 358.706 189.218 358.787 190.138C358.895 191.053 358.215 191.899 357.246 192.018Z" fill="white"/>
<path fill-rule="evenodd" clip-rule="evenodd" d="M357.142 192.191C356.355 192.278 355.617 191.734 355.535 190.97C355.454 190.207 356.023 189.484 356.81 189.397C357.598 189.31 358.336 189.854 358.417 190.618C358.498 191.382 357.93 192.104 357.142 192.191Z" fill="#253051"/>
<path fill-rule="evenodd" clip-rule="evenodd" d="M346.762 193.269C345.819 193.384 344.925 192.712 344.843 191.792C344.735 190.877 345.437 190.002 346.384 189.912C347.328 189.798 348.222 190.47 348.304 191.389C348.386 192.309 347.705 193.155 346.762 193.269Z" fill="white"/>
<path fill-rule="evenodd" clip-rule="evenodd" d="M346.685 193.439C345.898 193.526 345.16 192.981 345.078 192.218C344.997 191.454 345.566 190.731 346.353 190.644C347.14 190.557 347.879 191.101 347.96 191.865C348.067 192.624 347.473 193.352 346.685 193.439Z" fill="#253051"/>
<path fill-rule="evenodd" clip-rule="evenodd" d="M356.845 195.357C357.182 197.268 355.86 199.032 353.94 199.37C351.968 199.718 350.166 198.454 349.838 196.592L356.845 195.357Z" fill="#A58476"/>
<rect x="354.057" y="185.25" width="5.08474" height="1.27119" rx="0.635593" transform="rotate(-1.03786 354.057 185.25)" fill="#253051"/>
<rect x="343.051" y="186.809" width="5.08474" height="1.27119" rx="0.635593" transform="rotate(-8.56802 343.051 186.809)" fill="#253051"/>
<rect x="323.56" y="202.153" width="3.38983" height="1.27119" rx="0.635597" fill="#253051"/>
<rect x="315.085" y="202.153" width="3.38982" height="1.27119" rx="0.635597" fill="#253051"/>
<circle cx="306.61" cy="203" r="2.54237" fill="#F7B9A9"/>
<defs>
<filter id="filter0_d" x="346.204" y="106.685" width="299.361" height="139.75" filterUnits="userSpaceOnUse" color-interpolation-filters="sRGB">
<feFlood flood-opacity="0" result="BackgroundImageFix"/>
<feColorMatrix in="SourceAlpha" type="matrix" values="0 0 0 0 0 0 0 0 0 0 0 0 0 0 0 0 0 0 127 0"/>
<feOffset dy="2"/>
<feGaussianBlur stdDeviation="7"/>
<feColorMatrix type="matrix" values="0 0 0 0 0 0 0 0 0 0 0 0 0 0 0 0 0 0 0.1 0"/>
<feBlend mode="normal" in2="BackgroundImageFix" result="effect1_dropShadow"/>
<feBlend mode="normal" in="SourceGraphic" in2="effect1_dropShadow" result="shape"/>
</filter>
<filter id="filter1_d" x="-15.8643" y="102.685" width="288.488" height="147.75" filterUnits="userSpaceOnUse" color-interpolation-filters="sRGB">
<feFlood flood-opacity="0" result="BackgroundImageFix"/>
<feColorMatrix in="SourceAlpha" type="matrix" values="0 0 0 0 0 0 0 0 0 0 0 0 0 0 0 0 0 0 127 0"/>
<feOffset dy="2"/>
<feGaussianBlur stdDeviation="9"/>
<feColorMatrix type="matrix" values="0 0 0 0 0 0 0 0 0 0 0 0 0 0 0 0 0 0 0.1 0"/>
<feBlend mode="normal" in2="BackgroundImageFix" result="effect1_dropShadow"/>
<feBlend mode="normal" in="SourceGraphic" in2="effect1_dropShadow" result="shape"/>
</filter>
<linearGradient id="paint0_linear" x1="277.719" y1="57.2373" x2="277.719" y2="122.068" gradientUnits="userSpaceOnUse">
<stop stop-color="#FFED95" stop-opacity="0.253742"/>
<stop offset="1" stop-color="#FFD75C" stop-opacity="0.01"/>
</linearGradient>
</defs>
</svg>
