<?xml version="1.0" encoding="UTF-8"?>
<svg width="34px" height="30px" viewBox="0 0 34 30" version="1.1" xmlns="http://www.w3.org/2000/svg" xmlns:xlink="http://www.w3.org/1999/xlink">
    <!-- Generator: Sketch 54.1 (76490) - https://sketchapp.com -->
    <title>Group 11</title>
    <desc>Created with Sketch.</desc>
    <g id="V5-helvetica" stroke="none" stroke-width="1" fill="none" fill-rule="evenodd">
        <g id="Group-11" fill="#80C41C">
            <path d="M29.5207826,5.30567424 C29.2165019,5.17267554 28.8804279,5.0988913 28.5271304,5.0988913 C28.1741358,5.0988913 27.8383352,5.17254909 27.5342609,5.30533233 L27.5342609,3.67154348 L28.5275217,3.67154348 L29.5207826,3.67154348 L29.5207826,5.30567424 Z M29.5207826,17.5266847 L29.5207826,26.5778478 C29.5201304,28.3217609 28.1101304,29.7408913 26.3616522,29.7415435 L3.456,29.7415435 C1.70686957,29.7408913 0.296869565,28.3217609 0.296869565,26.5778478 L0.296869565,3.67154348 C0.298173913,1.93023913 1.70752174,0.514369565 3.456,0.513065217 L26.3616522,0.513065217 C28.1101304,0.514369565 29.5194783,1.93023913 29.5207826,3.67154348 L28.5275217,3.67154348 L27.5342609,3.67154348 C27.5336087,3.34741304 27.4044783,3.05980435 27.1905652,2.84393478 C26.9746957,2.62936957 26.6883913,2.50023913 26.3616522,2.49958696 L3.456,2.49958696 C3.12926087,2.50023913 2.84295652,2.62936957 2.62708696,2.84393478 C2.41252174,3.05980435 2.2833913,3.34741304 2.2833913,3.67154348 L2.2833913,26.5778478 C2.28404348,26.9058913 2.41317391,27.1948043 2.62773913,27.4106739 C2.84295652,27.6252391 3.12926087,27.7543696 3.456,27.7550217 L26.3616522,27.7550217 C26.6883913,27.7543696 26.9746957,27.6252391 27.189913,27.4106739 C27.4038261,27.1948043 27.5336087,26.9058913 27.5342609,26.5778478 L27.5342609,17.5270266 C27.8383352,17.6597987 28.1741358,17.7334565 28.5271304,17.7334565 C28.8804279,17.7334565 29.2165019,17.6596723 29.5207826,17.5266847 Z" id="Combined-Shape"></path>
            <path d="M7.73243478,23.4813261 C7.51721739,23.4813261 7.28113043,23.4167609 7.08743478,23.2661087 C6.67917391,22.9654565 6.52852174,22.4065435 6.76526087,21.9337174 L13.9222174,7.19067391 C14.1152609,6.82545652 14.4811304,6.58936957 14.8893913,6.58936957 C15.2976522,6.58936957 15.6837391,6.82545652 15.855913,7.19067391 L23.055913,21.9121957 C23.3135217,22.4280652 23.0989565,23.0730652 22.5615652,23.3313261 C22.0241739,23.6098043 21.3791739,23.3737174 21.1215652,22.8578478 L19.4448261,19.3980652 C18.3276522,19.0758913 17.145913,19.0321957 15.8774348,19.2689348 C14.6956957,19.4835 13.470913,19.9139348 12.2024348,20.5798043 C10.0104783,21.7406739 8.4843913,23.1591522 8.46286957,23.1806739 C8.26982609,23.3737174 7.99004348,23.4813261 7.73243478,23.4813261" id="Fill-3"></path>
            <path d="M27.5336739,7.58236957 L27.5336739,15.2506304 C27.5336739,15.7991087 27.9784565,16.2438913 28.5269348,16.2438913 C29.075413,16.2438913 29.5201957,15.7991087 29.5201957,15.2506304 L29.5201957,7.58236957 C29.5201957,7.0338913 29.075413,6.5891087 28.5269348,6.5891087 C27.9784565,6.5891087 27.5336739,7.0338913 27.5336739,7.58236957" id="Fill-7"></path>
            <path d="M24.6931304,12.4003696 L32.3613913,12.4003696 C32.9098696,12.4003696 33.3546522,11.955587 33.3546522,11.4071087 C33.3546522,10.8579783 32.9098696,10.4138478 32.3613913,10.4138478 L24.6931304,10.4138478 C24.1446522,10.4138478 23.6998696,10.8579783 23.6998696,11.4071087 C23.6998696,11.955587 24.1446522,12.4003696 24.6931304,12.4003696" id="Fill-9"></path>
        </g>
    </g>
</svg>