<svg width="124" height="130" viewBox="0 0 124 130" fill="none" xmlns="http://www.w3.org/2000/svg">
<rect y="26.5164" width="69.5755" height="69.5755" fill="#BFE0A1"/>
<path d="M77.7231 33.8806L56.8063 34.2163C57.9524 41.1826 57.8988 42.0732 58.048 47.6452H77.7231V33.8806Z" fill="#898988"/>
<path d="M71.268 14.6036C73.1826 13.3216 75.1979 10.0581 74.2818 7.40044C71.9943 1.64416 62.0007 4.10288 61.1375 6.88145C59.8759 9.17513 62.3256 14.3334 63.2018 13.8772L71.268 14.6036Z" fill="#1A1A1A"/>
<path d="M77.2727 40.9649C74.2184 50.5651 60.8688 49.1815 58.3299 39.5813C55.7911 29.9811 51.2841 22.1706 59.4516 19.5187C66.9928 16.7514 68.0323 16.8626 76.1748 19.5187C85.0116 22.4013 81.2187 31.1638 77.2727 40.9649Z" fill="#898988"/>
<path d="M68.8759 25.6498C68.8331 25.0412 68.3269 24.5693 67.7168 24.5693V24.5693C67.1052 24.5693 66.5982 25.0436 66.5575 25.6539L65.5157 41.2644C65.4753 41.8696 65.7117 42.4604 66.1584 42.8706L66.3671 43.0623C67.117 43.751 68.2646 43.7664 69.0327 43.0981L69.2879 42.8761C69.7615 42.464 70.0142 41.8534 69.9702 41.2271L68.8759 25.6498Z" fill="#1A1A1A"/>
<path d="M70.001 16.1548H65.8329V19.2346L67.9169 21.4589L70.001 19.2346V16.1548Z" fill="#F8B9A8"/>
<path d="M70.002 18.3789C70.002 19.377 65.8339 19.1108 65.8339 18.3789V19.888C65.8339 21.0389 66.7669 21.972 67.9179 21.972V21.972C69.0689 21.972 70.002 21.0389 70.002 19.888V18.3789Z" fill="#F8B9A8"/>
<g style="mix-blend-mode:multiply" opacity="0.3">
<path d="M70.0005 15.9834H65.8324V17.4563C66.6807 20.0296 68.8858 20.2214 70.0005 17.4563V15.9834Z" fill="#F8B9A8"/>
</g>
<path d="M62.3264 10.1225C61.8708 13.3782 64.3242 16.4604 67.0155 17.3309C67.3965 17.4542 67.8076 17.4431 68.1846 17.308C70.7328 16.3945 73.3343 13.6446 72.8804 10.1225C72.8804 6.3759 71.8054 2.64038 67.6034 2.64038C63.4013 2.64038 62.3264 6.3759 62.3264 10.1225Z" fill="#F8B9A8"/>
<ellipse rx="0.438579" ry="0.674736" transform="matrix(-1 0 0 1 69.8173 11.9516)" fill="#1A1A1A"/>
<ellipse rx="0.438579" ry="0.674736" transform="matrix(-1 0 0 1 65.0263 11.9516)" fill="#1A1A1A"/>
<path fill-rule="evenodd" clip-rule="evenodd" d="M67.4783 12.0317C67.5384 12.0445 67.5767 12.1035 67.5639 12.1636L67.2626 13.5812H67.8675C67.9289 13.5812 67.9787 13.631 67.9787 13.6924C67.9787 13.7538 67.9289 13.8035 67.8675 13.8035H67.1253C67.0918 13.8035 67.06 13.7884 67.0389 13.7623C67.0178 13.7363 67.0096 13.7021 67.0166 13.6693L67.3465 12.1174C67.3592 12.0573 67.4183 12.019 67.4783 12.0317Z" fill="#CF836F"/>
<ellipse rx="1.14705" ry="1.72058" transform="matrix(-1 0 0 1 61.5292 9.75891)" fill="#F8B9A8"/>
<ellipse rx="1.07958" ry="1.72058" transform="matrix(-1 0 0 1 73.6748 9.75891)" fill="#F8B9A8"/>
<path d="M66.0635 9.76589C66.0635 9.62439 65.9635 9.50213 65.8242 9.47687C65.1749 9.35911 64.8512 9.35766 64.2746 9.47253C64.1369 9.49995 64.0393 9.62228 64.0393 9.76267V9.76267C64.0393 9.92809 64.1734 10.0622 64.3388 10.0622H65.7672C65.9308 10.0622 66.0635 9.92953 66.0635 9.76589V9.76589Z" fill="#CF836E"/>
<path d="M70.6519 9.76302C70.6519 9.62251 70.5539 9.50023 70.4161 9.47278C69.8525 9.36053 69.5621 9.35903 69.0611 9.46829C68.9251 9.49795 68.8301 9.62023 68.8301 9.75947V9.75947C68.8301 9.92665 68.9656 10.0622 69.1328 10.0622H70.3527C70.5179 10.0622 70.6519 9.92825 70.6519 9.76302V9.76302Z" fill="#CF836E"/>
<path d="M66.1808 15.0417H69.0146C69.0146 15.579 68.1645 16.0446 67.5977 16.1162C67.0309 16.1879 66.1808 15.4894 66.1808 15.0417Z" fill="#FDF9EC"/>
<g style="mix-blend-mode:multiply" opacity="0.3">
<ellipse rx="0.640999" ry="0.843421" transform="matrix(-1 0 0 1 61.4957 9.69132)" fill="#F8B9A8"/>
</g>
<g style="mix-blend-mode:multiply" opacity="0.3">
<ellipse rx="0.674736" ry="0.843421" transform="matrix(-1 0 0 1 73.6075 9.69132)" fill="#F8B9A8"/>
</g>
<path d="M69.0339 23.8817C68.4789 24.8655 67.0622 24.8655 66.5072 23.8817V23.8817C65.9618 22.9148 66.6605 21.7187 67.7706 21.7187V21.7187C68.8807 21.7187 69.5793 22.9148 69.0339 23.8817V23.8817Z" fill="#1A1A1A"/>
<path d="M66.1891 19.5618C66.0582 18.9724 65.9388 18.3485 65.839 17.7469C65.7663 17.3084 65.4215 16.915 64.978 16.9442C64.738 16.96 64.5624 17.0396 64.3492 17.2267C64.257 17.3077 64.187 17.4111 64.1484 17.5276C63.9913 18.0008 63.7845 19.0347 63.8654 20.4913C63.9213 21.4975 64.4003 22.4421 64.908 23.1532C65.3087 23.7143 66.1089 23.5385 66.365 22.8982L66.8357 21.7215C66.9417 21.4563 66.9256 21.1605 66.7771 20.9164C66.5713 20.5782 66.3194 20.1479 66.1891 19.5618Z" fill="#FFFEFD"/>
<path d="M69.6912 19.7942C69.8222 19.2049 69.9416 18.5809 70.0414 17.9793C70.1141 17.5408 70.4589 17.1474 70.9023 17.1766C71.1424 17.1924 71.318 17.272 71.5312 17.4592C71.6234 17.5401 71.6933 17.6435 71.732 17.76C71.8891 18.2332 72.0958 19.2671 72.0149 20.7237C71.959 21.7299 71.4801 22.6745 70.9723 23.3856C70.5716 23.9468 69.7715 23.7709 69.5154 23.1306L69.0447 21.9539C68.9386 21.6887 68.9548 21.3929 69.1033 21.1489C69.309 20.8106 69.561 20.3804 69.6912 19.7942Z" fill="#FFFEFD"/>
<g style="mix-blend-mode:color-burn" opacity="0.5">
<path d="M75.9512 46.6005C75.8885 47.1576 76.3245 47.6452 76.8851 47.6452C77.4168 47.6452 77.8427 47.2044 77.8243 46.673C77.784 45.5093 76.0813 45.4434 75.9512 46.6005Z" fill="#898988"/>
</g>
<g style="mix-blend-mode:color-burn" opacity="0.5">
<path d="M60.98 46.4374C61.0426 46.9945 60.6067 47.4822 60.0461 47.4822C59.5143 47.4822 59.0885 47.0413 59.1069 46.5099C59.1472 45.3462 60.8498 45.2803 60.98 46.4374Z" fill="#898988"/>
</g>
<path d="M61.9288 26.9126H75.3313C76.0218 26.9126 76.5815 27.4765 76.5815 28.1721V36.357C76.5815 37.0526 76.0218 37.6165 75.3313 37.6165H61.9288C61.2383 37.6165 60.6786 37.0526 60.6786 36.357V28.1721C60.6786 27.4765 61.2383 26.9126 61.9288 26.9126Z" fill="#191919"/>
<g style="mix-blend-mode:multiply" opacity="0.5">
<path d="M73.6708 31.3289L75.3313 26.9126C76.0218 26.9126 76.5815 27.4765 76.5815 28.1721V36.357C76.5815 37.0526 76.0218 37.6165 75.3313 37.6165H61.9288C61.2383 37.6165 60.6786 37.0526 60.6786 36.357C64.6207 36.357 69.0828 37.0851 73.6708 31.3289Z" fill="#191919"/>
</g>
<path d="M63.5426 36.3137C62.9702 35.3169 63.4283 33.9782 64.5658 33.3238C65.7033 32.6693 67.0895 32.9469 67.6618 33.9437C68.2342 34.9405 67.7761 36.2791 66.6386 36.9335C65.5011 37.588 64.115 37.3105 63.5426 36.3137Z" fill="#F8B9A8"/>
<path d="M74.3454 33.9871C75.206 33.1418 75.122 31.6594 74.1578 30.6761C73.1936 29.6927 71.7143 29.5807 70.8537 30.426C69.9931 31.2713 70.0771 32.7537 71.0413 33.7371C72.0055 34.7205 73.4848 34.8324 74.3454 33.9871Z" fill="#F8B9A8"/>
<circle cx="62.6663" cy="6.19291" r="1.91142" fill="#1A1A1A"/>
<circle cx="64.8838" cy="3.74638" r="2.37016" fill="#1A1A1A"/>
<circle cx="68.8212" cy="3.24941" r="3.24941" fill="#1A1A1A"/>
<circle cx="72.5297" cy="5.65792" r="2.21724" fill="#1A1A1A"/>
<path d="M81.726 40.1831V32.5H77.1025L78.3264 40.1831H81.726Z" fill="#F8B9A8"/>
<path d="M54.5293 40.251V32.5H59.2887L58.0289 40.251H54.5293Z" fill="#F8B9A8"/>
<path d="M77.7144 40.7949L72.751 34.4037L74.6547 32.8398L81.1139 39.299L77.7144 40.7949Z" fill="#F8B9A8"/>
<path d="M57.8629 41.0122L65.1351 36.9895L63.8569 34.7754L55.0923 38.2718L57.8629 41.0122Z" fill="#F8B9A8"/>
<path d="M76.5584 33.656L82.7456 33.656L81.5249 24.9778C80.7362 22.9892 78.1771 21.8959 76.5584 25.157L76.5584 33.656Z" fill="#898988"/>
<path d="M60.6108 33.6002L53.4416 33.6002L54.7289 24.922C55.5604 22.9335 57.7542 21.6718 59.461 24.9329L60.6108 33.6002Z" fill="#898988"/>
<rect x="90.6255" y="78.8779" width="33.2294" height="33.2294" fill="#FF7FDB"/>
<rect x="101.121" y="30.2085" width="10.5704" height="10.5704" transform="rotate(45 101.121 30.2085)" fill="#F7B9A9"/>
<path d="M32.7038 60.177C31.9468 58.8577 28.5986 53.5427 23.019 53.5776C17.4394 53.6124 14.8872 58.5309 14.1858 59.676C12.0476 66.8304 16.3805 74.7754 17.106 78.6597C17.9205 78.9943 22.5704 78.8811 23.4217 78.6597L27.7542 78.1304C28.6739 78.3767 31.4516 77.8533 32.3441 77.5198C36.5182 75.817 36.4412 66.6907 32.7038 60.177Z" fill="white"/>
<path d="M26.9248 101.308H33.316L32.3853 122.793H28.2279L26.9248 101.308Z" fill="#F8B9A8"/>
<path d="M16.5898 101.308H22.9811L22.0503 122.793H17.8929L16.5898 101.308Z" fill="#F8B9A8"/>
<path d="M27.3242 123.395C28.6291 121.226 32.5567 121.406 33.5426 123.395C34.5285 125.384 35.178 127.824 33.0902 127.824H27.9285C25.7246 127.824 26.1063 125.752 27.3242 123.395Z" fill="#636464"/>
<mask id="mask0" mask-type="alpha" maskUnits="userSpaceOnUse" x="26" y="121" width="9" height="7">
<path d="M27.361 123.396C28.6693 121.227 32.6071 121.408 33.5956 123.396C34.5842 125.384 35.2354 127.824 33.142 127.824H27.9668C25.7572 127.824 26.1398 125.753 27.361 123.396Z" fill="#DF514F"/>
</mask>
<g mask="url(#mask0)">
<rect x="25.5444" y="126.161" width="9.81294" height="1.66321" fill="#898988"/>
</g>
<path d="M16.7519 123.395C18.0569 121.226 21.9844 121.406 22.9703 123.395C23.9563 125.384 24.6058 127.824 22.5179 127.824H17.3562C15.1523 127.824 15.534 125.752 16.7519 123.395Z" fill="#636464"/>
<mask id="mask1" mask-type="alpha" maskUnits="userSpaceOnUse" x="15" y="121" width="9" height="7">
<path d="M16.7887 123.396C18.097 121.227 22.0349 121.408 23.0234 123.396C24.0119 125.384 24.6631 127.824 22.5697 127.824H17.3945C15.1849 127.824 15.5676 125.753 16.7887 123.396Z" fill="#DF514F"/>
</mask>
<g mask="url(#mask1)">
<rect x="14.9722" y="126.161" width="9.81294" height="1.66321" fill="#898988"/>
</g>
<path d="M33.2037 78.0544H22.981V103.347H36.7153L33.2037 78.0544Z" fill="#6C7580"/>
<path d="M17.0201 77.7825L25.5646 78.0976V103.347H12.2383L17.0201 77.7825Z" fill="#6C7580"/>
<path d="M22.8089 78.0544H26.4895L28.9644 103.347H20.3975L22.8089 78.0544Z" fill="#565F6B"/>
<path d="M29.3594 42.8815C29.3594 40.8462 31.0093 39.1963 33.0446 39.1963H80.8758C82.9111 39.1963 84.5611 40.8462 84.5611 42.8815V124.277C84.5611 126.312 82.9111 127.962 80.8758 127.962H33.0446C31.0093 127.962 29.3594 126.312 29.3594 124.277V42.8815Z" fill="#191919"/>
<path d="M32.1885 46.7757C32.1885 45.4188 33.2884 44.3188 34.6453 44.3188H79.2755C80.6324 44.3188 81.7324 45.4188 81.7324 46.7757V122.294C81.7324 123.651 80.6324 124.751 79.2755 124.751H34.6453C33.2884 124.751 32.1885 123.651 32.1885 122.294V46.7757Z" fill="white"/>
<path d="M35.3232 117.87C35.3232 116.223 36.6582 114.888 38.3051 114.888H76.9157C78.5625 114.888 79.8975 116.223 79.8975 117.87V117.87C79.8975 119.517 78.5625 120.852 76.9157 120.852H38.3051C36.6582 120.852 35.3232 119.517 35.3232 117.87V117.87Z" fill="#E0E0E0"/>
<g style="mix-blend-mode:multiply" opacity="0.5">
<path d="M41.5928 54.2109C41.5928 53.8146 41.8863 53.4934 42.2483 53.4934H75.1898C75.5518 53.4934 75.8453 53.8146 75.8453 54.2109V60.3452C75.8453 60.7414 75.5518 61.0626 75.1898 61.0626H42.2483C41.8863 61.0626 41.5928 60.7414 41.5928 60.3452V54.2109Z" fill="#B5BABF"/>
</g>
<g style="mix-blend-mode:multiply" opacity="0.5">
<path d="M41.5928 76.2972C41.5928 76.033 41.7494 75.8188 41.9425 75.8188H59.5162C59.7093 75.8188 59.8659 76.033 59.8659 76.2972V80.3867C59.8659 80.6508 59.7093 80.865 59.5162 80.865H41.9425C41.7494 80.865 41.5928 80.6508 41.5928 80.3867V76.2972Z" fill="#B5BABF"/>
</g>
<path d="M60.4009 97.8579C60.4009 97.5938 60.5575 97.3796 60.7506 97.3796H78.3243C78.5174 97.3796 78.674 97.5938 78.674 97.8579V101.947C78.674 102.212 78.5174 102.426 78.3243 102.426H60.7506C60.5575 102.426 60.4009 102.212 60.4009 101.947V97.8579Z" fill="#80C343"/>
<g style="mix-blend-mode:multiply" opacity="0.5">
<path d="M41.3633 106.498C41.3633 106.233 41.476 106.019 41.615 106.019H54.2621C54.4011 106.019 54.5138 106.233 54.5138 106.498V110.587C54.5138 110.851 54.4011 111.065 54.2621 111.065H41.615C41.476 111.065 41.3633 110.851 41.3633 110.587V106.498Z" fill="#6C7580"/>
</g>
<g style="mix-blend-mode:multiply" opacity="0.5">
<path d="M41.5928 85.7184C41.5928 85.3181 41.8502 84.9937 42.1678 84.9937H71.0652C71.3828 84.9937 71.6402 85.3181 71.6402 85.7184V91.9146C71.6402 92.3149 71.3828 92.6393 71.0652 92.6393H42.1678C41.8502 92.6393 41.5928 92.3149 41.5928 91.9146V85.7184Z" fill="#B5BABF"/>
</g>
<g style="mix-blend-mode:multiply">
<path d="M49.0093 65.2321C49.0093 64.8719 49.2635 64.5798 49.577 64.5798H78.1067C78.4203 64.5798 78.6745 64.8719 78.6745 65.2321V70.8087C78.6745 71.1689 78.4203 71.4609 78.1067 71.4609H49.577C49.2635 71.4609 49.0093 71.1689 49.0093 70.8087V65.2321Z" fill="#80C343"/>
</g>
<ellipse cx="52.7061" cy="42.1544" rx="0.748069" ry="0.817488" fill="#6C7580"/>
<ellipse cx="55.9058" cy="42.1544" rx="0.748069" ry="0.817488" fill="#6C7580"/>
<ellipse cx="59.106" cy="42.1544" rx="0.748069" ry="0.817488" fill="#6C7580"/>
<rect x="35.2466" y="47.377" width="13.4564" height="2.06433" rx="1.03216" fill="#191919"/>
<path d="M44.4214 55.902C44.4214 55.6697 44.5627 55.4814 44.737 55.4814H73.3887C73.563 55.4814 73.7043 55.6697 73.7043 55.902V55.902C73.7043 56.1342 73.563 56.3225 73.3887 56.3225H44.737C44.5627 56.3225 44.4214 56.1342 44.4214 55.902V55.902Z" fill="white"/>
<path d="M43.2744 78.2272C43.2744 77.9949 43.3334 77.8066 43.4063 77.8066H55.3756C55.4484 77.8066 55.5075 77.9949 55.5075 78.2272V78.2272C55.5075 78.4594 55.4484 78.6477 55.3756 78.6477H43.4063C43.3334 78.6477 43.2744 78.4594 43.2744 78.2272V78.2272Z" fill="white"/>
<path d="M62.083 99.7879C62.083 99.5557 62.142 99.3674 62.2149 99.3674H74.1842C74.257 99.3674 74.3161 99.5557 74.3161 99.7879V99.7879C74.3161 100.02 74.257 100.208 74.1842 100.208H62.2149C62.142 100.208 62.083 100.02 62.083 99.7879V99.7879Z" fill="white"/>
<path d="M52.2197 66.644C52.2197 66.4329 52.3341 66.2617 52.4752 66.2617H75.6658C75.8069 66.2617 75.9213 66.4329 75.9213 66.644V66.644C75.9213 66.8551 75.8069 67.0263 75.6658 67.0263H52.4752C52.3341 67.0263 52.2197 66.8551 52.2197 66.644V66.644Z" fill="white"/>
<path d="M44.5747 87.8227C44.5747 87.6116 44.6891 87.4404 44.8302 87.4404H68.0208C68.1619 87.4404 68.2763 87.6116 68.2763 87.8227V87.8227C68.2763 88.0338 68.1619 88.205 68.0208 88.205H44.8302C44.6891 88.205 44.5747 88.0338 44.5747 87.8227V87.8227Z" fill="white"/>
<path d="M44.4204 58.0894C44.4204 57.8637 44.5879 57.6807 44.7944 57.6807H65.9482C66.1547 57.6807 66.3222 57.8637 66.3222 58.0894V58.0894C66.3222 58.3152 66.1547 58.4982 65.9482 58.4982H44.7944C44.5879 58.4982 44.4204 58.3152 44.4204 58.0894V58.0894Z" fill="white"/>
<path d="M54.0552 69.0408C54.0552 68.8151 54.2226 68.6321 54.4292 68.6321H75.5829C75.7895 68.6321 75.957 68.8151 75.957 69.0408V69.0408C75.957 69.2666 75.7895 69.4496 75.5829 69.4496H54.4292C54.2226 69.4496 54.0552 69.2666 54.0552 69.0408V69.0408Z" fill="white"/>
<path d="M44.5747 90.219C44.5747 89.9933 44.7422 89.8103 44.9487 89.8103H66.1025C66.309 89.8103 66.4765 89.9933 66.4765 90.219V90.219C66.4765 90.4448 66.309 90.6278 66.1025 90.6278H44.9487C44.7422 90.6278 44.5747 90.4448 44.5747 90.219V90.219Z" fill="white"/>
<circle cx="36.5862" cy="57.3962" r="2.0139" fill="#80C343"/>
<circle cx="36.5862" cy="78.2065" r="2.0139" fill="#80C343"/>
<circle cx="36.5862" cy="88.9475" r="2.0139" fill="#80C343"/>
<path d="M30.4154 50.8421C30.2617 49.7817 29.4853 48.4166 29.0215 47.8652L18.1354 47.5815C17.8889 47.6743 16.5772 48.3211 15.8113 50.463C14.8785 53.0634 16.8501 54.2484 22.8842 54.2484C29.0162 54.2484 30.858 53.8931 30.4154 50.8421Z" fill="#191919"/>
<path d="M25.1637 53.1294H21.1887V56.0745L23.1815 58.1951L25.1743 56.0745L25.1637 53.1294Z" fill="#F8B9A8"/>
<path d="M25.1636 55.2554C25.1636 56.2123 21.1886 55.9578 21.1886 55.2554V56.7001C21.1687 56.9734 21.2053 57.2478 21.2961 57.5064C21.3869 57.7649 21.5301 58.0019 21.7166 58.2026C21.9031 58.4033 22.129 58.5634 22.3801 58.6728C22.6312 58.7823 22.9022 58.8388 23.1761 58.8388C23.4501 58.8388 23.7211 58.7823 23.9722 58.6728C24.2233 58.5634 24.4492 58.4033 24.6357 58.2026C24.8222 58.0019 24.9654 57.7649 25.0562 57.5064C25.147 57.2478 25.1836 56.9734 25.1636 56.7001V55.2554Z" fill="#F8B9A8"/>
<path d="M25.1631 52.9651H21.1881V54.6404C22.8019 55.3429 24.0836 55.2521 25.1631 53.8758V52.9651Z" fill="#DD9887"/>
<path d="M18.0402 47.653C18.0349 47.8919 18.0536 48.1308 18.0959 48.3661C18.6444 51.3323 20.4905 53.8378 23.0136 54.2965C23.6508 54.515 24.2945 54.2152 24.925 53.9779C26.7217 52.8056 27.7763 51.5364 28.407 48.382C28.4583 48.1291 28.4805 47.8712 28.4733 47.6132C28.3938 44.305 27.2596 41.124 23.2581 41.124C19.2566 41.124 18.1144 44.3342 18.0402 47.653Z" fill="#F8B9A8"/>
<path d="M27.0045 50.6932C26.7586 50.6932 26.5593 50.3941 26.5593 50.0252C26.5593 49.6563 26.7586 49.3572 27.0045 49.3572C27.2504 49.3572 27.4497 49.6563 27.4497 50.0252C27.4497 50.3941 27.2504 50.6932 27.0045 50.6932Z" fill="#636464"/>
<path d="M22.004 50.6932C21.7581 50.6932 21.5588 50.3941 21.5588 50.0252C21.5588 49.6563 21.7581 49.3572 22.004 49.3572C22.2499 49.3572 22.4492 49.6563 22.4492 50.0252C22.4492 50.3941 22.2499 50.6932 22.004 50.6932Z" fill="#636464"/>
<path fill-rule="evenodd" clip-rule="evenodd" d="M24.3254 49.7391C24.2966 49.7454 24.2715 49.763 24.2556 49.7878C24.2397 49.8127 24.2343 49.8428 24.2406 49.8716L24.5056 51.0698H23.9756C23.9611 51.0698 23.9468 51.0727 23.9334 51.0783C23.9201 51.084 23.908 51.0922 23.8979 51.1026C23.8877 51.1129 23.8798 51.1252 23.8745 51.1387C23.8692 51.1522 23.8666 51.1666 23.867 51.1811C23.8666 51.1956 23.8692 51.2101 23.8745 51.2235C23.8798 51.237 23.8877 51.2493 23.8979 51.2597C23.908 51.2701 23.9201 51.2783 23.9334 51.284C23.9468 51.2896 23.9611 51.2925 23.9756 51.2925H24.6461C24.6627 51.293 24.6793 51.2897 24.6944 51.2828C24.7096 51.2759 24.723 51.2656 24.7335 51.2527C24.7441 51.2395 24.7515 51.224 24.7552 51.2074C24.7588 51.1909 24.7587 51.1738 24.7547 51.1573L24.4579 49.8319C24.4557 49.8169 24.4505 49.8025 24.4425 49.7896C24.4346 49.7768 24.4241 49.7656 24.4117 49.7569C24.3993 49.7483 24.3852 49.7422 24.3704 49.7391C24.3556 49.7361 24.3403 49.736 24.3254 49.7391V49.7391Z" fill="#CF836F"/>
<path d="M22.8945 48.0056C22.8938 47.9598 22.8769 47.9158 22.8468 47.8814C22.8167 47.8469 22.7754 47.8243 22.7302 47.8174C22.2499 47.7324 21.7584 47.7324 21.278 47.8174C21.231 47.8253 21.1887 47.8505 21.1593 47.888C21.13 47.9255 21.1157 47.9727 21.1194 48.0202C21.123 48.0678 21.1443 48.1122 21.1791 48.1448C21.2138 48.1774 21.2595 48.1958 21.3072 48.1964H22.7011C22.7264 48.1968 22.7515 48.1921 22.7749 48.1827C22.7984 48.1732 22.8197 48.1592 22.8377 48.1415C22.8557 48.1237 22.87 48.1026 22.8798 48.0792C22.8895 48.0559 22.8945 48.0309 22.8945 48.0056V48.0056Z" fill="#636464"/>
<path d="M28.001 48.0056C28.0009 47.9601 27.9845 47.9161 27.9549 47.8816C27.9253 47.8471 27.8843 47.8243 27.8393 47.8174C27.359 47.7324 26.8675 47.7324 26.3871 47.8174C26.3417 47.8232 26.3001 47.8457 26.2702 47.8805C26.2404 47.9152 26.2244 47.9598 26.2255 48.0056C26.2255 48.0562 26.2456 48.1047 26.2814 48.1405C26.3171 48.1763 26.3657 48.1964 26.4163 48.1964H27.7996C27.8255 48.1979 27.8515 48.194 27.8759 48.1851C27.9002 48.1761 27.9225 48.1623 27.9414 48.1444C27.9603 48.1266 27.9753 48.105 27.9855 48.0811C27.9958 48.0573 28.001 48.0316 28.001 48.0056Z" fill="#636464"/>
<path d="M23.109 51.9685H25.7749C25.7749 52.5225 24.9799 52.9997 24.4499 53.0739C23.9199 53.1481 23.109 52.4297 23.109 51.9685Z" fill="#FDF9EC"/>
<path d="M22.5037 44.8348C23.4349 43.7276 22.6852 44.6776 23.6677 43.1607C24.8318 44.8348 24.003 43.7984 24.8318 44.8348C26.1332 46.4181 27.1972 47.1467 27.9515 47.1467C29.211 47.3858 29.2297 44.1993 27.1972 42.2085C24.5198 39.5777 20.7412 41.0105 19.484 42.2063C17.7985 43.8073 17.3887 47.1444 18.5528 47.2242C20.123 46.8917 21.521 46.0462 22.5037 44.8348Z" fill="#191919"/>
<path d="M17.4809 49.8028C16.9292 49.8028 16.4819 49.0562 16.4819 48.1354C16.4819 47.2145 16.9292 46.468 17.4809 46.468C18.0327 46.468 18.48 47.2145 18.48 48.1354C18.48 49.0562 18.0327 49.8028 17.4809 49.8028Z" fill="#F8B9A8"/>
<path d="M17.3698 48.912C17.001 48.912 16.702 48.5145 16.702 48.024C16.702 47.5336 17.001 47.136 17.3698 47.136C17.7386 47.136 18.0376 47.5336 18.0376 48.024C18.0376 48.5145 17.7386 48.912 17.3698 48.912Z" fill="#DD9887"/>
<path d="M29.0351 49.8028C28.4834 49.8028 28.0361 49.0562 28.0361 48.1354C28.0361 47.2145 28.4834 46.468 29.0351 46.468C29.5869 46.468 30.0342 47.2145 30.0342 48.1354C30.0342 49.0562 29.5869 49.8028 29.0351 49.8028Z" fill="#F8B9A8"/>
<path d="M29.0348 48.912C28.7275 48.912 28.4783 48.5145 28.4783 48.024C28.4783 47.5336 28.7275 47.136 29.0348 47.136C29.3422 47.136 29.5913 47.5336 29.5913 48.024C29.5913 48.5145 29.3422 48.912 29.0348 48.912Z" fill="#DD9887"/>
<path d="M24.9513 49.5231C24.9513 49.963 25.0817 50.393 25.326 50.7587C25.5703 51.1245 25.9175 51.4095 26.3238 51.5779C26.73 51.7462 27.1771 51.7902 27.6084 51.7044C28.0396 51.6186 28.4358 51.4068 28.7467 51.0957C29.0577 50.7847 29.2694 50.3884 29.3552 49.957C29.441 49.5256 29.397 49.0784 29.2287 48.672C29.0604 48.2656 28.7755 47.9183 28.4098 47.6739C28.0442 47.4295 27.6143 47.2991 27.1746 47.2991C26.5849 47.2991 26.0194 47.5334 25.6025 47.9505C25.1855 48.3676 24.9513 48.9333 24.9513 49.5231Z" fill="#B6D6D9" fill-opacity="0.2"/>
<path fill-rule="evenodd" clip-rule="evenodd" d="M27.1743 51.5218C26.7785 51.5218 26.3916 51.4043 26.0625 51.1843C25.7334 50.9643 25.477 50.6516 25.3256 50.2857C25.1743 49.9198 25.1348 49.5173 25.2122 49.129C25.2896 48.7407 25.4804 48.3841 25.7605 48.1043C26.0406 47.8245 26.3973 47.6341 26.7856 47.5572C27.1739 47.4803 27.5763 47.5203 27.9418 47.6722C28.3074 47.824 28.6196 48.081 28.8392 48.4105C29.0587 48.7399 29.1756 49.1271 29.1751 49.5231C29.1744 50.0534 28.9633 50.5618 28.5881 50.9365C28.213 51.3113 27.7045 51.5218 27.1743 51.5218V51.5218ZM27.1743 51.7445C26.7344 51.745 26.3041 51.6149 25.9381 51.3707C25.5721 51.1266 25.2867 50.7792 25.1181 50.3728C24.9495 49.9663 24.9052 49.5189 24.9909 49.0872C25.0766 48.6555 25.2884 48.259 25.5995 47.9478C25.9106 47.6366 26.307 47.4247 26.7386 47.339C27.1701 47.2533 27.6174 47.2975 28.0237 47.4662C28.4301 47.6349 28.7773 47.9203 29.0214 48.2865C29.2655 48.6526 29.3955 49.083 29.395 49.5231C29.3922 50.1106 29.1571 50.6732 28.741 51.0879C28.3249 51.5026 27.7617 51.7358 27.1743 51.7365V51.7445Z" fill="white"/>
<path d="M19.3971 49.5231C19.3971 49.963 19.5275 50.393 19.7718 50.7587C20.0161 51.1245 20.3633 51.4095 20.7696 51.5779C21.1758 51.7462 21.6229 51.7902 22.0542 51.7044C22.4854 51.6186 22.8816 51.4068 23.1925 51.0957C23.5035 50.7847 23.7152 50.3884 23.801 49.957C23.8868 49.5256 23.8428 49.0784 23.6745 48.672C23.5062 48.2656 23.2213 47.9183 22.8556 47.6739C22.49 47.4295 22.0601 47.2991 21.6204 47.2991C21.0307 47.2991 20.4652 47.5334 20.0483 47.9505C19.6313 48.3676 19.3971 48.9333 19.3971 49.5231V49.5231Z" fill="#B6D6D9" fill-opacity="0.2"/>
<path fill-rule="evenodd" clip-rule="evenodd" d="M21.6201 51.5218C21.2242 51.5223 20.837 51.4053 20.5076 51.1856C20.1781 50.9659 19.9213 50.6534 19.7695 50.2875C19.6178 49.9217 19.5779 49.5191 19.655 49.1306C19.7322 48.7422 19.9228 48.3853 20.2027 48.1052C20.4827 47.8252 20.8394 47.6345 21.2278 47.5574C21.6162 47.4802 22.0187 47.5201 22.3843 47.6719C22.75 47.8237 23.0625 48.0806 23.2821 48.4102C23.5018 48.7397 23.6187 49.127 23.6182 49.5231C23.6175 50.053 23.4068 50.5609 23.0322 50.9356C22.6577 51.3103 22.1498 51.5211 21.6201 51.5218V51.5218ZM21.6201 51.7445C21.1802 51.745 20.7499 51.6149 20.3839 51.3707C20.0179 51.1266 19.7325 50.7792 19.5639 50.3728C19.3953 49.9663 19.351 49.5189 19.4367 49.0872C19.5224 48.6555 19.7342 48.259 20.0453 47.9478C20.3564 47.6366 20.7528 47.4247 21.1844 47.339C21.6159 47.2533 22.0632 47.2975 22.4695 47.4662C22.8759 47.6349 23.2231 47.9203 23.4672 48.2865C23.7113 48.6526 23.8413 49.083 23.8408 49.5231C23.838 50.1106 23.6029 50.6732 23.1868 51.0879C22.7707 51.5026 22.2075 51.7358 21.6201 51.7365V51.7445Z" fill="white"/>
<path fill-rule="evenodd" clip-rule="evenodd" d="M24.9644 49.7934C24.9699 49.8079 24.9784 49.8211 24.9893 49.8321C25.0002 49.8431 25.0133 49.8517 25.0277 49.8574C25.0421 49.8631 25.0576 49.8656 25.0731 49.865C25.0886 49.8643 25.1037 49.8605 25.1176 49.8536C25.1315 49.8467 25.1438 49.8371 25.1538 49.8252C25.1637 49.8133 25.1711 49.7994 25.1753 49.7845C25.1796 49.7696 25.1808 49.754 25.1787 49.7387C25.1766 49.7233 25.1713 49.7086 25.1631 49.6954C25.1376 49.651 25.1044 49.6115 25.0651 49.5787C25.0132 49.5324 24.9573 49.4907 24.8981 49.4541C24.7482 49.3584 24.5751 49.3052 24.3973 49.3004C24.2073 49.2919 24.0202 49.349 23.8673 49.4621C23.821 49.5004 23.7784 49.543 23.7401 49.5893C23.721 49.6116 23.7006 49.6329 23.6792 49.6529C23.6671 49.6609 23.6568 49.6712 23.6488 49.6832C23.6408 49.6952 23.6352 49.7087 23.6324 49.7228C23.6295 49.737 23.6295 49.7516 23.6323 49.7657C23.6351 49.7799 23.6407 49.7934 23.6487 49.8054C23.6567 49.8174 23.667 49.8277 23.679 49.8357C23.6909 49.8438 23.7044 49.8493 23.7186 49.8522C23.7327 49.855 23.7473 49.855 23.7614 49.8522C23.7756 49.8494 23.789 49.8439 23.8011 49.8358C23.8382 49.8091 23.872 49.7779 23.9017 49.7431V49.7431C23.9317 49.7078 23.9645 49.675 23.9998 49.645C24.116 49.5598 24.259 49.5193 24.4026 49.531C24.5395 49.5354 24.6725 49.5776 24.7868 49.6529C24.8348 49.6814 24.8801 49.7142 24.922 49.751C24.9371 49.7642 24.9512 49.7784 24.9644 49.7934V49.7934Z" fill="white"/>
<path d="M21.5909 56.3606C21.424 55.6158 21.2782 54.8126 21.1696 54.0783C21.163 54.031 21.1409 53.9872 21.1069 53.9536C21.0729 53.9201 21.0288 53.8987 20.9814 53.8927C20.3481 53.8079 20.1228 53.8344 19.7306 54.2188C19.7118 54.238 19.6965 54.2604 19.6856 54.285C19.5345 54.6562 19.2828 55.7032 19.3676 57.2487C19.4391 58.6642 20.4011 59.9525 21.0291 60.5887C21.0535 60.6137 21.0837 60.6322 21.1171 60.6426C21.1504 60.6529 21.1859 60.6547 21.2201 60.6479C21.2543 60.641 21.2863 60.6257 21.3131 60.6033C21.3399 60.581 21.3607 60.5522 21.3736 60.5198L22.3303 58.134C22.3433 58.1058 22.3501 58.075 22.3501 58.0439C22.3501 58.0128 22.3433 57.982 22.3303 57.9538C21.995 57.4687 21.7449 56.9299 21.5909 56.3606V56.3606Z" fill="#80C343"/>
<path d="M24.6839 56.3104C24.8482 55.5655 24.9966 54.7649 25.1053 54.0307C25.1118 53.983 25.1337 53.9389 25.1677 53.9049C25.2017 53.8709 25.2458 53.849 25.2934 53.8425C25.9241 53.7576 26.1494 53.7868 26.5442 54.1685C26.5631 54.1887 26.5784 54.212 26.5893 54.2374C26.7403 54.6085 26.9921 55.6556 26.9073 57.1984C26.8278 58.6139 25.8738 59.9022 25.2457 60.5411C25.2208 60.5659 25.19 60.5841 25.1563 60.5938C25.1225 60.6036 25.0868 60.6048 25.0524 60.5971C25.0181 60.5894 24.9862 60.5732 24.9598 60.55C24.9334 60.5268 24.9133 60.4973 24.9012 60.4642L23.9446 58.0785C23.9315 58.0502 23.9248 58.0195 23.9248 57.9883C23.9248 57.9572 23.9315 57.9265 23.9446 57.8982C24.2785 57.4142 24.5284 56.8774 24.6839 56.3104Z" fill="#80C343"/>
<path d="M14.5816 70.8637C14.415 69.5487 15.3591 68.3527 16.6768 68.2093V68.2093C18.079 68.0568 19.3034 69.1552 19.3034 70.5657L19.3034 76.056C19.3034 77.0754 18.5453 77.9357 17.534 78.0639V78.0639C16.4251 78.2044 15.4122 77.4193 15.2717 76.3104L14.5816 70.8637Z" fill="#F8B9A8"/>
<path d="M18.3577 74.4508L33.1797 81.7938L32.0364 84.6989L16.3178 78.1223L18.3577 74.4508Z" fill="#F8B9A8"/>
<path d="M13.5981 62.9616L18.9015 62.4163L20.6693 71.4697L13.5981 72.615V62.9616Z" fill="white"/>
<ellipse cx="33.3228" cy="83.2698" rx="2.26522" ry="2.58883" transform="rotate(-64.7266 33.3228 83.2698)" fill="#F8B9A8"/>
<circle cx="45.0331" cy="108.542" r="0.764566" fill="#FCFFF6"/>
<circle cx="47.9384" cy="108.542" r="0.764566" fill="#FCFFF6"/>
<circle cx="50.8437" cy="108.542" r="0.764566" fill="#FCFFF6"/>
<path d="M106.016 90.144C104.853 89.0197 104.299 86.4632 104.167 85.3254C103.837 87.0655 103.15 90.733 103.044 91.4825C102.912 92.4195 101.694 92.725 101.364 93.7289C101.034 94.7328 102.482 100.874 104.463 102.615C106.444 104.355 110.181 103.028 109.974 100.204C109.934 99.6537 107.997 98.3776 107.864 97.1729C107.732 95.9683 107.666 95.3642 107.864 93.8918C108.063 92.4195 107.468 91.5495 106.016 90.144Z" fill="#191919"/>
<path d="M94.3159 90.1379C95.4798 89.015 96.0354 86.4617 96.1676 85.3254C96.4983 87.0633 97.1861 90.726 97.2919 91.4746C97.4242 92.4104 98.6442 92.7155 98.9749 93.7181C99.3056 94.7207 97.8545 100.855 95.8705 102.592C93.8865 104.33 90.1444 103.005 90.3512 100.185C90.3915 99.6353 92.3318 98.3608 92.4641 97.1577C92.5964 95.9546 92.6625 95.3513 92.4641 93.8808C92.2657 92.4104 92.8609 91.5415 94.3159 90.1379Z" fill="#191919"/>
<rect width="13.4623" height="6.39121" transform="matrix(-1 0 0 1 106.338 116.13)" fill="#322F2F"/>
<path d="M108.889 100.658C105.014 93.0737 93.5403 95.086 92.1899 99.7C90.8395 104.314 91.0864 107.391 91.2357 110.925C91.3775 114.283 89.76 116.538 95.0316 116.538H104.452C109.437 116.538 109.465 114.611 109.502 110.72C109.527 108.088 109.938 104.26 108.889 100.658Z" fill="#6C9645"/>
<path d="M106.839 127.068C108.343 126.041 108.06 123.212 106.596 122.578C105.132 121.943 103.358 121.569 103.44 123.076L103.642 126.804C103.728 128.395 105.198 128.039 106.839 127.068Z" fill="#474747"/>
<mask id="mask2" mask-type="alpha" maskUnits="userSpaceOnUse" x="103" y="121" width="5" height="7">
<path d="M106.837 127.058C108.341 126.036 108.058 123.221 106.595 122.59C105.132 121.959 103.359 121.587 103.44 123.087L103.641 126.796C103.727 128.379 105.196 128.024 106.837 127.058Z" fill="#DF514F"/>
</mask>
<g mask="url(#mask2)">
<rect width="7.04191" height="1.19354" transform="matrix(-0.0540986 -0.998536 -0.998536 0.0540986 104.927 128.467)" fill="#E5E5E5"/>
</g>
<path d="M88.5395 114.202C89.0136 114.246 89.4683 114.406 89.8853 114.636L103.343 122.05C104.363 122.612 104.852 123.81 104.515 124.925V124.925C104.146 126.147 102.905 126.885 101.655 126.627L86.2852 123.458C85.9042 123.379 85.5299 123.246 85.1945 123.049C78.1961 118.941 81.6763 113.569 88.5395 114.202Z" fill="#322F2F"/>
<path d="M110.638 114.202C110.164 114.246 109.709 114.406 109.292 114.636L95.8338 122.05C94.8139 122.612 94.3257 123.81 94.6625 124.925V124.925C95.0317 126.147 96.2723 126.885 97.5227 126.627L112.892 123.458C113.273 123.379 113.647 123.246 113.983 123.049C120.981 118.941 117.501 113.569 110.638 114.202Z" fill="#322F2F"/>
<path d="M94.1804 104.223H104.702C105.244 104.223 105.683 104.663 105.683 105.206V111.594C105.683 112.137 105.244 112.577 104.702 112.577H94.1804C93.6383 112.577 93.1989 112.137 93.1989 111.594V105.206C93.1989 104.663 93.6383 104.223 94.1804 104.223Z" fill="#3A3A3A"/>
<g style="mix-blend-mode:multiply" opacity="0.5">
<path d="M103.398 107.67L104.702 104.223C105.244 104.223 105.683 104.663 105.683 105.206V111.594C105.683 112.137 105.244 112.577 104.702 112.577H94.1804C93.6383 112.577 93.1989 112.137 93.1989 111.594C96.2935 111.594 99.7964 112.162 103.398 107.67Z" fill="#3A3A3A"/>
</g>
<path fill-rule="evenodd" clip-rule="evenodd" d="M99.902 80.4707C99.6644 80.2621 99.1893 80.3979 98.9896 80.5948C98.744 80.837 98.4217 81.9941 98.477 82.5703L100.062 82.0311L101.196 82.4324C101.328 81.9366 100.997 80.8395 100.701 80.5701C100.511 80.3969 100.108 80.265 99.902 80.4707Z" fill="#191919"/>
<path d="M105.221 87.4609C105.221 90.7705 102.953 88.8385 99.9861 88.8385C97.0188 88.8385 94.4756 90.7705 94.4756 87.4609C94.4756 84.1513 96.881 81.4683 99.8483 81.4683C102.816 81.4683 105.221 84.1513 105.221 87.4609Z" fill="#2B2B2B"/>
<path d="M98.4707 93.8667H101.501V96.2517C100.369 96.9374 99.708 96.9207 98.4707 96.2517V93.8667Z" fill="#F8B9A8"/>
<path d="M98.4707 95.0377V93.729L101.501 94.0045C101.501 94.3489 100.647 94.9275 100.262 95.0377C99.8759 95.1479 98.884 95.1755 98.4707 95.0377Z" fill="#DD9887"/>
<path d="M95.3039 88.5812C95.3021 88.7207 95.3129 88.861 95.3362 88.9986C95.8296 91.9146 97.0217 93.6701 99.2845 94.3879C99.6946 94.5179 100.138 94.5066 100.544 94.3648C102.67 93.6227 103.926 92.1224 104.493 89.0155C104.52 88.8669 104.533 88.7149 104.531 88.5639C104.486 85.458 103.505 82.4326 99.9175 82.4326C96.3233 82.4326 95.3451 85.4692 95.3039 88.5812Z" fill="#F8B9A8"/>
<ellipse rx="0.387283" ry="0.619652" transform="matrix(-1 0 0 1 101.936 88.8069)" fill="#636464"/>
<ellipse rx="0.387283" ry="0.619652" transform="matrix(-1 0 0 1 97.9086 88.8069)" fill="#636464"/>
<ellipse rx="0.482166" ry="0.344404" transform="matrix(-1 0 0 1 97.3001 90.4916)" fill="#FA9797"/>
<ellipse rx="0.551047" ry="0.344404" transform="matrix(-1 0 0 1 102.604 90.4916)" fill="#FA9797"/>
<path fill-rule="evenodd" clip-rule="evenodd" d="M99.8302 89.7356C99.8799 89.7453 99.9125 89.7935 99.9028 89.8433L99.6383 91.2033H100.17C100.221 91.2033 100.262 91.2445 100.262 91.2952C100.262 91.3459 100.221 91.387 100.17 91.387H99.5269C99.4995 91.387 99.4735 91.3748 99.456 91.3536C99.4386 91.3324 99.4315 91.3046 99.4367 91.2777L99.7225 89.8082C99.7322 89.7584 99.7804 89.7259 99.8302 89.7356Z" fill="#CF836F"/>
<path d="M98.6826 87.2985C98.6826 87.2172 98.631 87.1445 98.5542 87.118C97.9009 86.8927 97.7471 86.8913 97.1788 87.114C97.1045 87.1431 97.056 87.2151 97.056 87.2948V87.2948C97.056 87.4027 97.1435 87.4902 97.2514 87.4902H98.491C98.5968 87.4902 98.6826 87.4044 98.6826 87.2985V87.2985Z" fill="#CF836E"/>
<path d="M102.71 87.2985C102.71 87.2172 102.659 87.1445 102.582 87.118C101.929 86.8927 101.775 86.8913 101.207 87.114C101.132 87.1431 101.084 87.2151 101.084 87.2948V87.2948C101.084 87.4027 101.171 87.4902 101.279 87.4902H102.519C102.625 87.4902 102.71 87.4044 102.71 87.2985V87.2985Z" fill="#CF836E"/>
<path d="M98.5279 92.4473H101.084C101.084 92.9484 100.317 93.3826 99.806 93.4494C99.2947 93.5162 98.5279 92.8648 98.5279 92.4473Z" fill="#FDF9EC"/>
<ellipse rx="0.688808" ry="1.30874" transform="matrix(-0.983443 0.18122 0.18122 0.983443 94.7512 88.8384)" fill="#F8B9A8"/>
<ellipse cx="105.015" cy="88.8384" rx="0.674407" ry="1.28137" transform="rotate(10.4408 105.015 88.8384)" fill="#F8B9A8"/>
<g style="mix-blend-mode:multiply" opacity="0.3">
<ellipse rx="0.275523" ry="0.619927" transform="matrix(-0.989438 0.144954 0.144954 0.989438 94.7513 88.8384)" fill="#F8B9A8"/>
</g>
<g style="mix-blend-mode:multiply" opacity="0.3">
<ellipse cx="105.014" cy="88.8384" rx="0.269763" ry="0.606966" transform="rotate(8.33462 105.014 88.8384)" fill="#F8B9A8"/>
</g>
<path d="M95.1647 88.2185C95.0545 87.8327 94.9351 87.5526 94.8892 87.4608C95.5091 83.9478 96.2806 83.7136 96.6112 83.3279C97.0245 82.8457 98.471 81.8126 101.295 82.2258C103.554 82.5565 105.015 86.2898 104.808 87.7363C104.693 87.8052 104.532 88.0807 104.532 88.0807C104.532 88.0807 104.372 89.2746 104.326 89.4583C104.095 88.8813 103.706 87.0709 103.706 86.4276C103.706 85.2566 102.191 84.0948 99.8486 84.0167C97.7822 83.9478 95.9913 85.3255 95.9913 86.2898C95.9913 87.2541 95.6751 88.5 95.4402 89.3205C95.4402 89.1139 95.2749 88.6042 95.1647 88.2185Z" fill="#2B2B2B"/>
<path d="M104.063 109.877C104.878 109.323 105.01 108.093 104.356 107.13C103.703 106.168 102.512 105.837 101.696 106.392C100.88 106.947 100.749 108.177 101.403 109.139C102.056 110.102 103.247 110.432 104.063 109.877Z" fill="#F8B9A8"/>
<path d="M94.6891 111.641C95.1251 112.525 96.3249 112.827 97.369 112.313C98.4131 111.8 98.9061 110.666 98.4701 109.782C98.0341 108.897 96.8343 108.596 95.7902 109.109C94.7461 109.622 94.2531 110.756 94.6891 111.641Z" fill="#F8B9A8"/>
<path d="M92.4433 122.858C90.9196 123.844 91.146 126.648 92.5965 127.304C94.047 127.959 95.8135 128.363 95.762 126.871L95.6349 123.18C95.5806 121.605 94.1038 121.929 92.4433 122.858Z" fill="#474747"/>
<mask id="mask3" mask-type="alpha" maskUnits="userSpaceOnUse" x="91" y="122" width="5" height="7">
<path d="M92.4441 122.852C90.921 123.844 91.1479 126.664 92.5981 127.324C94.0484 127.984 95.8144 128.39 95.7627 126.889L95.6348 123.178C95.5802 121.593 94.1039 121.918 92.4441 122.852Z" fill="#DF514F"/>
</mask>
<g mask="url(#mask3)">
<rect width="7.04191" height="1.19354" transform="matrix(0.0344302 0.999407 0.999407 -0.0344302 94.3818 121.481)" fill="#E5E5E5"/>
</g>
<path d="M88.5249 108.855L92.5976 108.787L92.1285 114.362L90.3675 114.928C90.2727 114.958 90.1743 114.977 90.0748 114.977C89.4678 114.982 88.8521 114.869 88.6838 114.317C88.6656 114.257 88.6601 114.195 88.6585 114.132L88.5249 108.855Z" fill="#F8B9A8"/>
<path d="M111.914 108.991L107.834 108.991L108.038 114.09L109.692 115.153C109.856 115.258 110.045 115.321 110.239 115.31C110.877 115.271 111.692 115.043 111.885 114.521C111.909 114.455 111.914 114.383 111.914 114.312L111.914 108.991Z" fill="#F8B9A8"/>
<path d="M97.0871 112.322C94.9702 113.36 93.7277 113.865 91.3804 114.595L91.9197 111.506L95.3873 111.098L97.0871 112.322Z" fill="#F8B9A8"/>
<path d="M102.599 109.874C104.718 110.923 107.253 114.168 109.603 114.906L109.331 111.574L104.707 108.787L102.599 109.874Z" fill="#F8B9A8"/>
<path d="M88.8058 102.727C89.4245 101.474 91.0055 98.9683 94.2362 97.228L93.0676 108.923H87.981C87.981 107.461 88.3488 103.653 88.8058 102.727Z" fill="#6C9645"/>
<path d="M111.651 103.007C111.046 101.783 109.499 99.3358 106.339 97.636L107.482 109.059H112.458C112.458 107.631 112.098 103.911 111.651 103.007Z" fill="#6C9645"/>
</svg>
