<svg width="183" height="130" viewBox="0 0 183 130" fill="none" xmlns="http://www.w3.org/2000/svg">
<path d="M99.1159 107.469L108.872 124.367H89.3599L99.1159 107.469Z" fill="#F7B9A9"/>
<circle cx="54.3752" cy="44.9806" r="44.7082" fill="#E7FCFE"/>
<rect x="131.371" y="52.5872" width="51.416" height="51.416" fill="#BFE0A1"/>
<path d="M34.2702 79.0569L53.8391 81.7511L53.6462 85.4743L33.3525 83.9881L34.2702 79.0569Z" fill="#F8B9A8"/>
<path d="M57.2628 83.7513C57.2628 85.2579 56.0414 86.4793 54.5347 86.4793C53.028 86.4793 51.8066 85.2579 51.8066 83.7513C51.8066 82.2446 53.028 81.0232 54.5347 81.0232C56.0414 81.0232 57.2628 82.2446 57.2628 83.7513Z" fill="#F8B9A8"/>
<path d="M85.8911 90.3088C85.7574 89.5514 86.34 88.8569 87.1091 88.8569V88.8569C87.7292 88.8569 88.2535 89.3161 88.3351 89.9308L92.867 124.04C92.907 124.341 92.6727 124.608 92.369 124.608V124.608C92.1252 124.608 91.9167 124.433 91.8743 124.193L85.8911 90.3088Z" fill="#6C7580"/>
<path d="M73.3323 24.7195C73.3497 23.8529 74.0276 23.1439 74.8926 23.0876L163.128 17.35C164.137 17.2844 164.973 18.1254 164.9 19.1348L160.243 84.0945C160.178 84.997 159.406 85.6835 158.503 85.6424L73.8118 81.7865C72.9075 81.7454 72.2009 80.9908 72.2191 80.0858L73.3323 24.7195Z" fill="#898988"/>
<path d="M71.4492 19.2977C71.4492 18.792 71.8405 18.3725 72.3449 18.3372L158.056 12.3481C158.613 12.3092 159.086 12.7504 159.086 13.3086V83.2264C159.086 83.7736 158.631 84.2108 158.084 84.1885L72.3729 80.6948C71.8568 80.6738 71.4492 80.2493 71.4492 79.7328V19.2977Z" fill="#DFDFDF"/>
<path d="M74.0625 35.2651C74.0625 27.3724 80.1789 20.8299 88.0538 20.2991L140.05 16.7946C148.712 16.2108 156.059 23.0793 156.059 31.7606V65.051C156.059 73.5664 148.978 80.3739 140.47 80.0394L88.4732 77.9951C80.4244 77.6786 74.0625 71.0617 74.0625 63.0067V35.2651Z" fill="white"/>
<rect width="1.29296" height="24.9444" rx="0.646481" transform="matrix(-0.993958 -0.109758 -0.271021 0.962574 25.2227 100.79)" fill="#6C7580"/>
<rect width="1.29296" height="24.9444" rx="0.646481" transform="matrix(0.993958 -0.109758 0.271021 0.962574 33.5879 100.79)" fill="#6C7580"/>
<rect x="21.3086" y="98.582" width="16.2035" height="2.60995" rx="1.30498" fill="#6C7580"/>
<path d="M126.739 60.459L97.303 60.9314C98.9159 70.735 98.8376 71.371 99.0476 79.2126L126.739 79.83V60.459Z" fill="#80C343"/>
<path d="M118.476 29.5032L121.896 23.1928C117.037 9.54721 104.215 18.3117 103 22.222L103.978 26.2671L118.476 29.5032Z" fill="#191919"/>
<path d="M126.105 70.4283C121.807 83.9386 103.02 81.9914 99.4472 68.4811C95.8743 54.9708 89.5317 43.9791 101.026 40.247C111.638 36.3526 113.101 36.5091 124.56 40.247C136.996 44.3036 131.659 56.6351 126.105 70.4283Z" fill="#80C343"/>
<path d="M114.181 48.8755C114.121 48.0191 113.408 47.355 112.55 47.355V47.355C111.689 47.355 110.976 48.0224 110.918 48.8813L109.426 71.2399C109.386 71.8451 109.622 72.4359 110.069 72.8461L111.187 73.8727C111.937 74.5614 113.084 74.5768 113.852 73.9085L115.067 72.8516C115.541 72.4395 115.793 71.8289 115.749 71.2026L114.181 48.8755Z" fill="#636464"/>
<path d="M115.845 35.1553H109.979V39.4895L112.912 42.6197L115.845 39.4895V35.1553Z" fill="#F8B9A8"/>
<path d="M115.845 38.2856C115.845 39.6902 109.979 39.3157 109.979 38.2856V40.4093C109.979 42.0291 111.292 43.3422 112.912 43.3422V43.3422C114.532 43.3422 115.845 42.0291 115.845 40.4093V38.2856Z" fill="#F8B9A8"/>
<g style="mix-blend-mode:multiply" opacity="0.3">
<path d="M115.845 34.9146H109.979V36.9874C111.173 40.6088 114.276 40.8786 115.845 36.9874V34.9146Z" fill="#F8B9A8"/>
</g>
<path d="M105.137 30.8351C103.815 30.8351 102.743 29.2671 102.743 27.3328C102.743 25.3986 103.815 23.8306 105.137 23.8306C106.459 23.8306 107.531 25.3986 107.531 27.3328C107.531 29.2671 106.459 30.8351 105.137 30.8351Z" fill="#E0E0E0"/>
<path d="M125.775 75.0631C125.775 77.6838 127.899 79.8084 130.52 79.8084V79.8084V79.8084C133.255 79.8084 135.383 77.4302 135.08 74.7118L132.165 48.5956C132.116 48.1537 132.018 47.7144 131.812 47.3205C130.66 45.1195 128.352 43.9263 126.358 46.9248C125.931 47.5671 125.775 48.3463 125.775 49.1176L125.775 75.0631Z" fill="#80C343"/>
<path d="M105.071 27.0239C104.552 30.7386 106.141 34.2889 108.716 36.1521C110.352 37.3359 112.556 37.3908 114.412 36.5936C117.341 35.3352 119.903 32.7289 120.124 29.3219C120.224 27.7879 119.967 26.2433 119.817 24.7134C119.383 20.3177 117.541 16.4944 112.498 16.4944C106.584 16.4944 105.071 21.7514 105.071 27.0239Z" fill="#F8B9A8"/>
<ellipse rx="0.617212" ry="0.949557" transform="matrix(-1 0 0 1 113.752 27.1664)" fill="#191919"/>
<ellipse rx="0.617212" ry="0.949557" transform="matrix(-1 0 0 1 107.67 27.2433)" fill="#191919"/>
<path fill-rule="evenodd" clip-rule="evenodd" d="M110.632 27.8367C110.716 27.8547 110.77 27.9377 110.752 28.0222L110.328 30.0173H111.179C111.266 30.0173 111.336 30.0873 111.336 30.1737C111.336 30.2601 111.266 30.3301 111.179 30.3301H110.135C110.088 30.3301 110.043 30.3088 110.013 30.2721C109.984 30.2355 109.972 30.1873 109.982 30.1412L110.446 27.9572C110.464 27.8727 110.547 27.8187 110.632 27.8367Z" fill="#CF836F"/>
<ellipse rx="1.51929" ry="2.42137" transform="matrix(-1 0 0 1 121.042 26.5124)" fill="#F8B9A8"/>
<path d="M109.056 24.5941C109.056 24.395 108.915 24.2229 108.719 24.1874C107.805 24.0216 107.35 24.0196 106.538 24.1813C106.344 24.2198 106.207 24.392 106.207 24.5896V24.5896C106.207 24.8224 106.396 25.0111 106.629 25.0111H108.639C108.869 25.0111 109.056 24.8244 109.056 24.5941V24.5941Z" fill="#CF836E"/>
<path d="M114.982 24.8248C114.982 24.6257 114.842 24.4536 114.646 24.4181C113.732 24.2524 113.276 24.2503 112.465 24.412C112.271 24.4506 112.134 24.6227 112.134 24.8203V24.8203C112.134 25.0531 112.322 25.2418 112.555 25.2418H114.565C114.796 25.2418 114.982 25.0551 114.982 24.8248V24.8248Z" fill="#CF836E"/>
<path d="M108.901 31.9128H112.889C112.889 32.6689 111.692 33.3241 110.895 33.4249C110.097 33.5258 108.901 32.5429 108.901 31.9128Z" fill="#FDF9EC"/>
<g style="mix-blend-mode:multiply" opacity="0.3">
<ellipse rx="0.949557" ry="1.18695" transform="matrix(-1 0 0 1 120.947 26.4174)" fill="#F8B9A8"/>
</g>
<path d="M114.475 46.4511C113.71 47.8076 111.756 47.8076 110.991 46.4511L110.92 46.3261C110.168 44.9928 111.132 43.3434 112.662 43.3434H112.803C114.334 43.3434 115.298 44.9928 114.545 46.3261L114.475 46.4511Z" fill="#636464"/>
<path d="M110.507 40.3079C110.301 39.3796 110.115 38.3903 109.965 37.4522C109.895 37.0133 109.551 36.6505 109.108 36.6251C108.573 36.5944 108.272 36.6942 107.861 37.0723C107.771 37.1554 107.7 37.2581 107.659 37.3737C107.436 38.003 107.119 39.4893 107.237 41.6159C107.328 43.2609 108.223 44.7889 109.051 45.8206C109.483 46.3582 110.285 46.1774 110.541 45.5372L111.485 43.1774C111.591 42.9122 111.578 42.6145 111.429 42.3704C111.127 41.8719 110.711 41.2257 110.507 40.3079Z" fill="#FFFEFD"/>
<path d="M115.437 40.6348C115.643 39.7065 115.829 38.7172 115.978 37.7791C116.048 37.3402 116.392 36.9774 116.836 36.952C117.37 36.9213 117.671 37.0212 118.082 37.3992C118.172 37.4823 118.243 37.585 118.284 37.7006C118.507 38.3299 118.825 39.8162 118.707 41.9428C118.615 43.5878 117.72 45.1158 116.892 46.1475C116.46 46.6851 115.659 46.5043 115.403 45.8641L114.459 43.5043C114.353 43.2391 114.366 42.9414 114.514 42.6973C114.817 42.1988 115.233 41.5526 115.437 40.6348Z" fill="#FFFEFD"/>
<path d="M112.379 14.5053C114.596 14.3888 116.258 16.399 116.674 17.273C115.796 18.5355 113.127 21.1478 109.47 21.4974C104.898 21.9344 101.157 17.4187 102.681 17.4187C104.205 17.4187 109.608 14.651 112.379 14.5053Z" fill="#191919"/>
<path d="M97.473 46.1191C97.0272 44.6895 95.2222 44.2424 94.132 45.269C82.6382 56.0915 80.8239 53.2674 74.429 44.5095C74.096 44.0534 73.5802 43.7496 73.0165 43.7151C70.1423 43.5391 69.8454 44.3271 69.3272 46.8832C69.2413 47.3071 69.2986 47.7564 69.4905 48.1441C76.8764 63.0669 87.978 64.6927 98.2899 51.5676C98.6865 51.0627 98.8038 50.3868 98.6127 49.7739L97.473 46.1191Z" fill="#80C343"/>
<ellipse rx="3.50806" ry="3.91284" transform="matrix(0.862984 -0.505232 -0.505232 -0.862984 69.4519 41.6632)" fill="#F8B9A8"/>
<rect x="74.9053" y="44.5681" width="6.74628" height="3.50806" rx="1.75403" transform="rotate(149.653 74.9053 44.5681)" fill="#FFFEFD"/>
<rect x="0.786133" y="37.863" width="21.6801" height="8.42491" rx="4.21245" fill="#EAF7D1"/>
<rect x="0.5" y="39.1494" width="20.6801" height="7.42491" rx="3.71245" fill="white" stroke="#8B8B8B"/>
<circle cx="6.00951" cy="42.862" r="0.954823" fill="#80C343"/>
<ellipse cx="10.7283" cy="42.809" rx="0.954823" ry="0.901777" fill="#80C343"/>
<ellipse cx="15.446" cy="42.809" rx="0.954823" ry="0.901777" fill="#80C343"/>
<path d="M94.7747 86.3342H83.2168C81.9741 86.3342 80.9668 85.5125 80.9668 84.4989V84.1469C80.9668 83.1332 81.9741 82.3115 83.2168 82.3115H94.7747V86.3342Z" fill="#FFEBB7"/>
<rect x="81.46" y="82.7136" width="1.23285" height="3.21817" fill="#5C546A"/>
<path d="M93.6035 81.708H80.4736V78.8921H93.6035C93.978 78.8921 94.2816 79.1397 94.2816 79.4452V81.1549C94.2816 81.4603 93.978 81.708 93.6035 81.708Z" fill="#FFEBB7"/>
<rect x="82.1992" y="75.2717" width="12.5751" height="3.01704" fill="#FFEBB7"/>
<path d="M94.7816 86.7364H83.4393C81.8078 86.7364 80.4805 85.6538 80.4805 84.3228C80.4805 82.9918 81.8078 81.9092 83.4393 81.9092H94.7816C95.0539 81.9092 95.2747 82.0893 95.2747 82.3115C95.2747 82.5336 95.0539 82.7137 94.7816 82.7137H83.4393C82.3517 82.7137 81.4668 83.4356 81.4668 84.3228C81.4668 85.21 82.3517 85.9319 83.4393 85.9319H94.7816C95.0539 85.9319 95.2747 86.112 95.2747 86.3342C95.2747 86.5563 95.0539 86.7364 94.7816 86.7364Z" fill="#00C37A"/>
<path d="M93.3021 81.9093H80.2339C80.0976 81.9093 79.9873 81.8194 79.9873 81.7082C79.9873 81.597 80.0976 81.5071 80.2339 81.5071H93.3021C93.71 81.5071 94.0418 81.2364 94.0418 80.9037V79.6968C94.0418 79.3641 93.71 79.0934 93.3021 79.0934H80.2339C80.0976 79.0934 79.9873 79.0035 79.9873 78.8923C79.9873 78.7811 80.0976 78.6912 80.2339 78.6912H93.3021C93.9819 78.6912 94.535 79.1423 94.535 79.6968V80.9037C94.535 81.4582 93.9819 81.9093 93.3021 81.9093Z" fill="#009BCA"/>
<path d="M94.7744 76.2773H83.4321C83.2959 76.2773 83.1855 76.1872 83.1855 76.0761V76.0761C83.1855 75.9651 83.2959 75.875 83.4321 75.875H94.7744V76.2773Z" fill="#E6BE94"/>
<path d="M94.7744 77.0817H83.4321C83.2959 77.0817 83.1855 76.9917 83.1855 76.8806V76.8806C83.1855 76.7695 83.2959 76.6794 83.4321 76.6794H94.7744V77.0817Z" fill="#E6BE94"/>
<path d="M94.7744 77.8862H83.4321C83.2959 77.8862 83.1855 77.7961 83.1855 77.685V77.685C83.1855 77.5739 83.2959 77.4839 83.4321 77.4839H94.7744V77.8862Z" fill="#E6BE94"/>
<path d="M80.4736 79.4956H93.2953C93.4315 79.4956 93.5419 79.5857 93.5419 79.6967V79.6967C93.5419 79.8078 93.4315 79.8979 93.2953 79.8979H80.4736V79.4956Z" fill="#E6BE94"/>
<path d="M80.4736 80.2998H93.2953C93.4315 80.2998 93.5419 80.3899 93.5419 80.5009V80.5009C93.5419 80.612 93.4315 80.7021 93.2953 80.7021H80.4736V80.2998Z" fill="#E6BE94"/>
<path d="M80.4736 81.1042H93.2953C93.4315 81.1042 93.5419 81.1943 93.5419 81.3054V81.3054C93.5419 81.4165 93.4315 81.5065 93.2953 81.5065H80.4736V81.1042Z" fill="#E6BE94"/>
<path d="M95.0277 78.6909H83.1923C82.3765 78.6909 81.7129 78.1496 81.7129 77.4841V75.875C81.7129 75.2095 82.3765 74.6682 83.1923 74.6682H95.0277C95.3 74.6682 95.5208 74.8483 95.5208 75.0705C95.5208 75.2926 95.3 75.4728 95.0277 75.4728H83.1923C82.9203 75.4728 82.6992 75.6532 82.6992 75.875V77.4841C82.6992 77.7059 82.9203 77.8864 83.1923 77.8864H95.0277C95.3 77.8864 95.5208 78.0665 95.5208 78.2887C95.5208 78.5108 95.3 78.6909 95.0277 78.6909Z" fill="#FF4F19"/>
<path d="M83.4321 85.5295C83.2958 85.5295 83.1855 85.6195 83.1855 85.7307C83.1855 85.8419 83.2958 85.9318 83.4321 85.9318H94.7744V85.5295H83.4321Z" fill="#E6BE94"/>
<path d="M83.4321 84.7249C83.2958 84.7249 83.1855 84.8148 83.1855 84.926C83.1855 85.0372 83.2958 85.1271 83.4321 85.1271H94.7744V84.7249H83.4321Z" fill="#E6BE94"/>
<path d="M83.4321 83.9204C83.2958 83.9204 83.1855 84.0104 83.1855 84.1215C83.1855 84.2327 83.2958 84.3227 83.4321 84.3227H94.7744V83.9204H83.4321Z" fill="#E6BE94"/>
<path d="M83.4321 83.116C83.2958 83.116 83.1855 83.2059 83.1855 83.3171C83.1855 83.4283 83.2958 83.5182 83.4321 83.5182H94.7744V83.116H83.4321Z" fill="#E6BE94"/>
<path d="M37.8448 55.5894C36.2794 54.0914 35.5323 50.6854 35.3544 49.1697C34.9097 51.4879 33.9847 56.374 33.8424 57.3726C33.6645 58.6209 32.0237 59.0279 31.5789 60.3654C31.1342 61.7028 33.0857 69.8852 35.754 72.2035C38.4223 74.5217 43.455 72.7541 43.1769 68.9916C43.1227 68.2589 40.5132 66.5587 40.3353 64.9538C40.1574 63.3489 40.0684 62.544 40.3353 60.5825C40.6021 58.6209 39.8016 57.4618 37.8448 55.5894Z" fill="#191919"/>
<path d="M24.6573 54.2762C26.4184 52.5786 28.3237 48.4071 28.5238 46.6892C29.0241 49.3165 29.7584 55.2918 29.9185 56.4236C30.1186 57.8383 31.9646 58.2996 32.4649 59.8154C32.9652 61.3311 30.7698 70.6046 27.7679 73.2319C24.7661 75.8592 19.1043 73.8559 19.4172 69.5917C19.4782 68.7613 22.0553 66.7581 22.614 65.0156C23.3442 62.7386 23.3442 63.0304 23.3442 60.3312C23.3442 58.0879 22.456 56.3983 24.6573 54.2762Z" fill="#191919"/>
<path d="M22.2313 68.3101C25.8628 58.5331 40.2856 59.1453 42.2105 68.3101C44.1355 77.4749 43.4697 88.0153 42.2105 88.0153H22.2312C22.2312 82.5976 21.1243 78.9531 22.2313 68.3101Z" fill="#6C9645"/>
<path fill-rule="evenodd" clip-rule="evenodd" d="M30.111 47.6289L28.7941 48.8154C28.4996 48.2778 28.3299 47.017 28.4678 46.6787C28.5799 46.4034 28.986 46.0726 29.3044 46.1769C29.4192 45.8906 29.8662 45.8508 30.1235 45.9399C30.524 46.0786 31.3045 47.008 31.3835 47.5455L30.111 47.6289Z" fill="#191919"/>
<path d="M31.6611 60.8418H35.1628V63.6083C33.8542 64.4037 33.0907 64.3843 31.6611 63.6083V60.8418Z" fill="#F8B9A8"/>
<path d="M35.1631 62.2279V60.55L31.6614 60.8081C31.6614 61.1307 32.6748 61.9059 33.1204 62.0091C33.5661 62.1123 34.6856 62.357 35.1631 62.2279Z" fill="#DD9887"/>
<path d="M38.6632 54.5843C38.6647 54.7282 38.6535 54.874 38.6319 55.0163C38.1153 58.4144 37.6884 59.4861 36.265 60.9951C35.9071 61.3745 35.4402 61.6504 34.9208 61.6989C31.2221 62.0441 28.6699 58.1068 28.6699 54.7869C28.6699 50.9445 29.0561 47.127 33.3154 47.127C37.4948 47.127 38.6223 50.8157 38.6632 54.5843Z" fill="#F8B9A8"/>
<path d="M30.859 51.5041C30.7861 52.4974 31.029 56.0831 30.1295 56.173C29.4 56.246 28.0139 55.0788 27.4303 55.5894C25.5336 51.3864 28.3508 48.4681 28.8894 47.9295C29.327 47.4918 31.3697 46.0327 34.3608 46.4704C36.7536 46.8205 38.519 49.2426 38.592 51.2122C38.592 51.2122 38.6406 52.9144 38.592 53.109C38.3479 52.4978 38.1542 52.3314 38.1542 51.65C38.1542 50.4098 37.5706 49.1064 35.0903 49.0238C32.9017 48.9508 30.932 50.5109 30.859 51.5041Z" fill="#191919"/>
<ellipse rx="0.779715" ry="1.29198" transform="matrix(-0.998411 -0.0563535 -0.00398888 0.999992 28.9429 56.3418)" fill="#F8B9A8"/>
<g style="mix-blend-mode:multiply" opacity="0.3">
<ellipse rx="0.312358" ry="0.610771" transform="matrix(-0.9961 -0.088233 -0.0461531 0.998934 28.9429 56.3416)" fill="#F8B9A8"/>
</g>
<ellipse cx="32.9679" cy="53.9674" rx="0.449328" ry="0.738182" fill="#191919"/>
<ellipse cx="37.3655" cy="53.6143" rx="0.417234" ry="0.641898" fill="#191919"/>
<ellipse cx="32.9013" cy="56.0272" rx="0.510663" ry="0.291808" fill="#FA9797"/>
<ellipse cx="37.7157" cy="55.7352" rx="0.510663" ry="0.291808" fill="#FA9797"/>
<path fill-rule="evenodd" clip-rule="evenodd" d="M35.4787 54.291C35.4276 54.3057 35.398 54.359 35.4127 54.4101L35.8013 55.7642L35.2353 55.8088C35.1823 55.8129 35.1427 55.8593 35.1468 55.9123C35.151 55.9653 35.1974 56.0049 35.2504 56.0007L35.9339 55.947C35.9627 55.9447 35.989 55.9296 36.0055 55.9059C36.0219 55.8821 36.0269 55.8522 36.0189 55.8244L35.5978 54.357C35.5831 54.3059 35.5298 54.2763 35.4787 54.291Z" fill="#CF836F"/>
<path d="M36.0488 52.143C36.0488 52.038 36.1142 51.9438 36.2127 51.9076C37.0039 51.6175 37.1942 51.6158 37.8827 51.9024C37.9775 51.9419 38.0387 52.0351 38.0387 52.1379V52.1379C38.0387 52.2798 37.9237 52.3948 37.7818 52.3948H36.3006C36.1616 52.3948 36.0488 52.2821 36.0488 52.143V52.143Z" fill="#CF836E"/>
<path d="M31.9414 52.0773C31.9414 51.9729 32.0058 51.8789 32.1034 51.8419C32.8651 51.5535 33.0503 51.5517 33.713 51.8367C33.8069 51.877 33.8671 51.9699 33.8671 52.0721V52.0721C33.8671 52.2147 33.7515 52.3304 33.6089 52.3304H32.1944C32.0547 52.3304 31.9414 52.2171 31.9414 52.0773V52.0773Z" fill="#CF836E"/>
<path d="M37.0707 57.1447L34.5273 57.2981C34.562 57.872 35.355 58.3234 35.8682 58.3693C36.3815 58.4151 37.0995 57.623 37.0707 57.1447Z" fill="#FDF9EC"/>
<rect width="0.877629" height="10.719" rx="0.438815" transform="matrix(-0.885508 0.464625 0.464625 0.885508 46.4609 76.1426)" fill="#191919"/>
<ellipse rx="2.52318" ry="2.90715" transform="matrix(-0.621116 -0.783719 -0.783719 0.621116 48.7062 83.3902)" fill="#F8B9A8"/>
<path d="M51.4049 86.4625L50.6025 85.8848L51.3086 85.4675L51.4049 86.4625Z" fill="#3E365B"/>
<path d="M121.14 24.947C121.098 22.8335 120.015 19.6812 118.715 18.0194C117.814 16.9464 116.29 15.9796 115.521 15.7872C113.903 15.3828 110.44 14.5941 107.015 15.9796C110.438 15.9796 114.02 15.2841 116.791 17.75C118.596 19.3992 119.881 22.5141 120.186 24.947H121.14Z" fill="#E0E0E0"/>
<path d="M120.088 29.9028C118.796 31.3405 117.033 32.2658 115.122 32.5098C114.878 32.5313 114.632 32.5398 114.387 32.5354L114.59 31.9314C115.399 31.8051 116.191 31.5805 116.947 31.2626C118.001 30.8105 118.974 30.1862 119.826 29.4151L120.088 29.9028Z" fill="#E0E0E0"/>
<path d="M115.163 31.7117L113.693 31.7307C113.585 31.7321 113.483 31.7762 113.408 31.8533C113.333 31.9304 113.291 32.0343 113.292 32.1419L113.294 32.3081C113.295 32.4157 113.338 32.5185 113.415 32.5936C113.492 32.6688 113.595 32.7103 113.702 32.7089L115.173 32.6899L115.163 31.7117Z" fill="#D3D3D3"/>
<path d="M120.958 30.4427C119.71 30.4427 118.699 28.9626 118.699 27.1369C118.699 25.3111 119.71 23.8311 120.958 23.8311C122.206 23.8311 123.218 25.3111 123.218 27.1369C123.218 28.9626 122.206 30.4427 120.958 30.4427Z" fill="#E0E0E0"/>
<path d="M120.958 28.8266C120.339 28.8266 119.837 28.1114 119.837 27.2291C119.837 26.3468 120.339 25.6316 120.958 25.6316C121.576 25.6316 122.078 26.3468 122.078 27.2291C122.078 28.1114 121.576 28.8266 120.958 28.8266Z" fill="#D3D3D3"/>
<path d="M53.2609 124.902L53.0537 109.136L58.5432 109.995L56.5397 125.197L53.2609 124.902Z" fill="#FAB09C"/>
<path d="M51.1128 125.95L46.9814 110.639L53.095 110.082L54.7101 125.404L51.1128 125.95Z" fill="#F8B9A8"/>
<path d="M38.3727 86.8857L30.2711 98.772C40.7801 101.403 35.7812 98.9898 41.2178 111.398C47.8903 112.585 51.7708 112.505 58.8721 111.398C61.7959 94.9771 67.5671 93.2455 38.3727 86.8857Z" fill="#424242"/>
<path d="M41.0556 86.9287H22.3494C21.6413 90.1235 22.6845 99.5812 32.2254 98.7069C41.2047 97.8841 43.394 90.4684 41.0556 86.9287Z" fill="#424242"/>
<path d="M59.268 85.9661H76.3115C76.4264 85.9661 76.5195 86.0535 76.5195 86.1614V86.541C76.5195 86.6489 76.4264 86.7363 76.3115 86.7363H59.268C59.1531 86.7363 59.0599 86.6489 59.0599 86.541V86.1614C59.0599 86.0535 59.1531 85.9661 59.268 85.9661Z" fill="#282828"/>
<path d="M76.1845 86.6558C76.2161 86.6676 76.2496 86.6731 76.2833 86.6718C76.3169 86.6705 76.35 86.6625 76.3805 86.6483C76.4111 86.6341 76.4385 86.6139 76.4612 86.5889C76.4839 86.564 76.5014 86.5347 76.5127 86.5029L81.7052 71.8028C81.7277 71.7383 81.724 71.6676 81.6947 71.6059C81.6654 71.5442 81.613 71.4967 81.5489 71.4736C81.4846 71.451 81.414 71.4547 81.3526 71.4841C81.2911 71.5135 81.2437 71.5661 81.2207 71.6304L76.0205 86.3305C76.0095 86.3627 76.0051 86.3967 76.0075 86.4306C76.0098 86.4644 76.0189 86.4975 76.0342 86.5278C76.0495 86.5581 76.0707 86.5851 76.0965 86.607C76.1223 86.629 76.1522 86.6456 76.1845 86.6558Z" fill="#282828"/>
<path d="M74.5938 86.2866H72.989V86.3097C72.989 86.3376 73.0066 86.3644 73.0379 86.3842C73.0692 86.4039 73.1117 86.415 73.156 86.415H74.4268C74.471 86.415 74.5135 86.4039 74.5448 86.3842C74.5762 86.3644 74.5938 86.3376 74.5938 86.3097V86.2866Z" fill="#4F4F4F"/>
<path d="M71.4489 86.2866H72.0908V86.415H71.4489V86.2866Z" fill="#4F4F4F"/>
<path d="M70.357 86.2866H70.7422V86.415H70.357V86.2866Z" fill="#4F4F4F"/>
<path d="M75.5893 86.4792C75.5361 86.4792 75.493 86.4217 75.493 86.3508C75.493 86.2799 75.5361 86.2224 75.5893 86.2224C75.6424 86.2224 75.6855 86.2799 75.6855 86.3508C75.6855 86.4217 75.6424 86.4792 75.5893 86.4792Z" fill="#4F4F4F"/>
<rect x="19.3906" y="86.7363" width="78.1832" height="2.37502" rx="1.18751" fill="#6C7580"/>
<path fill-rule="evenodd" clip-rule="evenodd" d="M48.1581 88.073C48.1581 87.2282 47.4779 86.5435 46.6389 86.5435H60.5529C61.4475 86.5435 62.1729 87.2737 62.1729 88.1745V100.467H48.1581V88.073Z" fill="#FCF3DE"/>
<mask id="path-98-inside-1" fill="white">
<path fill-rule="evenodd" clip-rule="evenodd" d="M51.8163 96.8837C51.8163 96.786 51.7421 96.7043 51.6449 96.6949L50.5448 96.5887C50.4334 96.5779 50.3369 96.6655 50.3369 96.7775V98.2823L51.4005 98.385C51.6234 98.4065 51.8163 98.2313 51.8163 98.0074V96.8837Z"/>
<path fill-rule="evenodd" clip-rule="evenodd" d="M51.8163 92.4281C51.8163 92.3304 51.7421 92.2487 51.6449 92.2393L50.5448 92.1331C50.4334 92.1224 50.3369 92.21 50.3369 92.3219V93.8267L51.4005 93.9294C51.6234 93.9509 51.8163 93.7757 51.8163 93.5518V92.4281Z"/>
<path fill-rule="evenodd" clip-rule="evenodd" d="M51.8163 88.1582C51.8163 88.0605 51.7421 87.9788 51.6449 87.9694L50.5448 87.8632C50.4334 87.8524 50.3369 87.94 50.3369 88.052V89.5568L51.4005 89.6595C51.6234 89.681 51.8163 89.5058 51.8163 89.2819V88.1582Z"/>
</mask>
<path d="M51.6449 96.6949L51.8947 94.1069L51.8947 94.1069L51.6449 96.6949ZM50.5448 96.5887L50.295 99.1767L50.295 99.1767L50.5448 96.5887ZM50.3369 98.2823H47.7369C47.7369 99.6215 48.7541 100.742 50.0871 100.87L50.3369 98.2823ZM51.4005 98.385L51.1507 100.973L51.1507 100.973L51.4005 98.385ZM51.6449 92.2393L51.8947 89.6513L51.8947 89.6513L51.6449 92.2393ZM50.5448 92.1331L50.295 94.7211L50.5448 92.1331ZM50.3369 93.8267H47.7369C47.7369 95.1659 48.7541 96.286 50.0871 96.4147L50.3369 93.8267ZM51.4005 93.9294L51.6504 91.3414L51.6504 91.3414L51.4005 93.9294ZM51.6449 87.9694L51.3951 90.5574L51.6449 87.9694ZM50.5448 87.8632L50.7946 85.2752L50.7946 85.2752L50.5448 87.8632ZM50.3369 89.5568H47.7369C47.7369 90.896 48.7541 92.0161 50.0871 92.1448L50.3369 89.5568ZM51.4005 89.6595L51.6504 87.0715L51.6504 87.0715L51.4005 89.6595ZM54.4163 96.8837C54.4163 95.4468 53.3249 94.245 51.8947 94.1069L51.3951 99.2828C50.1593 99.1636 49.2163 98.1251 49.2163 96.8837H54.4163ZM51.8947 94.1069L50.7946 94.0007L50.295 99.1767L51.3951 99.2828L51.8947 94.1069ZM50.7946 94.0007C49.1556 93.8425 47.7369 95.1309 47.7369 96.7775H52.9369C52.9369 98.2002 51.7111 99.3134 50.295 99.1767L50.7946 94.0007ZM47.7369 96.7775V98.2823H52.9369V96.7775H47.7369ZM50.0871 100.87L51.1507 100.973L51.6504 95.797L50.5867 95.6943L50.0871 100.87ZM51.1507 100.973C52.9012 101.142 54.4163 99.7659 54.4163 98.0074H49.2163C49.2163 96.6966 50.3457 95.6711 51.6504 95.797L51.1507 100.973ZM54.4163 98.0074V96.8837H49.2163V98.0074H54.4163ZM54.4163 92.4281C54.4163 90.9912 53.3249 89.7894 51.8947 89.6513L51.3951 94.8273C50.1593 94.708 49.2163 93.6696 49.2163 92.4281H54.4163ZM51.8947 89.6513L50.7946 89.5451L50.295 94.7211L51.3951 94.8273L51.8947 89.6513ZM50.7946 89.5451C49.1556 89.3869 47.7369 90.6753 47.7369 92.3219H52.9369C52.9369 93.7446 51.7111 94.8578 50.295 94.7211L50.7946 89.5451ZM47.7369 92.3219V93.8267H52.9369V92.3219H47.7369ZM50.0871 96.4147L51.1507 96.5174L51.6504 91.3414L50.5867 91.2388L50.0871 96.4147ZM51.1507 96.5174C52.9011 96.6863 54.4163 95.3104 54.4163 93.5518H49.2163C49.2163 92.2411 50.3457 91.2155 51.6504 91.3414L51.1507 96.5174ZM54.4163 93.5518V92.4281H49.2163V93.5518H54.4163ZM54.4163 88.1582C54.4163 86.7213 53.3249 85.5195 51.8947 85.3814L51.3951 90.5574C50.1593 90.4381 49.2163 89.3997 49.2163 88.1582H54.4163ZM51.8947 85.3814L50.7946 85.2752L50.295 90.4512L51.3951 90.5574L51.8947 85.3814ZM50.7946 85.2752C49.1556 85.117 47.7369 86.4054 47.7369 88.052H52.9369C52.9369 89.4747 51.7111 90.5879 50.295 90.4512L50.7946 85.2752ZM47.7369 88.052V89.5568H52.9369V88.052H47.7369ZM50.0871 92.1448L51.1507 92.2475L51.6504 87.0715L50.5867 86.9688L50.0871 92.1448ZM51.1507 92.2475C52.9011 92.4164 54.4163 91.0405 54.4163 89.2819H49.2163C49.2163 87.9712 50.3457 86.9456 51.6504 87.0715L51.1507 92.2475ZM54.4163 89.2819V88.1582H49.2163V89.2819H54.4163Z" fill="#3E365B" mask="url(#path-98-inside-1)"/>
<path fill-rule="evenodd" clip-rule="evenodd" d="M60.2598 97.9612C60.2598 97.8564 60.1748 97.7715 60.0701 97.7715H52.6234C52.5187 97.7715 52.4338 97.8564 52.4338 97.9612C52.4338 98.0659 52.5187 98.1508 52.6234 98.1508H60.0701C60.1748 98.1508 60.2598 98.0659 60.2598 97.9612Z" fill="#3E365B"/>
<path fill-rule="evenodd" clip-rule="evenodd" d="M60.2598 97.2185C60.2598 97.1137 60.1748 97.0288 60.0701 97.0288H52.6234C52.5187 97.0288 52.4338 97.1137 52.4338 97.2185C52.4338 97.3232 52.5187 97.4082 52.6234 97.4082H60.0701C60.1748 97.4082 60.2598 97.3232 60.2598 97.2185Z" fill="#3E365B"/>
<path fill-rule="evenodd" clip-rule="evenodd" d="M60.2598 93.5051C60.2598 93.4004 60.1748 93.3154 60.0701 93.3154H52.6234C52.5187 93.3154 52.4338 93.4004 52.4338 93.5051C52.4338 93.6099 52.5187 93.6948 52.6234 93.6948H60.0701C60.1748 93.6948 60.2598 93.6099 60.2598 93.5051Z" fill="#3E365B"/>
<path fill-rule="evenodd" clip-rule="evenodd" d="M60.2598 92.7629C60.2598 92.6582 60.1748 92.5732 60.0701 92.5732H52.6234C52.5187 92.5732 52.4338 92.6582 52.4338 92.7629C52.4338 92.8677 52.5187 92.9526 52.6234 92.9526H60.0701C60.1748 92.9526 60.2598 92.8677 60.2598 92.7629Z" fill="#3E365B"/>
<path fill-rule="evenodd" clip-rule="evenodd" d="M60.2598 89.2353C60.2598 89.1306 60.1748 89.0457 60.0701 89.0457H52.6234C52.5187 89.0457 52.4338 89.1306 52.4338 89.2353C52.4338 89.3401 52.5187 89.425 52.6234 89.425H60.0701C60.1748 89.425 60.2598 89.3401 60.2598 89.2353Z" fill="#3E365B"/>
<path fill-rule="evenodd" clip-rule="evenodd" d="M60.2598 88.3074C60.2598 88.2026 60.1748 88.1177 60.0701 88.1177H52.6234C52.5187 88.1177 52.4338 88.2026 52.4338 88.3074C52.4338 88.4121 52.5187 88.497 52.6234 88.497H60.0701C60.1748 88.497 60.2598 88.4121 60.2598 88.3074Z" fill="#3E365B"/>
<path fill-rule="evenodd" clip-rule="evenodd" d="M51.476 97.181C51.4108 97.1121 51.3048 97.1018 51.2277 97.157L50.5964 97.6091C50.5112 97.67 50.4916 97.7885 50.5526 97.8737C50.6135 97.9589 50.732 97.9785 50.8172 97.9175L51.3139 97.5619L52.6031 98.9267C52.675 99.0029 52.7951 99.0063 52.8712 98.9343C52.9474 98.8624 52.9508 98.7424 52.8789 98.6662L51.476 97.181Z" fill="#39C9A7"/>
<path fill-rule="evenodd" clip-rule="evenodd" d="M51.476 92.5397C51.4108 92.4707 51.3048 92.4605 51.2277 92.5157L50.5964 92.9677C50.5112 93.0287 50.4916 93.1472 50.5526 93.2323C50.6135 93.3175 50.732 93.3371 50.8172 93.2761L51.3139 92.9205L52.6031 94.2853C52.675 94.3615 52.7951 94.3649 52.8712 94.293C52.9474 94.2211 52.9508 94.101 52.8789 94.0249L51.476 92.5397Z" fill="#39C9A7"/>
<path fill-rule="evenodd" clip-rule="evenodd" d="M51.476 88.2699C51.4108 88.2009 51.3048 88.1907 51.2277 88.2459L50.5964 88.6979C50.5112 88.7589 50.4916 88.8774 50.5526 88.9626C50.6135 89.0477 50.732 89.0673 50.8172 89.0064L51.3139 88.6507L52.6031 90.0156C52.675 90.0917 52.7951 90.0951 52.8712 90.0232C52.9474 89.9513 52.9508 89.8312 52.8789 89.7551L51.476 88.2699Z" fill="#39C9A7"/>
<path d="M54.9953 5.7117C54.9416 5.17207 55.3249 4.6868 55.8623 4.61397L88.1035 0.244797C88.6685 0.168222 89.1844 0.575625 89.2409 1.14305L91.7072 25.9237C91.7658 26.5126 91.3064 27.0248 90.7147 27.0305L58.0699 27.3444C57.5486 27.3495 57.1097 26.9558 57.058 26.4371L54.9953 5.7117Z" fill="white"/>
<path d="M56.4319 6.1807C56.3782 5.64106 56.7614 5.15579 57.2988 5.08297L89.54 0.713791C90.105 0.637216 90.6209 1.04462 90.6774 1.61204L93.1437 26.3927C93.2023 26.9816 92.743 27.4938 92.1512 27.4995L59.5064 27.8134C58.9851 27.8184 58.5462 27.4248 58.4946 26.9061L56.4319 6.1807Z" fill="#C5C5C5"/>
<path d="M55.1078 5.80021C55.0491 5.21692 55.463 4.69187 56.044 4.6125L87.8602 0.266442C88.4711 0.182984 89.0295 0.622772 89.0912 1.2361L91.5454 25.6288C91.6094 26.2653 91.1133 26.8196 90.4734 26.8265L58.2548 27.1721C57.6911 27.1781 57.2159 26.7532 57.1595 26.1925L55.1078 5.80021Z" fill="white"/>
<path fill-rule="evenodd" clip-rule="evenodd" d="M88.1421 0.529937L55.9009 4.89911C55.5171 4.95113 55.2433 5.29775 55.2817 5.68321L57.3444 26.4086C57.3813 26.7791 57.6948 27.0603 58.0671 27.0567L90.7119 26.7428C91.1346 26.7387 91.4627 26.3728 91.4208 25.9522L88.9545 1.17155C88.9142 0.766243 88.5457 0.475241 88.1421 0.529937ZM55.8623 4.61397C55.3249 4.6868 54.9416 5.17207 54.9953 5.7117L57.058 26.4371C57.1097 26.9558 57.5486 27.3495 58.0699 27.3444L90.7147 27.0305C91.3064 27.0248 91.7658 26.5126 91.7072 25.9237L89.2409 1.14305C89.1844 0.575625 88.6685 0.168222 88.1035 0.244797L55.8623 4.61397Z" fill="#8B8B8B"/>
<path d="M56.8863 8.0061C56.8753 7.8956 56.9553 7.79683 57.0656 7.78459L87.1149 4.45084C87.3101 4.42917 87.4855 4.57114 87.5049 4.76663V4.76663C87.5242 4.96038 87.3829 5.13314 87.1892 5.15269L57.1083 8.18767C56.9969 8.19892 56.8974 8.11758 56.8863 8.0061V8.0061Z" fill="#474747"/>
<path d="M57.233 11.4548C57.222 11.3436 57.3028 11.2443 57.414 11.2327L87.549 8.08596C87.7072 8.06945 87.8486 8.1847 87.8644 8.34294V8.34294C87.8801 8.50072 87.7648 8.64133 87.607 8.65692L57.4551 11.6367C57.3435 11.6477 57.2441 11.5663 57.233 11.4548V11.4548Z" fill="#474747"/>
<path d="M57.6299 14.5981C57.6206 14.4867 57.703 14.3888 57.8143 14.3789L87.9951 11.7068C88.1535 11.6927 88.2931 11.8102 88.3064 11.9687V11.9687C88.3196 12.1267 88.2022 12.2654 88.0441 12.2786L57.849 14.7835C57.7373 14.7928 57.6392 14.7098 57.6299 14.5981V14.5981Z" fill="#474747"/>
<path d="M58.2871 21.9591C58.2828 21.8823 58.3414 21.8164 58.4182 21.8118L88.8152 19.9913C88.9245 19.9847 89.0183 20.0682 89.0244 20.1775V20.1775C89.0306 20.2866 88.9472 20.38 88.8381 20.3862L58.4344 22.0907C58.3574 22.0951 58.2915 22.0361 58.2871 21.9591V21.9591Z" fill="#474747"/>
<path fill-rule="evenodd" clip-rule="evenodd" d="M78.3102 16.3908C77.3105 16.7547 76.4598 17.6237 76.0001 18.6533C75.8915 18.8965 75.7704 19.1873 75.6364 19.5092C75.2908 20.3395 74.8588 21.3772 74.332 22.34C73.9653 23.0104 73.5486 23.6527 73.0762 24.1731C72.6041 24.6931 72.0696 25.0989 71.4661 25.2833C70.6254 25.5402 69.8315 25.3638 69.0193 24.7796C68.2145 24.2006 67.3838 23.2164 66.45 21.8421C65.8456 20.9526 65.0003 19.838 64.1186 19.0475C63.6775 18.6519 63.2348 18.3445 62.8154 18.1838C62.3985 18.024 62.0162 18.0129 61.6767 18.1895C61.45 18.3074 61.2064 18.5427 60.9571 18.8593C60.7099 19.1734 60.4662 19.5554 60.2363 19.9525C60.0066 20.3493 59.7925 20.758 59.6039 21.1247C59.5632 21.2038 59.5237 21.2811 59.4853 21.3559C59.3468 21.6265 59.2243 21.8656 59.1248 22.0429L58.8739 21.9021C58.9705 21.73 59.0893 21.4979 59.2273 21.2284C59.2661 21.1527 59.3063 21.0742 59.348 20.9931C59.5371 20.6255 59.7539 20.2115 59.9872 19.8084C60.2204 19.4056 60.4718 19.0105 60.731 18.6813C60.9882 18.3547 61.2624 18.0807 61.5439 17.9342C61.9776 17.7086 62.4501 17.7356 62.9184 17.9151C63.3842 18.0936 63.8571 18.4266 64.3107 18.8333C65.2186 19.6473 66.0794 20.7847 66.688 21.6804C67.6176 23.0485 68.4251 23.9977 69.1874 24.546C69.9423 25.089 70.6442 25.2336 71.382 25.0081C71.9186 24.8441 72.4112 24.4775 72.8631 23.9797C73.3146 23.4824 73.7187 22.8616 74.0796 22.2019C74.5985 21.2535 75.0196 20.2418 75.3638 19.415C75.4999 19.0879 75.624 18.7898 75.7373 18.536C76.2234 17.4473 77.1272 16.5152 78.2118 16.1204C79.3054 15.7223 80.5682 15.8767 81.7389 16.9375C82.961 18.0448 84.0611 19.7889 84.8862 21.2998C85.2999 22.0572 85.6464 22.7597 85.9062 23.2999C85.9837 23.4612 86.0543 23.6094 86.1162 23.7397C86.1575 23.8265 86.195 23.9054 86.2283 23.9748C86.3141 24.1537 86.3707 24.2676 86.3998 24.315L86.1547 24.4657C86.1157 24.4024 86.0516 24.2718 85.9689 24.0992C85.9346 24.0278 85.8969 23.9486 85.8557 23.8618C85.7942 23.7325 85.7247 23.5865 85.6469 23.4246C85.3881 22.8866 85.044 22.189 84.6337 21.4377C83.811 19.9312 82.7298 18.2236 81.5457 17.1507C80.4519 16.1597 79.3008 16.0302 78.3102 16.3908Z" fill="#474747"/>
<circle cx="82.146" cy="2.86073" r="0.323561" transform="rotate(-5.68366 82.146 2.86073)" fill="#898988"/>
<circle cx="83.6824" cy="2.67151" r="0.359512" transform="rotate(-5.68366 83.6824 2.67151)" fill="#898988"/>
<circle cx="85.2891" cy="2.47569" r="0.395463" transform="rotate(-5.68366 85.2891 2.47569)" fill="#898988"/>
<path d="M25.3702 75.2126C25.2509 74.488 25.749 73.8065 26.4756 73.7001L29.6775 73.2311C30.4507 73.1179 31.1511 73.7008 31.18 74.4817L31.5219 83.6962C31.5464 84.3571 31.0755 84.9331 30.4229 85.0406L28.3739 85.3778C27.6583 85.4955 26.9827 85.0109 26.865 84.2953L25.3702 75.2126Z" fill="#F8B9A8"/>
<path d="M28.7713 80.4556L48.4713 81.9079L48.514 85.6359L28.167 85.4349L28.7713 80.4556Z" fill="#F8B9A8"/>
<path d="M24.0984 67.3501L30.4031 66.4644L32.9136 77.1904L24.5257 78.8702L24.0984 67.3501Z" fill="#6C9645"/>
</svg>
