<svg width="351" height="302" viewBox="0 0 351 302" fill="none" xmlns="http://www.w3.org/2000/svg">
<path opacity="0.8" d="M32.9964 48.6822C1.59911 90.5983 -14.6798 143.458 21.441 215.827C54.379 281.819 137.621 320.443 237.487 291.451C337.647 262.377 365.656 150.404 342.844 114.77C320.035 79.1355 256.313 137.092 223.983 81.8575C191.653 26.6202 177.652 -5.2942 123.012 1.00057C78.392 6.14068 46.8249 30.2208 32.9964 48.6822Z" fill="url(#paint0_linear)"/>
<path d="M181.898 260.464C227.3 260.464 264.107 223.863 264.107 178.712C264.107 133.561 227.3 96.9597 181.898 96.9597C136.495 96.9597 99.6885 133.561 99.6885 178.712C99.6885 223.863 136.495 260.464 181.898 260.464Z" fill="#EEF5FF"/>
<path d="M174.834 254.131C220.236 254.131 257.043 217.529 257.043 172.379C257.043 127.228 220.236 90.6265 174.834 90.6265C129.431 90.6265 92.6247 127.228 92.6247 172.379C92.6247 217.529 129.431 254.131 174.834 254.131Z" fill="#5289DD"/>
<path d="M174.834 248.255C216.974 248.255 251.136 214.284 251.136 172.379C251.136 130.474 216.974 96.5029 174.834 96.5029C132.693 96.5029 98.5316 130.474 98.5316 172.379C98.5316 214.284 132.693 248.255 174.834 248.255Z" fill="white"/>
<path fill-rule="evenodd" clip-rule="evenodd" d="M114.638 188.577L125.386 195.489L124.108 197.407L113.36 190.495L114.638 188.577Z" fill="#89B2EF"/>
<path fill-rule="evenodd" clip-rule="evenodd" d="M148.04 180.448L157.996 183.645L157.265 185.837L147.339 182.64L148.04 180.448Z" fill="#89B2EF"/>
<path fill-rule="evenodd" clip-rule="evenodd" d="M174.286 171.374L175.899 173.018L164.299 184.223L162.685 182.579L174.286 171.374Z" fill="#89B2EF"/>
<path fill-rule="evenodd" clip-rule="evenodd" d="M141.098 182.274L142.803 183.827L130.928 196.554L129.223 195.001L141.098 182.274Z" fill="#89B2EF"/>
<path fill-rule="evenodd" clip-rule="evenodd" d="M107.331 202.796H114.273C115.643 202.796 116.739 203.893 116.77 205.232L117.196 233.518C117.227 234.949 116.009 236.106 114.578 236.045L107.331 235.68V202.796Z" fill="#D0625C"/>
<path fill-rule="evenodd" clip-rule="evenodd" d="M140.61 197.011H147.553C148.923 197.011 150.019 198.077 150.049 199.386L150.506 234.066C150.536 235.467 149.319 236.593 147.887 236.502L140.671 236.075V197.011H140.61Z" fill="#D0625C"/>
<path fill-rule="evenodd" clip-rule="evenodd" d="M157.509 201.335H164.451C165.821 201.335 166.917 202.431 166.948 203.771L167.405 234.005C167.435 235.436 166.217 236.594 164.786 236.533L157.539 236.137V201.335H157.509Z" fill="#D0625C"/>
<path fill-rule="evenodd" clip-rule="evenodd" d="M173.89 185.563H180.802C182.172 185.563 183.268 186.659 183.298 188.029L183.755 233.975C183.755 235.436 182.537 236.593 181.076 236.471L173.89 235.923V185.563Z" fill="#D0625C"/>
<path fill-rule="evenodd" clip-rule="evenodd" d="M124.23 215.615L130.684 214.245C132.207 213.94 133.638 215.067 133.668 216.62L134.064 233.549C134.095 234.98 132.938 236.137 131.507 236.076L124.23 235.832V215.615Z" fill="#D0625C"/>
<path fill-rule="evenodd" clip-rule="evenodd" d="M106.357 204.867C106.357 203.557 107.392 202.461 108.701 202.4L113.116 202.157C114.547 202.096 115.735 203.223 115.735 204.623V233.031C115.735 234.34 114.699 235.436 113.39 235.497L108.975 235.741C107.544 235.802 106.357 234.675 106.357 233.275V204.867Z" fill="#E57772"/>
<path fill-rule="evenodd" clip-rule="evenodd" d="M123.438 216.407C123.468 215.158 124.412 214.123 125.661 214.001L128.249 213.727C130.441 213.484 132.39 215.219 132.39 217.442V233.457C132.39 234.827 131.293 235.954 129.893 235.954H126.818C124.717 235.954 123.042 234.249 123.103 232.148L123.438 216.407Z" fill="#E57772"/>
<path fill-rule="evenodd" clip-rule="evenodd" d="M139.606 198.564C139.636 197.316 140.58 196.25 141.828 196.128L146.274 195.672C147.735 195.519 149.014 196.676 149.014 198.138V233.518C149.014 234.827 147.979 235.924 146.67 235.984L141.798 236.228C140.367 236.289 139.179 235.162 139.179 233.731L139.606 198.564Z" fill="#E57772"/>
<path fill-rule="evenodd" clip-rule="evenodd" d="M156.2 202.37C156.261 200.939 157.509 199.843 158.94 199.995L163.477 200.482C164.725 200.604 165.699 201.67 165.699 202.949V233.396C165.699 234.766 164.603 235.893 163.203 235.893H157.387C155.987 235.893 154.86 234.706 154.921 233.305L156.2 202.37Z" fill="#E57772"/>
<path fill-rule="evenodd" clip-rule="evenodd" d="M171.515 186.872C171.484 185.593 172.398 184.497 173.677 184.345L179.523 183.553C181.015 183.34 182.324 184.497 182.324 186.02V233.427C182.324 234.797 181.228 235.924 179.827 235.924H175.351C174.012 235.924 172.915 234.858 172.885 233.518L171.515 186.872Z" fill="#E57772"/>
<path fill-rule="evenodd" clip-rule="evenodd" d="M115.735 187.633C115.735 190.191 113.634 192.292 111.046 192.292C108.458 192.292 106.357 190.221 106.357 187.633C106.357 185.045 108.458 182.975 111.046 182.975C113.634 182.975 115.735 185.045 115.735 187.633Z" fill="#5289DD"/>
<path fill-rule="evenodd" clip-rule="evenodd" d="M182.324 169.76C182.324 172.318 180.223 174.419 177.635 174.419C175.047 174.419 172.946 172.348 172.946 169.76C172.946 167.203 175.047 165.102 177.635 165.102C180.223 165.102 182.324 167.172 182.324 169.76Z" fill="#5289DD"/>
<path fill-rule="evenodd" clip-rule="evenodd" d="M165.669 185.837C165.669 188.394 163.568 190.495 160.98 190.495C158.392 190.495 156.291 188.425 156.291 185.837C156.291 183.249 158.392 181.178 160.98 181.178C163.568 181.178 165.669 183.279 165.669 185.837Z" fill="#5289DD"/>
<path fill-rule="evenodd" clip-rule="evenodd" d="M149.014 180.478C149.014 183.036 146.913 185.137 144.325 185.137C141.737 185.137 139.636 183.066 139.636 180.478C139.636 177.89 141.737 175.82 144.325 175.82C146.913 175.82 149.014 177.92 149.014 180.478Z" fill="#5289DD"/>
<path fill-rule="evenodd" clip-rule="evenodd" d="M132.39 198.351C132.39 200.909 130.289 203.01 127.701 203.01C125.113 203.01 123.012 200.939 123.012 198.351C123.012 195.794 125.113 193.693 127.701 193.693C130.289 193.693 132.39 195.794 132.39 198.351Z" fill="#5289DD"/>
<path opacity="0.81" d="M142.742 166.198C152.999 166.198 161.315 157.787 161.315 147.412C161.315 137.037 152.999 128.626 142.742 128.626C132.484 128.626 124.169 137.037 124.169 147.412C124.169 157.787 132.484 166.198 142.742 166.198Z" fill="#F7C4A1"/>
<path d="M138.296 164.036C149.613 164.036 158.788 154.767 158.788 143.332C158.788 131.897 149.613 122.627 138.296 122.627C126.979 122.627 117.805 131.897 117.805 143.332C117.805 154.767 126.979 164.036 138.296 164.036Z" fill="#E3955C"/>
<path fill-rule="evenodd" clip-rule="evenodd" d="M138.449 117.025L139.727 119.583C139.819 119.765 140.001 119.887 140.184 119.917L143.046 120.313C143.564 120.374 143.746 120.983 143.381 121.348L141.311 123.328C141.158 123.48 141.097 123.663 141.128 123.845L141.615 126.646C141.706 127.134 141.189 127.499 140.732 127.286L138.175 125.977C137.992 125.885 137.779 125.885 137.596 125.977L135.038 127.286C134.582 127.529 134.064 127.134 134.155 126.646L134.643 123.845C134.673 123.663 134.612 123.449 134.46 123.328L132.389 121.348C132.024 121.014 132.237 120.405 132.724 120.313L135.586 119.917C135.8 119.887 135.952 119.765 136.043 119.583L137.322 117.025C137.566 116.568 138.205 116.568 138.449 117.025Z" fill="#FFC827"/>
<path fill-rule="evenodd" clip-rule="evenodd" d="M128.949 121.135L129.771 122.658C129.832 122.749 129.923 122.84 130.075 122.84L131.872 123.084C132.176 123.114 132.329 123.48 132.085 123.693L130.776 124.88C130.684 124.972 130.654 125.093 130.654 125.185L130.958 126.859C131.019 127.164 130.684 127.377 130.41 127.225L128.797 126.433C128.675 126.372 128.553 126.372 128.431 126.433L126.818 127.225C126.544 127.377 126.209 127.133 126.269 126.859L126.574 125.185C126.604 125.063 126.544 124.941 126.452 124.88L125.143 123.693C124.899 123.48 125.052 123.114 125.356 123.084L127.152 122.84C127.274 122.81 127.396 122.749 127.457 122.658L128.279 121.135C128.401 120.892 128.797 120.892 128.949 121.135Z" fill="#FFC827"/>
<path fill-rule="evenodd" clip-rule="evenodd" d="M147.522 121.135L148.344 122.658C148.405 122.749 148.496 122.84 148.649 122.84L150.445 123.084C150.749 123.114 150.902 123.48 150.658 123.693L149.349 124.88C149.258 124.972 149.227 125.093 149.227 125.185L149.532 126.859C149.592 127.164 149.258 127.377 148.984 127.225L147.37 126.433C147.248 126.372 147.126 126.372 147.004 126.433L145.391 127.225C145.117 127.377 144.782 127.133 144.843 126.859L145.147 125.185C145.178 125.063 145.117 124.941 145.025 124.88L143.716 123.693C143.472 123.48 143.625 123.114 143.929 123.084L145.726 122.84C145.847 122.81 145.969 122.749 146.03 122.658L146.852 121.135C146.974 120.892 147.37 120.892 147.522 121.135Z" fill="#FFC827"/>
<path opacity="0.81" d="M114.212 107.921C123.562 107.921 131.141 100.396 131.141 91.1138C131.141 81.8315 123.562 74.3066 114.212 74.3066C104.862 74.3066 97.2831 81.8315 97.2831 91.1138C97.2831 100.396 104.862 107.921 114.212 107.921Z" fill="#89B2EF"/>
<path d="M107.849 107.738C119.334 107.738 128.644 98.496 128.644 87.0949C128.644 75.6937 119.334 66.4513 107.849 66.4513C96.3633 66.4513 87.0527 75.6937 87.0527 87.0949C87.0527 98.496 96.3633 107.738 107.849 107.738Z" fill="#5289DD"/>
<path fill-rule="evenodd" clip-rule="evenodd" d="M108.001 60.7878L109.31 63.3455C109.401 63.5281 109.584 63.6499 109.767 63.6804L112.69 64.0762C113.207 64.1371 113.39 64.7461 113.025 65.1114L110.924 67.0905C110.772 67.2428 110.711 67.4255 110.741 67.6081L111.228 70.4093C111.32 70.8965 110.772 71.2619 110.315 71.0487L107.727 69.709C107.544 69.6177 107.331 69.6177 107.148 69.709L104.53 71.0183C104.073 71.2619 103.525 70.8661 103.616 70.3789L104.103 67.5777C104.134 67.395 104.073 67.1819 103.921 67.0601L101.82 65.081C101.455 64.7461 101.668 64.1371 102.155 64.0458L105.078 63.6499C105.291 63.6195 105.443 63.4977 105.535 63.315L106.844 60.7574C107.087 60.3616 107.757 60.3616 108.001 60.7878Z" fill="#FFC827"/>
<path fill-rule="evenodd" clip-rule="evenodd" d="M98.3488 65.7815L99.1709 67.3038C99.2318 67.3952 99.3536 67.4865 99.4754 67.4865L101.302 67.7301C101.637 67.7606 101.759 68.1259 101.515 68.3391L100.176 69.5265C100.084 69.6179 100.054 69.7397 100.054 69.831L100.358 71.5056C100.419 71.8101 100.084 72.0233 99.7799 71.871L98.1357 71.0794C98.0139 71.0185 97.8921 71.0185 97.7703 71.0794L96.187 71.9319C95.8826 72.0537 95.5476 71.8406 95.6085 71.5361L95.913 69.8615C95.9435 69.7397 95.8826 69.6179 95.7912 69.557L94.4515 68.3695C94.2079 68.1564 94.3602 67.791 94.6647 67.7606L96.4915 67.517C96.6133 67.4865 96.7351 67.4256 96.796 67.3343L97.6181 65.8119C97.8008 65.5074 98.1966 65.5074 98.3488 65.7815Z" fill="#FFC827"/>
<path fill-rule="evenodd" clip-rule="evenodd" d="M117.653 64.9287L118.475 66.4511C118.536 66.5424 118.657 66.6337 118.779 66.6337L120.606 66.8773C120.941 66.9078 121.063 67.2731 120.819 67.4863L119.48 68.6737C119.388 68.7651 119.358 68.8869 119.358 68.9782L119.662 70.6529C119.723 70.9573 119.388 71.1705 119.084 71.0182L117.44 70.2266C117.318 70.1657 117.196 70.1657 117.074 70.2266L115.43 71.0182C115.156 71.1705 114.791 70.9269 114.852 70.6529L115.156 68.9782C115.186 68.8564 115.126 68.7346 115.034 68.6737L113.695 67.4863C113.451 67.2731 113.603 66.9078 113.908 66.8773L115.735 66.6337C115.856 66.6033 115.978 66.5424 116.039 66.4511L116.861 64.9287C117.074 64.6546 117.5 64.6546 117.653 64.9287Z" fill="#FFC827"/>
<path d="M187.957 116.02C197.374 116.02 205.008 108.1 205.008 98.3298C205.008 88.5598 197.374 80.6396 187.957 80.6396C178.54 80.6396 170.906 88.5598 170.906 98.3298C170.906 108.1 178.54 116.02 187.957 116.02Z" fill="#FF193D" fill-opacity="0.2"/>
<path d="M183.572 114.711C194.721 114.711 203.759 105.346 203.759 93.7932C203.759 82.2408 194.721 72.8756 183.572 72.8756C172.423 72.8756 163.385 82.2408 163.385 93.7932C163.385 105.346 172.423 114.711 183.572 114.711Z" fill="#FF193D"/>
<path fill-rule="evenodd" clip-rule="evenodd" d="M193.072 71.353L193.864 72.9058C193.924 73.0276 194.016 73.0885 194.138 73.119L195.934 73.3625C196.239 73.393 196.36 73.7584 196.147 73.9715L194.868 75.1894C194.777 75.2807 194.747 75.4025 194.747 75.5243L195.051 77.2294C195.112 77.5339 194.777 77.747 194.503 77.6252L192.92 76.8336C192.798 76.7727 192.676 76.7727 192.554 76.8336L190.971 77.6252C190.697 77.7775 190.362 77.5339 190.423 77.2294L190.727 75.5243C190.758 75.4025 190.697 75.2807 190.606 75.1894L189.327 73.9715C189.114 73.7584 189.236 73.393 189.54 73.3625L191.336 73.119C191.458 73.0885 191.58 73.0276 191.61 72.9058L192.402 71.353C192.524 71.079 192.95 71.079 193.072 71.353Z" fill="#FFC827"/>
<path fill-rule="evenodd" clip-rule="evenodd" d="M173.92 71.353L174.712 72.9058C174.773 73.0276 174.864 73.0885 174.986 73.119L176.782 73.3625C177.087 73.393 177.209 73.7584 176.996 73.9715L175.717 75.1894C175.625 75.2807 175.595 75.4025 175.595 75.5243L175.899 77.2294C175.96 77.5339 175.625 77.747 175.351 77.6252L173.768 76.8336C173.646 76.7727 173.524 76.7727 173.403 76.8336L171.819 77.6252C171.545 77.7775 171.21 77.5339 171.271 77.2294L171.576 75.5243C171.606 75.4025 171.545 75.2807 171.454 75.1894L170.175 73.9715C169.962 73.7584 170.084 73.393 170.388 73.3625L172.185 73.119C172.307 73.0885 172.428 73.0276 172.459 72.9058L173.25 71.353C173.403 71.079 173.799 71.079 173.92 71.353Z" fill="#FFC827"/>
<path fill-rule="evenodd" clip-rule="evenodd" d="M183.694 67.1818L184.973 69.7698C185.064 69.9525 185.216 70.0743 185.43 70.1048L188.261 70.531C188.748 70.5919 188.961 71.2009 188.596 71.5663L186.556 73.5758C186.404 73.728 186.343 73.9107 186.373 74.1239L186.861 76.9555C186.952 77.4427 186.434 77.8385 185.978 77.5949L183.45 76.2552C183.268 76.1639 183.055 76.1639 182.872 76.2552L180.345 77.5949C179.888 77.8385 179.37 77.4427 179.462 76.9555L179.949 74.1239C179.979 73.9412 179.918 73.728 179.766 73.5758L177.726 71.5663C177.361 71.2009 177.574 70.5919 178.061 70.531L180.893 70.1048C181.075 70.0743 181.258 69.9525 181.35 69.7698L182.628 67.1818C182.841 66.7251 183.481 66.7251 183.694 67.1818Z" fill="#FFC827"/>
<path fill-rule="evenodd" clip-rule="evenodd" d="M201.719 240.613C201.75 241.374 202.359 241.952 203.028 241.922L248.437 240.435C249.541 240.398 250.406 239.474 250.37 238.37L249.37 207.82C249.126 200.117 243.006 194.058 235.76 194.302L213.381 195.032C206.134 195.276 200.44 201.731 200.684 209.434L201.719 240.613Z" fill="#C26262"/>
<path d="M231.071 205.019C230.675 208.551 230.34 212.144 230.036 215.828C229.609 221.065 229.305 226.15 229.122 231.082C228.483 231.113 227.843 231.113 227.204 231.143C227.021 227.124 226.656 222.527 225.895 217.472C225.286 213.24 224.525 209.464 223.794 206.207C224.19 206.511 225.347 207.272 226.991 207.242C229.457 207.181 230.888 205.263 231.071 205.019Z" fill="#EAE7E7"/>
<path fill-rule="evenodd" clip-rule="evenodd" d="M226.96 207.242C229.792 207.151 232.045 204.776 231.954 201.914L231.923 200.787C231.832 197.955 229.457 195.702 226.595 195.794C223.763 195.885 221.51 198.26 221.602 201.122L221.632 202.249C221.723 205.141 224.129 207.333 226.96 207.242Z" fill="#E2AA9F"/>
<path fill-rule="evenodd" clip-rule="evenodd" d="M218.222 198.473C217.613 198.047 216.821 198.229 216.365 198.747L215.969 199.234C215.482 199.813 215.421 200.665 215.816 201.305L220.231 208.734C220.597 209.312 221.267 209.647 221.845 209.404C223.185 208.917 225.316 207.759 225.133 205.567C224.951 203.131 220.353 199.843 218.222 198.473Z" fill="#EAE7E7"/>
<path fill-rule="evenodd" clip-rule="evenodd" d="M236.003 198.26C236.643 197.864 237.434 198.016 237.952 198.595L238.378 199.082C238.896 199.66 238.957 200.543 238.561 201.183L234.024 208.673C233.659 209.251 232.989 209.586 232.319 209.343C230.919 208.795 228.696 207.638 228.818 205.354C229.031 202.827 233.781 199.6 236.003 198.26Z" fill="#EAE7E7"/>
<path fill-rule="evenodd" clip-rule="evenodd" d="M204.977 198.686C207.9 198.595 210.366 200.878 210.458 203.801L211.462 234.219C211.554 236.898 209.422 239.212 206.682 239.303C204.003 239.395 201.689 237.263 201.597 234.523L200.745 208.764C200.593 204.776 202.267 201.152 204.977 198.686Z" fill="#C26262"/>
<path d="M227.569 207.942C226.991 207.972 226.534 208.307 226.534 208.764L226.96 221.491C226.96 221.887 227.478 222.252 228.026 222.222C228.605 222.192 229.061 221.857 229.061 221.4L228.635 208.673C228.635 208.277 228.178 207.942 227.569 207.942Z" fill="#C26262"/>
<path fill-rule="evenodd" clip-rule="evenodd" d="M206.165 180.813C206.591 193.693 216.974 203.801 229.396 203.406C241.819 203.01 251.532 192.201 251.105 179.352C250.679 166.503 240.297 156.364 227.874 156.759C215.421 157.155 205.738 167.873 206.165 180.813Z" fill="#F7B9A9"/>
<path fill-rule="evenodd" clip-rule="evenodd" d="M206.164 180.661C205.982 174.906 207.778 169.578 210.884 165.407C207.93 180.052 209.879 196.159 227.265 203.466C215.786 202.705 206.56 192.931 206.164 180.661Z" fill="#E2AA9F"/>
<path fill-rule="evenodd" clip-rule="evenodd" d="M206.012 179.747C206.012 181.27 206.195 182.701 206.195 182.701C206.256 183.31 206.56 185.38 207.504 187.968C207.991 189.338 208.814 191.196 210.153 193.266C210.427 192.322 210.793 191.165 211.341 189.826C211.584 189.186 211.95 188.273 212.559 187.177C213.655 185.167 214.629 184.193 215.451 182.305C217.308 177.89 214.873 176.094 216.608 173.079C218.344 170.004 221.967 169.06 225.59 168.208C236.704 165.498 244.925 169.669 247.147 165.955C247.665 165.102 247.604 164.25 247.574 163.975C247.269 159.926 239.566 157.186 235.12 156.424C225.925 154.841 214.051 158.464 209.24 166.959C206.652 171.405 206.012 177.312 206.012 179.747Z" fill="#253051"/>
<path fill-rule="evenodd" clip-rule="evenodd" d="M212.193 181.818C212.68 183.919 214.081 185.319 215.421 185.045C216.73 184.771 217.461 182.823 216.974 180.783C216.486 178.682 215.086 177.281 213.746 177.555C212.406 177.86 211.706 179.778 212.193 181.818Z" fill="#F7B9A9"/>
<path fill-rule="evenodd" clip-rule="evenodd" d="M231.162 191.531C232.258 191.47 233.141 190.496 233.05 189.4C232.989 188.303 232.015 187.42 230.919 187.512C229.822 187.573 228.939 188.547 229.031 189.643C229.092 190.739 230.036 191.592 231.162 191.531Z" fill="white"/>
<path fill-rule="evenodd" clip-rule="evenodd" d="M231.314 191.714C232.228 191.653 232.959 190.861 232.898 189.948C232.837 189.034 232.045 188.303 231.132 188.364C230.218 188.425 229.487 189.217 229.548 190.13C229.609 191.044 230.401 191.775 231.314 191.714Z" fill="#253051"/>
<path fill-rule="evenodd" clip-rule="evenodd" d="M243.341 190.831C244.437 190.77 245.32 189.795 245.229 188.699C245.168 187.603 244.194 186.72 243.098 186.812C242.002 186.872 241.119 187.847 241.21 188.943C241.301 190.039 242.245 190.892 243.341 190.831Z" fill="white"/>
<path fill-rule="evenodd" clip-rule="evenodd" d="M243.463 191.013C244.376 190.952 245.107 190.161 245.046 189.247C244.985 188.334 244.194 187.603 243.28 187.664C242.367 187.725 241.636 188.516 241.697 189.43C241.727 190.343 242.55 191.074 243.463 191.013Z" fill="#253051"/>
<path fill-rule="evenodd" clip-rule="evenodd" d="M232.289 195.367C232.289 197.681 234.146 199.478 236.399 199.478C238.713 199.478 240.51 197.62 240.51 195.367H232.289Z" fill="#A58476"/>
<path fill-rule="evenodd" clip-rule="evenodd" d="M241.545 182.427L246.843 183.614C247.117 183.706 247.36 183.858 247.452 184.101L247.513 184.223C247.604 184.406 247.513 184.589 247.33 184.65C247.269 184.65 247.208 184.71 247.147 184.65L241.606 184.132C241.179 184.101 240.875 183.827 240.753 183.462L240.662 183.066C240.571 182.762 240.784 182.366 241.179 182.305C241.301 182.396 241.454 182.396 241.545 182.427Z" fill="#243051"/>
<path fill-rule="evenodd" clip-rule="evenodd" d="M233.172 183.31L227.661 185.015C227.387 185.106 227.113 185.319 227.052 185.593L227.021 185.746C226.93 185.928 227.021 186.111 227.265 186.141C227.295 186.141 227.417 186.172 227.448 186.141L233.263 185.167C233.659 185.106 234.024 184.832 234.116 184.467L234.207 184.041C234.298 183.675 233.994 183.371 233.628 183.34C233.385 183.249 233.263 183.249 233.172 183.31Z" fill="#243051"/>
<path fill-rule="evenodd" clip-rule="evenodd" d="M242.945 167.599C243.341 167.599 244.042 167.568 244.833 167.812C249.948 169.426 251.105 180.082 251.075 179.687C251.105 179.047 251.166 177.951 251.014 176.429C250.74 173.414 249.492 170.704 249.492 170.704C248.639 168.725 247.604 167.112 246.63 165.955C247.117 165.467 247.33 164.798 247.086 164.28C246.934 163.975 246.721 163.823 246.569 163.762C245.32 165.041 244.133 166.32 242.945 167.599Z" fill="#253051"/>
<path fill-rule="evenodd" clip-rule="evenodd" d="M205.465 179.454C205.494 179.422 205.525 179.421 205.584 179.388C206.36 178.989 207.133 178.559 207.909 178.16C209.221 177.494 210.534 176.858 211.878 176.221C212.804 175.785 213.731 175.379 214.659 174.973C214.928 174.87 215.167 174.738 215.436 174.635C215.555 174.569 215.706 174.532 215.825 174.466C217.472 173.785 219.12 173.135 220.77 172.515C222.18 171.997 223.591 171.509 225.034 171.051C225.695 170.84 226.357 170.628 227.018 170.417C227.439 170.277 227.861 170.167 228.282 170.057C229.005 169.843 229.728 169.66 230.453 169.507C230.936 169.394 231.419 169.282 231.872 169.201C231.903 169.2 231.903 169.2 231.933 169.199C231.994 169.196 232.084 169.162 232.145 169.159C232.658 169.046 233.172 168.962 233.656 168.881C234.685 168.714 235.687 168.61 236.718 168.505C237.052 168.46 237.386 168.445 237.721 168.431C239.362 168.329 240.976 168.29 242.624 168.341C244.515 168.381 246.381 168.545 248.252 168.829C248.406 168.853 248.559 168.877 248.713 168.901L248.711 168.871L247.653 159.194L247.543 158.041L247.271 155.279L246.74 150.03L246.421 146.874L246.142 143.961C246.083 143.293 245.843 142.663 245.454 142.131C245.226 141.806 244.971 141.543 244.658 141.343C244.28 141.054 243.875 140.858 243.414 140.756C243.383 140.758 243.351 140.729 243.321 140.73C242.303 140.439 241.153 140.641 240.238 141.32L239.029 142.256L233.216 146.682L232.981 146.876L232.096 147.554L231.564 147.942L230.147 149.009L228.258 150.432L224.747 153.113L223.98 153.695L220.94 155.99L219.376 157.185L218.462 157.895L214.479 160.931L210.938 163.614C209.727 164.52 208.742 165.69 208.038 167.031C207.445 168.123 207.04 169.329 206.821 170.618L205.465 179.454Z" fill="#E3955C"/>
<path fill-rule="evenodd" clip-rule="evenodd" d="M240.865 163.601L243.148 167.069L246.455 164.61L247.573 158.039L247.272 155.31L247.271 155.279L245.607 152.73L242.299 155.189L240.865 163.601Z" fill="#F3C0B7"/>
<path fill-rule="evenodd" clip-rule="evenodd" d="M231.905 169.261C231.936 169.26 231.936 169.26 231.966 169.258C232.027 169.256 232.117 169.221 232.178 169.219C232.691 169.105 233.205 169.022 233.689 168.94C234.718 168.774 235.72 168.67 236.751 168.564C237.085 168.519 237.419 168.505 237.754 168.49L238.456 164.285L236.173 160.818L232.896 163.275L231.905 169.261Z" fill="#20201F"/>
<path fill-rule="evenodd" clip-rule="evenodd" d="M228.257 150.401L229.397 152.12L232.674 149.662L233.184 146.653L232.949 146.846L232.064 147.524L231.562 147.912L230.146 148.979L228.257 150.401Z" fill="#F3C0B7"/>
<path fill-rule="evenodd" clip-rule="evenodd" d="M218.461 157.864L219.993 160.175L223.27 157.718L223.978 153.664L220.939 155.959L219.375 157.154L218.461 157.864Z" fill="#20201F"/>
<path fill-rule="evenodd" clip-rule="evenodd" d="M214.916 173.164L215.797 174.528C217.444 173.847 219.092 173.197 220.742 172.577L221.909 165.731L219.626 162.263L216.349 164.721L214.916 173.164Z" fill="#20201F"/>
<path fill-rule="evenodd" clip-rule="evenodd" d="M208.035 166.97L210.058 170.052L213.334 167.594L214.478 160.901L210.936 163.584C209.726 164.489 208.739 165.629 208.035 166.97Z" fill="#F3C0B7"/>
<path fill-rule="evenodd" clip-rule="evenodd" d="M205.584 179.388C206.36 178.988 207.133 178.559 207.909 178.16C209.221 177.494 210.534 176.858 211.878 176.221L212.001 175.545L209.718 172.078L206.442 174.535L205.584 179.388Z" fill="#F3C0B7"/>
<path fill-rule="evenodd" clip-rule="evenodd" d="M220.772 172.576C222.182 172.058 223.594 171.57 225.037 171.112C225.698 170.9 226.359 170.689 227.021 170.478C227.441 170.338 227.863 170.228 228.285 170.118C229.007 169.904 229.731 169.721 230.456 169.567C230.938 169.455 231.421 169.343 231.875 169.262C231.905 169.261 231.905 169.261 231.936 169.26C231.996 169.257 232.086 169.223 232.147 169.22L232.896 163.275L236.173 160.818L238.456 164.285L240.866 163.632L242.301 155.22L245.578 152.762L247.272 155.31L246.741 150.061L246.422 146.905L246.144 143.991C246.084 143.323 245.844 142.694 245.455 142.162C245.228 141.836 244.973 141.573 244.659 141.373C244.281 141.085 243.876 140.889 243.415 140.787C243.384 140.788 243.353 140.759 243.322 140.761C242.304 140.469 241.155 140.671 240.239 141.351L239.03 142.287L233.217 146.713L232.982 146.906L232.707 149.722L229.431 152.179L229.094 154.266L225.817 156.724L224.382 165.136L221.972 165.789L220.772 172.576Z" fill="#C26262"/>
<path fill-rule="evenodd" clip-rule="evenodd" d="M243.66 147.176L245.943 150.643L246.74 150.03L246.42 146.874L246.142 143.961C246.083 143.293 245.842 142.663 245.454 142.131C245.226 141.806 244.971 141.543 244.658 141.343L243.66 147.176Z" fill="#F3C0B7"/>
<path fill-rule="evenodd" clip-rule="evenodd" d="M234.256 155.232L235.691 146.819L238.998 144.36L241.281 147.828L239.846 156.24L236.539 158.699L234.256 155.232Z" fill="#20201F"/>
<path fill-rule="evenodd" clip-rule="evenodd" d="M224.319 165.078L225.754 156.666L229.031 154.208L231.314 157.675L229.879 166.087L226.602 168.545L224.319 165.078Z" fill="#F3C0B7"/>
<path d="M232.289 212.844C232.659 212.844 232.959 212.544 232.959 212.174C232.959 211.805 232.659 211.505 232.289 211.505C231.919 211.505 231.619 211.805 231.619 212.174C231.619 212.544 231.919 212.844 232.289 212.844Z" fill="#EAE7E7"/>
<path d="M231.802 217.99C232.172 217.99 232.471 217.69 232.471 217.32C232.471 216.95 232.172 216.65 231.802 216.65C231.432 216.65 231.132 216.95 231.132 217.32C231.132 217.69 231.432 217.99 231.802 217.99Z" fill="#EAE7E7"/>
<path d="M224.159 218.234C224.529 218.234 224.829 217.934 224.829 217.564C224.829 217.194 224.529 216.894 224.159 216.894C223.789 216.894 223.489 217.194 223.489 217.564C223.489 217.934 223.789 218.234 224.159 218.234Z" fill="#EAE7E7"/>
<path d="M223.307 213.118C223.677 213.118 223.976 212.818 223.976 212.448C223.976 212.078 223.677 211.778 223.307 211.778C222.937 211.778 222.637 212.078 222.637 212.448C222.637 212.818 222.937 213.118 223.307 213.118Z" fill="#EAE7E7"/>
<path fill-rule="evenodd" clip-rule="evenodd" d="M227.326 221.095C225.56 219.055 222.454 218.781 220.414 220.547C220.414 220.547 218.709 221.978 217.826 222.74C214.324 225.723 220.566 233.335 224.281 230.169C225.133 229.469 226.778 228.038 226.778 228.038C228.878 226.302 229.092 223.196 227.326 221.095Z" fill="#EAE7E7"/>
<path d="M224.403 231.265L226.534 215.097C226.717 213.758 227.965 212.692 229.335 212.692H253.693C255.064 212.692 256.008 213.788 255.764 215.097L253.024 231.265C252.811 232.605 251.532 233.67 250.192 233.67H226.504C225.164 233.701 224.22 232.605 224.403 231.265Z" fill="#F2F2F2"/>
<path d="M226.625 215.067C234.694 221.278 242.61 227.489 250.375 233.701C242.245 233.701 234.116 233.67 225.956 233.67C224.89 233.67 224.129 232.848 224.281 231.813L226.625 215.067Z" fill="#C9C9C9"/>
<path d="M239.809 226.759C240.662 226.759 241.393 226.058 241.393 225.175C241.393 224.292 240.692 223.592 239.809 223.592C238.926 223.592 238.226 224.292 238.226 225.175C238.256 226.058 238.957 226.759 239.809 226.759Z" fill="white"/>
<path fill-rule="evenodd" clip-rule="evenodd" d="M230.188 224.171C230.279 227.368 227.813 230.017 224.616 230.138C221.419 230.26 218.77 227.764 218.648 224.566C218.557 221.369 221.023 218.721 224.22 218.599C227.417 218.507 230.066 221.004 230.188 224.171Z" fill="#F7B9A9"/>
<path fill-rule="evenodd" clip-rule="evenodd" d="M245.29 223.897C246.234 227.124 249.522 228.982 252.75 228.038C255.977 227.094 257.834 223.806 256.89 220.578C255.947 217.351 252.658 215.493 249.431 216.437C246.264 217.381 244.407 220.7 245.29 223.897Z" fill="#F7B9A9"/>
<path fill-rule="evenodd" clip-rule="evenodd" d="M167.953 96.229C166.552 104.389 172.032 112.153 180.162 113.554C188.322 114.954 196.086 109.474 197.487 101.344C198.887 93.1842 193.407 85.42 185.277 84.0194C177.087 82.5883 169.353 88.0689 167.953 96.229Z" fill="#F4C1B8"/>
<path fill-rule="evenodd" clip-rule="evenodd" d="M167.861 95.6504C168.501 91.9054 170.388 88.7083 173.007 86.4552C169.109 95.4677 168.227 106.185 178.792 113.28C171.332 111.209 166.491 103.658 167.861 95.6504Z" fill="#E2AA9F"/>
<path fill-rule="evenodd" clip-rule="evenodd" d="M180.164 101.444C180.028 102.27 180.574 103.063 181.393 103.195C182.246 103.327 182.997 102.766 183.167 101.94C183.304 101.114 182.758 100.321 181.939 100.189C181.12 100.057 180.301 100.618 180.164 101.444Z" fill="white"/>
<path fill-rule="evenodd" clip-rule="evenodd" d="M180.621 101.244C180.517 101.905 180.964 102.534 181.617 102.633C182.271 102.732 182.924 102.302 183.027 101.608C183.13 100.946 182.683 100.317 182.03 100.218C181.377 100.152 180.758 100.582 180.621 101.244Z" fill="#202020"/>
<path fill-rule="evenodd" clip-rule="evenodd" d="M189.329 102.754C189.193 103.579 189.739 104.372 190.558 104.504C191.411 104.637 192.161 104.075 192.332 103.249C192.469 102.423 191.923 101.63 191.104 101.498C190.25 101.366 189.466 101.928 189.329 102.754Z" fill="white"/>
<path fill-rule="evenodd" clip-rule="evenodd" d="M189.785 102.551C189.682 103.21 190.129 103.837 190.782 103.936C191.435 104.035 192.088 103.606 192.192 102.913C192.295 102.254 191.848 101.627 191.195 101.528C190.542 101.429 189.923 101.891 189.785 102.551Z" fill="#202020"/>
<path fill-rule="evenodd" clip-rule="evenodd" d="M182.659 106.916C182.415 108.256 183.481 109.535 184.942 109.778C186.434 110.022 187.835 109.169 188.048 107.86L182.659 106.916Z" fill="#A58476"/>
<path fill-rule="evenodd" clip-rule="evenodd" d="M187.987 81.2488C192.433 82.4362 198.583 85.9377 198.278 89.5306C198.157 90.8398 197.213 91.7228 196.787 92.1795C192.676 96.0769 184.364 92.6058 183.268 92.1795C181.715 91.5097 179.218 90.2004 176.691 87.5819C176.782 88.9521 176.782 92.3622 174.773 95.9246C172.581 99.8219 169.292 101.588 168.105 102.197C167.039 99.5479 166.613 96.5945 167.191 93.641C167.435 92.3318 168.105 89.4088 170.388 86.5771C170.906 85.9377 172.276 84.324 174.529 82.9843C180.436 79.3306 186.921 80.9748 187.987 81.2488Z" fill="#202020"/>
<path fill-rule="evenodd" clip-rule="evenodd" d="M180.101 99.2128C180.497 98.9997 181.289 98.6039 182.385 98.6952C182.659 98.7257 183.664 98.7866 183.816 99.2433C183.846 99.3346 183.846 99.5782 183.694 99.6695C183.633 99.7304 183.572 99.7 183.511 99.7C183.116 99.6696 182.263 99.3651 181.837 99.3042C181.532 99.2433 181.319 99.2737 180.893 99.3346C179.827 99.4564 179.188 99.9131 179.157 99.8827C179.188 99.8218 179.553 99.4869 180.101 99.2128Z" fill="#202020"/>
<path fill-rule="evenodd" clip-rule="evenodd" d="M193.407 101.497C193.133 101.162 192.493 100.492 191.458 100.187C191.215 100.096 190.24 99.7915 189.936 100.187C189.875 100.279 189.784 100.492 189.875 100.614C189.936 100.674 189.966 100.705 190.027 100.705C190.423 100.827 191.306 100.857 191.702 100.918C192.006 100.979 192.189 101.07 192.554 101.283C193.468 101.771 193.955 102.471 193.985 102.41C194.077 102.38 193.833 101.923 193.407 101.497Z" fill="#202020"/>
<path fill-rule="evenodd" clip-rule="evenodd" d="M195.112 92.6969C195.569 93.2146 196.056 93.854 196.452 94.6152C198.126 97.7208 197.609 100.918 197.335 102.197C197.883 100.522 198.735 97.1119 197.487 93.4277C197.183 92.5752 196.817 91.814 196.452 91.1746C195.995 91.6617 195.538 92.1793 195.112 92.6969Z" fill="#202020"/>
<path fill-rule="evenodd" clip-rule="evenodd" d="M171.972 97.5689C171.393 98.7564 171.637 99.9743 172.459 100.34C173.281 100.705 174.438 100.005 174.986 98.8478C175.564 97.6603 175.321 96.4424 174.499 96.077C173.646 95.7116 172.52 96.4119 171.972 97.5689Z" fill="#F4C1B8"/>
<path fill-rule="evenodd" clip-rule="evenodd" d="M123.712 140.774C123.712 140.713 123.651 140.652 123.59 140.683C122.372 141.261 114.182 145.585 116.313 153.867C117.866 159.865 115.948 161.935 114.547 162.636C114.364 162.727 114.395 163.153 114.608 163.153C118.14 163.336 127.305 161.935 123.651 142.083V142.053L123.712 140.774Z" fill="#202020"/>
<path d="M120.819 144.611C120.576 143.88 120.515 143.21 120.545 142.753C120.545 142.692 120.484 142.631 120.423 142.662C120.21 142.753 119.906 142.905 119.662 143.24C119.571 143.393 119.48 143.514 119.419 143.636C119.419 143.667 119.419 143.667 119.419 143.667C119.449 144.123 119.54 145.098 120.21 146.103C121.154 147.442 122.555 147.808 123.011 147.899C123.042 147.899 123.072 147.899 123.103 147.838C123.133 147.777 123.194 147.716 123.255 147.655C123.316 147.564 123.407 147.534 123.438 147.473C123.042 147.29 121.489 146.437 120.819 144.611Z" fill="#E57772"/>
<path fill-rule="evenodd" clip-rule="evenodd" d="M146.578 138.734C146.548 138.673 146.609 138.612 146.7 138.612C148.009 138.886 156.961 141.292 156.778 149.848C156.595 156.059 158.94 157.612 160.462 158.008C160.675 158.038 160.736 158.464 160.523 158.525C157.113 159.469 147.857 160.169 146.943 140.013V139.982L146.578 138.734Z" fill="#202020"/>
<path d="M150.262 141.809C150.354 141.018 150.232 140.378 150.11 139.922C150.08 139.861 150.14 139.8 150.232 139.8C150.475 139.83 150.81 139.922 151.115 140.196C151.267 140.287 151.358 140.409 151.45 140.531C151.45 140.561 151.48 140.531 151.48 140.561C151.541 140.987 151.693 141.992 151.237 143.119C150.628 144.641 149.349 145.311 148.923 145.494C148.892 145.524 148.862 145.494 148.801 145.463C148.77 145.402 148.679 145.372 148.618 145.341C148.527 145.281 148.466 145.25 148.375 145.22C148.709 144.885 150.049 143.728 150.262 141.809Z" fill="#E57772"/>
<path fill-rule="evenodd" clip-rule="evenodd" d="M150.323 144.489C151.45 152.892 145.939 160.535 137.992 161.6C130.075 162.666 122.707 156.729 121.611 148.325C120.484 139.921 125.995 132.279 133.942 131.213C141.859 130.148 149.197 136.085 150.323 144.489Z" fill="#F4C1B8"/>
<path fill-rule="evenodd" clip-rule="evenodd" d="M150.323 144.489C150.171 143.332 149.836 141.748 149.044 139.982C148.1 137.882 146.883 136.42 146 135.537C146.7 137.364 147.492 140.135 147.766 143.545C147.918 145.676 148.161 148.66 147.126 151.918C145.512 157.094 141.737 160.017 139.94 161.205C140.976 160.9 145.482 159.5 148.344 154.658C150.963 150.182 150.475 145.707 150.323 144.489Z" fill="#E2AA9F"/>
<path fill-rule="evenodd" clip-rule="evenodd" d="M131.72 131.579C132.785 131.244 133.638 131.153 133.821 131.153C141.767 130.087 149.288 135.659 150.354 143.606C150.445 144.245 150.476 144.885 150.476 145.524C150.476 145.585 150.445 145.615 150.415 145.615C149.075 145.889 141.28 145.95 136.287 142.144C135.526 141.566 134.399 141.718 133.821 142.51C132.298 144.641 128.827 148.295 122.22 150C122.159 150 122.098 150.03 122.037 150.03C122.007 150 121.946 150 121.916 149.969C121.672 149.178 121.489 148.356 121.367 147.503C121.367 147.503 121.063 145.22 121.459 142.936C122.311 138.46 126.148 133.254 131.72 131.579Z" fill="#202020"/>
<path fill-rule="evenodd" clip-rule="evenodd" d="M135.076 154.182C135.204 155.033 134.608 155.798 133.758 155.883C132.907 156.011 132.142 155.416 132.057 154.565C131.972 153.715 132.525 152.949 133.375 152.864C134.183 152.779 134.948 153.332 135.076 154.182Z" fill="white"/>
<path fill-rule="evenodd" clip-rule="evenodd" d="M139.514 156.211C139.575 156.211 139.666 156.272 139.636 156.333C139.727 157.581 138.875 158.677 137.596 158.86C136.348 159.012 135.191 158.19 134.978 156.972C134.978 156.911 135.008 156.82 135.069 156.82L139.514 156.211Z" fill="#A58476"/>
<path fill-rule="evenodd" clip-rule="evenodd" d="M135.146 154.792C135.248 155.454 134.787 156.065 134.122 156.166C133.456 156.268 132.841 155.81 132.739 155.148C132.636 154.487 133.097 153.876 133.763 153.774C134.48 153.621 135.043 154.08 135.146 154.792Z" fill="#202020"/>
<path fill-rule="evenodd" clip-rule="evenodd" d="M142.627 153.176C142.755 154.024 142.159 154.787 141.309 154.872C140.459 154.999 139.693 154.406 139.608 153.558C139.523 152.71 140.076 151.947 140.926 151.862C141.734 151.735 142.499 152.328 142.627 153.176Z" fill="white"/>
<path fill-rule="evenodd" clip-rule="evenodd" d="M142.453 153.566C142.556 154.232 142.095 154.846 141.429 154.948C140.763 155.051 140.149 154.59 140.046 153.924C139.944 153.259 140.405 152.645 141.071 152.542C141.736 152.44 142.351 152.849 142.453 153.566Z" fill="#202020"/>
<path d="M130.289 152.557C130.258 152.557 130.41 152.375 130.502 152.253C130.502 152.253 131.141 151.552 132.298 151.37C132.329 151.37 132.359 151.37 132.359 151.37C132.42 151.37 132.511 151.339 132.664 151.339C132.998 151.339 133.333 151.37 133.668 151.431C133.729 151.431 133.76 151.522 133.729 151.552L133.699 151.674C133.699 151.705 133.699 151.705 133.699 151.705C133.699 151.735 133.638 151.735 133.668 151.735C133.668 151.735 133.333 151.705 133.242 151.674C133.181 151.674 132.785 151.613 132.39 151.644C132.207 151.644 131.324 151.705 130.624 152.283C130.502 152.405 130.319 152.557 130.289 152.557Z" fill="#202020"/>
<path d="M142.041 150.974C142.041 150.943 141.889 150.822 141.737 150.73C141.737 150.73 140.945 150.213 139.788 150.365C139.758 150.365 139.727 150.365 139.727 150.365C139.667 150.365 139.575 150.395 139.423 150.426C139.088 150.517 138.784 150.609 138.479 150.761C138.418 150.791 138.418 150.852 138.449 150.913L138.51 151.035C138.51 151.065 138.54 151.035 138.54 151.065C138.57 151.065 138.601 151.096 138.57 151.096C138.57 151.096 138.905 150.974 138.966 150.913C139.027 150.883 139.393 150.73 139.758 150.669C139.941 150.639 140.793 150.456 141.646 150.822C141.798 150.883 142.041 151.004 142.041 150.974Z" fill="#202020"/>
<path d="M95.2736 101.192C97.7287 101.192 99.7189 99.2015 99.7189 96.7464C99.7189 94.2913 97.7287 92.301 95.2736 92.301C92.8184 92.301 90.8282 94.2913 90.8282 96.7464C90.8282 99.2015 92.8184 101.192 95.2736 101.192Z" fill="#202020"/>
<path fill-rule="evenodd" clip-rule="evenodd" d="M122.007 88.0079C122.22 89.8347 122.037 91.7225 121.52 93.4885C121.002 95.2544 120.149 96.9291 118.962 98.3601C117.805 99.7912 116.374 101.009 114.73 101.892C113.116 102.775 111.32 103.354 109.493 103.536C101.759 104.358 94.8169 98.7559 93.9948 90.9918C93.7816 89.1649 93.9643 87.2771 94.4819 85.5112C94.9995 83.7452 95.8521 82.0706 97.0395 80.6395C98.1966 79.2085 99.6276 77.9906 101.272 77.1076C102.886 76.2246 104.682 75.6461 106.509 75.4634C114.212 74.6108 121.154 80.2437 122.007 88.0079Z" fill="#F4C1B8"/>
<path fill-rule="evenodd" clip-rule="evenodd" d="M122.007 88.0078C121.854 86.5767 121.489 85.1457 120.911 83.806C120.241 82.2532 119.266 80.8526 118.109 79.6346C118.962 82.0096 119.449 84.5063 119.571 87.0335C119.662 88.9821 119.784 91.7529 118.688 94.7367C116.983 99.4866 113.207 102.105 111.441 103.14C112.477 102.897 116.861 101.679 119.784 97.2639C122.463 93.2448 122.129 89.1344 122.007 88.0078Z" fill="#E2AA9F"/>
<path fill-rule="evenodd" clip-rule="evenodd" d="M104.378 75.7678C105.047 75.5851 105.717 75.4633 106.418 75.4024C114.151 74.5804 121.337 80.1828 122.159 87.9165C122.22 88.5254 122.25 89.1648 122.25 89.7738V89.8042V89.8347L122.22 89.8651H122.189C120.88 90.0783 113.329 89.9565 108.579 86.1201C108.397 85.9678 108.214 85.8765 107.97 85.8156C107.727 85.7547 107.514 85.7242 107.301 85.7547C107.087 85.7851 106.874 85.846 106.661 85.9678C106.478 86.0896 106.296 86.2419 106.144 86.3941C104.591 88.4341 101.15 91.8747 94.6952 93.3666C94.6343 93.3666 94.5734 93.3971 94.5125 93.3971C94.482 93.3666 94.4516 93.3666 94.3907 93.3362C94.1775 92.5445 94.0253 91.7529 93.934 90.9308C93.8122 89.4693 93.8731 87.9774 94.1471 86.5159C95.0301 82.1923 98.8969 77.2293 104.378 75.7678Z" fill="#202020"/>
<path fill-rule="evenodd" clip-rule="evenodd" d="M106.768 95.8631C106.797 96.1486 106.74 96.4627 106.597 96.7197C106.454 96.9766 106.253 97.205 105.968 97.3478C105.71 97.4905 105.396 97.5476 105.11 97.5191C104.824 97.4905 104.538 97.3763 104.281 97.1765C104.052 96.9766 103.881 96.7482 103.795 96.4627C103.709 96.1772 103.709 95.8631 103.795 95.5776C103.881 95.2921 104.052 95.0351 104.281 94.8353C104.51 94.6354 104.795 94.5212 105.081 94.4926C105.281 94.4641 105.482 94.4926 105.682 94.5498C105.882 94.6069 106.053 94.6925 106.196 94.8353C106.339 94.9495 106.482 95.1208 106.568 95.2921C106.682 95.4919 106.74 95.6918 106.768 95.8631Z" fill="white"/>
<path fill-rule="evenodd" clip-rule="evenodd" d="M114.449 95.1442C114.477 95.4297 114.42 95.7438 114.277 96.0008C114.134 96.2577 113.934 96.4861 113.648 96.6289C113.391 96.7717 113.076 96.8288 112.79 96.8002C112.504 96.7717 112.219 96.6575 111.961 96.4576C111.733 96.2577 111.561 96.0293 111.475 95.7438C111.39 95.4583 111.39 95.1442 111.475 94.8587C111.561 94.5732 111.733 94.3163 111.961 94.1164C112.19 93.9165 112.476 93.8023 112.762 93.7738C112.962 93.7452 113.162 93.7738 113.362 93.8309C113.562 93.888 113.734 93.9736 113.877 94.1164C114.02 94.2306 114.163 94.4019 114.248 94.5732C114.363 94.7731 114.42 94.9729 114.449 95.1442Z" fill="white"/>
<path fill-rule="evenodd" clip-rule="evenodd" d="M110.619 98.6949H110.65C110.65 98.6949 110.68 98.6949 110.68 98.7254L110.711 98.7558V98.7863C110.772 99.243 110.619 99.6997 110.345 100.035C110.071 100.4 109.645 100.613 109.188 100.674C108.732 100.735 108.275 100.583 107.94 100.309C107.575 100.035 107.361 99.6084 107.3 99.1517C107.3 99.1212 107.3 99.0908 107.3 99.0908C107.3 99.0603 107.331 99.0603 107.361 99.0603L110.619 98.6949Z" fill="#B7918A"/>
<path fill-rule="evenodd" clip-rule="evenodd" d="M106.431 95.9298C106.459 96.099 106.431 96.24 106.402 96.4092C106.346 96.5502 106.29 96.7194 106.177 96.8322C106.065 96.945 105.952 97.0578 105.812 97.1424C105.671 97.227 105.502 97.2552 105.362 97.2834C105.052 97.3116 104.715 97.227 104.462 97.0296C104.209 96.8322 104.04 96.522 104.012 96.2118C103.984 95.9016 104.068 95.5632 104.265 95.3094C104.462 95.0556 104.771 94.8864 105.08 94.8582C105.39 94.83 105.727 94.9146 105.981 95.112C106.234 95.3094 106.402 95.5914 106.431 95.9298Z" fill="#202020"/>
<path fill-rule="evenodd" clip-rule="evenodd" d="M114.111 95.2109C114.139 95.3801 114.111 95.5211 114.083 95.6904C114.027 95.8314 113.97 96.0006 113.858 96.1134C113.745 96.2262 113.633 96.339 113.492 96.4236C113.352 96.5082 113.183 96.5364 113.042 96.5646C112.733 96.5928 112.395 96.5082 112.142 96.3108C111.889 96.1134 111.72 95.8032 111.692 95.4929C111.664 95.1827 111.748 94.8443 111.945 94.5905C112.142 94.3367 112.452 94.1675 112.761 94.1393C113.07 94.1111 113.408 94.1957 113.661 94.3931C113.914 94.5905 114.083 94.8725 114.111 95.2109Z" fill="#202020"/>
<path d="M111.654 91.5398L113.542 91.3267C113.786 91.2962 113.999 91.4789 113.999 91.6921C114.029 91.9357 113.847 92.1488 113.634 92.1488L111.746 92.3619C111.502 92.3924 111.289 92.2097 111.289 91.9965C111.228 91.7834 111.411 91.5703 111.654 91.5398Z" fill="#202020"/>
<path d="M102.916 92.91C102.886 92.6664 103.068 92.4533 103.281 92.4533L105.169 92.2401C105.413 92.2097 105.626 92.3924 105.626 92.6055C105.656 92.8491 105.474 93.0622 105.26 93.0622L103.373 93.2754C103.129 93.3363 102.946 93.1536 102.916 92.91Z" fill="#202020"/>
<path d="M95.9434 106.063C97.9277 106.063 99.5363 104.455 99.5363 102.471C99.5363 100.486 97.9277 98.8778 95.9434 98.8778C93.9592 98.8778 92.3506 100.486 92.3506 102.471C92.3506 104.455 93.9592 106.063 95.9434 106.063Z" fill="#202020"/>
<path d="M98.8665 110.935C100.851 110.935 102.459 109.326 102.459 107.342C102.459 105.358 100.851 103.749 98.8665 103.749C96.8822 103.749 95.2736 105.358 95.2736 107.342C95.2736 109.326 96.8822 110.935 98.8665 110.935Z" fill="#202020"/>
<path d="M102.307 116.142C104.291 116.142 105.9 114.533 105.9 112.549C105.9 110.565 104.291 108.956 102.307 108.956C100.323 108.956 98.7142 110.565 98.7142 112.549C98.7142 114.533 100.323 116.142 102.307 116.142Z" fill="#202020"/>
<path d="M108.123 117.116C105.595 118.425 107.422 117.481 105.382 118.517C103.616 119.43 105.778 118.334 101.729 120.404C100.48 117.969 100.906 115.259 102.672 114.345C104.438 113.462 106.874 114.68 108.123 117.116Z" fill="#202020"/>
<path d="M101.363 115.411L104.256 113.949C104.56 113.797 104.926 113.919 105.078 114.223C105.23 114.528 105.108 114.893 104.804 115.046L101.911 116.507C101.607 116.659 101.241 116.538 101.089 116.233C100.937 115.929 101.059 115.563 101.363 115.411Z" fill="#7B10D9"/>
<defs>
<linearGradient id="paint0_linear" x1="144.119" y1="307.82" x2="210.377" y2="-27.4387" gradientUnits="userSpaceOnUse">
<stop stop-color="#80DDCE"/>
<stop offset="1" stop-color="#80DDC7" stop-opacity="0"/>
</linearGradient>
</defs>
</svg>
