<svg width="167" height="129" viewBox="0 0 167 129" fill="none" xmlns="http://www.w3.org/2000/svg">
<rect opacity="0.6" width="60.7427" height="60.7427" fill="#BCF4F5"/>
<path fill-rule="evenodd" clip-rule="evenodd" d="M26.9194 17.1972C26.9194 16.6916 27.3078 16.2817 27.7869 16.2817H30.4312C30.9103 16.2817 31.2987 16.6916 31.2987 17.1972C31.2987 17.7028 30.9103 18.1127 30.4312 18.1127H28.6545V19.9694C28.6545 20.475 28.2661 20.8849 27.7869 20.8849C27.3078 20.8849 26.9194 20.475 26.9194 19.9694V17.1972ZM34.8522 17.1972C34.8522 16.6916 35.2406 16.2817 35.7197 16.2817H41.0082C41.4873 16.2817 41.8757 16.6916 41.8757 17.1972C41.8757 17.7028 41.4873 18.1127 41.0082 18.1127H35.7197C35.2406 18.1127 34.8522 17.7028 34.8522 17.1972ZM45.4292 17.1972C45.4292 16.6916 45.8176 16.2817 46.2967 16.2817H51.5852C52.0643 16.2817 52.4527 16.6916 52.4527 17.1972C52.4527 17.7028 52.0643 18.1127 51.5852 18.1127H46.2967C45.8176 18.1127 45.4292 17.7028 45.4292 17.1972ZM56.0062 17.1972C56.0062 16.6916 56.3946 16.2817 56.8737 16.2817H62.1622C62.6413 16.2817 63.0297 16.6916 63.0297 17.1972C63.0297 17.7028 62.6413 18.1127 62.1622 18.1127H56.8737C56.3946 18.1127 56.0062 17.7028 56.0062 17.1972ZM66.5832 17.1972C66.5832 16.6916 66.9716 16.2817 67.4507 16.2817H72.7392C73.2183 16.2817 73.6067 16.6916 73.6067 17.1972C73.6067 17.7028 73.2183 18.1127 72.7392 18.1127H67.4507C66.9716 18.1127 66.5832 17.7028 66.5832 17.1972ZM77.1602 17.1972C77.1602 16.6916 77.5486 16.2817 78.0277 16.2817H83.3162C83.7953 16.2817 84.1837 16.6916 84.1837 17.1972C84.1837 17.7028 83.7953 18.1127 83.3162 18.1127H78.0277C77.5486 18.1127 77.1602 17.7028 77.1602 17.1972ZM87.7372 17.1972C87.7372 16.6916 88.1256 16.2817 88.6047 16.2817H93.8932C94.3723 16.2817 94.7607 16.6916 94.7607 17.1972C94.7607 17.7028 94.3723 18.1127 93.8932 18.1127H88.6047C88.1256 18.1127 87.7372 17.7028 87.7372 17.1972ZM98.3142 17.1972C98.3142 16.6916 98.7026 16.2817 99.1817 16.2817H104.47C104.949 16.2817 105.338 16.6916 105.338 17.1972C105.338 17.7028 104.949 18.1127 104.47 18.1127H99.1817C98.7026 18.1127 98.3142 17.7028 98.3142 17.1972ZM108.891 17.1972C108.891 16.6916 109.28 16.2817 109.759 16.2817H115.047C115.526 16.2817 115.915 16.6916 115.915 17.1972C115.915 17.7028 115.526 18.1127 115.047 18.1127H109.759C109.28 18.1127 108.891 17.7028 108.891 17.1972ZM119.468 17.1972C119.468 16.6916 119.857 16.2817 120.336 16.2817H125.624C126.103 16.2817 126.492 16.6916 126.492 17.1972C126.492 17.7028 126.103 18.1127 125.624 18.1127H120.336C119.857 18.1127 119.468 17.7028 119.468 17.1972ZM130.045 17.1972C130.045 16.6916 130.434 16.2817 130.913 16.2817H136.201C136.68 16.2817 137.069 16.6916 137.069 17.1972C137.069 17.7028 136.68 18.1127 136.201 18.1127H130.913C130.434 18.1127 130.045 17.7028 130.045 17.1972ZM140.622 17.1972C140.622 16.6916 141.011 16.2817 141.49 16.2817H146.778C147.257 16.2817 147.646 16.6916 147.646 17.1972C147.646 17.7028 147.257 18.1127 146.778 18.1127H141.49C141.011 18.1127 140.622 17.7028 140.622 17.1972ZM151.199 17.1972C151.199 16.6916 151.588 16.2817 152.067 16.2817H157.355C157.834 16.2817 158.223 16.6916 158.223 17.1972C158.223 17.7028 157.834 18.1127 157.355 18.1127H152.067C151.588 18.1127 151.199 17.7028 151.199 17.1972ZM161.776 17.1972C161.776 16.6916 162.165 16.2817 162.644 16.2817H165.288C165.767 16.2817 166.155 16.6916 166.155 17.1972V19.9694C166.155 20.475 165.767 20.8849 165.288 20.8849C164.809 20.8849 164.42 20.475 164.42 19.9694V18.1127H162.644C162.165 18.1127 161.776 17.7028 161.776 17.1972ZM165.288 24.5983C165.767 24.5983 166.155 25.0082 166.155 25.5138V31.0581C166.155 31.5637 165.767 31.9736 165.288 31.9736C164.809 31.9736 164.42 31.5637 164.42 31.0581V25.5138C164.42 25.0082 164.809 24.5983 165.288 24.5983ZM27.7869 24.5983C28.2661 24.5983 28.6545 25.0082 28.6545 25.5138V31.0582C28.6545 31.5638 28.2661 31.9736 27.7869 31.9736C27.3078 31.9736 26.9194 31.5638 26.9194 31.0582V25.5138C26.9194 25.0082 27.3078 24.5983 27.7869 24.5983ZM165.288 35.687C165.767 35.687 166.155 36.0969 166.155 36.6025V42.1469C166.155 42.6525 165.767 43.0624 165.288 43.0624C164.809 43.0624 164.42 42.6525 164.42 42.1469V36.6025C164.42 36.0969 164.809 35.687 165.288 35.687ZM27.7869 35.687C28.2661 35.687 28.6545 36.0969 28.6545 36.6025V42.1469C28.6545 42.6525 28.2661 43.0624 27.7869 43.0624C27.3078 43.0624 26.9194 42.6525 26.9194 42.1469V36.6025C26.9194 36.0969 27.3078 35.687 27.7869 35.687ZM165.288 46.7758C165.767 46.7758 166.155 47.1857 166.155 47.6913V53.2356C166.155 53.7412 165.767 54.1511 165.288 54.1511C164.809 54.1511 164.42 53.7412 164.42 53.2356V47.6913C164.42 47.1857 164.809 46.7758 165.288 46.7758ZM27.7869 46.7758C28.2661 46.7758 28.6545 47.1857 28.6545 47.6913V53.2357C28.6545 53.7413 28.2661 54.1511 27.7869 54.1511C27.3078 54.1511 26.9194 53.7413 26.9194 53.2357V47.6913C26.9194 47.1857 27.3078 46.7758 27.7869 46.7758ZM165.288 57.8645C165.767 57.8645 166.155 58.2744 166.155 58.78V64.3244C166.155 64.83 165.767 65.2399 165.288 65.2399C164.809 65.2399 164.42 64.83 164.42 64.3244V58.78C164.42 58.2744 164.809 57.8645 165.288 57.8645ZM27.7869 57.8646C28.2661 57.8646 28.6545 58.2744 28.6545 58.78V64.3244C28.6545 64.83 28.2661 65.2399 27.7869 65.2399C27.3078 65.2399 26.9194 64.83 26.9194 64.3244V58.78C26.9194 58.2744 27.3078 57.8646 27.7869 57.8646ZM165.288 68.9533C165.767 68.9533 166.155 69.3632 166.155 69.8688V75.4131C166.155 75.9188 165.767 76.3286 165.288 76.3286C164.809 76.3286 164.42 75.9188 164.42 75.4131V69.8688C164.42 69.3632 164.809 68.9533 165.288 68.9533ZM27.7869 68.9533C28.2661 68.9533 28.6545 69.3632 28.6545 69.8688V75.4132C28.6545 75.9188 28.2661 76.3286 27.7869 76.3286C27.3078 76.3286 26.9194 75.9188 26.9194 75.4132V69.8688C26.9194 69.3632 27.3078 68.9533 27.7869 68.9533ZM165.288 80.042C165.767 80.042 166.155 80.4519 166.155 80.9575V86.5019C166.155 87.0075 165.767 87.4174 165.288 87.4174C164.809 87.4174 164.42 87.0075 164.42 86.5019V80.9575C164.42 80.4519 164.809 80.042 165.288 80.042ZM27.7869 80.042C28.2661 80.042 28.6545 80.4519 28.6545 80.9575V86.5019C28.6545 87.0075 28.2661 87.4174 27.7869 87.4174C27.3078 87.4174 26.9194 87.0075 26.9194 86.5019V80.9575C26.9194 80.4519 27.3078 80.042 27.7869 80.042ZM165.288 91.1308C165.767 91.1308 166.155 91.5407 166.155 92.0463V97.5907C166.155 98.0963 165.767 98.5061 165.288 98.5061C164.809 98.5061 164.42 98.0963 164.42 97.5907V92.0463C164.42 91.5407 164.809 91.1308 165.288 91.1308ZM27.7869 91.1308C28.2661 91.1308 28.6545 91.5407 28.6545 92.0463V97.5907C28.6545 98.0963 28.2661 98.5061 27.7869 98.5061C27.3078 98.5061 26.9194 98.0963 26.9194 97.5907V92.0463C26.9194 91.5407 27.3078 91.1308 27.7869 91.1308ZM165.288 102.22C165.767 102.22 166.155 102.629 166.155 103.135V108.679C166.155 109.185 165.767 109.595 165.288 109.595C164.809 109.595 164.42 109.185 164.42 108.679V103.135C164.42 102.629 164.809 102.22 165.288 102.22ZM27.7869 102.22C28.2661 102.22 28.6545 102.629 28.6545 103.135V108.679C28.6545 109.185 28.2661 109.595 27.7869 109.595C27.3078 109.595 26.9194 109.185 26.9194 108.679V103.135C26.9194 102.629 27.3078 102.22 27.7869 102.22ZM165.288 113.308C165.767 113.308 166.155 113.718 166.155 114.224V119.768C166.155 120.274 165.767 120.684 165.288 120.684C164.809 120.684 164.42 120.274 164.42 119.768V114.224C164.42 113.718 164.809 113.308 165.288 113.308ZM27.7869 113.308C28.2661 113.308 28.6545 113.718 28.6545 114.224V119.768C28.6545 120.274 28.2661 120.684 27.7869 120.684C27.3078 120.684 26.9194 120.274 26.9194 119.768V114.224C26.9194 113.718 27.3078 113.308 27.7869 113.308ZM165.288 124.397C165.767 124.397 166.155 124.807 166.155 125.313V128.085C166.155 128.59 165.767 129 165.288 129H162.644C162.165 129 161.776 128.59 161.776 128.085C161.776 127.579 162.165 127.169 162.644 127.169H164.42V125.313C164.42 124.807 164.809 124.397 165.288 124.397ZM27.7869 124.397C28.2661 124.397 28.6545 124.807 28.6545 125.313V127.169H30.4312C30.9103 127.169 31.2987 127.579 31.2987 128.085C31.2987 128.59 30.9103 129 30.4312 129H27.7869C27.3078 129 26.9194 128.59 26.9194 128.085V125.313C26.9194 124.807 27.3078 124.397 27.7869 124.397ZM34.8522 128.085C34.8522 127.579 35.2406 127.169 35.7197 127.169H41.0082C41.4873 127.169 41.8757 127.579 41.8757 128.085C41.8757 128.59 41.4873 129 41.0082 129H35.7197C35.2406 129 34.8522 128.59 34.8522 128.085ZM45.4292 128.085C45.4292 127.579 45.8176 127.169 46.2967 127.169H51.5852C52.0643 127.169 52.4527 127.579 52.4527 128.085C52.4527 128.59 52.0643 129 51.5852 129H46.2967C45.8176 129 45.4292 128.59 45.4292 128.085ZM56.0062 128.085C56.0062 127.579 56.3946 127.169 56.8737 127.169H62.1622C62.6413 127.169 63.0297 127.579 63.0297 128.085C63.0297 128.59 62.6413 129 62.1622 129H56.8737C56.3946 129 56.0062 128.59 56.0062 128.085ZM66.5832 128.085C66.5832 127.579 66.9716 127.169 67.4507 127.169H72.7392C73.2183 127.169 73.6067 127.579 73.6067 128.085C73.6067 128.59 73.2183 129 72.7392 129H67.4507C66.9716 129 66.5832 128.59 66.5832 128.085ZM77.1602 128.085C77.1602 127.579 77.5486 127.169 78.0277 127.169H83.3162C83.7953 127.169 84.1837 127.579 84.1837 128.085C84.1837 128.59 83.7953 129 83.3162 129H78.0277C77.5486 129 77.1602 128.59 77.1602 128.085ZM87.7372 128.085C87.7372 127.579 88.1256 127.169 88.6047 127.169H93.8932C94.3723 127.169 94.7607 127.579 94.7607 128.085C94.7607 128.59 94.3723 129 93.8932 129H88.6047C88.1256 129 87.7372 128.59 87.7372 128.085ZM98.3142 128.085C98.3142 127.579 98.7026 127.169 99.1817 127.169H104.47C104.949 127.169 105.338 127.579 105.338 128.085C105.338 128.59 104.949 129 104.47 129H99.1817C98.7026 129 98.3142 128.59 98.3142 128.085ZM108.891 128.085C108.891 127.579 109.28 127.169 109.759 127.169H115.047C115.526 127.169 115.915 127.579 115.915 128.085C115.915 128.59 115.526 129 115.047 129H109.759C109.28 129 108.891 128.59 108.891 128.085ZM119.468 128.085C119.468 127.579 119.857 127.169 120.336 127.169H125.624C126.103 127.169 126.492 127.579 126.492 128.085C126.492 128.59 126.103 129 125.624 129H120.336C119.857 129 119.468 128.59 119.468 128.085ZM130.045 128.085C130.045 127.579 130.434 127.169 130.913 127.169H136.201C136.68 127.169 137.069 127.579 137.069 128.085C137.069 128.59 136.68 129 136.201 129H130.913C130.434 129 130.045 128.59 130.045 128.085ZM140.622 128.085C140.622 127.579 141.011 127.169 141.49 127.169H146.778C147.257 127.169 147.646 127.579 147.646 128.085C147.646 128.59 147.257 129 146.778 129H141.49C141.011 129 140.622 128.59 140.622 128.085ZM151.199 128.085C151.199 127.579 151.588 127.169 152.067 127.169H157.355C157.834 127.169 158.223 127.579 158.223 128.085C158.223 128.59 157.834 129 157.355 129H152.067C151.588 129 151.199 128.59 151.199 128.085Z" fill="#3590F3"/>
<path fill-rule="evenodd" clip-rule="evenodd" d="M67.798 64.5924C64.3616 64.0727 61.2209 64.516 59.4873 64.9562C59.2578 65.0145 59.0268 64.8656 58.9715 64.6237C58.9161 64.3818 59.0574 64.1384 59.287 64.0802C61.1024 63.6192 64.3542 63.1613 67.9195 63.7004C71.489 64.2402 75.397 65.784 78.4747 69.3514C80.3155 71.4851 81.1407 74.0242 81.53 76.1179C81.7249 77.1664 81.8117 78.1092 81.8606 78.8407C81.8636 78.8867 81.8666 78.9321 81.8694 78.9766L83.2924 76.6949C83.4221 76.4869 83.6872 76.4291 83.8845 76.5658C84.0819 76.7024 84.1367 76.9818 84.007 77.1897L81.8936 80.5786C81.7639 80.7866 81.4988 80.8444 81.3015 80.7077L78.0854 78.4807C77.8881 78.3441 77.8332 78.0647 77.9629 77.8568C78.0926 77.6488 78.3577 77.591 78.5551 77.7277L81.0401 79.4485C81.0311 79.2832 81.0207 79.1021 81.0075 78.904C80.96 78.1929 80.8765 77.2901 80.6908 76.2912C80.3186 74.2899 79.5404 71.9263 77.8419 69.9576C74.9335 66.5863 71.2303 65.1114 67.798 64.5924Z" fill="#282828"/>
<ellipse cx="51.4968" cy="98.3196" rx="5.31857" ry="4.98512" fill="white"/>
<ellipse cx="16.0398" cy="40.1599" rx="5.31857" ry="4.98512" fill="white"/>
<rect x="10.7212" y="39.4756" width="46.0943" height="58.8439" fill="white"/>
<path d="M6.96669 93.3345H50.141C45.9174 95.827 47.0124 102.425 51.4967 103.305H7.80094C3.42099 101.448 2.84742 95.5827 6.96669 93.3345Z" fill="#6C9645"/>
<rect x="16.0396" y="35.1748" width="47.0329" height="7.52655" fill="white"/>
<path d="M63.0201 35.1746C59.5932 35.1746 56.8151 38.5444 56.8151 42.7012L69.2251 42.7012C69.2251 38.5444 66.447 35.1746 63.0201 35.1746Z" fill="#6C9645"/>
<path d="M23.7549 49.5751C23.7549 49.0563 24.0543 48.6357 24.4236 48.6357H51.5663C51.9356 48.6357 52.235 49.0563 52.235 49.5751C52.235 50.0938 51.9356 50.5144 51.5663 50.5144H24.4236C24.0543 50.5144 23.7549 50.0938 23.7549 49.5751Z" fill="#6C9645"/>
<path d="M23.7549 66.7961C23.7549 66.2197 24.0543 65.7524 24.4236 65.7524H51.5663C51.9356 65.7524 52.235 66.2197 52.235 66.7961C52.235 67.3725 51.9356 67.8398 51.5663 67.8398H24.4236C24.0543 67.8398 23.7549 67.3725 23.7549 66.7961Z" fill="#6C9645"/>
<path d="M23.7549 84.017C23.7549 83.4982 24.0543 83.0776 24.4236 83.0776H51.5663C51.9356 83.0776 52.235 83.4982 52.235 84.017C52.235 84.5357 51.9356 84.9563 51.5663 84.9563H24.4236C24.0543 84.9563 23.7549 84.5357 23.7549 84.017Z" fill="#6C9645"/>
<ellipse cx="17.213" cy="46.7971" rx="3.526" ry="3.72138" fill="#BFE0A1"/>
<ellipse cx="16.7794" cy="46.5681" rx="3.526" ry="3.72138" fill="#F1F1F1"/>
<rect width="0.549951" height="1.94705" rx="0.274976" transform="matrix(0.74883 -0.662762 0.622097 0.78294 14.6636 46.5918)" fill="#80C343"/>
<rect width="0.555423" height="4.08756" rx="0.277712" transform="matrix(0.614508 0.788911 -0.755322 0.655354 18.6245 45.022)" fill="#80C343"/>
<ellipse cx="17.213" cy="64.0871" rx="3.526" ry="3.72138" fill="#BFE0A1"/>
<ellipse cx="16.7794" cy="63.8581" rx="3.526" ry="3.72138" fill="#F1F1F1"/>
<rect width="0.549951" height="1.94705" rx="0.274976" transform="matrix(0.74883 -0.662762 0.622097 0.78294 14.6636 63.8818)" fill="#80C343"/>
<rect width="0.555423" height="4.08756" rx="0.277712" transform="matrix(0.614508 0.788911 -0.755322 0.655354 18.6245 62.312)" fill="#80C343"/>
<ellipse cx="17.213" cy="81.3771" rx="3.526" ry="3.72138" fill="#BFE0A1"/>
<ellipse cx="16.7794" cy="81.1481" rx="3.526" ry="3.72138" fill="#F1F1F1"/>
<rect width="0.549951" height="1.94705" rx="0.274976" transform="matrix(0.74883 -0.662762 0.622097 0.78294 14.6636 81.1719)" fill="#80C343"/>
<rect width="0.555423" height="4.08756" rx="0.277712" transform="matrix(0.614508 0.788911 -0.755322 0.655354 18.6245 79.6021)" fill="#80C343"/>
<path fill-rule="evenodd" clip-rule="evenodd" d="M147.882 39.7471C148.202 39.8157 148.409 40.1433 148.343 40.4789L147.278 45.9476C147.212 46.2832 146.9 46.4996 146.58 46.431C146.26 46.3624 146.054 46.0348 146.119 45.6992L146.9 41.6905C141.223 45.5711 129.86 53.0086 121.624 57.2688C112.77 61.8484 100.421 66.8949 95.3546 68.8455C95.0481 68.9636 94.7084 68.7986 94.5959 68.477C94.4834 68.1555 94.6407 67.7991 94.9472 67.6811C100 65.7354 112.303 60.7067 121.101 56.1563C129.267 51.9324 140.572 44.5351 146.241 40.6611L142.433 39.8446C142.113 39.7761 141.907 39.4484 141.972 39.1128C142.038 38.7772 142.35 38.5608 142.67 38.6294L147.882 39.7471Z" fill="#282828"/>
<path d="M73.1758 110.452C73.4428 109.577 74.6052 109.577 74.8722 110.452L75.8561 113.675C75.9755 114.066 76.3179 114.331 76.7043 114.331H79.8883C80.7523 114.331 81.1115 115.508 80.4125 116.049L77.8366 118.041C77.524 118.283 77.3932 118.711 77.5126 119.102L78.4965 122.326C78.7635 123.2 77.8231 123.928 77.1241 123.387L74.5482 121.395C74.2356 121.153 73.8124 121.153 73.4998 121.395L70.9239 123.387C70.2249 123.928 69.2845 123.2 69.5514 122.326L70.5354 119.102C70.6548 118.711 70.524 118.283 70.2114 118.041L67.6355 116.049C66.9365 115.508 67.2957 114.331 68.1597 114.331H71.3437C71.7301 114.331 72.0725 114.066 72.1919 113.675L73.1758 110.452Z" fill="#FFC827"/>
<path d="M93.8069 110.452C94.0739 109.577 95.2363 109.577 95.5033 110.452L96.4872 113.675C96.6066 114.066 96.949 114.331 97.3354 114.331H100.519C101.383 114.331 101.743 115.508 101.044 116.049L98.4677 118.041C98.1551 118.283 98.0243 118.711 98.1437 119.102L99.1276 122.326C99.3946 123.2 98.4542 123.928 97.7552 123.387L95.1793 121.395C94.8667 121.153 94.4435 121.153 94.1309 121.395L91.5549 123.387C90.856 123.928 89.9156 123.2 90.1825 122.326L91.1665 119.102C91.2858 118.711 91.1551 118.283 90.8425 118.041L88.2665 116.049C87.5676 115.508 87.9268 114.331 88.7907 114.331H91.9748C92.3611 114.331 92.7036 114.066 92.823 113.675L93.8069 110.452Z" fill="#FFC827"/>
<path d="M114.247 110.452C114.514 109.577 115.676 109.577 115.943 110.452L116.927 113.675C117.047 114.066 117.389 114.331 117.775 114.331H120.959C121.823 114.331 122.183 115.508 121.484 116.049L118.908 118.041C118.595 118.283 118.464 118.711 118.584 119.102L119.568 122.326C119.835 123.2 118.894 123.928 118.195 123.387L115.619 121.395C115.307 121.153 114.883 121.153 114.571 121.395L111.995 123.387C111.296 123.928 110.356 123.2 110.623 122.326L111.606 119.102C111.726 118.711 111.595 118.283 111.282 118.041L108.707 116.049C108.008 115.508 108.367 114.331 109.231 114.331H112.415C112.801 114.331 113.144 114.066 113.263 113.675L114.247 110.452Z" fill="#FFC827"/>
<path d="M85.7915 102.804C85.7915 102.515 85.9455 102.282 86.1355 102.282H156.418C156.608 102.282 156.762 102.515 156.762 102.804C156.762 103.092 156.608 103.325 156.418 103.325H86.1355C85.9455 103.325 85.7915 103.092 85.7915 102.804Z" fill="#80C343"/>
<path fill-rule="evenodd" clip-rule="evenodd" d="M98.3096 83.7943C98.3138 83.6071 98.4549 83.4518 98.6398 83.4309L105.419 82.6637C105.749 82.6263 106.039 82.8867 106.039 83.2215V102.325C106.039 102.531 105.872 102.699 105.667 102.699H98.4557C98.1427 102.699 97.891 102.44 97.8981 102.125L98.3096 83.7943Z" fill="#80C343"/>
<path fill-rule="evenodd" clip-rule="evenodd" d="M125.884 68.1616C125.886 67.9732 126.032 67.8164 126.223 67.7964L133.798 67.007C134.023 66.9836 134.219 67.1558 134.219 67.3767V102.349C134.219 102.547 134.06 102.71 133.858 102.72L125.851 103.116C125.632 103.127 125.449 102.955 125.452 102.74L125.884 68.1616Z" fill="#80C343"/>
<path fill-rule="evenodd" clip-rule="evenodd" d="M112.307 71.12C112.315 70.9046 112.503 70.7415 112.716 70.7643L120.11 71.5575C120.299 71.5777 120.442 71.7377 120.442 71.9284V102.326C120.442 102.532 120.276 102.699 120.071 102.699H111.419C111.208 102.699 111.04 102.523 111.049 102.311L112.307 71.12Z" fill="#80C343"/>
<path fill-rule="evenodd" clip-rule="evenodd" d="M139.228 57.7349C139.223 57.5448 139.36 57.3811 139.548 57.3551L148.201 56.1539C148.423 56.1231 148.621 56.297 148.621 56.5231V102.326C148.621 102.532 148.456 102.699 148.251 102.699H140.867C140.667 102.699 140.503 102.539 140.497 102.337L139.228 57.7349Z" fill="#80C343"/>
</svg>
