{
  "root": "libs/shared-ui",
  "sourceRoot": "libs/shared-ui/src",
  "projectType": "library",
  "tags": [],
  "targets": {
    "lint": {
      "executor": "@nrwl/linter:eslint",
      "outputs": ["{options.outputFile}"],
      "options": {
        "lintFilePatterns": ["libs/shared-ui/**/*.{ts,tsx,js,jsx}"]
      }
    }
  }
}
