<svg width="166" height="131" viewBox="0 0 166 131" fill="none" xmlns="http://www.w3.org/2000/svg">
<path d="M94.2702 123.046V8.80128C94.2702 6.71205 93.4402 4.70839 91.9629 3.23108C90.4856 1.75377 88.4819 0.923828 86.3927 0.923828H7.88521C5.79598 0.923828 3.79231 1.75377 2.315 3.23108C0.83769 4.70839 0.00772095 6.71205 0.00772095 8.80128V123.046C0.00772095 125.136 0.83769 127.139 2.315 128.617C3.79231 130.094 5.79598 130.924 7.88521 130.924H86.3927C88.4819 130.924 90.4856 130.094 91.9629 128.617C93.4402 127.139 94.2702 125.136 94.2702 123.046Z" fill="#282828"/>
<path d="M-6.10352e-05 121.525V5.09711C-6.10352e-05 2.90677 2.2629 1.16746 4.96389 1.27633L89.7832 4.8405C92.2976 4.94936 94.2702 6.63424 94.2624 8.66905C94.2106 47.6286 94.1535 86.5891 94.0913 125.55C94.0913 127.751 91.805 129.467 89.0963 129.371L4.44806 125.379C1.94925 125.229 -6.10352e-05 123.547 -6.10352e-05 121.525Z" fill="#4C4C4C"/>
<path d="M5.16867 114.526V16.3106C5.16865 15.1824 5.39174 14.0654 5.82518 13.0238C6.25862 11.9823 6.89379 11.0368 7.69415 10.2417C8.49451 9.44665 9.44425 8.81776 10.4887 8.39125C11.5331 7.96474 12.6516 7.74903 13.7797 7.75656H80.6564C81.7847 7.74869 82.9035 7.96414 83.9482 8.3905C84.9929 8.81685 85.9429 9.44569 86.7436 10.2408C87.5442 11.0359 88.1796 11.9815 88.6132 13.0232C89.0468 14.065 89.27 15.1822 89.27 16.3106V114.526C89.2536 116.8 88.3389 118.975 86.7254 120.577C85.1119 122.18 82.9304 123.079 80.6564 123.08H13.7408C11.4736 123.07 9.30186 122.166 7.697 120.564C6.09214 118.963 5.18366 116.793 5.16867 114.526Z" fill="#A0CFEF"/>
<path d="M82.9556 118.896V13.8845H11.0709V118.896H82.9556Z" fill="white"/>
<path d="M75.454 103.022H22.1289C21.1664 103.022 20.2434 102.64 19.5628 101.959C18.8823 101.279 18.4999 100.356 18.4999 99.3933V95.2771C18.4999 94.3146 18.8823 93.3916 19.5628 92.711C20.2434 92.0304 21.1664 91.6481 22.1289 91.6481H75.454C76.4164 91.6481 77.3395 92.0304 78.02 92.711C78.7006 93.3916 79.0829 94.3146 79.0829 95.2771V99.3959C79.0829 100.358 78.7006 101.281 78.02 101.962C77.3395 102.643 76.4164 103.025 75.454 103.025V103.022ZM79.0829 69.3973V65.2759C79.0829 64.3134 78.7006 63.3904 78.02 62.7098C77.3395 62.0292 76.4164 61.6469 75.454 61.6469H22.1289C21.1664 61.6469 20.2434 62.0292 19.5628 62.7098C18.8823 63.3904 18.4999 64.3134 18.4999 65.2759V69.3973C18.4999 70.3598 18.8823 71.2828 19.5628 71.9634C20.2434 72.644 21.1664 73.0263 22.1289 73.0263H75.454C76.4164 73.0263 77.3395 72.644 78.02 71.9634C78.7006 71.2828 79.0829 70.3598 79.0829 69.3973ZM79.0829 41.0732V36.9466C79.0829 35.9841 78.7006 35.0611 78.02 34.3805C77.3395 33.7 76.4164 33.3176 75.454 33.3176H22.1289C21.1664 33.3176 20.2434 33.7 19.5628 34.3805C18.8823 35.0611 18.4999 35.9841 18.4999 36.9466V41.0655C18.4999 42.0279 18.8823 42.951 19.5628 43.6315C20.2434 44.3121 21.1664 44.6944 22.1289 44.6944H75.454C76.4164 44.6944 77.3395 44.3121 78.02 43.6315C78.7006 42.951 79.0829 42.0279 79.0829 41.0655V41.0732Z" fill="#E0E0E0"/>
<path d="M37.8683 111.063C37.8683 111.732 38.134 112.373 38.607 112.846C39.08 113.319 39.7215 113.585 40.3904 113.585H54.0379C54.7068 113.585 55.3483 113.319 55.8213 112.846C56.2943 112.373 56.5601 111.732 56.5601 111.063C56.5594 110.732 56.4951 110.403 56.3708 110.096C56.1797 109.635 55.856 109.241 55.4407 108.964C55.0253 108.687 54.5371 108.54 54.0379 108.541H40.3826C40.0508 108.541 39.7223 108.606 39.4157 108.733C38.9544 108.923 38.5601 109.247 38.2832 109.662C38.0063 110.078 37.8591 110.566 37.8605 111.066L37.8683 111.063Z" fill="#41B6F7"/>
<path d="M62.0968 38.2297H22.5747C22.4643 38.2305 22.3548 38.2084 22.2533 38.1649C22.1504 38.1236 22.0569 38.0619 21.9785 37.9834C21.902 37.9035 21.8406 37.8104 21.7971 37.7087C21.7554 37.6058 21.7351 37.4956 21.7375 37.3846C21.7368 37.2745 21.758 37.1653 21.7998 37.0634C21.8416 36.9615 21.9033 36.869 21.9812 36.7911C22.0591 36.7132 22.1516 36.6515 22.2535 36.6097C22.3554 36.5679 22.4646 36.5467 22.5747 36.5474H62.1045C62.3266 36.5474 62.5396 36.6356 62.6966 36.7926C62.8536 36.9496 62.9418 37.1626 62.9418 37.3846C62.9426 37.4956 62.9215 37.6056 62.8797 37.7083C62.8379 37.8111 62.7762 37.9046 62.6982 37.9834C62.6203 38.0613 62.5278 38.1229 62.426 38.1649C62.3219 38.2089 62.2098 38.231 62.0968 38.2297Z" fill="#BCBCBC"/>
<path d="M78.2431 24.6365H19.3398C19.1179 24.6359 18.9054 24.5474 18.7485 24.3906C18.5917 24.2337 18.5032 24.0211 18.5025 23.7993C18.5021 23.6883 18.5232 23.5782 18.5647 23.4753C18.606 23.3723 18.6677 23.2789 18.7462 23.2005C18.8246 23.1227 18.917 23.0603 19.0184 23.0165C19.1203 22.9744 19.2295 22.9524 19.3398 22.9517H78.2431C78.4668 22.9544 78.6804 23.0452 78.8376 23.2043C78.9948 23.3635 79.083 23.5782 79.083 23.8019C79.0822 23.9122 79.0602 24.0213 79.0182 24.1233C78.9738 24.2206 78.9114 24.3086 78.8341 24.3825C78.7558 24.461 78.6623 24.5227 78.5593 24.564C78.4572 24.6052 78.3481 24.6263 78.2379 24.6262L78.2431 24.6365ZM16.4444 23.8019C16.4437 23.5773 16.3542 23.3621 16.1954 23.2033C16.0366 23.0445 15.8214 22.9549 15.5968 22.9543C15.4865 22.955 15.3773 22.977 15.2754 23.0191C15.174 23.0629 15.0816 23.1253 15.0032 23.2031C14.9247 23.2815 14.863 23.3749 14.8217 23.4779C14.7802 23.5808 14.7591 23.6909 14.7595 23.8019C14.7602 24.0237 14.8486 24.2363 15.0055 24.3932C15.1624 24.55 15.3749 24.6384 15.5968 24.6391C15.8196 24.6385 16.0333 24.5504 16.1918 24.3938C16.3503 24.2372 16.441 24.0247 16.4444 23.8019ZM59.7146 28.1929C59.716 28.0263 59.6673 27.8631 59.5749 27.7245C59.4825 27.5858 59.3506 27.4781 59.1962 27.4153C59.0943 27.373 58.9851 27.351 58.8748 27.3505H19.3398C19.2295 27.3512 19.1203 27.3732 19.0184 27.4153C18.9159 27.4572 18.8233 27.5199 18.7462 27.5993C18.6677 27.6777 18.606 27.7712 18.5647 27.8741C18.5235 27.9762 18.5024 28.0854 18.5025 28.1955C18.5025 28.4178 18.5906 28.631 18.7476 28.7885C18.9045 28.9459 19.1175 29.0347 19.3398 29.0354H58.8644C58.9744 29.0357 59.0832 29.0141 59.1847 28.9718C59.2862 28.9295 59.3782 28.8674 59.4554 28.7891C59.5336 28.7113 59.5955 28.6188 59.6378 28.5169C59.68 28.415 59.7017 28.3058 59.7017 28.1955L59.7146 28.1929ZM79.083 50.9777C79.0822 50.8674 79.0602 50.7582 79.0182 50.6562C78.9753 50.5543 78.9127 50.4618 78.8341 50.3841C78.7558 50.3056 78.6623 50.2439 78.5593 50.2026C78.4572 50.1614 78.3481 50.1403 78.2379 50.1404H19.3398C19.1179 50.1411 18.9054 50.2295 18.7485 50.3864C18.5917 50.5433 18.5032 50.7558 18.5025 50.9777C18.5024 51.0887 18.5235 51.1987 18.5647 51.3017C18.606 51.4046 18.6677 51.4981 18.7462 51.5765C18.8246 51.6542 18.917 51.7166 19.0184 51.7605C19.1203 51.8025 19.2295 51.8246 19.3398 51.8253H78.2431C78.4673 51.8239 78.6818 51.7341 78.8401 51.5754C78.9983 51.4166 79.0875 51.2018 79.0882 50.9777H79.083ZM16.4392 50.9777C16.4358 50.7549 16.3451 50.5423 16.1866 50.3857C16.0281 50.2292 15.8144 50.1411 15.5916 50.1404C15.3697 50.1411 15.1572 50.2295 15.0003 50.3864C14.8435 50.5433 14.755 50.7558 14.7543 50.9777C14.7539 51.0878 14.7751 51.197 14.8165 51.2991C14.856 51.4024 14.9169 51.496 14.9954 51.5739C15.0716 51.6536 15.1628 51.7175 15.2638 51.762C15.3647 51.8065 15.4735 51.8306 15.5838 51.8331C15.6956 51.8332 15.8065 51.8121 15.9104 51.7709C16.0144 51.729 16.1088 51.6664 16.1878 51.5868C16.2681 51.5095 16.3309 51.4158 16.3718 51.3121C16.4162 51.2089 16.4392 51.0978 16.4392 50.9854V50.9777ZM49.1621 55.3713C49.1615 55.1495 49.073 54.9369 48.9162 54.78C48.7593 54.6232 48.5467 54.5347 48.3249 54.5341H19.3554C19.1335 54.5347 18.921 54.6232 18.7641 54.78C18.6072 54.9369 18.5188 55.1495 18.5181 55.3713C18.5173 55.4822 18.5384 55.5922 18.5802 55.695C18.622 55.7978 18.6837 55.8912 18.7617 55.9701C18.8402 56.0479 18.9325 56.1103 19.0339 56.1541C19.1361 56.1954 19.2452 56.2165 19.3554 56.2163H48.3301C48.4405 56.2148 48.5495 56.191 48.6505 56.1465C48.7516 56.1019 48.8427 56.0376 48.9184 55.9571C48.9958 55.8779 49.0574 55.7846 49.0999 55.6824C49.1394 55.5798 49.1596 55.4708 49.1595 55.3609L49.1621 55.3713ZM67.5662 79.6465C67.5655 79.4247 67.4771 79.2121 67.3202 79.0552C67.1633 78.8984 66.9508 78.8099 66.7289 78.8093H19.345C19.1231 78.8099 18.9106 78.8984 18.7537 79.0552C18.5968 79.2121 18.5084 79.4247 18.5077 79.6465C18.5084 79.8693 18.5964 80.083 18.753 80.2415C18.9096 80.4 19.1222 80.4907 19.345 80.4941H66.7212C66.9443 80.4877 67.1562 80.3947 67.3122 80.2349C67.4681 80.0775 67.5565 79.8655 67.5584 79.6439L67.5662 79.6465ZM16.4496 79.6465C16.4475 79.4233 16.3572 79.21 16.1984 79.0531C16.0396 78.8962 15.8252 78.8086 15.602 78.8093C15.3801 78.8099 15.1675 78.8984 15.0106 79.0552C14.8538 79.2121 14.7654 79.4247 14.7647 79.6465C14.7618 79.8136 14.809 79.9777 14.9003 80.1176C14.9917 80.2575 15.1229 80.3668 15.277 80.4313C15.4311 80.4958 15.6011 80.5125 15.7649 80.4794C15.9286 80.4462 16.0786 80.3647 16.1955 80.2453C16.3555 80.0895 16.4485 79.8775 16.4547 79.6543L16.4496 79.6465ZM33.8401 84.0402C33.8401 83.8181 33.7519 83.6051 33.5949 83.4481C33.4378 83.2911 33.2249 83.2029 33.0028 83.2029H19.345C19.1229 83.2029 18.91 83.2911 18.753 83.4481C18.5959 83.6051 18.5077 83.8181 18.5077 84.0402C18.5069 84.1511 18.528 84.2611 18.5698 84.3638C18.6116 84.4666 18.6733 84.5601 18.7514 84.6389C18.8292 84.7168 18.9217 84.7785 19.0236 84.8204C19.1251 84.8637 19.2345 84.8858 19.345 84.8852H32.9951C33.2171 84.8852 33.4301 84.797 33.5871 84.64C33.7441 84.483 33.8323 84.27 33.8323 84.0479L33.8401 84.0402ZM53.0555 84.0402C53.0563 83.9297 53.0342 83.8203 52.9907 83.7187C52.9494 83.6158 52.8877 83.5223 52.8092 83.444C52.7298 83.3674 52.6366 83.3067 52.5345 83.2651C52.4322 83.2214 52.3217 83.2002 52.2105 83.2029H38.5551C38.3329 83.2029 38.1197 83.2905 37.9616 83.4466C37.8811 83.5233 37.8168 83.6154 37.7722 83.7173C37.7277 83.8192 37.704 83.929 37.7024 84.0402C37.7016 84.1511 37.7227 84.2611 37.7645 84.3638C37.8063 84.4666 37.868 84.5601 37.946 84.6389C38.0239 84.7168 38.1164 84.7785 38.2182 84.8204C38.3207 84.8637 38.431 84.8858 38.5422 84.8852H52.1897C52.4127 84.885 52.6267 84.7976 52.7859 84.6415C52.8663 84.5647 52.9305 84.4726 52.975 84.3707C53.0195 84.2688 53.0434 84.1591 53.0451 84.0479L53.0555 84.0402Z" fill="#4C4C4C"/>
<path d="M125.886 96.3528C128.253 96.0469 130.456 97.5944 130.78 99.8003L134.261 122.93C134.56 125.003 133.038 126.911 130.835 127.191C128.631 127.471 126.594 126.048 126.267 123.969L123.305 104.391C123.105 102.943 123.234 101.469 123.68 100.078C124.127 98.6866 124.881 97.4135 125.886 96.3528Z" fill="#2EA88A"/>
<path d="M94.0317 126.546H131.262V102.986C131.265 100.312 130.206 97.7468 128.317 95.8539C126.429 93.9611 123.866 92.8958 121.192 92.8923H104.084C101.413 92.9033 98.8543 93.9711 96.9679 95.8624C95.0814 97.7537 94.0203 100.315 94.0162 102.986L94.0421 126.546H94.0317Z" fill="#28C8A2"/>
<path d="M114.167 102.579C114.685 102.578 115.198 102.475 115.676 102.275C116.154 102.076 116.589 101.784 116.954 101.417C117.319 101.049 117.608 100.613 117.805 100.134C118.001 99.6549 118.102 99.1415 118.1 98.6234V97.7602C118.113 97.2355 118.021 96.7134 117.83 96.2247C117.638 95.736 117.351 95.2906 116.985 94.9147C116.618 94.5388 116.18 94.2401 115.697 94.0361C115.213 93.8321 114.694 93.7271 114.169 93.7271C113.644 93.7271 113.124 93.8321 112.641 94.0361C112.157 94.2401 111.719 94.5388 111.353 94.9147C110.986 95.2906 110.699 95.736 110.507 96.2247C110.316 96.7134 110.224 97.2355 110.238 97.7602V98.6234C110.233 99.1419 110.332 99.6562 110.527 100.136C110.723 100.617 111.012 101.053 111.377 101.421C111.743 101.789 112.177 102.081 112.656 102.28C113.135 102.478 113.649 102.58 114.167 102.579Z" fill="#E2AA9F"/>
<path d="M97.5052 95.3782C98.5777 95.3823 99.6047 95.8117 100.361 96.5723C101.117 97.3328 101.541 98.3624 101.538 99.4348V122.792C101.552 123.297 101.464 123.799 101.28 124.269C101.096 124.739 100.82 125.167 100.468 125.529C100.116 125.89 99.6946 126.177 99.2296 126.373C98.7647 126.57 98.2651 126.671 97.7605 126.671C97.2558 126.671 96.7563 126.57 96.2914 126.373C95.8264 126.177 95.4055 125.89 95.0534 125.529C94.7012 125.167 94.425 124.739 94.2411 124.269C94.0572 123.799 93.9693 123.297 93.9825 122.792V103.009C94.0007 101.561 94.3238 100.133 94.9308 98.8185C95.5377 97.5036 96.4149 96.3314 97.5052 95.3782Z" fill="#2EA88A"/>
<path fill-rule="evenodd" clip-rule="evenodd" d="M93.6636 78.9362C93.6636 90.1316 102.689 99.2325 113.812 99.2325C124.935 99.2325 133.961 90.1601 133.961 78.9362C133.961 67.7123 124.935 58.6399 113.812 58.6399C102.689 58.6399 93.6636 67.7123 93.6636 78.9362Z" fill="#F7B9A9"/>
<path fill-rule="evenodd" clip-rule="evenodd" d="M93.0934 78.3608C93.0868 73.4838 94.7818 68.7572 97.8862 64.9958C94.7161 77.8268 96.0095 92.1561 111.834 99.1315C101.336 98.1413 93.0934 89.214 93.0934 78.3608Z" fill="#E2AA9F"/>
<path fill-rule="evenodd" clip-rule="evenodd" d="M123.696 87.7935C123.696 88.1698 123.807 88.5376 124.017 88.8505C124.226 89.1634 124.523 89.4073 124.87 89.5513C125.218 89.6953 125.601 89.7329 125.97 89.6595C126.339 89.5861 126.678 89.4049 126.944 89.1388C127.21 88.8727 127.391 88.5337 127.465 88.1647C127.538 87.7956 127.5 87.413 127.356 87.0654C127.212 86.7177 126.968 86.4206 126.656 86.2115C126.343 86.0025 125.975 85.8909 125.599 85.8909C125.095 85.8943 124.613 86.0958 124.257 86.4519C123.901 86.808 123.699 87.2899 123.696 87.7935Z" fill="#F6F6F6"/>
<path fill-rule="evenodd" clip-rule="evenodd" d="M107.718 87.7935C107.718 88.1698 107.83 88.5376 108.039 88.8505C108.248 89.1634 108.545 89.4073 108.893 89.5513C109.24 89.6953 109.623 89.7329 109.992 89.6595C110.361 89.5861 110.7 89.4049 110.966 89.1388C111.232 88.8727 111.413 88.5337 111.487 88.1647C111.56 87.7956 111.523 87.413 111.378 87.0654C111.234 86.7177 110.991 86.4206 110.678 86.2115C110.365 86.0025 109.997 85.8909 109.621 85.8909C109.117 85.8949 108.636 86.0967 108.28 86.4526C107.924 86.8085 107.722 87.2901 107.718 87.7935Z" fill="#F7F7F7"/>
<path fill-rule="evenodd" clip-rule="evenodd" d="M124.201 88.3016C124.201 88.578 124.282 88.8484 124.436 89.0785C124.589 89.3086 124.807 89.4881 125.062 89.5942C125.317 89.7004 125.598 89.7284 125.87 89.6748C126.141 89.6212 126.39 89.4883 126.586 89.293C126.781 89.0977 126.915 88.8488 126.969 88.5777C127.023 88.3066 126.995 88.0255 126.89 87.7701C126.784 87.5146 126.605 87.2963 126.375 87.1426C126.145 86.989 125.875 86.907 125.599 86.907C125.415 86.906 125.233 86.9413 125.063 87.011C124.893 87.0807 124.739 87.1833 124.609 87.313C124.479 87.4427 124.376 87.5968 124.306 87.7665C124.236 87.9361 124.201 88.118 124.201 88.3016Z" fill="#212121"/>
<path fill-rule="evenodd" clip-rule="evenodd" d="M108.485 88.3016C108.485 88.5774 108.567 88.847 108.72 89.0763C108.874 89.3057 109.091 89.4844 109.346 89.59C109.601 89.6955 109.881 89.7231 110.152 89.6693C110.423 89.6155 110.671 89.4827 110.866 89.2876C111.061 89.0926 111.194 88.8441 111.248 88.5736C111.302 88.3031 111.274 88.0227 111.168 87.7679C111.063 87.5131 110.884 87.2953 110.655 87.142C110.425 86.9888 110.156 86.907 109.88 86.907C109.697 86.9063 109.515 86.9419 109.345 87.0117C109.176 87.0816 109.022 87.1843 108.892 87.3139C108.763 87.4436 108.66 87.5976 108.59 87.7671C108.52 87.9366 108.485 88.1182 108.485 88.3016Z" fill="#212121"/>
<path fill-rule="evenodd" clip-rule="evenodd" d="M114.463 92.9543C114.463 93.9192 114.846 94.8446 115.528 95.5268C116.211 96.2091 117.136 96.5924 118.101 96.5924C119.066 96.5924 119.991 96.2091 120.673 95.5268C121.356 94.8446 121.739 93.9192 121.739 92.9543H114.463Z" fill="#BC9480"/>
<path d="M131.234 83.5762L120.207 83.7188C119.98 83.7472 119.763 83.8286 119.573 83.9565C119.384 84.0844 119.227 84.2552 119.116 84.4549C119.015 84.6476 118.956 84.8597 118.943 85.077C118.931 85.2942 118.965 85.5116 119.043 85.7147C119.471 86.9252 119.922 88.1616 120.339 89.3722C120.523 90.0906 120.94 90.7276 121.525 91.1835C122.11 91.6395 122.83 91.8885 123.571 91.8917H128.852C129.618 91.89 130.36 91.6243 130.953 91.1394C131.546 90.6545 131.954 89.98 132.107 89.2296L132.867 85.5721C132.912 85.3307 132.903 85.0824 132.842 84.8445C132.782 84.6066 132.669 84.3849 132.514 84.1949C132.358 84.0048 132.163 83.851 131.942 83.7441C131.721 83.6373 131.479 83.58 131.234 83.5762Z" fill="white" fill-opacity="0.15"/>
<path fill-rule="evenodd" clip-rule="evenodd" d="M131.234 83.0762L131.241 83.0763C131.56 83.0812 131.873 83.1555 132.16 83.294C132.446 83.4326 132.699 83.632 132.901 83.8783C133.102 84.1247 133.248 84.412 133.327 84.7204C133.406 85.0288 133.417 85.3507 133.358 85.6636L133.357 85.6738L132.597 89.33C132.597 89.3303 132.597 89.3298 132.597 89.33C132.42 90.1928 131.951 90.969 131.269 91.5265C130.587 92.0842 129.734 92.3898 128.853 92.3917L123.571 92.3917L123.569 92.3917C122.717 92.3881 121.89 92.1019 121.218 91.5779C120.551 91.0583 120.074 90.334 119.86 89.5167C119.598 88.7566 119.324 87.9894 119.049 87.2219C118.89 86.7767 118.731 86.3315 118.574 85.8874C118.472 85.62 118.428 85.334 118.444 85.0482C118.461 84.76 118.539 84.4786 118.673 84.2228L118.679 84.2114C118.828 83.9431 119.039 83.7139 119.294 83.5421C119.548 83.3703 119.84 83.2609 120.145 83.2227L120.172 83.2192L131.234 83.0762ZM120.244 84.2184C120.104 84.2396 119.971 84.2918 119.853 84.3711C119.73 84.4539 119.628 84.564 119.555 84.6928C119.489 84.821 119.451 84.9617 119.443 85.1058C119.434 85.252 119.457 85.3983 119.51 85.535L119.515 85.5481C119.67 85.9864 119.828 86.4304 119.988 86.8763C120.266 87.6545 120.546 88.4387 120.812 89.2092L120.818 89.2284L120.823 89.2481C120.98 89.8593 121.335 90.4013 121.833 90.7892C122.33 91.177 122.942 91.3888 123.573 91.3917H128.851C129.502 91.3902 130.132 91.1644 130.636 90.7524C131.14 90.3403 131.487 89.767 131.618 89.1292L132.376 85.476C132.407 85.3076 132.401 85.1346 132.358 84.9687C132.315 84.8013 132.236 84.6453 132.127 84.5116C132.017 84.3778 131.88 84.2695 131.725 84.1944C131.571 84.1201 131.403 84.0798 131.233 84.0763L120.244 84.2184Z" fill="#252525"/>
<path d="M104.525 83.5762L115.551 83.7188C115.778 83.7472 115.995 83.8286 116.185 83.9565C116.375 84.0844 116.531 84.2552 116.643 84.4549C116.744 84.6476 116.803 84.8597 116.815 85.077C116.828 85.2942 116.794 85.5116 116.715 85.7147C116.288 86.9252 115.837 88.1616 115.419 89.3722C115.235 90.0906 114.818 90.7276 114.233 91.1835C113.648 91.6395 112.929 91.8885 112.187 91.8917H106.912C106.146 91.89 105.404 91.6243 104.811 91.1394C104.218 90.6545 103.81 89.98 103.656 89.2296L102.897 85.5721C102.852 85.3311 102.86 85.0832 102.921 84.8457C102.981 84.6082 103.093 84.3868 103.248 84.1968C103.403 84.0069 103.597 83.8529 103.818 83.7458C104.038 83.6386 104.28 83.5807 104.525 83.5762Z" fill="white" fill-opacity="0.15"/>
<path fill-rule="evenodd" clip-rule="evenodd" d="M104.525 83.5761L104.515 83.0762C104.198 83.0821 103.885 83.1571 103.599 83.296C103.313 83.435 103.061 83.6345 102.861 83.8808C102.66 84.127 102.515 84.414 102.436 84.7219C102.358 85.0299 102.347 85.3512 102.405 85.6635L103.166 89.3299C103.166 89.3297 103.166 89.3302 103.166 89.3299C103.343 90.1927 103.812 90.9689 104.494 91.5265C105.176 92.0842 106.03 92.3897 106.911 92.3917L112.187 92.3917L112.189 92.3917C113.041 92.388 113.868 92.1018 114.54 91.5779C115.207 91.0582 115.684 90.3338 115.898 89.5166C116.161 88.7565 116.435 87.9893 116.709 87.2218C116.868 86.7766 117.028 86.3314 117.185 85.8873C117.286 85.62 117.331 85.334 117.314 85.0482C117.298 84.7598 117.22 84.4784 117.086 84.2227L117.079 84.2114C116.93 83.9431 116.719 83.7138 116.465 83.542C116.21 83.3702 115.918 83.2608 115.614 83.2226L115.586 83.2191L104.531 83.0762L104.525 83.5761ZM104.527 84.0762C104.357 84.0804 104.19 84.121 104.037 84.1954C103.881 84.2708 103.745 84.3791 103.636 84.5128C103.527 84.6465 103.448 84.8023 103.405 84.9694C103.363 85.135 103.357 85.3078 103.387 85.4759L104.146 89.1292C104.277 89.767 104.623 90.3402 105.127 90.7523C105.631 91.1643 106.262 91.3901 106.913 91.3917H112.186C112.816 91.3887 113.428 91.1769 113.926 90.7892C114.423 90.4012 114.778 89.8592 114.935 89.248L114.94 89.2283L114.947 89.2092C115.212 88.4386 115.493 87.6544 115.771 86.8762C115.93 86.4303 116.089 85.9864 116.244 85.5481L116.249 85.5348C116.301 85.3981 116.324 85.2518 116.316 85.1057C116.308 84.9617 116.269 84.821 116.203 84.6927C116.13 84.5639 116.028 84.4538 115.905 84.371C115.788 84.2917 115.654 84.2396 115.514 84.2183L104.527 84.0762Z" fill="#252525"/>
<path d="M105.782 75.4577C105.782 75.3099 106.08 75.2348 106.596 74.6438C106.971 74.2164 107.263 73.7234 107.459 73.1896C105.971 74.7887 103.986 75.8367 101.826 76.1628C100.429 76.3647 99.0035 76.2468 97.6581 75.818C97.8139 76.616 97.9213 77.4228 97.9795 78.2339C98.1765 80.7741 97.8317 82.6975 97.7203 83.8069C97.5233 86.0284 96.5616 88.5427 96.3646 89.1104C95.2727 87.6644 94.3613 86.0906 93.6506 84.4238C92.8367 82.5264 90.9367 77.8632 92.2198 72.0205C93.6273 65.6076 97.9665 62.0072 99.1745 61.0455C101.573 59.1321 104.372 57.7837 107.363 57.1003C114.935 55.374 124.823 57.8391 130.2 65.434C133.725 70.416 133.997 75.7428 133.948 78.2831C132.365 77.4731 130.971 76.3391 129.855 74.9548C129.179 74.119 128.616 73.1988 128.178 72.2176C125.706 73.9885 122.931 75.2922 119.989 76.0642C112.851 77.9254 105.782 76.2224 105.782 75.4577Z" fill="#343434"/>
<path d="M112.039 82.1246L106.66 82.4538C106.546 82.4638 106.432 82.4279 106.344 82.354C106.256 82.2801 106.201 82.1743 106.191 82.0598C106.181 81.9453 106.217 81.8316 106.291 81.7436C106.365 81.6556 106.471 81.6006 106.585 81.5906L111.935 80.9063C112.077 80.8933 112.217 80.9367 112.327 81.0271C112.436 81.1174 112.505 81.2473 112.519 81.3884L112.545 81.6166C112.542 81.75 112.488 81.8773 112.394 81.972C112.3 82.0666 112.173 82.1213 112.039 82.1246Z" fill="#252525"/>
<path d="M122.156 82.0727L127.558 82.2775C127.617 82.2803 127.676 82.2712 127.731 82.2507C127.786 82.2302 127.836 82.1988 127.879 82.1584C127.921 82.118 127.955 82.0693 127.979 82.0154C128.002 81.9614 128.014 81.9033 128.014 81.8446C128.019 81.7351 127.983 81.6277 127.913 81.5433C127.843 81.459 127.745 81.4037 127.636 81.3884L122.257 80.8285C122.189 80.8206 122.119 80.827 122.053 80.8474C121.986 80.8679 121.925 80.9018 121.873 80.9471C121.82 80.9924 121.778 81.0482 121.748 81.1107C121.718 81.1733 121.702 81.2414 121.7 81.3106V81.5387C121.691 81.6044 121.696 81.6712 121.715 81.7347C121.734 81.7983 121.766 81.8571 121.809 81.9075C121.852 81.9579 121.905 81.9986 121.965 82.0271C122.025 82.0556 122.09 82.0711 122.156 82.0727Z" fill="#252525"/>
<path d="M121.011 108.378C121.561 109.298 121.724 110.399 121.464 111.44C121.203 112.48 120.541 113.375 119.621 113.927L99.6255 125.999C99.2 126.255 98.7281 126.425 98.2369 126.5C97.7456 126.574 97.2445 126.55 96.7623 126.431C96.28 126.311 95.8261 126.098 95.4263 125.803C95.0265 125.508 94.6887 125.137 94.4322 124.712C94.1757 124.286 94.0055 123.814 93.9314 123.323C93.8573 122.832 93.8806 122.331 94.0001 121.849C94.1196 121.366 94.3329 120.912 94.6279 120.513C94.9229 120.113 95.2937 119.775 95.7192 119.518L112.654 109.295C113.904 108.564 115.294 108.105 116.734 107.947C118.174 107.789 119.631 107.935 121.011 108.378Z" fill="#2EA88A"/>
<path d="M139.267 98.1931H123.12C121.982 98.1931 121.06 99.1157 121.06 100.254V122.432C121.06 123.57 121.982 124.493 123.12 124.493H139.267C140.405 124.493 141.327 123.57 141.327 122.432V100.254C141.327 99.1157 140.405 98.1931 139.267 98.1931Z" fill="#4C4C4C"/>
<path d="M123.338 124.493L141.327 100.254L141.296 122.741C141.296 122.974 141.25 123.205 141.16 123.421C141.07 123.636 140.939 123.832 140.774 123.997C140.608 124.162 140.412 124.293 140.196 124.382C139.98 124.471 139.749 124.516 139.516 124.516L123.338 124.493Z" fill="#3F3F3F"/>
<path d="M118.618 114.847C121.17 114.847 123.24 112.778 123.24 110.226C123.24 107.673 121.17 105.604 118.618 105.604C116.065 105.604 113.996 107.673 113.996 110.226C113.996 112.778 116.065 114.847 118.618 114.847Z" fill="#F7B9A9"/>
<path d="M141.327 114.342C143.88 114.342 145.949 112.273 145.949 109.72C145.949 107.168 143.88 105.098 141.327 105.098C138.775 105.098 136.706 107.168 136.706 109.72C136.706 112.273 138.775 114.342 141.327 114.342Z" fill="#F7B9A9"/>
<path d="M164.136 130.916H11.5012C11.2959 130.916 11.0926 130.875 10.903 130.796C10.7135 130.717 10.5414 130.602 10.3968 130.456C10.2522 130.31 10.138 130.137 10.0606 129.947C9.98321 129.757 9.94422 129.553 9.94593 129.348V126.084C9.94593 125.672 10.1098 125.276 10.4015 124.985C10.6931 124.693 11.0887 124.529 11.5012 124.529H164.136C164.548 124.529 164.944 124.693 165.235 124.985C165.527 125.276 165.691 125.672 165.691 126.084V129.348C165.693 129.553 165.654 129.757 165.576 129.947C165.499 130.137 165.385 130.31 165.24 130.456C165.095 130.602 164.923 130.717 164.734 130.796C164.544 130.875 164.341 130.916 164.136 130.916Z" fill="#6C7580"/>
</svg>
