<svg width="209" height="127" viewBox="0 0 209 127" fill="none" xmlns="http://www.w3.org/2000/svg">
<path d="M23.7082 94.0315L0 71.1427C4.52524 66.4537 10.3386 63.2115 16.7055 61.8257C23.0724 60.4399 29.7072 60.9727 35.7715 63.3567C41.8357 65.7408 47.0574 69.8691 50.7767 75.22C54.496 80.571 56.5459 86.9045 56.6676 93.4203C56.7893 99.9361 54.9772 106.342 51.4602 111.828C47.9433 117.314 42.8794 121.634 36.9083 124.243C30.9373 126.852 24.327 127.632 17.9128 126.485C11.4986 125.338 5.5683 122.315 0.871166 117.798L23.7082 94.0315Z" fill="#F5C143" fill-opacity="0.6"/>
<path d="M162.862 45.9089V0C175.017 0.0581956 186.658 4.91392 195.253 13.5111C203.847 22.1083 208.701 33.7517 208.757 45.9089H162.862Z" fill="#5DA6F5" fill-opacity="0.8"/>
<path d="M169.202 110.64H44.376C43.3418 110.64 42.3192 110.422 41.3747 110.001C40.4302 109.58 39.5851 108.964 38.8943 108.194C38.2035 107.425 37.6827 106.518 37.3656 105.533C37.0485 104.549 36.9424 103.508 37.054 102.48C39.8196 76.8484 42.6037 51.2167 45.4062 25.5849C45.6025 23.7774 46.4604 22.1064 47.8147 20.8936C49.169 19.6807 50.9241 19.0118 52.7419 19.0156L177.277 19.2922C178.307 19.2953 179.325 19.5145 180.265 19.9354C181.205 20.3564 182.046 20.9699 182.734 21.7363C183.422 22.5027 183.942 23.4049 184.259 24.3846C184.577 25.3644 184.686 26.3999 184.578 27.4243C181.896 52.9685 179.211 78.508 176.524 104.043C176.334 105.853 175.481 107.529 174.129 108.747C172.777 109.965 171.021 110.64 169.202 110.64Z" fill="white"/>
<path d="M167.202 112.64H42.376C41.3418 112.64 40.3192 112.422 39.3747 112.001C38.4302 111.58 37.5851 110.964 36.8943 110.194C36.2035 109.425 35.6827 108.518 35.3656 107.533C35.0485 106.549 34.9424 105.508 35.054 104.48C37.8196 78.8484 40.6037 53.2167 43.4062 27.5849C43.6025 25.7774 44.4604 24.1064 45.8147 22.8936C47.169 21.6807 48.9241 21.0118 50.7419 21.0156L175.277 21.2922C176.307 21.2953 177.325 21.5145 178.265 21.9354C179.205 22.3564 180.046 22.9699 180.734 23.7363C181.422 24.5027 181.942 25.4049 182.259 26.3846C182.577 27.3644 182.686 28.3999 182.578 29.4243C179.896 54.9685 177.211 80.508 174.524 106.043C174.334 107.853 173.481 109.529 172.129 110.747C170.777 111.965 169.021 112.64 167.202 112.64Z" fill="#8C8C8C"/>
<path d="M31.1133 28.4216C32.0011 28.0155 33.0063 27.9467 33.9412 28.228C41.512 29.9083 154.556 28.8434 162.286 27.8961C163.498 27.6728 164.749 27.9201 165.785 28.5876C167.223 29.694 167.389 31.7339 167.444 32.5706C168.011 41.2075 171.468 107.066 171.468 107.066L170.382 110.026C169.062 113.58 123.25 111.872 101.298 112.522C81.1293 113.117 60.8989 111.139 40.7653 112.522C39.866 112.607 38.9589 112.501 38.1034 112.211C34.8953 111.07 32.8695 107.122 32.8695 107.122L28.2993 34.0643C28.2993 34.0643 28.8455 29.6663 31.1133 28.4216Z" fill="white"/>
<path d="M123.56 57.3678H152.966C153.267 57.3907 153.569 57.3493 153.853 57.2464C154.137 57.1434 154.396 56.9813 154.612 56.7707C154.829 56.5601 154.998 56.306 155.108 56.025C155.219 55.7441 155.269 55.4428 155.254 55.1411C154.729 51.0935 154.208 47.0436 153.692 42.9914C153.588 42.4707 153.3 42.0047 152.881 41.6784C152.463 41.3521 151.94 41.1874 151.41 41.2143H119.875C118.368 41.2143 117.269 42.459 117.656 43.7244C118.882 47.7766 120.11 51.8311 121.341 55.888C121.506 56.3381 121.81 56.7241 122.209 56.9901C122.608 57.2561 123.081 57.3884 123.56 57.3678Z" fill="#80C343"/>
<path d="M30.1659 23.83L165.148 23.5949C166.747 23.5838 168.286 24.2071 169.426 25.3283C170.567 26.4495 171.216 27.9771 171.233 29.5764L171.606 105.075C171.613 104.944 171.613 104.812 171.606 104.681L163.572 35.2121C163.376 33.8533 162.689 32.6136 161.64 31.7278C160.591 30.8421 159.254 30.3718 157.882 30.4062H38.2691C37.537 30.3841 36.8077 30.5067 36.1231 30.7671C35.4385 31.0274 34.8119 31.4204 34.2795 31.9234C33.747 32.4264 33.319 33.0296 33.0201 33.6984C32.7211 34.3672 32.5571 35.0884 32.5374 35.8207L32.897 105.524C32.9201 106.253 33.0872 106.971 33.3886 107.635C33.69 108.299 34.1197 108.897 34.6531 109.394C35.1864 109.892 35.8128 110.279 36.4963 110.533C37.1798 110.788 37.9068 110.904 38.6356 110.877L165.853 110.669C167.293 110.706 168.692 110.185 169.756 109.214C170.821 108.244 171.469 106.899 171.564 105.462C171.564 106.112 171.564 106.762 171.564 107.419C171.564 108.215 171.405 109.003 171.099 109.738C170.793 110.472 170.345 111.139 169.78 111.7C169.215 112.261 168.545 112.705 167.809 113.006C167.072 113.308 166.283 113.46 165.487 113.456H38.6702C37.1787 113.464 35.7369 112.92 34.6216 111.93C33.5062 110.939 32.796 109.572 32.6273 108.09C29.8018 82.2321 26.9716 56.3722 24.1369 30.5099C24.0464 29.6654 24.1351 28.8113 24.3973 28.0035C24.6594 27.1956 25.089 26.4521 25.658 25.8217C26.227 25.1912 26.9227 24.6879 27.6995 24.3447C28.4763 24.0015 29.3167 23.8261 30.1659 23.83Z" fill="#ECF5E3"/>
<path d="M111.675 81.75L66.7825 82.4415C69.2439 97.1844 69.1263 99.0722 69.4444 110.862H111.675V81.75Z" fill="#6C9645"/>
<path d="M99.0364 34.839L104.236 25.2479C96.8516 4.50274 77.3541 17.828 75.5081 23.768L76.9877 29.9155L99.0364 34.839Z" fill="#1C1C1C"/>
<path d="M110.666 96.9292C104.118 117.384 75.4805 114.438 70.0322 93.9833C64.584 73.5287 54.9182 56.8772 72.4383 51.2277C88.6171 45.3291 90.8434 45.5712 108.315 51.2277C127.266 57.3751 119.136 76.0457 110.666 96.9292Z" fill="#6C9645"/>
<path d="M92.79 62.5134C92.7813 62.3831 92.7238 62.2609 92.629 62.1711C92.5341 62.0814 92.4089 62.0307 92.2784 62.0293H88.6278C88.4968 62.0291 88.3706 62.0792 88.2754 62.1693C88.1803 62.2593 88.1232 62.3825 88.1162 62.5134L85.6617 99.7163C85.6558 99.7929 85.667 99.8699 85.6945 99.9416C85.722 100.013 85.7651 100.078 85.8207 100.131L90.0452 104.052C90.1402 104.137 90.2633 104.184 90.3909 104.184C90.5184 104.184 90.6415 104.137 90.7366 104.052L95.203 100.124C95.2605 100.071 95.3057 100.005 95.3355 99.9322C95.3654 99.8594 95.3791 99.7811 95.3759 99.7024L92.79 62.5134Z" fill="#636464"/>
<path d="M95.1231 44.0361H86.1902V50.64L90.6566 55.4114L95.1231 50.64V44.0361Z" fill="#F8B9A8"/>
<path d="M95.1231 48.8071C95.1231 50.9508 86.1902 50.3768 86.1902 48.8071V52.0434C86.1902 53.2281 86.6608 54.3644 87.4984 55.2021C88.336 56.0399 89.4721 56.5105 90.6566 56.5105C91.8412 56.5105 92.9773 56.0399 93.8149 55.2021C94.6525 54.3644 95.1231 53.2281 95.1231 52.0434V48.8071Z" fill="#F8B9A8"/>
<path d="M95.1231 43.6694H86.1902V46.8296C88.0086 52.3616 92.7378 52.7627 95.1231 46.8296V43.6694Z" fill="#DD9887"/>
<path d="M78.6423 35.8229C77.1297 35.8229 75.9035 33.8961 75.9035 31.5191C75.9035 29.1422 77.1297 27.2153 78.6423 27.2153C80.1549 27.2153 81.3811 29.1422 81.3811 31.5191C81.3811 33.8961 80.1549 35.8229 78.6423 35.8229Z" fill="#E0E0E0"/>
<path d="M113.915 108.118C113.931 108.284 113.979 108.445 114.057 108.592C114.135 108.739 114.241 108.87 114.37 108.976C114.498 109.082 114.647 109.161 114.806 109.21C114.965 109.259 115.132 109.275 115.298 109.259L121.224 108.713L127.446 108.132C127.625 108.116 127.798 108.063 127.955 107.975C128.111 107.888 128.248 107.769 128.355 107.625C128.463 107.482 128.539 107.317 128.579 107.143C128.619 106.968 128.622 106.787 128.587 106.611L119.212 60.8953C119.186 60.7825 119.147 60.6733 119.094 60.5703C117.02 56.6841 112.498 54.5888 109.705 61.3586C109.629 61.5399 109.601 61.7373 109.622 61.9326L113.915 108.118Z" fill="#6C9645"/>
<path d="M78.7022 31.1185C77.7135 38.1511 83.0719 44.8103 88.8865 46.6151C89.6105 46.8344 90.3854 46.8175 91.099 46.5667C96.6302 44.6651 102.286 38.732 101.304 31.1185C101.304 23.0832 99.0018 15.0825 89.9997 15.0825C80.9976 15.0825 78.7022 23.0832 78.7022 31.1185Z" fill="#F8B9A8"/>
<path d="M95.3859 31.2427C95.8823 31.2427 96.2847 30.6111 96.2847 29.8321C96.2847 29.053 95.8823 28.4214 95.3859 28.4214C94.8895 28.4214 94.4871 29.053 94.4871 29.8321C94.4871 30.6111 94.8895 31.2427 95.3859 31.2427Z" fill="#1C1C1C"/>
<path d="M85.1254 31.2427C85.6218 31.2427 86.0242 30.6111 86.0242 29.8321C86.0242 29.053 85.6218 28.4214 85.1254 28.4214C84.629 28.4214 84.2266 29.053 84.2266 29.8321C84.2266 30.6111 84.629 31.2427 85.1254 31.2427Z" fill="#1C1C1C"/>
<path d="M76.6857 33.0838C76.2536 33.0838 75.9032 32.2955 75.9032 31.3231C75.9032 30.3508 76.2536 29.5625 76.6857 29.5625C77.1179 29.5625 77.4683 30.3508 77.4683 31.3231C77.4683 32.2955 77.1179 33.0838 76.6857 33.0838Z" fill="#E0E0E0"/>
<path d="M89.9581 32.0103L90.6495 35.3502H89.1077" stroke="#CF836F" stroke-linecap="round" stroke-linejoin="round"/>
<path d="M102.9 35.0405C104.197 35.0405 105.248 32.9384 105.248 30.3454C105.248 27.7524 104.197 25.6504 102.9 25.6504C101.604 25.6504 100.552 27.7524 100.552 30.3454C100.552 32.9384 101.604 35.0405 102.9 35.0405Z" fill="#E0E0E0"/>
<path d="M102.117 32.9017C100.934 35.7141 98.8117 37.994 96.1371 39.3259C95.7901 39.4816 95.4353 39.6184 95.0744 39.7356V38.7259C96.1957 38.1273 97.2426 37.3902 98.1918 36.5308C99.5112 35.3193 100.627 33.8902 101.493 32.3018L102.117 32.9017Z" fill="#E0E0E0"/>
<path d="M95.811 38.0391L93.6991 38.7772C93.5451 38.831 93.4187 38.9439 93.3478 39.0911C93.2768 39.2383 93.2672 39.4077 93.3209 39.562L93.4038 39.8001C93.4575 39.9544 93.5702 40.081 93.7171 40.1521C93.8641 40.2231 94.0331 40.2328 94.1872 40.179L96.2991 39.4409L95.811 38.0391Z" fill="#E0E0E0"/>
<path d="M86.9923 25.621C86.9942 25.4542 86.9358 25.2924 86.8278 25.1653C86.7198 25.0382 86.5695 24.9545 86.4046 24.9295C85.2203 24.67 83.9937 24.67 82.8093 24.9295C82.6457 24.956 82.4971 25.0404 82.3905 25.1673C82.2839 25.2942 82.2264 25.4552 82.2286 25.621C82.2282 25.7173 82.2479 25.8126 82.2865 25.9008C82.325 25.9891 82.3816 26.0683 82.4526 26.1333C82.5235 26.1984 82.6073 26.248 82.6985 26.2789C82.7897 26.3097 82.8863 26.3212 82.9822 26.3125H86.2525C86.3473 26.3191 86.4425 26.3062 86.532 26.2744C86.6216 26.2427 86.7036 26.1928 86.773 26.1279C86.8424 26.063 86.8977 25.9845 86.9355 25.8973C86.9732 25.8101 86.9926 25.716 86.9923 25.621Z" fill="#4C4545"/>
<path d="M97.0863 25.7388C97.0875 25.5689 97.0262 25.4045 96.914 25.277C96.8018 25.1494 96.6465 25.0677 96.4779 25.0473C95.4272 24.8019 94.3342 24.8019 93.2836 25.0473C93.1175 25.0708 92.9656 25.1539 92.8562 25.2811C92.7468 25.4083 92.6873 25.571 92.689 25.7388C92.7049 25.9351 92.797 26.1174 92.9456 26.2466C93.0942 26.3758 93.2875 26.4418 93.4841 26.4303H96.2981C96.3953 26.4369 96.4928 26.4242 96.5851 26.3929C96.6774 26.3617 96.7626 26.3125 96.8358 26.2483C96.9091 26.184 96.9689 26.106 97.0119 26.0185C97.0549 25.9311 97.0802 25.836 97.0863 25.7388Z" fill="#4C4545"/>
<path d="M86.5359 38.1719H92.6894C92.6894 39.3198 90.8433 40.3155 89.6126 40.4677C88.3819 40.6198 86.5359 39.1262 86.5359 38.1719Z" fill="white"/>
<path d="M104.073 32.3018C104.722 32.3018 105.247 31.3384 105.247 30.1499C105.247 28.9615 104.722 27.998 104.073 27.998C103.425 27.998 102.9 28.9615 102.9 30.1499C102.9 31.3384 103.425 32.3018 104.073 32.3018Z" fill="#E0E0E0"/>
<path d="M90.8293 64.5808C90.7848 64.66 90.7201 64.7258 90.6417 64.7717C90.5633 64.8175 90.4742 64.8417 90.3834 64.8417C90.2926 64.8417 90.2034 64.8175 90.1251 64.7717C90.0467 64.7258 89.9819 64.66 89.9374 64.5808L85.4848 56.7046C85.4418 56.626 85.4199 56.5376 85.4212 56.4481C85.4225 56.3585 85.447 56.2708 85.4922 56.1935C85.5375 56.1162 85.602 56.052 85.6794 56.007C85.7569 55.9621 85.8447 55.938 85.9342 55.937H94.8326C94.9221 55.938 95.0099 55.9621 95.0873 56.007C95.1648 56.052 95.2293 56.1162 95.2746 56.1935C95.3198 56.2708 95.3443 56.3585 95.3456 56.4481C95.3469 56.5376 95.325 56.626 95.282 56.7046L90.8293 64.5808Z" fill="#636464"/>
<path d="M86.9506 51.3449C86.5634 49.6162 86.2246 47.7491 85.9826 46.0549C85.9733 45.9996 85.947 45.9486 85.9074 45.9089C85.8677 45.8693 85.8167 45.8429 85.7614 45.8336C84.1919 45.6193 83.6872 45.6469 82.7469 46.5736C82.7262 46.5972 82.7077 46.6227 82.6915 46.6496C82.0192 48.8105 81.7841 51.0837 82.0001 53.3365C82.1868 56.7041 84.5791 59.7398 85.9688 61.0675C85.9976 61.0968 86.0335 61.1183 86.0729 61.1299C86.1124 61.1416 86.1541 61.143 86.1943 61.134C86.2344 61.125 86.2716 61.1059 86.3023 61.0785C86.333 61.0512 86.3562 61.0164 86.3698 60.9776L88.686 55.1897C88.7014 55.1573 88.7093 55.1218 88.7093 55.086C88.7093 55.0501 88.7014 55.0147 88.686 54.9822C87.9118 53.8733 87.3254 52.6445 86.9506 51.3449Z" fill="white"/>
<path d="M94.4591 51.843C94.8462 50.1142 95.1505 48.2472 95.427 46.553C95.4363 46.4977 95.4626 46.4466 95.5023 46.407C95.5419 46.3673 95.593 46.341 95.6483 46.3317C97.2178 46.1173 97.7225 46.145 98.6628 47.0716C98.6851 47.0964 98.7038 47.1244 98.7181 47.1546C99.4028 49.3106 99.6497 51.5817 99.4441 53.8345C99.2574 57.2021 96.8721 60.2378 95.4754 61.5655C95.4466 61.5949 95.4107 61.6164 95.3713 61.628C95.3318 61.6396 95.2901 61.641 95.25 61.632C95.2098 61.623 95.1726 61.6039 95.1419 61.5766C95.1112 61.5492 95.088 61.5145 95.0744 61.4756L92.7582 55.6877C92.7428 55.6553 92.7349 55.6199 92.7349 55.584C92.7349 55.5481 92.7428 55.5127 92.7582 55.4803C93.5203 54.3691 94.0949 53.1403 94.4591 51.843Z" fill="white"/>
<path d="M89.7511 12.005C93.1251 11.8322 95.6487 14.9094 96.2848 16.2509C94.9504 18.1871 90.8919 22.1978 85.3261 22.7303C78.4121 23.4218 72.6873 16.5067 75.0035 16.5067C77.3197 16.5067 85.5404 12.2332 89.7511 12.005Z" fill="#1C1C1C"/>
<path d="M65.8974 56.1654L65.0332 55.9648C63.2724 57.1174 61.5047 58.2906 59.7301 59.4846C54.4248 63.0528 49.2646 66.6324 44.2497 70.2237C41.6416 67.6699 39.2027 64.9488 36.9485 62.0777C35.3285 60.0392 33.4156 58.2519 31.2721 56.7739C31.1591 56.6897 31.036 56.62 30.9056 56.5664C28.14 56.2968 26.6881 56.4351 25.7892 57.1681C23.8879 58.7239 24.6692 62.0777 23.9778 62.14C23.6182 62.14 23.2864 61.3171 23.2864 61.3102C25.3757 65.9706 28.1131 70.3124 31.4173 74.2067C35.9667 79.5244 38.753 82.7745 43.2748 83.4936C46.4207 83.9984 49.8915 82.242 56.8332 78.7222C66.9553 73.6189 68.7045 69.7949 69.1885 67.43C69.23 67.2364 69.2507 67.0704 69.2715 66.9667L65.8974 56.1654Z" fill="#6C9645"/>
<path d="M27.5636 58.2925C30.102 56.7869 30.799 53.2713 29.1203 50.4401C27.4416 47.609 24.0229 46.5344 21.4845 48.04C18.946 49.5456 18.249 53.0612 19.9277 55.8924C21.6064 58.7235 25.0251 59.7981 27.5636 58.2925Z" fill="#F8B9A8"/>
<path d="M29.5515 53.4794L21.5624 58.1579C21.3185 58.3007 21.2366 58.6142 21.3794 58.8581L23.5628 62.5877C23.7056 62.8316 24.019 62.9135 24.2629 62.7707L32.252 58.0922C32.4958 57.9494 32.5778 57.6359 32.435 57.3921L30.2515 53.6625C30.1088 53.4186 29.7953 53.3366 29.5515 53.4794Z" fill="white"/>
<path d="M91.2027 103.83C91.4171 102.298 92.2307 100.914 93.4649 99.9818C94.6991 99.0495 96.2529 98.6454 97.7848 98.8583L123.837 102.503C125.369 102.717 126.753 103.531 127.685 104.765C128.617 105.999 129.021 107.553 128.808 109.086C128.702 109.845 128.447 110.576 128.059 111.237C127.67 111.897 127.155 112.475 126.543 112.937C125.931 113.398 125.235 113.735 124.493 113.927C123.751 114.12 122.978 114.164 122.219 114.058L96.1739 110.42C95.4148 110.314 94.684 110.059 94.0233 109.671C93.3626 109.282 92.7849 108.767 92.3233 108.155C91.8617 107.543 91.5251 106.846 91.3328 106.104C91.1406 105.362 91.0963 104.589 91.2027 103.83Z" fill="#6C9645"/>
<path d="M94.4867 103.173C95.1356 99.9998 92.7927 96.8408 89.2537 96.1168C85.7147 95.3928 82.3197 97.378 81.6708 100.551C81.0219 103.724 83.3648 106.883 86.9038 107.607C90.4429 108.331 93.8379 106.346 94.4867 103.173Z" fill="#F8B9A8"/>
<path d="M91.9156 97.6924L89.8803 107.645C89.8183 107.948 90.0137 108.244 90.3167 108.306L94.9635 109.256C95.2666 109.318 95.5625 109.123 95.6244 108.82L97.6598 98.8675C97.7218 98.5645 97.5264 98.2685 97.2233 98.2065L92.5765 97.2559C92.2735 97.1939 91.9776 97.3894 91.9156 97.6924Z" fill="white"/>
<path d="M124.305 49.0107C124.376 48.6439 124.51 48.3335 124.707 48.0795C124.905 47.8209 125.163 47.6915 125.483 47.6915C125.803 47.6915 126.038 47.8256 126.189 48.0936C126.344 48.357 126.421 48.7332 126.421 49.2223C126.421 49.7115 126.393 50.3863 126.337 51.247L125.744 51.1976L125.688 50.9718C125.467 51.0988 125.241 51.1623 125.011 51.1623C124.78 51.1623 124.59 51.0871 124.439 50.9366C124.289 50.7814 124.213 50.5603 124.213 50.2735C124.213 49.9866 124.354 49.7397 124.637 49.5327C124.924 49.3258 125.253 49.2176 125.624 49.2082V49.0178C125.624 48.6462 125.535 48.4605 125.356 48.4605C125.267 48.4605 125.185 48.524 125.109 48.6509C125.039 48.7732 124.987 48.9143 124.954 49.0742L124.305 49.0107ZM124.933 50.3158C124.933 50.4663 125.022 50.5415 125.201 50.5415C125.323 50.5415 125.453 50.5133 125.589 50.4569L125.603 49.8643C125.382 49.8831 125.215 49.9395 125.102 50.0336C124.989 50.123 124.933 50.217 124.933 50.3158Z" fill="white"/>
<path d="M133.404 49.3987C133.155 49.3752 132.908 49.3634 132.663 49.3634C132.424 49.3634 132.139 49.3681 131.81 49.3775V49.4693C131.81 49.9442 131.822 50.4874 131.845 51.0988L130.857 51.0353C130.834 50.4239 130.822 49.9019 130.822 49.4693V49.434C130.766 49.4434 130.27 49.4716 129.334 49.5186L129.291 48.6721C129.978 48.6486 130.491 48.618 130.829 48.5804C130.853 47.9502 130.888 47.3694 130.935 46.838L131.923 46.9226C131.871 47.4541 131.838 47.9902 131.824 48.531C132.153 48.5216 132.454 48.5169 132.727 48.5169C133 48.5169 133.258 48.5287 133.503 48.5522L133.404 49.3987Z" fill="white"/>
<path d="M138.174 47.7691C138.4 47.7691 138.567 47.8938 138.675 48.143C138.788 48.3923 138.844 48.6886 138.844 49.0319C138.844 49.3705 138.807 49.7067 138.732 50.0407C138.661 50.3746 138.546 50.6591 138.386 50.8942C138.231 51.1247 138.052 51.2399 137.85 51.2399C137.553 51.2399 137.309 51.1082 137.116 50.8449C137.116 50.9107 137.121 51.0048 137.13 51.127L136.509 51.0635C136.481 50.4992 136.467 49.742 136.467 48.792C136.467 47.8373 136.493 46.8803 136.545 45.9209L137.349 45.9914C137.292 46.9179 137.264 47.7597 137.264 48.5169C137.579 48.0184 137.883 47.7691 138.174 47.7691ZM137.264 49.7232L137.271 50.2735C137.328 50.3534 137.377 50.4098 137.419 50.4428C137.462 50.471 137.525 50.4851 137.61 50.4851C137.727 50.4851 137.831 50.3558 137.92 50.0971C138.01 49.8337 138.054 49.5845 138.054 49.3493C138.054 49.1142 138.04 48.9449 138.012 48.8414C137.988 48.7379 137.934 48.6862 137.85 48.6862C137.671 48.6862 137.476 49.0319 137.264 49.7232Z" fill="white"/>
<path d="M141.637 47.8185L144.148 47.7621C144.849 47.7621 145.416 47.788 145.848 47.8397L145.721 48.6862C145.34 48.6345 144.84 48.6086 144.219 48.6086L141.637 48.6651V47.8185ZM141.637 49.3634L144.148 49.307C144.849 49.307 145.416 49.3329 145.848 49.3846L145.721 50.2311C145.34 50.1794 144.84 50.1535 144.219 50.1535L141.637 50.21V49.3634Z" fill="white"/>
<path d="M149.991 49.2858C150 49.22 150.005 49.1353 150.005 49.0319C150.005 48.9284 149.984 48.8226 149.941 48.7144C149.899 48.6063 149.845 48.5522 149.779 48.5522C149.647 48.5522 149.551 48.705 149.49 49.0107C149.433 49.3117 149.405 49.5892 149.405 49.8431C149.405 50.2711 149.492 50.4851 149.666 50.4851C149.807 50.4851 150.007 50.2382 150.266 49.7444L150.788 50.1183C150.661 50.4616 150.501 50.7343 150.308 50.9366C150.12 51.1388 149.892 51.2399 149.624 51.2399C149.356 51.2399 149.114 51.1341 148.897 50.9225C148.686 50.7108 148.58 50.3887 148.58 49.956C148.58 49.4951 148.655 49.0366 148.805 48.5804C148.89 48.3311 149.015 48.1266 149.179 47.9667C149.349 47.8068 149.563 47.7268 149.821 47.7268C150.08 47.7268 150.294 47.8585 150.463 48.1219C150.637 48.3852 150.724 48.6768 150.724 48.9966C150.724 49.133 150.703 49.2506 150.661 49.3493L149.991 49.2858Z" fill="white"/>
<path d="M95.2704 15.8686C99.496 18.0597 102.052 23.9545 102.313 26.8237H103.487C103.422 26.3673 102.704 24.4762 102.313 23.1068C101.607 20.6367 98.9873 17.2381 96.0529 15.2817C93.2056 13.3835 89.3364 12.9994 86.4672 12.543L84.7065 13.1299C86.402 13.0646 91.0449 13.6776 95.2704 15.8686Z" fill="#E0E0E0"/>
</svg>
