<svg width="350" height="301" viewBox="0 0 350 301" fill="none" xmlns="http://www.w3.org/2000/svg">
<path opacity="0.8" d="M32.1351 48.468C0.737778 90.384 -15.5412 143.244 20.5797 215.613C53.5177 281.604 136.76 320.229 236.626 291.236C336.785 262.163 364.795 150.189 341.983 114.555C319.173 78.9213 255.451 136.878 223.121 81.6433C190.792 26.4059 176.791 -5.50843 122.151 0.786341C77.5307 5.92645 45.9636 30.0066 32.1351 48.468Z" fill="url(#paint0_linear)"/>
<path d="M296.862 69.6606H39.1863C35.1484 69.6606 31.9087 72.9513 31.9087 76.9942V223.76C31.9087 227.803 35.1954 231.094 39.1863 231.094H296.862C300.9 231.094 304.14 227.803 304.14 223.76V76.9471C304.14 72.9043 300.853 69.6606 296.862 69.6606Z" fill="#C9C9C9"/>
<path d="M284.467 231.047H40.6419C39.562 231.047 38.4821 230.812 37.4961 230.389C36.5101 229.966 35.6179 229.307 34.8667 228.508C34.1155 227.709 33.5521 226.769 33.1765 225.735C32.8009 224.7 32.66 223.619 32.707 222.538C35.1954 174.117 37.6369 125.744 40.1254 77.3232C40.2193 75.2548 41.1115 73.3274 42.567 71.917C44.0225 70.5067 45.9945 69.7076 48.0604 69.6606L292.871 69.9426C293.951 69.9426 295.031 70.1777 296.064 70.6008C297.05 71.0239 297.989 71.682 298.694 72.4812C299.445 73.2803 300.008 74.2206 300.384 75.2548C300.759 76.289 300.9 77.3702 300.853 78.4515C298.036 126.731 295.266 175.058 292.496 223.384C292.402 225.453 291.51 227.38 290.007 228.79C288.458 230.248 286.486 231 284.467 231.047Z" fill="#E8E8E8"/>
<path d="M279.818 222.162H54.0703C51.9574 222.162 49.9384 221.316 48.4829 219.811C46.9804 218.307 46.1353 216.286 46.1353 214.217V86.2081C46.1353 85.1739 46.3231 84.1396 46.7457 83.1524C47.1682 82.1652 47.7316 81.319 48.4829 80.5669C49.2341 79.8147 50.1262 79.2506 51.0653 78.8275C52.0513 78.4514 53.0842 78.2163 54.1172 78.2163H279.818C281.931 78.2163 283.95 79.0625 285.453 80.5669C286.955 82.0712 287.8 84.0926 287.8 86.2081V214.217C287.8 215.251 287.613 216.286 287.19 217.273C286.767 218.26 286.204 219.106 285.453 219.858C284.701 220.61 283.856 221.175 282.87 221.598C281.931 221.974 280.898 222.162 279.818 222.162Z" fill="#A0CFEF"/>
<path d="M278.973 89.0287H55.6138V212.102H278.973V89.0287Z" fill="white"/>
<rect x="66.8745" y="141.74" width="56.4492" height="5.28041" rx="2.64021" fill="#363636"/>
<rect x="150.348" y="154.896" width="93.9867" height="5.28041" rx="2.64021" fill="#363636"/>
<rect x="66.8745" y="158.209" width="38.0863" height="2.64021" rx="1.3201" fill="#363636"/>
<rect x="150.348" y="169.681" width="71.5336" height="2.6402" rx="1.3201" fill="#363636"/>
<rect x="150.348" y="181.826" width="71.5336" height="2.64021" rx="1.3201" fill="#363636"/>
<rect x="150.348" y="193.971" width="71.5336" height="2.6402" rx="1.3201" fill="#363636"/>
<rect x="66.8745" y="172.466" width="31.4513" height="2.6402" rx="1.3201" fill="#363636"/>
<rect x="66.8745" y="187.779" width="39.982" height="2.64021" rx="1.3201" fill="#363636"/>
<rect x="114.558" y="155.569" width="5.27393" height="5.28042" rx="1" fill="#89B2EF"/>
<rect x="114.558" y="169.826" width="5.27393" height="5.2804" rx="1" fill="#87DEC9"/>
<rect x="114.558" y="185.139" width="5.27393" height="5.28042" rx="1" fill="#F7B9A9"/>
<ellipse cx="177.192" cy="123.572" rx="17.7177" ry="17.7394" fill="#39C9A7"/>
<ellipse cx="236.121" cy="123.572" rx="17.7177" ry="17.7394" fill="#0174FF"/>
<rect x="79.999" y="99.516" width="30.1998" height="30.2801" rx="6" fill="#89B2EF"/>
<path d="M256.868 171.883L256.868 171.883C253.54 170.345 249.615 171.764 248.1 175.052L232.321 209.289C230.912 212.346 232.278 215.984 235.372 217.414C238.466 218.843 242.116 217.524 243.526 214.466L256.891 185.466C258.951 180.995 258.788 176.062 256.868 171.883Z" fill="#253051"/>
<path d="M220.36 188.284C223.102 186.321 226.95 186.958 228.954 189.706L241.7 207.058C243.855 210.014 243.212 214.122 240.263 216.233C237.728 218.049 234.17 217.46 232.317 214.918L219.025 196.816C217.021 194.067 217.619 190.247 220.36 188.284Z" fill="#253051"/>
<path d="M220.306 188.253C223.048 186.29 226.895 186.927 228.899 189.676C230.006 191.182 230.836 192.312 231.389 193.065C234.808 197.72 225.023 205.029 221.403 200.099C220.863 199.363 220.051 198.258 218.97 196.786C216.966 194.037 217.564 190.217 220.306 188.253Z" fill="#EAE7E7"/>
<path d="M227.254 192.553C225.22 196.153 220.619 197.4 216.977 195.338C213.335 193.275 212.031 188.685 214.065 185.085C216.098 181.485 220.699 180.238 224.341 182.3C227.983 184.363 229.287 188.953 227.254 192.553Z" fill="#F7B9A9"/>
<rect width="60.5602" height="16.4734" transform="matrix(-1 0 0 1 308.032 215.242)" fill="#253051"/>
<path d="M306.812 218.958H247.371V180.92C247.371 171.916 254.755 164.617 263.863 164.617H291.947C301.055 164.617 308.438 171.916 308.438 180.92V217.353C308.438 218.24 307.71 218.958 306.812 218.958Z" fill="#D7D7D7"/>
<rect x="272.448" y="180.803" width="3.65799" height="33.7504" rx="1.82899" fill="#253051"/>
<path d="M306.812 219.014H281.206C276.539 182.787 275.929 164.673 279.377 164.673C282.17 164.673 286.36 164.673 291.946 164.673C301.054 164.673 308.438 171.972 308.438 180.976V217.41C308.438 218.296 307.71 219.014 306.812 219.014Z" fill="#253051"/>
<path d="M248.276 219.393H269.335C270.634 201.701 271.222 189.924 271.101 184.061C270.832 171.098 268.889 164.617 265.271 164.617C256.163 164.617 246.65 171.849 246.65 180.949V217.772C246.65 218.667 247.378 219.393 248.276 219.393Z" fill="#253051"/>
<path d="M285.332 170.041L289.741 188.524L281.352 219.06C277.46 194.354 276.125 181.363 277.345 180.086C278.021 179.378 280.052 178.285 280.799 176.47C281.2 175.496 281.384 173.621 281.352 170.845L285.332 170.041Z" fill="#354470"/>
<path d="M267.184 170.443C265.45 174.097 263.001 179.722 259.838 187.318L269.469 218.658C272.803 193.952 273.861 180.961 272.641 179.684C271.965 178.977 269.933 177.884 269.186 176.068C268.785 175.095 268.601 173.22 268.634 170.443C269.402 166.789 268.918 166.789 267.184 170.443Z" fill="#354470"/>
<path d="M275.434 180.28C271.867 180.28 268.976 177.422 268.976 173.896V172.484C268.976 168.958 271.867 166.1 275.434 166.1C279.001 166.1 281.893 168.958 281.893 172.484V173.896C281.893 177.422 279.001 180.28 275.434 180.28Z" fill="#E2AA9F"/>
<path d="M303.327 171.385L303.312 171.378C300.223 170.04 296.659 171.491 295.346 174.622L280.446 210.164C279.132 213.297 280.572 216.926 283.661 218.27C283.664 218.271 283.667 218.272 283.669 218.274L283.684 218.28C286.773 219.618 290.338 218.167 291.65 215.036L306.551 179.494C307.864 176.361 306.425 172.732 303.335 171.388C303.333 171.387 303.33 171.386 303.327 171.385Z" fill="#253051"/>
<path d="M271.168 237.025C268.31 235.235 267.431 231.431 269.206 228.529L280.369 210.118C282.278 206.996 286.316 206.026 289.389 207.951C292.033 209.606 292.845 213.123 291.204 215.807L279.556 235.01C277.782 237.912 274.027 238.815 271.168 237.025Z" fill="#253051"/>
<path d="M271.16 237.088C268.302 235.299 267.424 231.495 269.198 228.592C270.167 226.993 270.894 225.795 271.379 224.995C274.373 220.057 284.853 226.329 281.681 231.558C281.207 232.339 280.496 233.511 279.549 235.073C277.774 237.976 274.019 238.878 271.16 237.088Z" fill="#EAE7E7"/>
<path d="M272.482 229.019C276.582 229.529 279.487 233.313 278.972 237.47C278.456 241.627 274.714 244.583 270.614 244.073C266.515 243.563 263.61 239.78 264.125 235.622C264.641 231.465 268.383 228.509 272.482 229.019Z" fill="#F7B9A9"/>
<path d="M300.413 145.578C300.413 160.956 287.803 173.422 272.247 173.422C256.691 173.422 244.08 160.956 244.08 145.578C244.08 130.2 256.691 117.734 272.247 117.734C287.803 117.734 300.413 130.2 300.413 145.578Z" fill="#F7B9A9"/>
<path d="M300.414 145.578C300.414 138.799 297.961 132.587 293.887 127.758C298.178 144.881 296.425 163.99 274.946 173.293C289.236 171.949 300.414 160.056 300.414 145.578Z" fill="#E2AA9F"/>
<path d="M300.82 144.774C300.929 149.782 299.482 154.483 297.141 158.543C286.072 157.393 285.301 137.897 285.301 137.897C271.022 139.649 260.46 138.365 253.615 134.045C249.644 131.538 248.484 126.329 251.024 122.41C252.558 120.042 255.187 118.586 258.034 118.526C261.101 118.462 264.131 118.109 267.125 117.467C267.125 117.467 269.902 116.821 272.653 116.93C288.624 117.566 300.475 128.988 300.82 144.774Z" fill="#253051"/>
<path d="M292.32 149.901C292.32 151.579 290.943 152.94 289.246 152.94C287.548 152.94 286.171 151.579 286.171 149.901C286.171 148.222 287.548 146.862 289.246 146.862C290.943 146.862 292.32 148.222 292.32 149.901Z" fill="#F7B9A9"/>
<path fill-rule="evenodd" clip-rule="evenodd" d="M268.316 154.337C266.749 154.25 265.487 152.854 265.617 151.283C265.704 149.712 267.097 148.446 268.665 148.577C270.232 148.664 271.494 150.061 271.364 151.632C271.277 153.203 269.927 154.425 268.316 154.337Z" fill="white"/>
<path fill-rule="evenodd" clip-rule="evenodd" d="M250.877 154.337C249.31 154.25 248.047 152.854 248.178 151.283C248.265 149.712 249.658 148.446 251.225 148.577C252.792 148.664 254.055 150.061 253.924 151.632C253.837 153.203 252.488 154.425 250.877 154.337Z" fill="white"/>
<path fill-rule="evenodd" clip-rule="evenodd" d="M267.234 153.3C265.928 153.212 264.883 152.08 264.97 150.774C265.057 149.467 266.189 148.422 267.495 148.509C268.801 148.597 269.846 149.729 269.759 151.035C269.672 152.342 268.54 153.387 267.234 153.3Z" fill="#253051"/>
<path fill-rule="evenodd" clip-rule="evenodd" d="M249.794 153.3C248.488 153.212 247.443 152.08 247.53 150.774C247.617 149.467 248.749 148.422 250.055 148.509C251.361 148.597 252.406 149.729 252.319 151.035C252.232 152.342 251.1 153.387 249.794 153.3Z" fill="#253051"/>
<path fill-rule="evenodd" clip-rule="evenodd" d="M266.706 158.935C266.706 161.986 264.05 164.354 260.829 164.354C257.52 164.354 254.952 161.905 254.952 158.935H266.706Z" fill="#A58476"/>
<path fill-rule="evenodd" clip-rule="evenodd" d="M253.471 141.872L245.896 143.438C245.504 143.558 245.156 143.759 245.025 144.08L244.938 144.241C244.808 144.482 244.938 144.722 245.2 144.803C245.287 144.803 245.374 144.883 245.461 144.803L253.384 144.12C253.994 144.08 254.429 143.719 254.603 143.237L254.734 142.715C254.864 142.314 254.56 141.792 253.994 141.711C253.819 141.832 253.602 141.832 253.471 141.872Z" fill="#243051"/>
<path fill-rule="evenodd" clip-rule="evenodd" d="M265.443 143.036L273.323 145.284C273.715 145.405 274.107 145.686 274.194 146.047L274.237 146.248C274.368 146.489 274.237 146.73 273.889 146.77C273.846 146.77 273.671 146.81 273.628 146.77L265.313 145.485C264.747 145.405 264.224 145.044 264.094 144.562L263.963 144C263.833 143.518 264.268 143.117 264.79 143.076C265.139 142.956 265.313 142.956 265.443 143.036Z" fill="#243051"/>
<defs>
<linearGradient id="paint0_linear" x1="143.258" y1="307.606" x2="209.516" y2="-27.6529" gradientUnits="userSpaceOnUse">
<stop stop-color="#80DDCE"/>
<stop offset="1" stop-color="#80DDC7" stop-opacity="0"/>
</linearGradient>
</defs>
</svg>
