<svg width="19" height="14" viewBox="0 0 19 14" fill="none" xmlns="http://www.w3.org/2000/svg">
<path fill-rule="evenodd" clip-rule="evenodd" d="M18.4893 0.987717C18.8799 1.37824 18.8799 2.01141 18.4893 2.40193L7.48933 13.4019C7.09881 13.7925 6.46564 13.7925 6.07512 13.4019L1.07512 8.40193C0.684595 8.01141 0.684595 7.37824 1.07512 6.98772C1.46564 6.59719 2.09881 6.59719 2.48933 6.98772L6.78223 11.2806L17.0751 0.987717C17.4656 0.597193 18.0988 0.597193 18.4893 0.987717Z" fill="white"/>
</svg>
