<svg width="74" height="60" viewBox="0 0 74 60" fill="none" xmlns="http://www.w3.org/2000/svg">
<path id="Combined Shape" fill-rule="evenodd" clip-rule="evenodd" d="M24.6002 0C15.1754 0 5.4796 10.1667 1.54931 24.172C-0.469376 31.3687 -0.518043 39.2136 1.41902 45.6963C3.565 52.8817 7.98198 57.7416 13.8568 59.3778C15.3356 59.7904 16.8586 60 18.3839 60C25.8716 60 32.5109 54.9759 34.5296 47.7845C37.02 38.9092 31.8011 29.6684 22.8922 27.1847C18.9432 26.0887 14.5824 26.5058 10.9269 28.3083C11.0444 27.8174 11.1665 27.3466 11.2953 26.8863C14.5517 15.2856 20.9394 10.066 24.4347 10.066L24.5889 10.069C25.2606 10.0996 25.9068 9.64823 26.094 8.98049L28.034 2.06588C28.1486 1.66001 28.0849 1.2258 27.8596 0.86843C27.6334 0.513299 27.268 0.268587 26.8502 0.195471C26.1134 0.0656545 25.3572 0 24.6002 0ZM65.7001 0.195471C64.9641 0.0656545 64.2071 0.00149215 63.4516 0.00149215C54.0246 0.00149215 44.3302 10.1667 40.3977 24.1706C38.3783 31.3679 38.3303 39.2136 40.2667 45.6963C42.4134 52.8817 46.8304 57.7416 52.7045 59.3778C54.184 59.7904 55.707 60 57.2323 60C64.72 60 71.3593 54.9759 73.378 47.7845C75.8699 38.9092 70.6495 29.6684 61.7421 27.1847C57.7931 26.0887 53.4338 26.5058 49.7768 28.3083C49.8936 27.8203 50.0156 27.3496 50.1452 26.8863C53.4016 15.2856 59.7901 10.066 63.2853 10.066L63.4381 10.069C64.1217 10.0996 64.7559 9.64823 64.9431 8.98049L66.8839 2.06588C66.9977 1.66001 66.9341 1.2258 66.7087 0.86843C66.4833 0.513299 66.1172 0.267094 65.7001 0.195471Z" fill="url(#paint0_linear)"/>
<defs>
<linearGradient id="paint0_linear" x1="66.3932" y1="60" x2="-1.46874" y2="60" gradientUnits="userSpaceOnUse">
<stop stop-color="#206BB5"/>
<stop offset="1" stop-color="#1B80E3"/>
</linearGradient>
</defs>
</svg>
