<svg width="1155" height="576" viewBox="0 0 1155 576" fill="none" xmlns="http://www.w3.org/2000/svg">
<path fill-rule="evenodd" clip-rule="evenodd" d="M1150.62 128.118C1153.09 102.911 1134.28 80.6306 1109.02 78.8384L56.6691 4.18565C27.0768 2.08641 2.68445 27.0661 5.48718 56.6001L48.1949 506.639C51.8745 545.413 85.3472 574.47 124.254 572.664L1066.57 528.91C1092.38 527.712 1113.39 507.751 1115.91 482.041L1150.62 128.118Z" fill="url(#paint0_linear)"/>
<mask id="mask0" mask-type="alpha" maskUnits="userSpaceOnUse" x="5" y="3" width="1146" height="570">
<path fill-rule="evenodd" clip-rule="evenodd" d="M1150.49 127.943C1152.96 102.736 1134.15 80.4556 1108.89 78.6634L56.5355 4.01065C26.9432 1.9114 2.5509 26.8911 5.35364 56.425L48.0614 506.464C51.7411 545.238 85.2137 574.295 124.121 572.488L1066.44 528.735C1092.24 527.537 1113.26 507.576 1115.78 481.866L1150.49 127.943Z" fill="white"/>
</mask>
<g mask="url(#mask0)">
<path opacity="0.071806" fill-rule="evenodd" clip-rule="evenodd" d="M-30.9051 528.636C-30.9051 528.636 303.464 601.423 509.254 449.158C715.045 296.893 1016.95 217.606 1143.34 231.729C1269.72 245.852 1374.59 509.046 1374.59 509.046L1312.52 947.818L878.115 1119.13L328.32 932.186L-50.8041 791.971L-30.9051 528.636Z" fill="white"/>
<path opacity="0.081806" fill-rule="evenodd" clip-rule="evenodd" d="M39.8849 437.946C39.8849 437.946 357.297 571.417 584.807 459.495C812.316 347.572 1122.58 325.28 1244.74 362.544C1366.9 399.808 1427.22 678.383 1427.22 678.383L1294.5 1099.02L838.742 1187.45L327.803 901.749L-22.6813 693.603L39.8849 437.946Z" fill="white"/>
</g>
<defs>
<linearGradient id="paint0_linear" x1="122.587" y1="572.915" x2="1174.09" y2="572.915" gradientUnits="userSpaceOnUse">
<stop stop-color="#206BB5"/>
<stop offset="1" stop-color="#1B80E3"/>
</linearGradient>
</defs>
</svg>
