{
  "version": 2,
  "projects": {
    "ap-site": "apps/ap-site",
    "jeli-help-site": "apps/jeli-help-site",
    "jeli-site": "apps/jeli-site",
    "mst-help-site": "apps/mst-help-site",
    "mst-nepal-site": "apps/mst-nepal-site",
    "mst-training-site": "apps/mst-training-site",
    "nepal-help-site": "apps/nepal-help-site",
    "shared-ui": "libs/shared-ui",
    "utils": "libs/utils"
  }
}
