<svg width="166" height="108" viewBox="0 0 166 108" fill="none" xmlns="http://www.w3.org/2000/svg">
<g clip-path="url(#clip0)">
<path opacity="0.802502" fill-rule="evenodd" clip-rule="evenodd" d="M155.951 14.6113C155.498 10.9101 152.094 8.3025 148.402 8.82836L7.498 28.8993C3.90696 29.4109 1.3857 32.7022 1.82697 36.3026L7.61392 83.5197C8.0258 86.8803 10.8936 89.397 14.2793 89.3689L157.498 88.183C161.475 88.1501 164.537 84.6612 164.053 80.7134L155.951 14.6113Z" fill="#F0F0F0"/>
<path fill-rule="evenodd" clip-rule="evenodd" d="M5.00882 77.3634C5.00882 80.9414 7.83615 83.88 11.4116 84.0181L153.706 89.5115C157.482 89.6573 160.623 86.6356 160.623 82.8568V32.0303C160.623 28.6487 158.089 25.8039 154.73 25.4149L12.4346 8.93452C8.47948 8.47644 5.00882 11.5683 5.00882 15.5499L5.00882 77.3634Z" fill="white"/>
<mask id="mask0" mask-type="alpha" maskUnits="userSpaceOnUse" x="5" y="8" width="156" height="82">
<path fill-rule="evenodd" clip-rule="evenodd" d="M5.00882 77.3634C5.00882 80.9414 7.83615 83.88 11.4116 84.0181L153.706 89.5115C157.482 89.6573 160.623 86.6356 160.623 82.8568V32.0303C160.623 28.6487 158.089 25.8039 154.73 25.4149L12.4346 8.93452C8.47948 8.47644 5.00882 11.5683 5.00882 15.5499L5.00882 77.3634Z" fill="white"/>
</mask>
<g mask="url(#mask0)">
<path fill-rule="evenodd" clip-rule="evenodd" d="M9.60566 59.7307L21.8168 61.0585L10.282 105.786L4.66429 105.175L9.60566 59.7307Z" fill="#E7E8ED"/>
<path fill-rule="evenodd" clip-rule="evenodd" d="M-2.45757 58.4191L9.7536 59.7469L-1.78121 104.474L-7.39894 103.864L-2.45757 58.4191Z" fill="#E7E8ED"/>
<path d="M20.8094 70.6495C21.49 64.308 17.045 57.3018 10.7045 56.6124L9.34938 56.465C3.00402 55.7751 -2.69924 60.3597 -3.38919 66.705V66.705C-4.07915 73.0504 0.505456 78.7537 6.85082 79.4436L8.21805 79.5923C14.5654 80.2825 20.1281 76.9978 20.8094 70.6495V70.6495Z" fill="#EAEBEE"/>
<path d="M-0.598873 41.0436C-0.11962 36.636 3.84192 33.4515 8.24948 33.9307L16.5053 34.8284C20.9128 35.3077 24.0973 39.2692 23.6181 43.6768L20.6557 70.9208L-3.56124 68.2876L-0.598873 41.0436Z" fill="#202020"/>
<path d="M18.4721 41.9084C17.7102 40.6719 18.095 39.0519 19.3315 38.2901V38.2901C20.568 37.5283 22.188 37.9131 22.9499 39.1496L29.3388 49.5192C30.1006 50.7558 29.7158 52.3757 28.4793 53.1376V53.1376C27.2428 53.8994 25.6228 53.5146 24.861 52.2781L18.4721 41.9084Z" fill="#202020"/>
<path d="M8.01066 39.9683L8.55753 34.9389L10.5317 35.9889C10.5317 35.9889 10.7442 38.0299 10.9234 40.069C11.3105 44.4749 11.4217 53.2027 10.8451 57.3241L8.77568 42.6807L9.59725 41.3282L8.01066 39.9683Z" fill="#373737"/>
<path d="M18.6112 41.0678L19.1375 36.2282L17.2435 36.7568C17.2435 36.7568 16.3818 39.1115 15.8317 40.3575C14.099 44.2824 12.2057 52.7494 11.9074 56.7432L17.2302 43.4477L16.6734 41.9997L18.6112 41.0678Z" fill="#373737"/>
<path d="M11.0762 48.9076C11.5011 44.9994 10.6611 38.2136 10.4569 36.6767L17.0616 37.3949C16.2546 39.0548 13.627 46.575 13.3465 49.1545C12.6704 55.3724 11.0503 64.3771 11.7535 67.646C12.1697 69.5804 14.8079 70.2849 15.4271 70.3523L4.69458 69.1853C5.80286 69.2359 7.21504 69.0417 8.65759 67.3093C10.8194 64.7132 10.6329 52.9838 11.0762 48.9076Z" fill="#EAEBEE"/>
<path fill-rule="evenodd" clip-rule="evenodd" d="M37.0786 44.8367C36.7245 44.2839 36.1666 43.8932 35.526 43.7495C34.8854 43.6059 34.2141 43.7208 33.6578 44.0694L26.3073 48.6998C25.7092 49.0813 25.287 49.6845 25.1333 50.3771C24.9797 51.0697 25.1073 51.7949 25.488 52.3935C25.8145 52.9079 26.3315 53.2722 26.9259 53.4065C27.5202 53.5407 28.1436 53.4342 28.6596 53.11L36.3128 48.2563C36.5886 48.083 36.8274 47.8568 37.0154 47.5907C37.2034 47.3246 37.3368 47.024 37.408 46.7061C37.4792 46.3882 37.4867 46.0593 37.4302 45.7385C37.3737 45.4176 37.2542 45.1112 37.0786 44.8367V44.8367Z" fill="#202020"/>
<path fill-rule="evenodd" clip-rule="evenodd" d="M37.1045 44.8158C36.7502 44.2632 36.1922 43.8727 35.5516 43.7293C34.911 43.5859 34.2397 43.7011 33.6836 44.0498C33.6836 44.0498 32.7364 44.6429 32.2384 44.9591C30.269 46.2082 32.8479 50.4551 34.9412 49.129C35.4148 48.8324 36.3386 48.2368 36.3386 48.2368C36.6152 48.064 36.8547 47.8379 37.0433 47.5718C37.2318 47.3057 37.3656 47.0047 37.4368 46.6864C37.5081 46.3682 37.5154 46.0389 37.4584 45.7178C37.4013 45.3966 37.2811 45.0901 37.1045 44.8158V44.8158Z" fill="#EAE7E7"/>
<path fill-rule="evenodd" clip-rule="evenodd" d="M13.078 49.5821C12.7237 49.0294 12.1656 48.639 11.525 48.4956C10.8845 48.3521 10.2132 48.4673 9.65703 48.8161C9.65703 48.8161 8.70988 49.4092 8.21188 49.7254C6.2425 50.9745 8.82134 55.2214 10.9147 53.8953C11.3882 53.5987 12.312 53.003 12.312 53.003C12.5886 52.8302 12.8282 52.6042 13.0167 52.3381C13.2053 52.0719 13.339 51.771 13.4103 51.4527C13.4816 51.1344 13.4889 50.8052 13.4318 50.484C13.3748 50.1629 13.2545 49.8563 13.078 49.5821V49.5821Z" fill="#EAE7E7"/>
<path fill-rule="evenodd" clip-rule="evenodd" d="M33.862 45.3932C33.9438 45.99 34.2008 46.549 34.6005 46.9997C35.0002 47.4503 35.5245 47.7723 36.1071 47.9249C36.6898 48.0775 37.3047 48.0539 37.8739 47.857C38.4432 47.6601 38.9413 47.2989 39.3051 46.8189C39.669 46.3389 39.8824 45.7618 39.9182 45.1605C39.9541 44.5592 39.8108 43.9608 39.5065 43.441C39.2022 42.9212 38.7506 42.5033 38.2087 42.2402C37.6669 41.9771 37.0592 41.8806 36.4625 41.9629C35.6658 42.0794 34.9467 42.5043 34.4603 43.1459C33.9738 43.7876 33.759 44.5947 33.862 45.3932V45.3932Z" fill="#F7B9A9"/>
<path fill-rule="evenodd" clip-rule="evenodd" d="M9.83529 50.1598C9.91717 50.7565 10.1742 51.3156 10.5738 51.7662C10.9735 52.2169 11.4978 52.5389 12.0805 52.6915C12.6632 52.8441 13.278 52.8204 13.8472 52.6236C14.4165 52.4267 14.9146 52.0654 15.2785 51.5854C15.6424 51.1054 15.8557 50.5283 15.8916 49.927C15.9274 49.3258 15.7841 48.7274 15.4798 48.2076C15.1755 47.6877 14.7239 47.2699 14.1821 47.0068C13.6402 46.7437 13.0325 46.6472 12.4359 46.7295C11.6391 46.846 10.92 47.2708 10.4336 47.9125C9.94715 48.5541 9.73229 49.3612 9.83529 50.1598V50.1598Z" fill="#F7B9A9"/>
<path fill-rule="evenodd" clip-rule="evenodd" d="M13.4061 40.3729C13.7466 40.4102 14.0911 40.3801 14.42 40.2842C14.7488 40.1883 15.0555 40.0284 15.3224 39.8138C15.5894 39.5992 15.8114 39.334 15.9758 39.0335C16.1402 38.733 16.2436 38.403 16.2803 38.0624L16.3425 37.49C16.3796 37.1496 16.3492 36.8052 16.2531 36.4765C16.157 36.1478 15.9971 35.8413 15.7826 35.5744C15.568 35.3075 15.303 35.0855 15.0027 34.921C14.7023 34.7566 14.3725 34.6528 14.0321 34.6158C13.6917 34.5788 13.3473 34.6092 13.0186 34.7053C12.69 34.8014 12.3834 34.9612 12.1165 35.1758C11.8496 35.3903 11.6276 35.6553 11.4631 35.9557C11.2986 36.256 11.1949 36.5858 11.1579 36.9263L11.0957 37.4987C11.0583 37.8392 11.0884 38.1837 11.1843 38.5125C11.2803 38.8413 11.4401 39.148 11.6547 39.415C11.8693 39.682 12.1345 39.904 12.435 40.0684C12.7356 40.2327 13.0656 40.3362 13.4061 40.3729V40.3729Z" fill="#E2AA9F"/>
<path fill-rule="evenodd" clip-rule="evenodd" d="M6.21861 28.2801C5.64866 33.5218 9.27817 38.2191 14.3364 38.7691C19.3947 39.3191 23.9491 35.5105 24.5189 30.2699C25.0887 25.0294 21.4593 20.3309 16.4011 19.7809C11.3428 19.2308 6.7905 23.0205 6.21861 28.2801Z" fill="#F7B9A9"/>
<path fill-rule="evenodd" clip-rule="evenodd" d="M6.2247 28.2258C6.4569 25.9981 7.43776 23.9152 9.00659 22.3184C6.97318 28.0737 6.83362 34.7116 13.4421 38.6721C8.85425 37.7109 5.68206 33.2163 6.2247 28.2258Z" fill="#E2AA9F"/>
<path fill-rule="evenodd" clip-rule="evenodd" d="M6.27364 27.8198C6.21794 28.2201 6.18464 28.6232 6.17388 29.0272C6.16876 29.7701 6.24291 30.5115 6.39503 31.2385C6.558 32.0312 6.81435 32.8016 7.1587 33.5337C7.35953 33.0804 7.58461 32.6383 7.83295 32.2093C8.02633 31.8608 8.24075 31.5243 8.475 31.2019C9.02911 30.4544 9.48473 30.1159 9.92271 29.3909C10.9303 27.7136 10.0484 26.8473 10.922 25.7195C11.7974 24.5738 13.317 24.4006 14.8336 24.2644C19.4808 23.8108 22.5682 25.9706 23.6756 24.5862C23.8504 24.3639 23.9519 24.0927 23.9661 23.8101C24.0725 22.1477 21.1241 20.6043 19.3652 20.0385C15.7454 18.8711 10.7249 19.6529 8.29089 22.8208C7.02233 24.4754 6.41738 26.8292 6.27364 27.8198Z" fill="#253051"/>
<path fill-rule="evenodd" clip-rule="evenodd" d="M8.54607 29.0646C8.61985 29.9599 9.11737 30.6306 9.6723 30.595C10.2272 30.5593 10.6346 29.7926 10.5587 28.9168C10.4848 28.0226 9.98739 27.3507 9.43133 27.3863C8.87429 27.4414 8.47017 28.1888 8.54607 29.0646Z" fill="#F7B9A9"/>
<path fill-rule="evenodd" clip-rule="evenodd" d="M17.4245 31.0302C17.5745 31.0428 17.7248 31.0106 17.8566 30.9377C17.9883 30.8648 18.0954 30.7545 18.1645 30.6207C18.2335 30.4869 18.2614 30.3357 18.2444 30.1861C18.2275 30.0365 18.1667 29.8953 18.0695 29.7803C17.9724 29.6653 17.8433 29.5817 17.6986 29.54C17.554 29.4984 17.4002 29.5005 17.2568 29.5463C17.1133 29.592 16.9867 29.6792 16.8928 29.797C16.799 29.9147 16.7421 30.0576 16.7295 30.2076C16.7139 30.4085 16.7781 30.6076 16.9081 30.7615C17.0382 30.9155 17.2237 31.012 17.4245 31.0302Z" fill="white"/>
<path fill-rule="evenodd" clip-rule="evenodd" d="M22.6531 31.5986C22.8031 31.6111 22.9535 31.5789 23.0852 31.506C23.2169 31.4331 23.3241 31.3228 23.3932 31.1891C23.4622 31.0553 23.49 30.904 23.4731 30.7544C23.4562 30.6048 23.3953 30.4636 23.2982 30.3486C23.201 30.2336 23.072 30.15 22.9273 30.1083C22.7826 30.0667 22.6289 30.0689 22.4854 30.1146C22.342 30.1603 22.2154 30.2476 22.1215 30.3653C22.0277 30.483 21.9708 30.6259 21.9581 30.7759C21.9425 30.9769 22.0067 31.1759 22.1368 31.3299C22.2669 31.4838 22.4524 31.5804 22.6531 31.5986Z" fill="white"/>
<path fill-rule="evenodd" clip-rule="evenodd" d="M17.5204 30.762C17.6568 30.7737 17.7936 30.7446 17.9134 30.6785C18.0333 30.6124 18.1309 30.5122 18.1939 30.3906C18.2568 30.269 18.2823 30.1315 18.267 29.9954C18.2518 29.8593 18.1966 29.7309 18.1083 29.6262C18.02 29.5215 17.9027 29.4454 17.7712 29.4075C17.6396 29.3695 17.4998 29.3714 17.3693 29.4129C17.2389 29.4545 17.1237 29.5338 17.0383 29.6408C16.953 29.7479 16.9012 29.8778 16.8897 30.0142C16.8764 30.1966 16.9349 30.3769 17.0528 30.5166C17.1706 30.6563 17.3384 30.7444 17.5204 30.762V30.762Z" fill="#253051"/>
<path fill-rule="evenodd" clip-rule="evenodd" d="M22.749 31.3306C22.8854 31.3423 23.0222 31.3132 23.1421 31.2471C23.262 31.181 23.3596 31.0808 23.4225 30.9592C23.4854 30.8376 23.5109 30.7001 23.4957 30.564C23.4804 30.4279 23.4252 30.2994 23.3369 30.1948C23.2487 30.0901 23.1313 30.014 22.9998 29.976C22.8683 29.9381 22.7284 29.94 22.598 29.9815C22.4675 30.0231 22.3523 30.1024 22.267 30.2094C22.1816 30.3164 22.1299 30.4464 22.1183 30.5828C22.105 30.7651 22.1635 30.9455 22.2814 31.0852C22.3992 31.2249 22.5671 31.313 22.749 31.3306V31.3306Z" fill="#253051"/>
<path fill-rule="evenodd" clip-rule="evenodd" d="M17.8745 32.4789C17.8492 32.8993 17.9996 33.3138 18.2926 33.6311C18.5857 33.9484 18.9973 34.1426 19.4371 34.171C19.8769 34.1994 20.3087 34.0595 20.6376 33.7823C20.9665 33.5051 21.1655 33.1131 21.1909 32.6927L17.8745 32.4789Z" fill="#A58476"/>
<path fill-rule="evenodd" clip-rule="evenodd" d="M21.9332 28.0746L23.9833 28.8251C24.0334 28.8446 24.0786 28.874 24.116 28.9114C24.1534 28.9488 24.182 28.9932 24.1999 29.0418L24.2129 29.096C24.2205 29.1114 24.2241 29.1282 24.2234 29.1452C24.2226 29.1621 24.2176 29.1785 24.2087 29.1931C24.1998 29.2077 24.1873 29.22 24.1722 29.2289C24.1572 29.2378 24.14 29.2432 24.1223 29.2444V29.2444C24.1047 29.2425 24.0654 29.2561 24.0497 29.2365L21.8615 28.7347C21.7854 28.7207 21.7157 28.6846 21.6617 28.6315C21.6077 28.5783 21.5722 28.5108 21.5601 28.4382L21.5398 28.2777C21.5354 28.2446 21.5386 28.2111 21.5493 28.1795C21.56 28.1479 21.5779 28.119 21.6018 28.0948C21.6256 28.0706 21.6548 28.0518 21.6873 28.0396C21.7197 28.0274 21.7547 28.0221 21.7897 28.0242V28.0242C21.8384 28.0386 21.8863 28.0554 21.9332 28.0746V28.0746Z" fill="#243051"/>
<path fill-rule="evenodd" clip-rule="evenodd" d="M18.2555 27.9332L15.9723 28.316C15.9145 28.3253 15.8593 28.348 15.8109 28.3825C15.7625 28.417 15.7221 28.4623 15.6927 28.5151L15.6691 28.5699C15.6578 28.5859 15.6507 28.6045 15.6484 28.624C15.6461 28.6436 15.6487 28.6634 15.6559 28.6815C15.6632 28.6996 15.6748 28.7154 15.6897 28.7274C15.7046 28.7394 15.7223 28.7471 15.741 28.7499V28.7499C15.7596 28.7519 15.7934 28.7751 15.814 28.7578L18.1734 28.6885C18.2523 28.6911 18.3303 28.669 18.3973 28.6252C18.4644 28.5813 18.5175 28.5177 18.5497 28.4425L18.6041 28.2763C18.6154 28.2421 18.6195 28.2058 18.616 28.17C18.6125 28.1341 18.6016 28.0996 18.584 28.0687C18.5664 28.0377 18.5426 28.0112 18.5141 27.9909C18.4856 27.9706 18.4531 27.9569 18.419 27.9509C18.3683 27.9255 18.3105 27.9192 18.2555 27.9332V27.9332Z" fill="#243051"/>
<path fill-rule="evenodd" clip-rule="evenodd" d="M21.8883 25.0138C22.1472 25.0334 22.4003 25.1004 22.6359 25.2116C24.6101 26.1849 24.4362 30.7106 24.4551 30.5367C24.5428 30.0878 24.5986 29.6331 24.6221 29.1763C24.6486 28.3403 24.5564 27.5058 24.3484 26.6994C24.1574 25.9417 23.8638 25.2166 23.4762 24.5455C23.7015 24.3766 23.825 24.0987 23.7558 23.8768C23.7236 23.7747 23.6608 23.6863 23.5764 23.6242C23.0011 24.086 22.445 24.5476 21.8883 25.0138Z" fill="#253051"/>
<path fill-rule="evenodd" clip-rule="evenodd" d="M6.15583 27.5773L6.20191 27.5607C6.53498 27.4412 6.86655 27.3249 7.20313 27.2148C7.76868 27.0239 8.33634 26.845 8.9061 26.6781C9.30259 26.5598 9.69988 26.448 10.098 26.3427C10.208 26.3122 10.3178 26.2832 10.4275 26.2558C10.4847 26.2415 10.5442 26.2264 10.599 26.213C11.2949 26.034 11.9935 25.872 12.6948 25.727C13.2917 25.6031 13.8907 25.4909 14.4918 25.3903C14.7717 25.3423 15.0512 25.2976 15.3329 25.2544C15.5095 25.227 15.6792 25.2011 15.8597 25.1798C16.1624 25.1411 16.4665 25.1105 16.7711 25.0856C16.968 25.0706 17.1659 25.0558 17.3643 25.0478C17.3711 25.0474 17.3779 25.0481 17.3845 25.05V25.05L17.4779 25.0465C17.688 25.0352 17.8973 25.0307 18.1065 25.0273C18.5247 25.0228 18.9435 25.0331 19.3627 25.0502C19.4982 25.057 19.6346 25.0661 19.7698 25.0752C20.4303 25.1242 21.0877 25.2056 21.742 25.3192C22.4977 25.4482 23.2451 25.6218 23.9804 25.8388C24.0399 25.8555 24.0994 25.8722 24.1597 25.8913L24.1606 25.8834L24.2912 21.9686L24.3111 21.5035L24.3581 20.3922L24.4487 18.275L24.5025 16.9973L24.5533 15.8205C24.5648 15.5515 24.5036 15.2845 24.3763 15.0475C24.3054 14.914 24.2141 14.7925 24.1057 14.6872C23.9724 14.5564 23.8153 14.4525 23.6429 14.3811C23.6311 14.375 23.6187 14.3698 23.606 14.3657C23.4024 14.2771 23.1812 14.2363 22.9594 14.2464C22.7375 14.2566 22.521 14.3175 22.3262 14.4244L21.7821 14.7211L19.1848 16.144L19.0762 16.2038L18.6974 16.4093L18.4668 16.5365L17.8369 16.8807L16.9994 17.3388L15.4305 18.1982L15.0897 18.3885L13.737 19.1282L13.0316 19.5085L12.6236 19.7324L10.8461 20.7045L9.27007 21.5665C8.27995 22.1118 7.54149 23.0228 7.21207 24.1053L6.15583 27.5773Z" fill="#E3955C"/>
<path fill-rule="evenodd" clip-rule="evenodd" d="M21.2348 23.342L21.9451 24.8389L23.3952 24.0587L24.2156 21.5359L24.2157 21.5348L24.2625 20.4332L24.2626 20.4321L23.7368 19.3256L22.2845 20.1055L21.2348 23.342Z" fill="#F3C0B7"/>
<path fill-rule="evenodd" clip-rule="evenodd" d="M17.2923 25.0292C17.2992 25.0288 17.3061 25.0295 17.3127 25.0314V25.0314L17.4069 25.0281C17.6187 25.0171 17.8297 25.0129 18.0406 25.0098C18.4622 25.0058 18.8845 25.0166 19.3072 25.0343C19.4437 25.0412 19.5812 25.0505 19.7176 25.0597L20.2499 23.4372L19.5245 21.9306L18.049 22.7122L17.2923 25.0292Z" fill="#20201F"/>
<path fill-rule="evenodd" clip-rule="evenodd" d="M16.881 17.2883L17.2381 18.0622L18.7197 17.2436L19.1053 16.0376L18.9954 16.0998L18.5986 16.3236L18.3654 16.4547L17.7281 16.8135L16.881 17.2883Z" fill="#F3C0B7"/>
<path fill-rule="evenodd" clip-rule="evenodd" d="M12.5833 19.6815L13.048 20.6693L14.458 19.9041L14.9534 18.3705L13.6511 19.09L12.9761 19.4637L12.5833 19.6815Z" fill="#20201F"/>
<path fill-rule="evenodd" clip-rule="evenodd" d="M10.2765 25.5321L10.5556 26.1069C11.2419 25.9351 11.9309 25.7798 12.6226 25.641L13.4671 23.0767L12.7549 21.6124L11.3166 22.3744L10.2765 25.5321Z" fill="#20201F"/>
<path fill-rule="evenodd" clip-rule="evenodd" d="M7.79599 22.7365L8.44799 24.0677L9.9456 23.291L10.8015 20.7038L9.18951 21.5587C8.6441 21.8501 8.16911 22.2516 7.79599 22.7365V22.7365Z" fill="#F3C0B7"/>
<path fill-rule="evenodd" clip-rule="evenodd" d="M6.15587 27.5772C6.48682 27.4554 6.81628 27.3368 7.15069 27.2246C7.71262 27.03 8.27661 26.8474 8.84266 26.6771L8.92829 26.4076L8.21926 24.8779L6.76318 25.6803L6.15587 27.5772Z" fill="#F3C0B7"/>
<path fill-rule="evenodd" clip-rule="evenodd" d="M12.617 25.7739C13.2168 25.6496 13.8187 25.537 14.4228 25.436C14.7041 25.3878 14.9849 25.343 15.268 25.2995C15.4455 25.272 15.616 25.2461 15.7974 25.2247C16.1016 25.1858 16.4071 25.1551 16.7133 25.1302C16.9111 25.1152 17.11 25.1003 17.3094 25.0923C17.3162 25.0918 17.3231 25.0926 17.3296 25.0945V25.0945L17.4236 25.091L18.0667 22.7634L19.5385 21.9725L20.2597 23.4905L21.2661 23.3716L22.3313 20.0899L23.8036 19.2944L24.3375 20.4153L24.4284 18.2892L24.4824 17.0061L24.5333 15.8243C24.5448 15.5543 24.4833 15.2861 24.3554 15.0481C24.2841 14.914 24.1923 14.792 24.0833 14.6863C23.9495 14.5549 23.7916 14.4505 23.6183 14.3788C23.6064 14.3727 23.594 14.3675 23.5812 14.3634C23.3766 14.2743 23.1543 14.2333 22.9314 14.2435C22.7085 14.2537 22.4908 14.3148 22.2951 14.4222L21.7483 14.7201L19.1384 16.1488L19.0292 16.2088L18.7577 17.3209L17.286 18.1108L17.0244 18.9226L15.5553 19.7093L14.4878 22.9919L13.4825 23.1109L12.617 25.7739Z" fill="#C26262"/>
<path fill-rule="evenodd" clip-rule="evenodd" d="M23.3202 16.9669L24.0548 18.5249L24.425 18.3305L24.4811 17.0121L24.534 15.7979C24.5459 15.5204 24.4834 15.2449 24.3531 15.0004C24.2805 14.8628 24.1869 14.7374 24.0759 14.6289L23.3202 16.9669Z" fill="#F3C0B7"/>
<path fill-rule="evenodd" clip-rule="evenodd" d="M18.9945 19.6176L20.0419 16.3809L21.4863 15.6001L22.1923 17.0966L21.145 20.3333L19.7016 21.1142L18.9945 19.6176Z" fill="#20201F"/>
<path fill-rule="evenodd" clip-rule="evenodd" d="M14.4627 22.8843L15.5428 19.6512L17.05 18.8773L17.7981 20.3783L16.718 23.6114L15.2095 24.3853L14.4627 22.8843Z" fill="#F3C0B7"/>
<path d="M42.6206 38.7005C42.0926 38.7005 41.8286 38.4285 41.8286 37.8845V30.9605C41.8286 30.4165 42.1006 30.1445 42.6446 30.1445H46.8326C47.2486 30.1445 47.4566 30.3445 47.4566 30.7445C47.4566 31.1605 47.2486 31.3685 46.8326 31.3685H43.3646V33.7565H46.5806C46.9966 33.7565 47.2046 33.9565 47.2046 34.3565C47.2046 34.7725 46.9966 34.9805 46.5806 34.9805H43.3646V37.8845C43.3646 38.4285 43.1166 38.7005 42.6206 38.7005ZM50.8879 38.7245C50.2799 38.7245 49.7519 38.6005 49.3039 38.3525C48.8559 38.1045 48.5079 37.7525 48.2599 37.2965C48.0119 36.8325 47.8879 36.2885 47.8879 35.6645C47.8879 35.0405 48.0119 34.5005 48.2599 34.0445C48.5079 33.5885 48.8559 33.2365 49.3039 32.9885C49.7519 32.7405 50.2799 32.6165 50.8879 32.6165C51.4959 32.6165 52.0239 32.7405 52.4719 32.9885C52.9199 33.2365 53.2679 33.5885 53.5159 34.0445C53.7639 34.5005 53.8879 35.0405 53.8879 35.6645C53.8879 36.2885 53.7639 36.8325 53.5159 37.2965C53.2679 37.7525 52.9199 38.1045 52.4719 38.3525C52.0239 38.6005 51.4959 38.7245 50.8879 38.7245ZM50.8879 37.5845C51.3359 37.5845 51.6959 37.4245 51.9679 37.1045C52.2399 36.7765 52.3759 36.2965 52.3759 35.6645C52.3759 35.0245 52.2399 34.5485 51.9679 34.2365C51.6959 33.9165 51.3359 33.7565 50.8879 33.7565C50.4399 33.7565 50.0799 33.9165 49.8079 34.2365C49.5359 34.5485 49.3999 35.0245 49.3999 35.6645C49.3999 36.2965 49.5359 36.7765 49.8079 37.1045C50.0799 37.4245 50.4399 37.5845 50.8879 37.5845ZM55.894 38.7005C55.382 38.7005 55.126 38.4445 55.126 37.9325V33.3965C55.126 32.8925 55.37 32.6405 55.858 32.6405C56.346 32.6405 56.59 32.8925 56.59 33.3965V33.7685C56.878 33.0805 57.494 32.6965 58.438 32.6165C58.782 32.5765 58.974 32.7725 59.014 33.2045C59.054 33.6285 58.846 33.8645 58.39 33.9125L58.126 33.9365C57.142 34.0325 56.65 34.5365 56.65 35.4485V37.9325C56.65 38.4445 56.398 38.7005 55.894 38.7005ZM66.143 38.7245C65.607 38.7245 65.083 38.6645 64.571 38.5445C64.067 38.4245 63.627 38.2445 63.251 38.0045C63.067 37.8845 62.955 37.7365 62.915 37.5605C62.875 37.3845 62.887 37.2205 62.951 37.0685C63.023 36.9085 63.131 36.8005 63.275 36.7445C63.427 36.6805 63.599 36.7085 63.791 36.8285C64.143 37.0365 64.515 37.1885 64.907 37.2845C65.299 37.3805 65.711 37.4285 66.143 37.4285C66.775 37.4285 67.235 37.3245 67.523 37.1165C67.811 36.9005 67.955 36.6245 67.955 36.2885C67.955 36.0085 67.851 35.7885 67.643 35.6285C67.443 35.4685 67.095 35.3365 66.599 35.2325L65.279 34.9565C63.775 34.6365 63.023 33.8645 63.023 32.6405C63.023 32.1125 63.163 31.6525 63.443 31.2605C63.723 30.8685 64.111 30.5645 64.607 30.3485C65.103 30.1325 65.675 30.0245 66.323 30.0245C66.803 30.0245 67.259 30.0845 67.691 30.2045C68.123 30.3245 68.511 30.5005 68.855 30.7325C69.015 30.8445 69.111 30.9845 69.143 31.1525C69.175 31.3125 69.155 31.4645 69.083 31.6085C69.011 31.7445 68.895 31.8405 68.735 31.8965C68.583 31.9445 68.403 31.9085 68.195 31.7885C67.899 31.6205 67.599 31.5005 67.295 31.4285C66.991 31.3565 66.663 31.3205 66.311 31.3205C65.759 31.3205 65.327 31.4365 65.015 31.6685C64.703 31.9005 64.547 32.2045 64.547 32.5805C64.547 32.8685 64.643 33.1005 64.835 33.2765C65.027 33.4445 65.355 33.5765 65.819 33.6725L67.127 33.9485C67.919 34.1165 68.507 34.3805 68.891 34.7405C69.283 35.1005 69.479 35.5805 69.479 36.1805C69.479 36.6845 69.343 37.1285 69.071 37.5125C68.799 37.8965 68.411 38.1965 67.907 38.4125C67.411 38.6205 66.823 38.7245 66.143 38.7245ZM71.4214 38.7005C70.9254 38.7005 70.6774 38.4445 70.6774 37.9325V33.3965C70.6774 32.8925 70.9214 32.6405 71.4094 32.6405C71.8974 32.6405 72.1414 32.8925 72.1414 33.3965V33.6365C72.3174 33.3165 72.5614 33.0685 72.8734 32.8925C73.1854 32.7085 73.5454 32.6165 73.9534 32.6165C74.8334 32.6165 75.4094 33.0005 75.6814 33.7685C75.8654 33.4085 76.1294 33.1285 76.4734 32.9285C76.8174 32.7205 77.2094 32.6165 77.6494 32.6165C78.9694 32.6165 79.6294 33.4205 79.6294 35.0285V37.9325C79.6294 38.4445 79.3774 38.7005 78.8734 38.7005C78.3774 38.7005 78.1294 38.4445 78.1294 37.9325V35.0885C78.1294 34.6405 78.0534 34.3125 77.9014 34.1045C77.7574 33.8965 77.5094 33.7925 77.1574 33.7925C76.7654 33.7925 76.4574 33.9325 76.2334 34.2125C76.0094 34.4845 75.8974 34.8645 75.8974 35.3525V37.9325C75.8974 38.4445 75.6494 38.7005 75.1534 38.7005C74.6494 38.7005 74.3974 38.4445 74.3974 37.9325V35.0885C74.3974 34.6405 74.3214 34.3125 74.1694 34.1045C74.0254 33.8965 73.7814 33.7925 73.4374 33.7925C73.0454 33.7925 72.7374 33.9325 72.5134 34.2125C72.2894 34.4845 72.1774 34.8645 72.1774 35.3525V37.9325C72.1774 38.4445 71.9254 38.7005 71.4214 38.7005ZM83.1088 38.7245C82.6848 38.7245 82.3048 38.6445 81.9688 38.4845C81.6408 38.3165 81.3808 38.0925 81.1888 37.8125C81.0048 37.5325 80.9128 37.2165 80.9128 36.8645C80.9128 36.4325 81.0248 36.0925 81.2488 35.8445C81.4728 35.5885 81.8368 35.4045 82.3408 35.2925C82.8448 35.1805 83.5208 35.1245 84.3688 35.1245H84.7888V34.8725C84.7888 34.4725 84.7008 34.1845 84.5248 34.0085C84.3488 33.8325 84.0528 33.7445 83.6368 33.7445C83.4048 33.7445 83.1528 33.7725 82.8808 33.8285C82.6168 33.8845 82.3368 33.9805 82.0408 34.1165C81.8488 34.2045 81.6888 34.2165 81.5608 34.1525C81.4328 34.0805 81.3448 33.9725 81.2968 33.8285C81.2568 33.6765 81.2648 33.5245 81.3208 33.3725C81.3848 33.2205 81.5088 33.1085 81.6928 33.0365C82.0608 32.8845 82.4128 32.7765 82.7488 32.7125C83.0928 32.6485 83.4048 32.6165 83.6848 32.6165C84.5408 32.6165 85.1768 32.8165 85.5928 33.2165C86.0088 33.6085 86.2168 34.2205 86.2168 35.0525V37.9325C86.2168 38.4445 85.9848 38.7005 85.5208 38.7005C85.0488 38.7005 84.8128 38.4445 84.8128 37.9325V37.6685C84.6768 37.9965 84.4608 38.2565 84.1648 38.4485C83.8688 38.6325 83.5168 38.7245 83.1088 38.7245ZM83.4208 37.6925C83.8128 37.6925 84.1368 37.5565 84.3928 37.2845C84.6568 37.0125 84.7888 36.6685 84.7888 36.2525V35.9885H84.3808C83.6288 35.9885 83.1048 36.0485 82.8088 36.1685C82.5208 36.2805 82.3768 36.4885 82.3768 36.7925C82.3768 37.0565 82.4688 37.2725 82.6528 37.4405C82.8368 37.6085 83.0928 37.6925 83.4208 37.6925ZM88.5073 38.7005C87.9953 38.7005 87.7393 38.4445 87.7393 37.9325V33.3965C87.7393 32.8925 87.9833 32.6405 88.4713 32.6405C88.9593 32.6405 89.2033 32.8925 89.2033 33.3965V33.7685C89.4913 33.0805 90.1073 32.6965 91.0513 32.6165C91.3953 32.5765 91.5873 32.7725 91.6273 33.2045C91.6673 33.6285 91.4593 33.8645 91.0033 33.9125L90.7393 33.9365C89.7553 34.0325 89.2633 34.5365 89.2633 35.4485V37.9325C89.2633 38.4445 89.0113 38.7005 88.5073 38.7005ZM95.4664 38.7245C93.9144 38.7245 93.1384 37.9565 93.1384 36.4205V33.8645H92.5144C92.1144 33.8645 91.9144 33.6765 91.9144 33.3005C91.9144 32.9245 92.1144 32.7365 92.5144 32.7365H93.1384V31.6445C93.1384 31.1405 93.3904 30.8885 93.8944 30.8885C94.3904 30.8885 94.6384 31.1405 94.6384 31.6445V32.7365H95.9104C96.3104 32.7365 96.5104 32.9245 96.5104 33.3005C96.5104 33.6765 96.3104 33.8645 95.9104 33.8645H94.6384V36.3365C94.6384 36.7205 94.7224 37.0085 94.8904 37.2005C95.0584 37.3925 95.3304 37.4885 95.7064 37.4885C95.8424 37.4885 95.9624 37.4765 96.0664 37.4525C96.1704 37.4285 96.2624 37.4125 96.3424 37.4045C96.4384 37.3965 96.5184 37.4285 96.5824 37.5005C96.6464 37.5645 96.6784 37.7005 96.6784 37.9085C96.6784 38.0685 96.6504 38.2125 96.5944 38.3405C96.5464 38.4605 96.4544 38.5445 96.3184 38.5925C96.2144 38.6245 96.0784 38.6525 95.9104 38.6765C95.7424 38.7085 95.5944 38.7245 95.4664 38.7245ZM45.8966 52.7245C44.9606 52.7245 44.1686 52.5485 43.5206 52.1965C42.8806 51.8445 42.3926 51.3445 42.0566 50.6965C41.7206 50.0485 41.5526 49.2805 41.5526 48.3925C41.5526 47.4965 41.7246 46.7245 42.0686 46.0765C42.4126 45.4205 42.9086 44.9165 43.5566 44.5645C44.2046 44.2045 44.9806 44.0245 45.8846 44.0245C46.3326 44.0245 46.7806 44.0805 47.2286 44.1925C47.6846 44.2965 48.1126 44.4765 48.5126 44.7325C48.6886 44.8365 48.7886 44.9765 48.8126 45.1525C48.8446 45.3205 48.8206 45.4805 48.7406 45.6325C48.6606 45.7845 48.5406 45.8925 48.3806 45.9565C48.2206 46.0125 48.0446 45.9845 47.8526 45.8725C47.5486 45.6965 47.2406 45.5685 46.9286 45.4885C46.6166 45.4085 46.2686 45.3685 45.8846 45.3685C44.9886 45.3685 44.3086 45.6285 43.8446 46.1485C43.3886 46.6685 43.1606 47.4165 43.1606 48.3925C43.1606 49.3765 43.3966 50.1245 43.8686 50.6365C44.3406 51.1485 45.0406 51.4045 45.9686 51.4045C46.2326 51.4045 46.5006 51.3845 46.7726 51.3445C47.0526 51.2965 47.3286 51.2285 47.6006 51.1405V49.1725H46.2806C45.8646 49.1725 45.6566 48.9805 45.6566 48.5965C45.6566 48.2205 45.8646 48.0325 46.2806 48.0325H48.2606C48.6766 48.0325 48.8846 48.2405 48.8846 48.6565V51.5725C48.8846 51.9405 48.7406 52.1765 48.4526 52.2805C48.1006 52.4085 47.6966 52.5165 47.2406 52.6045C46.7846 52.6845 46.3366 52.7245 45.8966 52.7245ZM53.1965 52.7245C52.5885 52.7245 52.0605 52.6005 51.6125 52.3525C51.1645 52.1045 50.8165 51.7525 50.5685 51.2965C50.3205 50.8325 50.1965 50.2885 50.1965 49.6645C50.1965 49.0405 50.3205 48.5005 50.5685 48.0445C50.8165 47.5885 51.1645 47.2365 51.6125 46.9885C52.0605 46.7405 52.5885 46.6165 53.1965 46.6165C53.8045 46.6165 54.3325 46.7405 54.7805 46.9885C55.2285 47.2365 55.5765 47.5885 55.8245 48.0445C56.0725 48.5005 56.1965 49.0405 56.1965 49.6645C56.1965 50.2885 56.0725 50.8325 55.8245 51.2965C55.5765 51.7525 55.2285 52.1045 54.7805 52.3525C54.3325 52.6005 53.8045 52.7245 53.1965 52.7245ZM53.1965 51.5845C53.6445 51.5845 54.0045 51.4245 54.2765 51.1045C54.5485 50.7765 54.6845 50.2965 54.6845 49.6645C54.6845 49.0245 54.5485 48.5485 54.2765 48.2365C54.0045 47.9165 53.6445 47.7565 53.1965 47.7565C52.7485 47.7565 52.3885 47.9165 52.1165 48.2365C51.8445 48.5485 51.7085 49.0245 51.7085 49.6645C51.7085 50.2965 51.8445 50.7765 52.1165 51.1045C52.3885 51.4245 52.7485 51.5845 53.1965 51.5845ZM59.6934 52.7005C59.2934 52.7005 58.9974 52.4885 58.8054 52.0645L56.8974 47.6365C56.7854 47.3725 56.7814 47.1405 56.8854 46.9405C56.9974 46.7405 57.2174 46.6405 57.5454 46.6405C57.7294 46.6405 57.8774 46.6845 57.9894 46.7725C58.1014 46.8525 58.2014 47.0085 58.2894 47.2405L59.7294 50.8405L61.2174 47.2285C61.3054 47.0045 61.4054 46.8525 61.5174 46.7725C61.6374 46.6845 61.7974 46.6405 61.9974 46.6405C62.2534 46.6405 62.4334 46.7405 62.5374 46.9405C62.6414 47.1405 62.6374 47.3685 62.5254 47.6245L60.5814 52.0645C60.4054 52.4885 60.1094 52.7005 59.6934 52.7005ZM66.4204 52.7245C65.7564 52.7245 65.1844 52.6005 64.7044 52.3525C64.2244 52.1045 63.8524 51.7525 63.5884 51.2965C63.3324 50.8405 63.2044 50.3005 63.2044 49.6765C63.2044 49.0685 63.3284 48.5365 63.5764 48.0805C63.8324 47.6245 64.1804 47.2685 64.6204 47.0125C65.0684 46.7485 65.5764 46.6165 66.1444 46.6165C66.9764 46.6165 67.6324 46.8805 68.1124 47.4085C68.6004 47.9365 68.8444 48.6565 68.8444 49.5685C68.8444 49.8645 68.6524 50.0125 68.2684 50.0125H64.6444C64.7564 51.0605 65.3564 51.5845 66.4444 51.5845C66.6524 51.5845 66.8844 51.5605 67.1404 51.5125C67.4044 51.4565 67.6524 51.3645 67.8844 51.2365C68.0924 51.1165 68.2684 51.0805 68.4124 51.1285C68.5564 51.1685 68.6564 51.2525 68.7124 51.3805C68.7764 51.5085 68.7844 51.6525 68.7364 51.8125C68.6964 51.9645 68.5844 52.0965 68.4004 52.2085C68.1204 52.3845 67.7964 52.5165 67.4284 52.6045C67.0684 52.6845 66.7324 52.7245 66.4204 52.7245ZM66.2044 47.6365C65.7644 47.6365 65.4084 47.7725 65.1364 48.0445C64.8644 48.3165 64.7004 48.6845 64.6444 49.1485H67.5964C67.5644 48.6605 67.4284 48.2885 67.1884 48.0325C66.9564 47.7685 66.6284 47.6365 66.2044 47.6365ZM70.8003 52.7005C70.2883 52.7005 70.0323 52.4445 70.0323 51.9325V47.3965C70.0323 46.8925 70.2763 46.6405 70.7643 46.6405C71.2523 46.6405 71.4963 46.8925 71.4963 47.3965V47.7685C71.7843 47.0805 72.4003 46.6965 73.3443 46.6165C73.6883 46.5765 73.8803 46.7725 73.9203 47.2045C73.9603 47.6285 73.7523 47.8645 73.2963 47.9125L73.0323 47.9365C72.0483 48.0325 71.5563 48.5365 71.5563 49.4485V51.9325C71.5563 52.4445 71.3043 52.7005 70.8003 52.7005ZM75.4755 52.7005C74.9795 52.7005 74.7315 52.4445 74.7315 51.9325V47.3965C74.7315 46.8925 74.9755 46.6405 75.4635 46.6405C75.9515 46.6405 76.1955 46.8925 76.1955 47.3965V47.6485C76.3955 47.3125 76.6635 47.0565 76.9995 46.8805C77.3435 46.7045 77.7275 46.6165 78.1515 46.6165C79.5355 46.6165 80.2275 47.4205 80.2275 49.0285V51.9325C80.2275 52.4445 79.9795 52.7005 79.4835 52.7005C78.9795 52.7005 78.7275 52.4445 78.7275 51.9325V49.1005C78.7275 48.6445 78.6395 48.3125 78.4635 48.1045C78.2955 47.8965 78.0315 47.7925 77.6715 47.7925C77.2315 47.7925 76.8795 47.9325 76.6155 48.2125C76.3595 48.4845 76.2315 48.8485 76.2315 49.3045V51.9325C76.2315 52.4445 75.9795 52.7005 75.4755 52.7005ZM82.519 52.7005C82.023 52.7005 81.775 52.4445 81.775 51.9325V47.3965C81.775 46.8925 82.019 46.6405 82.507 46.6405C82.995 46.6405 83.239 46.8925 83.239 47.3965V47.6365C83.415 47.3165 83.659 47.0685 83.971 46.8925C84.283 46.7085 84.643 46.6165 85.051 46.6165C85.931 46.6165 86.507 47.0005 86.779 47.7685C86.963 47.4085 87.227 47.1285 87.571 46.9285C87.915 46.7205 88.307 46.6165 88.747 46.6165C90.067 46.6165 90.727 47.4205 90.727 49.0285V51.9325C90.727 52.4445 90.475 52.7005 89.971 52.7005C89.475 52.7005 89.227 52.4445 89.227 51.9325V49.0885C89.227 48.6405 89.151 48.3125 88.999 48.1045C88.855 47.8965 88.607 47.7925 88.255 47.7925C87.863 47.7925 87.555 47.9325 87.331 48.2125C87.107 48.4845 86.995 48.8645 86.995 49.3525V51.9325C86.995 52.4445 86.747 52.7005 86.251 52.7005C85.747 52.7005 85.495 52.4445 85.495 51.9325V49.0885C85.495 48.6405 85.419 48.3125 85.267 48.1045C85.123 47.8965 84.879 47.7925 84.535 47.7925C84.143 47.7925 83.835 47.9325 83.611 48.2125C83.387 48.4845 83.275 48.8645 83.275 49.3525V51.9325C83.275 52.4445 83.023 52.7005 82.519 52.7005ZM95.1664 52.7245C94.5024 52.7245 93.9304 52.6005 93.4504 52.3525C92.9704 52.1045 92.5984 51.7525 92.3344 51.2965C92.0784 50.8405 91.9504 50.3005 91.9504 49.6765C91.9504 49.0685 92.0744 48.5365 92.3224 48.0805C92.5784 47.6245 92.9264 47.2685 93.3664 47.0125C93.8144 46.7485 94.3224 46.6165 94.8904 46.6165C95.7224 46.6165 96.3784 46.8805 96.8584 47.4085C97.3464 47.9365 97.5904 48.6565 97.5904 49.5685C97.5904 49.8645 97.3984 50.0125 97.0144 50.0125H93.3904C93.5024 51.0605 94.1024 51.5845 95.1904 51.5845C95.3984 51.5845 95.6304 51.5605 95.8864 51.5125C96.1504 51.4565 96.3984 51.3645 96.6304 51.2365C96.8384 51.1165 97.0144 51.0805 97.1584 51.1285C97.3024 51.1685 97.4024 51.2525 97.4584 51.3805C97.5224 51.5085 97.5304 51.6525 97.4824 51.8125C97.4424 51.9645 97.3304 52.0965 97.1464 52.2085C96.8664 52.3845 96.5424 52.5165 96.1744 52.6045C95.8144 52.6845 95.4784 52.7245 95.1664 52.7245ZM94.9504 47.6365C94.5104 47.6365 94.1544 47.7725 93.8824 48.0445C93.6104 48.3165 93.4464 48.6845 93.3904 49.1485H96.3424C96.3104 48.6605 96.1744 48.2885 95.9344 48.0325C95.7024 47.7685 95.3744 47.6365 94.9504 47.6365ZM99.5224 52.7005C99.0264 52.7005 98.7784 52.4445 98.7784 51.9325V47.3965C98.7784 46.8925 99.0224 46.6405 99.5104 46.6405C99.9984 46.6405 100.242 46.8925 100.242 47.3965V47.6485C100.442 47.3125 100.71 47.0565 101.046 46.8805C101.39 46.7045 101.774 46.6165 102.198 46.6165C103.582 46.6165 104.274 47.4205 104.274 49.0285V51.9325C104.274 52.4445 104.026 52.7005 103.53 52.7005C103.026 52.7005 102.774 52.4445 102.774 51.9325V49.1005C102.774 48.6445 102.686 48.3125 102.51 48.1045C102.342 47.8965 102.078 47.7925 101.718 47.7925C101.278 47.7925 100.926 47.9325 100.662 48.2125C100.406 48.4845 100.278 48.8485 100.278 49.3045V51.9325C100.278 52.4445 100.026 52.7005 99.5224 52.7005ZM108.486 52.7245C106.934 52.7245 106.158 51.9565 106.158 50.4205V47.8645H105.534C105.134 47.8645 104.934 47.6765 104.934 47.3005C104.934 46.9245 105.134 46.7365 105.534 46.7365H106.158V45.6445C106.158 45.1405 106.41 44.8885 106.914 44.8885C107.41 44.8885 107.658 45.1405 107.658 45.6445V46.7365H108.93C109.33 46.7365 109.53 46.9245 109.53 47.3005C109.53 47.6765 109.33 47.8645 108.93 47.8645H107.658V50.3365C107.658 50.7205 107.742 51.0085 107.91 51.2005C108.078 51.3925 108.35 51.4885 108.726 51.4885C108.862 51.4885 108.982 51.4765 109.086 51.4525C109.19 51.4285 109.282 51.4125 109.362 51.4045C109.458 51.3965 109.538 51.4285 109.602 51.5005C109.666 51.5645 109.698 51.7005 109.698 51.9085C109.698 52.0685 109.67 52.2125 109.614 52.3405C109.566 52.4605 109.474 52.5445 109.338 52.5925C109.234 52.6245 109.098 52.6525 108.93 52.6765C108.762 52.7085 108.614 52.7245 108.486 52.7245ZM114.585 52.6045C114.065 52.6045 113.805 52.3405 113.805 51.8125V44.8885C113.805 44.3685 114.061 44.1085 114.573 44.1085C115.085 44.1085 115.341 44.3685 115.341 44.8885V51.2965H118.821C119.269 51.2965 119.493 51.5125 119.493 51.9445C119.493 52.3845 119.269 52.6045 118.821 52.6045H114.585ZM123.233 52.7245C122.569 52.7245 121.997 52.6005 121.517 52.3525C121.037 52.1045 120.665 51.7525 120.401 51.2965C120.145 50.8405 120.017 50.3005 120.017 49.6765C120.017 49.0685 120.141 48.5365 120.389 48.0805C120.645 47.6245 120.993 47.2685 121.433 47.0125C121.881 46.7485 122.389 46.6165 122.957 46.6165C123.789 46.6165 124.445 46.8805 124.925 47.4085C125.413 47.9365 125.657 48.6565 125.657 49.5685C125.657 49.8645 125.465 50.0125 125.081 50.0125H121.457C121.569 51.0605 122.169 51.5845 123.257 51.5845C123.465 51.5845 123.697 51.5605 123.953 51.5125C124.217 51.4565 124.465 51.3645 124.697 51.2365C124.905 51.1165 125.081 51.0805 125.225 51.1285C125.369 51.1685 125.469 51.2525 125.525 51.3805C125.589 51.5085 125.597 51.6525 125.549 51.8125C125.509 51.9645 125.397 52.0965 125.213 52.2085C124.933 52.3845 124.609 52.5165 124.241 52.6045C123.881 52.6845 123.545 52.7245 123.233 52.7245ZM123.017 47.6365C122.577 47.6365 122.221 47.7725 121.949 48.0445C121.677 48.3165 121.513 48.6845 121.457 49.1485H124.409C124.377 48.6605 124.241 48.2885 124.001 48.0325C123.769 47.7685 123.441 47.6365 123.017 47.6365ZM128.777 52.7245C128.353 52.7245 127.973 52.6445 127.637 52.4845C127.309 52.3165 127.049 52.0925 126.857 51.8125C126.673 51.5325 126.581 51.2165 126.581 50.8645C126.581 50.4325 126.693 50.0925 126.917 49.8445C127.141 49.5885 127.505 49.4045 128.009 49.2925C128.513 49.1805 129.189 49.1245 130.037 49.1245H130.457V48.8725C130.457 48.4725 130.369 48.1845 130.193 48.0085C130.017 47.8325 129.721 47.7445 129.305 47.7445C129.073 47.7445 128.821 47.7725 128.549 47.8285C128.285 47.8845 128.005 47.9805 127.709 48.1165C127.517 48.2045 127.357 48.2165 127.229 48.1525C127.101 48.0805 127.013 47.9725 126.965 47.8285C126.925 47.6765 126.933 47.5245 126.989 47.3725C127.053 47.2205 127.177 47.1085 127.361 47.0365C127.729 46.8845 128.081 46.7765 128.417 46.7125C128.761 46.6485 129.073 46.6165 129.353 46.6165C130.209 46.6165 130.845 46.8165 131.261 47.2165C131.677 47.6085 131.885 48.2205 131.885 49.0525V51.9325C131.885 52.4445 131.653 52.7005 131.189 52.7005C130.717 52.7005 130.481 52.4445 130.481 51.9325V51.6685C130.345 51.9965 130.129 52.2565 129.833 52.4485C129.537 52.6325 129.185 52.7245 128.777 52.7245ZM129.089 51.6925C129.481 51.6925 129.805 51.5565 130.061 51.2845C130.325 51.0125 130.457 50.6685 130.457 50.2525V49.9885H130.049C129.297 49.9885 128.773 50.0485 128.477 50.1685C128.189 50.2805 128.045 50.4885 128.045 50.7925C128.045 51.0565 128.137 51.2725 128.321 51.4405C128.505 51.6085 128.761 51.6925 129.089 51.6925ZM135.663 52.7245C135.151 52.7245 134.699 52.6005 134.307 52.3525C133.923 52.1045 133.623 51.7525 133.407 51.2965C133.191 50.8325 133.083 50.2885 133.083 49.6645C133.083 49.0325 133.191 48.4925 133.407 48.0445C133.623 47.5885 133.923 47.2365 134.307 46.9885C134.699 46.7405 135.151 46.6165 135.663 46.6165C136.079 46.6165 136.455 46.7085 136.791 46.8925C137.127 47.0765 137.379 47.3205 137.547 47.6245V44.8045C137.547 44.3005 137.795 44.0485 138.291 44.0485C138.795 44.0485 139.047 44.3005 139.047 44.8045V51.9325C139.047 52.4445 138.799 52.7005 138.303 52.7005C137.807 52.7005 137.559 52.4445 137.559 51.9325V51.6805C137.391 52.0005 137.139 52.2565 136.803 52.4485C136.467 52.6325 136.087 52.7245 135.663 52.7245ZM136.083 51.5845C136.531 51.5845 136.891 51.4245 137.163 51.1045C137.435 50.7765 137.571 50.2965 137.571 49.6645C137.571 49.0245 137.435 48.5485 137.163 48.2365C136.891 47.9165 136.531 47.7565 136.083 47.7565C135.635 47.7565 135.275 47.9165 135.003 48.2365C134.731 48.5485 134.595 49.0245 134.595 49.6645C134.595 50.2965 134.731 50.7765 135.003 51.1045C135.275 51.4245 135.635 51.5845 136.083 51.5845ZM143.495 52.7245C142.831 52.7245 142.259 52.6005 141.779 52.3525C141.299 52.1045 140.927 51.7525 140.663 51.2965C140.407 50.8405 140.279 50.3005 140.279 49.6765C140.279 49.0685 140.403 48.5365 140.651 48.0805C140.907 47.6245 141.255 47.2685 141.695 47.0125C142.143 46.7485 142.651 46.6165 143.219 46.6165C144.051 46.6165 144.707 46.8805 145.187 47.4085C145.675 47.9365 145.919 48.6565 145.919 49.5685C145.919 49.8645 145.727 50.0125 145.343 50.0125H141.719C141.831 51.0605 142.431 51.5845 143.519 51.5845C143.727 51.5845 143.959 51.5605 144.215 51.5125C144.479 51.4565 144.727 51.3645 144.959 51.2365C145.167 51.1165 145.343 51.0805 145.487 51.1285C145.631 51.1685 145.731 51.2525 145.787 51.3805C145.851 51.5085 145.859 51.6525 145.811 51.8125C145.771 51.9645 145.659 52.0965 145.475 52.2085C145.195 52.3845 144.871 52.5165 144.503 52.6045C144.143 52.6845 143.807 52.7245 143.495 52.7245ZM143.279 47.6365C142.839 47.6365 142.483 47.7725 142.211 48.0445C141.939 48.3165 141.775 48.6845 141.719 49.1485H144.671C144.639 48.6605 144.503 48.2885 144.263 48.0325C144.031 47.7685 143.703 47.6365 143.279 47.6365ZM147.874 52.7005C147.362 52.7005 147.106 52.4445 147.106 51.9325V47.3965C147.106 46.8925 147.35 46.6405 147.838 46.6405C148.326 46.6405 148.57 46.8925 148.57 47.3965V47.7685C148.858 47.0805 149.474 46.6965 150.418 46.6165C150.762 46.5765 150.954 46.7725 150.994 47.2045C151.034 47.6285 150.826 47.8645 150.37 47.9125L150.106 47.9365C149.122 48.0325 148.63 48.5365 148.63 49.4485V51.9325C148.63 52.4445 148.378 52.7005 147.874 52.7005ZM153.895 52.7245C153.551 52.7245 153.187 52.6885 152.803 52.6165C152.419 52.5445 152.075 52.4205 151.771 52.2445C151.603 52.1485 151.499 52.0325 151.459 51.8965C151.419 51.7525 151.423 51.6205 151.471 51.5005C151.527 51.3725 151.615 51.2805 151.735 51.2245C151.863 51.1685 152.011 51.1805 152.179 51.2605C152.499 51.4125 152.799 51.5205 153.079 51.5845C153.359 51.6405 153.635 51.6685 153.907 51.6685C154.291 51.6685 154.575 51.6045 154.759 51.4765C154.951 51.3405 155.047 51.1645 155.047 50.9485C155.047 50.6125 154.799 50.3965 154.303 50.3005L153.103 50.0725C152.087 49.8805 151.579 49.3525 151.579 48.4885C151.579 48.1045 151.683 47.7725 151.891 47.4925C152.107 47.2125 152.403 46.9965 152.779 46.8445C153.155 46.6925 153.587 46.6165 154.075 46.6165C154.779 46.6165 155.407 46.7725 155.959 47.0845C156.111 47.1645 156.199 47.2765 156.223 47.4205C156.255 47.5565 156.239 47.6885 156.175 47.8165C156.119 47.9365 156.027 48.0245 155.899 48.0805C155.771 48.1285 155.623 48.1125 155.455 48.0325C155.207 47.9045 154.967 47.8125 154.735 47.7565C154.511 47.7005 154.295 47.6725 154.087 47.6725C153.695 47.6725 153.403 47.7405 153.211 47.8765C153.027 48.0125 152.935 48.1925 152.935 48.4165C152.935 48.7685 153.163 48.9845 153.619 49.0645L154.819 49.2925C155.339 49.3885 155.731 49.5645 155.995 49.8205C156.267 50.0765 156.403 50.4205 156.403 50.8525C156.403 51.4365 156.175 51.8965 155.719 52.2325C155.263 52.5605 154.655 52.7245 153.895 52.7245Z" fill="#3F8EFC"/>
<path d="M48.0246 63.8378V64.7178H46.8146V71.2378H45.8046V69.4878C45.6379 69.7678 45.3979 69.9944 45.0846 70.1678C44.7713 70.3344 44.4046 70.4178 43.9846 70.4178C43.5313 70.4178 43.1179 70.3178 42.7446 70.1178C42.3779 69.9178 42.0879 69.6378 41.8746 69.2778C41.6613 68.9111 41.5546 68.4911 41.5546 68.0178C41.5546 67.5444 41.6579 67.1278 41.8646 66.7678C42.0779 66.4078 42.3679 66.1278 42.7346 65.9278C43.1013 65.7278 43.5113 65.6278 43.9646 65.6278C44.3779 65.6278 44.7413 65.7144 45.0546 65.8878C45.3679 66.0544 45.6179 66.2778 45.8046 66.5578V64.7178H40.6646V63.8378H48.0246ZM44.1746 66.3278C43.7279 66.3278 43.3513 66.4611 43.0446 66.7278L45.6146 68.8878C45.7746 68.6144 45.8546 68.3178 45.8546 67.9978C45.8546 67.7111 45.7879 67.4411 45.6546 67.1878C45.5279 66.9278 45.3379 66.7211 45.0846 66.5678C44.8313 66.4078 44.5279 66.3278 44.1746 66.3278ZM42.4746 68.0178C42.4746 68.3511 42.5513 68.6411 42.7046 68.8878C42.8579 69.1344 43.0646 69.3244 43.3246 69.4578C43.5846 69.5911 43.8713 69.6578 44.1846 69.6578C44.6446 69.6578 45.0213 69.5211 45.3146 69.2478L42.7246 67.0878C42.5579 67.3478 42.4746 67.6578 42.4746 68.0178ZM48.7791 64.7178H47.5591V63.8378H51.0491V64.7178H49.8291V71.2378H48.7791V64.7178ZM46.5091 60.7378C47.0225 60.7378 47.4158 60.7944 47.6891 60.9078C47.9558 61.0211 48.2425 61.2911 48.5491 61.7178C48.8558 62.1378 49.2691 62.8544 49.7891 63.8678H48.8891C48.4825 63.5611 48.1758 63.3511 47.9691 63.2378C47.7691 63.1244 47.5725 63.0511 47.3791 63.0178C47.1858 62.9844 46.8958 62.9678 46.5091 62.9678H46.0491V62.2978H46.4891C46.8625 62.2978 47.1458 62.3111 47.3391 62.3378C47.5325 62.3644 47.7291 62.4311 47.9291 62.5378C48.1291 62.6378 48.3791 62.8078 48.6791 63.0478C48.3991 62.5411 48.1491 62.1711 47.9291 61.9378C47.7091 61.7044 47.5025 61.5611 47.3091 61.5078C47.1158 61.4478 46.8558 61.4178 46.5291 61.4178H46.0491V60.7378H46.5091ZM56.6369 61.1278C59.9369 61.1278 61.5869 62.0778 61.5869 63.9778V64.1378L60.5569 64.1278V63.9978C60.5569 63.2978 60.2369 62.7878 59.5969 62.4678C58.9569 62.1478 57.9603 61.9878 56.6069 61.9878C55.7269 61.9878 55.0136 62.0478 54.4669 62.1678C53.9269 62.2878 53.5203 62.4844 53.2469 62.7578C52.9803 63.0244 52.8403 63.3844 52.8269 63.8378H54.0569V64.7178H52.8369V71.2378H51.7869V64.7178H50.5669V63.8378H51.7869C51.8203 62.9111 52.2203 62.2278 52.9869 61.7878C53.7603 61.3478 54.9769 61.1278 56.6369 61.1278ZM60.1548 66.6278C59.6614 66.6278 59.2548 66.7578 58.9348 67.0178C58.6214 67.2778 58.4648 67.6411 58.4648 68.1078C58.4648 68.5344 58.5914 68.8744 58.8448 69.1278C59.1048 69.3811 59.4481 69.5078 59.8748 69.5078C60.2081 69.5078 60.5014 69.4011 60.7548 69.1878C61.0081 68.9744 61.1348 68.6711 61.1348 68.2778H62.1048V71.4478H61.0748V69.6678C60.9281 69.8811 60.7248 70.0478 60.4648 70.1678C60.2048 70.2878 59.9081 70.3478 59.5748 70.3478C59.3881 70.3478 59.2048 70.3278 59.0248 70.2878C58.9181 70.8878 58.6448 71.3611 58.2048 71.7078C57.7714 72.0544 57.2414 72.2278 56.6148 72.2278C56.0081 72.2278 55.5081 72.0711 55.1148 71.7578C54.7214 71.4511 54.5248 71.0178 54.5248 70.4578C54.5248 70.0444 54.6414 69.7078 54.8748 69.4478C55.1148 69.1878 55.3981 69.0344 55.7248 68.9878V68.9478C55.3781 68.8611 55.0848 68.6944 54.8448 68.4478C54.6114 68.2011 54.4948 67.8644 54.4948 67.4378C54.4948 66.9644 54.6614 66.5778 54.9948 66.2778C55.3348 65.9778 55.8314 65.8278 56.4848 65.8278C56.6248 65.8278 56.7314 65.8311 56.8048 65.8378V66.6978C56.3848 66.6711 56.0648 66.7444 55.8448 66.9178C55.6314 67.0911 55.5248 67.3211 55.5248 67.6078C55.5248 67.9011 55.6281 68.1311 55.8348 68.2978C56.0481 68.4644 56.3414 68.5478 56.7148 68.5478H56.8048V69.3778H56.7248C56.3581 69.3778 56.0748 69.4678 55.8748 69.6478C55.6814 69.8211 55.5848 70.0511 55.5848 70.3378C55.5848 70.6711 55.6914 70.9244 55.9048 71.0978C56.1248 71.2711 56.4081 71.3578 56.7548 71.3578C57.1348 71.3578 57.4614 71.2378 57.7348 70.9978C58.0081 70.7511 58.1914 70.4111 58.2848 69.9778C58.0048 69.7844 57.7848 69.5278 57.6248 69.2078C57.4714 68.8878 57.3948 68.5111 57.3948 68.0778C57.3948 67.5711 57.5114 67.1411 57.7448 66.7878C57.9781 66.4344 58.2948 66.1711 58.6948 65.9978C59.0948 65.8178 59.5481 65.7278 60.0548 65.7278H60.6748V64.7178H53.5748V63.8378H63.1248V64.7178H61.7248V66.6278H60.1548ZM68.387 64.7178V66.6678C68.5337 66.3811 68.7437 66.1544 69.017 65.9878C69.297 65.8144 69.6337 65.7278 70.027 65.7278C70.4337 65.7278 70.7937 65.8278 71.107 66.0278C71.4204 66.2211 71.6637 66.4911 71.837 66.8378C72.0104 67.1778 72.097 67.5678 72.097 68.0078C72.097 68.4811 72.007 68.8911 71.827 69.2378C71.647 69.5778 71.4004 69.8411 71.087 70.0278C70.7737 70.2078 70.417 70.2978 70.017 70.2978C69.777 70.2978 69.5637 70.2744 69.377 70.2278V69.3978C69.477 69.4244 69.6004 69.4378 69.747 69.4378C70.1204 69.4378 70.427 69.3144 70.667 69.0678C70.9137 68.8144 71.037 68.4678 71.037 68.0278C71.037 67.6144 70.9104 67.2778 70.657 67.0178C70.4104 66.7578 70.097 66.6278 69.717 66.6278C69.277 66.6278 68.9437 66.7744 68.717 67.0678C68.497 67.3611 68.387 67.7111 68.387 68.1178V71.2378H67.377V69.4078C67.2237 69.6944 67.0004 69.9244 66.707 70.0978C66.4137 70.2711 66.0604 70.3578 65.647 70.3578C65.2337 70.3578 64.867 70.2611 64.547 70.0678C64.227 69.8744 63.977 69.6044 63.797 69.2578C63.6237 68.9044 63.537 68.4944 63.537 68.0278C63.537 67.5678 63.627 67.1644 63.807 66.8178C63.987 66.4711 64.2404 66.2044 64.567 66.0178C64.8937 65.8244 65.267 65.7278 65.687 65.7278C66.087 65.7278 66.4304 65.8111 66.717 65.9778C67.0037 66.1444 67.2237 66.3678 67.377 66.6478V64.7178H62.647V63.8378H72.977V64.7178H68.387ZM65.987 69.4778C66.287 69.4778 66.5404 69.4078 66.747 69.2678C66.9604 69.1278 67.117 68.9478 67.217 68.7278C67.3237 68.5078 67.377 68.2811 67.377 68.0478C67.377 67.6678 67.257 67.3378 67.017 67.0578C66.777 66.7711 66.4337 66.6278 65.987 66.6278C65.5937 66.6278 65.2637 66.7578 64.997 67.0178C64.7304 67.2711 64.597 67.6111 64.597 68.0378C64.597 68.4778 64.727 68.8278 64.987 69.0878C65.247 69.3478 65.5804 69.4778 65.987 69.4778ZM80.6541 61.1278C82.2207 61.1278 83.3907 61.3711 84.1641 61.8578C84.9374 62.3378 85.3241 63.0411 85.3241 63.9678V64.1278H84.2941V63.9878C84.2941 63.3011 83.9874 62.7978 83.3741 62.4778C82.7674 62.1511 81.8541 61.9878 80.6341 61.9878C79.4407 61.9878 78.5607 62.1311 77.9941 62.4178C77.4341 62.6978 77.1407 63.1711 77.1141 63.8378H78.3441V64.7178H77.1241V71.2378H76.0741V64.7178H74.8541V63.8378H76.0741C76.1007 62.9178 76.4841 62.2378 77.2241 61.7978C77.9707 61.3511 79.1141 61.1278 80.6541 61.1278ZM79.9919 68.1378V69.1178C79.9919 69.5044 80.0819 69.8178 80.2619 70.0578C80.4485 70.2911 80.7319 70.4078 81.1119 70.4078C81.4452 70.4078 81.7052 70.3011 81.8919 70.0878C82.0785 69.8678 82.1719 69.5811 82.1719 69.2278V69.0878H83.1919V69.2378C83.1919 69.8844 83.0085 70.3944 82.6419 70.7678C82.2752 71.1344 81.7752 71.3178 81.1419 71.3178C80.4419 71.3178 79.8985 71.1144 79.5119 70.7078C79.1252 70.2944 78.9319 69.7411 78.9319 69.0478V67.2478H80.3719C80.9185 67.2478 81.3652 67.1311 81.7119 66.8978C82.0652 66.6644 82.2419 66.3078 82.2419 65.8278C82.2419 65.4678 82.1452 65.1844 81.9519 64.9778C81.7585 64.7644 81.4952 64.6578 81.1619 64.6578C80.8285 64.6578 80.5652 64.7644 80.3719 64.9778C80.1785 65.1844 80.0819 65.4678 80.0819 65.8278C80.0819 65.9144 80.0885 66.0511 80.1019 66.2378H79.0619C79.0352 66.0378 79.0219 65.8911 79.0219 65.7978C79.0219 65.3911 79.1085 65.0344 79.2819 64.7278C79.4552 64.4144 79.7019 64.1744 80.0219 64.0078C80.3485 63.8344 80.7285 63.7478 81.1619 63.7478C81.8085 63.7478 82.3252 63.9378 82.7119 64.3178C83.1052 64.6911 83.3019 65.2178 83.3019 65.8978C83.3019 66.6244 83.0619 67.1811 82.5819 67.5678C82.1085 67.9478 81.4952 68.1378 80.7419 68.1378H79.9919ZM86.6019 63.8378V64.7178H85.3819V71.2378H84.3219V63.8378H86.6019ZM94.7836 63.8378V64.7178H93.5636V71.2378H92.5536V67.5678H89.5936C89.2403 67.7344 88.9703 67.8744 88.7836 67.9878C88.6036 68.1011 88.4469 68.2444 88.3136 68.4178C88.1869 68.5911 88.1236 68.8011 88.1236 69.0478C88.1236 69.3344 88.2169 69.5744 88.4036 69.7678C88.5969 69.9611 88.8503 70.0578 89.1636 70.0578C89.4969 70.0578 89.7603 69.9511 89.9536 69.7378C90.1536 69.5178 90.2536 69.2511 90.2536 68.9378H91.1336V71.8078H90.1736V70.2278C90.0736 70.4078 89.9069 70.5711 89.6736 70.7178C89.4403 70.8578 89.1536 70.9278 88.8136 70.9278C88.2869 70.9278 87.8603 70.7744 87.5336 70.4678C87.2069 70.1544 87.0436 69.7511 87.0436 69.2578C87.0436 68.9178 87.1169 68.6278 87.2636 68.3878C87.4169 68.1411 87.6103 67.9378 87.8436 67.7778C88.0769 67.6111 88.3669 67.4411 88.7136 67.2678C88.3003 67.1678 87.9603 66.9744 87.6936 66.6878C87.4336 66.3944 87.3036 66.0211 87.3036 65.5678C87.3036 65.2011 87.3903 64.8811 87.5636 64.6078C87.7436 64.3278 87.9869 64.1144 88.2936 63.9678C88.6069 63.8144 88.9569 63.7378 89.3436 63.7378C89.6969 63.7378 90.0169 63.8044 90.3036 63.9378C90.5969 64.0711 90.8303 64.2678 91.0036 64.5278C91.1769 64.7811 91.2636 65.0878 91.2636 65.4478C91.2636 65.7344 91.2069 65.9878 91.0936 66.2078C90.9803 66.4211 90.8236 66.6178 90.6236 66.7978H92.5536V63.8378H94.7836ZM88.2436 65.6378C88.2436 65.9711 88.3703 66.2444 88.6236 66.4578C88.8769 66.6644 89.2069 66.7744 89.6136 66.7878C89.8603 66.6344 90.0503 66.4678 90.1836 66.2878C90.3169 66.1078 90.3836 65.8944 90.3836 65.6478C90.3836 65.3544 90.2803 65.1144 90.0736 64.9278C89.8736 64.7411 89.6203 64.6478 89.3136 64.6478C89.0136 64.6478 88.7603 64.7344 88.5536 64.9078C88.3469 65.0811 88.2436 65.3244 88.2436 65.6378ZM95.5272 64.7178H94.3072V63.8378H97.7972V64.7178H96.5772V71.2378H95.5272V64.7178ZM102.585 61.1478C103.898 61.1478 104.912 61.3911 105.625 61.8778C106.338 62.3578 106.695 63.0444 106.695 63.9378V64.1078H105.665V63.9678C105.665 63.2944 105.392 62.8011 104.845 62.4878C104.305 62.1678 103.548 62.0078 102.575 62.0078C101.615 62.0078 100.878 62.1478 100.365 62.4278C99.8583 62.7078 99.595 63.1778 99.575 63.8378H100.805V64.7178H99.585V71.2378H98.535V64.7178H97.315V63.8378H98.535C98.5617 62.9311 98.9183 62.2578 99.605 61.8178C100.292 61.3711 101.285 61.1478 102.585 61.1478ZM108.023 64.7178H106.823V71.2378H105.773V69.2078C105.566 69.5544 105.273 69.8278 104.893 70.0278C104.519 70.2211 104.086 70.3178 103.593 70.3178C102.953 70.3178 102.426 70.1644 102.013 69.8578C101.599 69.5511 101.393 69.1178 101.393 68.5578C101.393 68.1511 101.513 67.8211 101.753 67.5678C101.993 67.3144 102.273 67.1611 102.593 67.1078V67.0778C102.233 66.9911 101.929 66.8078 101.683 66.5278C101.443 66.2478 101.323 65.8811 101.323 65.4278C101.323 64.9278 101.486 64.5244 101.813 64.2178C102.139 63.9044 102.563 63.7478 103.083 63.7478C103.609 63.7478 104.023 63.8978 104.323 64.1978C104.629 64.4978 104.783 64.8878 104.783 65.3678C104.783 65.4544 104.776 65.5711 104.763 65.7178H103.973L103.983 65.4878C103.983 65.2411 103.906 65.0378 103.753 64.8778C103.599 64.7111 103.386 64.6278 103.113 64.6278C102.839 64.6278 102.623 64.7144 102.463 64.8878C102.303 65.0611 102.223 65.2778 102.223 65.5378C102.223 65.8911 102.356 66.1644 102.623 66.3578C102.889 66.5511 103.239 66.6478 103.673 66.6478H104.253V67.4978H103.713C103.313 67.4978 103.003 67.5844 102.783 67.7578C102.569 67.9244 102.463 68.1544 102.463 68.4478C102.463 68.7744 102.589 69.0244 102.843 69.1978C103.096 69.3644 103.429 69.4478 103.843 69.4478C104.216 69.4478 104.546 69.3678 104.833 69.2078C105.126 69.0411 105.356 68.8111 105.523 68.5178C105.689 68.2178 105.773 67.8778 105.773 67.4978V63.8378H108.023V64.7178ZM113.241 64.7178V66.6678C113.387 66.3811 113.597 66.1544 113.871 65.9878C114.151 65.8144 114.487 65.7278 114.881 65.7278C115.287 65.7278 115.647 65.8278 115.961 66.0278C116.274 66.2211 116.517 66.4911 116.691 66.8378C116.864 67.1778 116.951 67.5678 116.951 68.0078C116.951 68.4811 116.861 68.8911 116.681 69.2378C116.501 69.5778 116.254 69.8411 115.941 70.0278C115.627 70.2078 115.271 70.2978 114.871 70.2978C114.631 70.2978 114.417 70.2744 114.231 70.2278V69.3978C114.331 69.4244 114.454 69.4378 114.601 69.4378C114.974 69.4378 115.281 69.3144 115.521 69.0678C115.767 68.8144 115.891 68.4678 115.891 68.0278C115.891 67.6144 115.764 67.2778 115.511 67.0178C115.264 66.7578 114.951 66.6278 114.571 66.6278C114.131 66.6278 113.797 66.7744 113.571 67.0678C113.351 67.3611 113.241 67.7111 113.241 68.1178V71.2378H112.231V69.4078C112.077 69.6944 111.854 69.9244 111.561 70.0978C111.267 70.2711 110.914 70.3578 110.501 70.3578C110.087 70.3578 109.721 70.2611 109.401 70.0678C109.081 69.8744 108.831 69.6044 108.651 69.2578C108.477 68.9044 108.391 68.4944 108.391 68.0278C108.391 67.5678 108.481 67.1644 108.661 66.8178C108.841 66.4711 109.094 66.2044 109.421 66.0178C109.747 65.8244 110.121 65.7278 110.541 65.7278C110.941 65.7278 111.284 65.8111 111.571 65.9778C111.857 66.1444 112.077 66.3678 112.231 66.6478V64.7178H107.501V63.8378H117.831V64.7178H113.241ZM110.841 69.4778C111.141 69.4778 111.394 69.4078 111.601 69.2678C111.814 69.1278 111.971 68.9478 112.071 68.7278C112.177 68.5078 112.231 68.2811 112.231 68.0478C112.231 67.6678 112.111 67.3378 111.871 67.0578C111.631 66.7711 111.287 66.6278 110.841 66.6278C110.447 66.6278 110.117 66.7578 109.851 67.0178C109.584 67.2711 109.451 67.6111 109.451 68.0378C109.451 68.4778 109.581 68.8278 109.841 69.0878C110.101 69.3478 110.434 69.4778 110.841 69.4778ZM118.584 64.7178H117.364V63.8378H120.854V64.7178H119.634V71.2378H118.584V64.7178ZM122.412 67.9678V69.2178C122.412 69.5844 122.495 69.8778 122.662 70.0978C122.828 70.3178 123.075 70.4278 123.402 70.4278C123.702 70.4278 123.938 70.3278 124.112 70.1278C124.292 69.9211 124.382 69.6478 124.382 69.3078V69.0878H125.392V69.2778C125.392 69.9044 125.215 70.4044 124.862 70.7778C124.515 71.1444 124.035 71.3278 123.422 71.3278C122.762 71.3278 122.255 71.1311 121.902 70.7378C121.555 70.3378 121.382 69.8144 121.382 69.1678V67.1078H122.422C123.508 67.1078 124.052 66.5878 124.052 65.5478V64.7178H120.372V63.8378H126.192V64.7178H125.092V65.5478C125.092 66.3211 124.905 66.9178 124.532 67.3378C124.158 67.7578 123.578 67.9678 122.792 67.9678H122.412ZM129.203 63.8378V64.7178H127.983V71.2378H126.933V64.7178H125.713V63.8378H126.963V63.4278C126.963 63.0411 126.89 62.7178 126.743 62.4578C126.597 62.1911 126.337 62.0578 125.963 62.0578C125.59 62.0578 125.327 62.1911 125.173 62.4578C125.02 62.7178 124.943 63.0411 124.943 63.4278V64.0778H123.923V63.4778C123.923 62.7778 124.087 62.2211 124.413 61.8078C124.74 61.3878 125.257 61.1778 125.963 61.1778C126.683 61.1778 127.2 61.3844 127.513 61.7978C127.827 62.2111 127.983 62.7711 127.983 63.4778V63.8378H129.203Z" fill="#6E6F7A"/>
</g>
</g>
<defs>
<clipPath id="clip0">
<rect width="164.826" height="99.8946" fill="white" transform="translate(0.285706 7.30655)"/>
</clipPath>
</defs>
</svg>
