<svg width="70" height="71" viewBox="0 0 70 71" fill="none" xmlns="http://www.w3.org/2000/svg">
<g filter="url(#filter0_b)">
<circle cx="34.7984" cy="35.2754" r="34.5679" fill="white"/>
</g>
<path d="M31.9185 27.6684C30.9199 27.033 29.6132 27.7503 29.6132 28.9339V41.6171C29.6132 42.8007 30.9199 43.518 31.9185 42.8825L41.8838 36.541C42.81 35.9516 42.81 34.5994 41.8838 34.01L31.9185 27.6684Z" fill="#3A3D5E"/>
<defs>
<filter id="filter0_b" x="-11.7695" y="-11.2925" width="93.1358" height="93.1358" filterUnits="userSpaceOnUse" color-interpolation-filters="sRGB">
<feFlood flood-opacity="0" result="BackgroundImageFix"/>
<feGaussianBlur in="BackgroundImage" stdDeviation="6"/>
<feComposite in2="SourceAlpha" operator="in" result="effect1_backgroundBlur"/>
<feBlend mode="normal" in="SourceGraphic" in2="effect1_backgroundBlur" result="shape"/>
</filter>
</defs>
</svg>
