<svg width="99" height="81" viewBox="0 0 99 81" fill="none" xmlns="http://www.w3.org/2000/svg">
<path id="Combined Shape" opacity="0.1" fill-rule="evenodd" clip-rule="evenodd" d="M32.911 0.151367C20.3022 0.151367 7.33081 13.707 2.07272 32.3808C-0.627947 41.9763 -0.69306 52.4362 1.89842 61.0797C4.76938 70.6603 10.6786 77.1402 18.5382 79.3217C20.5166 79.8718 22.5541 80.1514 24.5947 80.1514C34.612 80.1514 43.4943 73.4526 46.195 63.8641C49.5268 52.0304 42.5447 39.7092 30.6261 36.3976C25.343 34.9363 19.5089 35.4924 14.6184 37.8957C14.7757 37.2412 14.939 36.6135 15.1113 35.9997C19.4678 20.5321 28.0136 13.5727 32.6897 13.5727L32.896 13.5767C33.7946 13.6175 34.6591 13.0157 34.9095 12.1254L37.505 2.90587C37.6582 2.36472 37.5731 1.78577 37.2716 1.30927C36.9691 0.835766 36.4802 0.509483 35.9212 0.411996C34.9355 0.238907 33.9238 0.151367 32.911 0.151367ZM87.8961 0.411996C86.9114 0.238907 85.8986 0.153357 84.8879 0.153357C72.2761 0.153357 59.3067 13.707 54.0456 32.3788C51.3439 41.9753 51.2798 52.4362 53.8703 61.0797C56.7422 70.6603 62.6515 77.1402 70.51 79.3217C72.4895 79.8718 74.527 80.1514 76.5675 80.1514C86.5848 80.1514 95.4672 73.4526 98.1679 63.8641C101.502 52.0304 94.5175 39.7092 82.6009 36.3976C77.3178 34.9363 71.4857 35.4924 66.5933 37.8957C66.7495 37.2452 66.9128 36.6175 67.0861 35.9997C71.4426 20.5321 79.9894 13.5727 84.6655 13.5727L84.8699 13.5767C85.7844 13.6175 86.6329 13.0157 86.8833 12.1254L89.4798 2.90587C89.6321 2.36472 89.5469 1.78577 89.2454 1.30927C88.9439 0.835765 88.4541 0.507493 87.8961 0.411996Z" fill="#206BB5"/>
</svg>
