<svg xmlns="http://www.w3.org/2000/svg" width="16" height="12" viewBox="0 0 16 12">
  <path id="icon-foot-yt" d="M8,12a43.987,43.987,0,0,1-6.26-.367,2.079,2.079,0,0,1-1.41-1.51A24.249,24.249,0,0,1,0,6,24.346,24.346,0,0,1,.329,1.877,2.132,2.132,0,0,1,1.74.353,45.66,45.66,0,0,1,8,0a43.9,43.9,0,0,1,6.26.367,2.077,2.077,0,0,1,1.409,1.51A23.079,23.079,0,0,1,16,6.014a24.351,24.351,0,0,1-.329,4.123,2.082,2.082,0,0,1-1.41,1.51A45.666,45.666,0,0,1,8,12ZM6.408,3.41V8.546l4.151-2.568Z" fill="#fff"/>
</svg>
