{
  "root": "apps/mst-help-site",
  "sourceRoot": "apps/mst-help-site/src",
  "projectType": "application",
  "targets": {
    "build": {
      "executor": "@nrwl/gatsby:build",
      "options": {
        "outputPath": "apps/mst-help-site/public",
        "uglify": true,
        "color": true,
        "profile": false
      },
      "configurations": {
        "production": {}
      }
    },
    "serve": {
      "executor": "@nrwl/gatsby:server",
      "options": {
        "buildTarget": "mst-help-site:build"
      },
      "configurations": {
        "production": {
          "buildTarget": "mst-help-site:build:production"
        }
      }
    },
    "lint": {
      "executor": "@nrwl/linter:eslint",
      "outputs": ["{options.outputFile}"],
      "options": {
        "lintFilePatterns": ["apps/mst-help-site/**/*.{ts,tsx,js,jsx}"]
      }
    }
  },
  "tags": []
}
