<svg width="178" height="109" viewBox="0 0 178 109" fill="none" xmlns="http://www.w3.org/2000/svg">
<path opacity="0.802502" fill-rule="evenodd" clip-rule="evenodd" d="M168.173 14.7541C167.72 11.0566 164.322 8.44972 160.634 8.96974L7.29082 30.5873C3.69538 31.0942 1.16864 34.3878 1.61028 37.9918L7.3891 85.1494C7.80353 88.5314 10.7038 91.055 14.1105 90.9981L169.784 88.3974C173.738 88.3313 176.764 84.8541 176.283 80.9287L168.173 14.7541Z" fill="#F0F0F0"/>
<path fill-rule="evenodd" clip-rule="evenodd" d="M4.79007 77.0234C4.79007 80.6095 7.62975 83.5517 11.2136 83.6788L167.261 89.214C171.03 89.3477 174.157 86.3291 174.157 82.5586V31.7661C174.157 28.3609 171.588 25.5042 168.202 25.1439L12.1544 8.53826C8.21976 8.11956 4.79007 11.2036 4.79007 15.1605L4.79007 77.0234Z" fill="white"/>
<mask id="mask0" mask-type="alpha" maskUnits="userSpaceOnUse" x="4" y="8" width="171" height="82">
<path fill-rule="evenodd" clip-rule="evenodd" d="M4.79007 77.0234C4.79007 80.6095 7.62975 83.5517 11.2136 83.6788L167.261 89.214C171.03 89.3477 174.157 86.3291 174.157 82.5586V31.7661C174.157 28.3609 171.588 25.5042 168.202 25.1439L12.1544 8.53826C8.21976 8.11956 4.79007 11.2036 4.79007 15.1605L4.79007 77.0234Z" fill="white"/>
</mask>
<g mask="url(#mask0)">
<path d="M18.2075 37.1555L18.2076 37.1554C19.3556 36.6404 20.5987 36.92 20.9844 37.7798L25.0012 46.733C25.3599 47.5326 24.7853 48.569 23.7179 49.0479C22.6504 49.5268 21.4942 49.2669 21.1355 48.4673L17.7331 40.8835C17.2086 39.7143 17.4318 38.356 18.2075 37.1555Z" fill="#212121"/>
<path d="M32.1425 43.5465C31.7113 42.4721 30.48 41.945 29.3924 42.3693L22.4996 45.0301C21.3299 45.4864 20.7579 46.7929 21.2215 47.9484C21.6203 48.9421 22.7588 49.4294 23.7645 49.0369L30.954 46.2604C32.0416 45.8361 32.5738 44.621 32.1425 43.5465Z" fill="#212121"/>
<path d="M32.1641 43.5477C31.7329 42.4732 30.5016 41.9461 29.414 42.3704C28.8155 42.6014 28.3667 42.7747 28.0675 42.8902C26.2187 43.6038 27.7017 47.5259 29.6595 46.7698C29.952 46.6569 30.3907 46.4874 30.9756 46.2616C32.0632 45.8372 32.5953 44.6221 32.1641 43.5477Z" fill="#EAE7E7"/>
<path d="M-0.240219 50.9003L20.4805 52.7132L19.988 58.3427L-0.732735 56.5298L-0.240219 50.9003Z" fill="#212121"/>
<path d="M9.57042 57.2929L20.0003 58.2054L10.8245 98.2175L6.0267 97.7977L9.57042 57.2929Z" fill="#212121"/>
<path d="M-0.720749 56.3925L9.70915 57.305L0.53329 97.3171L-4.26446 96.8974L-0.720749 56.3925Z" fill="#212121"/>
<path d="M0.0661865 52.2065L20.4041 53.9859L21.5413 40.987C21.8105 37.9101 19.5025 35.1948 16.3862 34.9222L6.77717 34.0815C3.66085 33.8089 0.916372 36.0821 0.647182 39.159L-0.442103 51.6096C-0.468597 51.9124 -0.241028 52.1797 0.0661865 52.2065Z" fill="#D7D7D7"/>
<path d="M12.9397 40.479C12.9533 40.3229 12.8379 40.1853 12.6818 40.1717L11.9955 40.1116C11.8394 40.098 11.7018 40.2134 11.6881 40.3695L10.7285 51.3378C10.7148 51.4939 10.8303 51.6315 10.9864 51.6452L11.6727 51.7052C11.8288 51.7189 11.9664 51.6034 11.9801 51.4473L12.9397 40.479Z" fill="#212121"/>
<path d="M0.0177591 52.7586L8.77887 53.5251C11.4899 40.9296 12.2556 34.5802 11.076 34.477C10.1203 34.3934 8.68673 34.268 6.77536 34.1007C3.65904 33.8281 0.9083 36.1729 0.631386 39.3381L-0.489155 52.1459C-0.516409 52.4574 -0.289455 52.7317 0.0177591 52.7586Z" fill="#212121"/>
<path d="M20.0459 54.5109L12.8403 53.8805C12.9443 47.576 13.1079 43.3874 13.3311 41.3148C13.8247 36.7322 14.6904 34.495 15.9282 34.6033C19.0445 34.8759 22.0752 37.7218 21.7933 40.9445L20.6524 53.9852C20.6246 54.3024 20.3531 54.5377 20.0459 54.5109Z" fill="#212121"/>
<path d="M8.87793 36.1332L6.8169 42.3172L8.77444 53.0035C10.8444 44.6773 11.6899 40.2778 11.3107 39.8049C11.1005 39.5428 10.4381 39.1085 10.2367 38.4657C10.1287 38.121 10.1218 37.4748 10.216 36.527L8.87793 36.1332Z" fill="#4F4F50"/>
<path d="M15.0754 36.8138C15.5595 38.1145 16.2291 40.11 17.0844 42.8005L12.8523 53.2219C12.4499 44.6795 12.4765 40.2083 12.9321 39.8084C13.1845 39.5868 13.9123 39.2741 14.2222 38.6761C14.3884 38.3554 14.5075 37.7201 14.5793 36.7704C14.4259 35.4986 14.5913 35.5131 15.0754 36.8138Z" fill="#4F4F50"/>
<path d="M11.9585 39.9285V39.9285C13.179 40.0352 14.2537 39.145 14.3592 37.9399L14.4014 37.4575C14.5068 36.2526 13.6029 35.1892 12.3825 35.0824C11.1621 34.9757 10.0871 35.8659 9.98173 37.0709L9.93953 37.5532C9.83409 38.7583 10.7381 39.8217 11.9585 39.9285" fill="#E2AA9F"/>
<path d="M4.10488 37.9057L4.10988 37.9032C5.13842 37.375 6.39303 37.7909 6.91358 38.8327L12.8236 50.6604C13.3446 51.703 12.9331 52.978 11.9044 53.5081C11.9035 53.5086 11.9026 53.509 11.9018 53.5095L11.8968 53.5121C10.8682 54.0403 9.61361 53.6243 9.09306 52.5825L3.18302 40.7549C2.66203 39.7122 3.07357 38.4372 4.10221 37.9071C4.1031 37.9066 4.10399 37.9062 4.10488 37.9057Z" fill="#212121"/>
<path d="M20.4744 54.3808C20.8055 53.2713 20.1696 52.0925 19.0542 51.7479L12.0028 49.5413C10.8032 49.1707 9.54246 49.8375 9.18637 51.0305C8.8802 52.0564 9.46816 53.1464 10.4996 53.465L17.8553 55.7656C18.9707 56.1102 20.1433 55.4902 20.4744 54.3808Z" fill="#212121"/>
<path d="M20.4907 54.3952C20.8218 53.2857 20.1859 52.1069 19.0705 51.7623C18.4583 51.5707 17.9992 51.427 17.6931 51.3313C15.8018 50.7394 14.522 54.7324 16.5251 55.3589C16.8243 55.4525 17.2731 55.5928 17.8716 55.78C18.987 56.1246 20.1596 55.5046 20.4907 54.3952Z" fill="#EAE7E7"/>
<path d="M18.3209 52.6175C17.3797 53.6793 17.4884 55.3128 18.5638 56.266C19.6392 57.2193 21.2739 57.1312 22.2151 56.0694C23.1562 55.0077 23.0475 53.3743 21.9721 52.421C20.8967 51.4678 19.262 51.5558 18.3209 52.6175Z" fill="#F7B9A9"/>
<path d="M4.44942 27.3219C3.98966 32.577 7.93158 37.2146 13.2542 37.6803C18.5766 38.1459 23.2641 34.2633 23.7239 29.0082C24.1836 23.7531 20.2416 19.1155 14.9191 18.6498C9.59653 18.1842 4.90917 22.0668 4.44942 27.3219" fill="#F7B9A9"/>
<path d="M4.44907 27.3219C4.65177 25.005 5.67687 22.9559 7.21525 21.4275C5.23492 27.1505 5.26353 33.7332 12.3343 37.5551C7.48536 36.6683 4.01622 32.2694 4.44907 27.3219" fill="#E2AA9F"/>
<path d="M4.33444 27.035C4.14732 28.743 4.50184 30.3928 5.1816 31.8505C9.00316 31.7885 9.84971 25.1493 9.84971 25.1493C14.6831 26.1755 18.3353 26.0528 20.8063 24.7814C22.24 24.0437 22.782 23.2434 22.6394 22.5007C22.4968 21.7581 21.8053 20.76 19.9646 19.9597C18.4434 19.2984 17.6847 19.0211 16.6796 18.712C16.6796 18.712 15.7486 18.408 14.8041 18.363C9.32071 18.102 4.92434 21.6507 4.33444 27.035Z" fill="#323232"/>
<path d="M7.08923 29.0415C7.03905 29.615 7.46938 30.1212 8.05012 30.172C8.63113 30.2229 9.14283 29.799 9.19301 29.2255C9.2432 28.6519 8.81286 28.1457 8.23185 28.0949C7.65111 28.0441 7.13942 28.4678 7.08923 29.0415" fill="#F7B9A9"/>
<path fill-rule="evenodd" clip-rule="evenodd" d="M14.8199 30.752C15.3587 30.7691 15.8324 30.3297 15.8347 29.7889C15.8519 29.2495 15.4131 28.7753 14.8729 28.7731C14.3341 28.756 13.8604 29.1955 13.8581 29.7362C13.8409 30.2757 14.2661 30.7336 14.8199 30.752Z" fill="white"/>
<path fill-rule="evenodd" clip-rule="evenodd" d="M20.7869 31.2741C21.3257 31.2912 21.7994 30.8518 21.8017 30.311C21.8189 29.7715 21.3801 29.2974 20.8399 29.2952C20.3011 29.2781 19.8274 29.7175 19.8251 30.2583C19.8079 30.7977 20.2331 31.2557 20.7869 31.2741Z" fill="white"/>
<path fill-rule="evenodd" clip-rule="evenodd" d="M15.2212 30.4298C15.6707 30.4391 16.062 30.0835 16.0713 29.6344C16.0806 29.1854 15.7245 28.7944 15.2751 28.785C14.8256 28.7757 14.4343 29.1313 14.425 29.5804C14.4157 30.0294 14.7718 30.4205 15.2212 30.4298Z" fill="#323232"/>
<path fill-rule="evenodd" clip-rule="evenodd" d="M21.1881 30.9519C21.6376 30.9612 22.029 30.6056 22.0382 30.1565C22.0475 29.7075 21.6915 29.3164 21.242 29.3071C20.7925 29.2978 20.4012 29.6534 20.3919 30.1025C20.3826 30.5515 20.7387 30.9425 21.1881 30.9519Z" fill="#323232"/>
<path fill-rule="evenodd" clip-rule="evenodd" d="M15.2334 32.3713C15.1422 33.414 15.98 34.3029 17.0822 34.3993C18.2143 34.4984 19.1663 33.7384 19.2552 32.7231L15.2334 32.3713Z" fill="#A58476"/>
<path fill-rule="evenodd" clip-rule="evenodd" d="M20.2717 26.9366L22.8167 27.6984C22.9472 27.7513 23.0603 27.8303 23.0954 27.944L23.1204 28.0015C23.1579 28.0877 23.106 28.1661 23.0142 28.1857C22.9845 28.1831 22.9523 28.2079 22.9249 28.1779L20.2343 27.7075C20.027 27.6755 19.8888 27.539 19.8436 27.3692L19.8145 27.1869C19.7819 27.0458 19.9017 26.8766 20.0978 26.8661C20.1538 26.9124 20.2282 26.919 20.2717 26.9366Z" fill="#323232"/>
<path fill-rule="evenodd" clip-rule="evenodd" d="M16.1407 26.9761L13.3774 27.5085C13.2397 27.5379 13.0973 27.6222 13.0567 27.7431L13.0358 27.8104C12.9839 27.8888 13.0214 27.975 13.1393 27.9992C13.1542 28.0005 13.2126 28.0194 13.2287 28.007L16.1121 27.8169C16.3082 27.8064 16.4977 27.6985 16.5568 27.5378L16.6183 27.3497C16.6774 27.1889 16.5404 27.0387 16.3629 27.0094C16.2473 26.9578 16.1878 26.9526 16.1407 26.9761Z" fill="#323232"/>
<path d="M24.6276 49.6765C24.5374 48.6358 25.3079 47.719 26.3486 47.6288L40.5587 46.397C41.5994 46.3068 42.5162 47.0773 42.6065 48.118L43.3001 56.1201C43.3903 57.1609 42.6198 58.0777 41.5791 58.1679L27.3689 59.3996C26.3282 59.4899 25.4114 58.7193 25.3212 57.6786L24.6276 49.6765Z" fill="#212121"/>
<path d="M23.6755 49.0101C23.5853 47.9694 24.3558 47.0526 25.3965 46.9624L39.6067 45.7306C40.6474 45.6404 41.5642 46.411 41.6544 47.4517L42.348 55.4538C42.4382 56.4945 41.6677 57.4113 40.627 57.5015L26.4169 58.7333C25.3762 58.8235 24.4594 58.053 24.3691 57.0122L23.6755 49.0101Z" fill="#323232"/>
<path fill-rule="evenodd" clip-rule="evenodd" d="M33.8574 44.0537C34.4099 44.0047 34.8982 44.4108 34.9508 44.9629L35.0577 46.0861C35.0841 46.3634 34.8807 46.6096 34.6034 46.636C34.3261 46.6624 34.0799 46.459 34.0535 46.1817L33.9466 45.0585L30.3897 45.374L30.5199 46.6597C30.548 46.9368 30.3461 47.1843 30.0689 47.2124C29.7918 47.2404 29.5444 47.0385 29.5163 46.7614L29.3861 45.4757C29.3294 44.9165 29.7407 44.4189 30.3006 44.3692L33.8574 44.0537Z" fill="#323232"/>
<path d="M29.3594 43.5066C29.2833 44.9234 30.385 46.1344 31.8199 46.2114C33.255 46.2884 34.4798 45.2021 34.5558 43.7854C34.6318 42.3686 33.5303 41.1577 32.0952 41.0807C30.6602 41.0037 29.4354 42.0898 29.3594 43.5066Z" fill="#F7B9A9"/>
<path d="M47.4019 38.3806C46.8739 38.3806 46.6099 38.1086 46.6099 37.5646V30.6406C46.6099 30.0966 46.8819 29.8246 47.4259 29.8246H51.6139C52.0299 29.8246 52.2379 30.0246 52.2379 30.4246C52.2379 30.8406 52.0299 31.0486 51.6139 31.0486H48.1459V33.4366H51.3619C51.7779 33.4366 51.9859 33.6366 51.9859 34.0366C51.9859 34.4526 51.7779 34.6606 51.3619 34.6606H48.1459V37.5646C48.1459 38.1086 47.8979 38.3806 47.4019 38.3806ZM55.6692 38.4046C55.0612 38.4046 54.5332 38.2806 54.0852 38.0326C53.6372 37.7846 53.2892 37.4326 53.0412 36.9766C52.7932 36.5126 52.6692 35.9686 52.6692 35.3446C52.6692 34.7206 52.7932 34.1806 53.0412 33.7246C53.2892 33.2686 53.6372 32.9166 54.0852 32.6686C54.5332 32.4206 55.0612 32.2966 55.6692 32.2966C56.2772 32.2966 56.8052 32.4206 57.2532 32.6686C57.7012 32.9166 58.0492 33.2686 58.2972 33.7246C58.5452 34.1806 58.6692 34.7206 58.6692 35.3446C58.6692 35.9686 58.5452 36.5126 58.2972 36.9766C58.0492 37.4326 57.7012 37.7846 57.2532 38.0326C56.8052 38.2806 56.2772 38.4046 55.6692 38.4046ZM55.6692 37.2646C56.1172 37.2646 56.4772 37.1046 56.7492 36.7846C57.0212 36.4566 57.1572 35.9766 57.1572 35.3446C57.1572 34.7046 57.0212 34.2286 56.7492 33.9166C56.4772 33.5966 56.1172 33.4366 55.6692 33.4366C55.2212 33.4366 54.8612 33.5966 54.5892 33.9166C54.3172 34.2286 54.1812 34.7046 54.1812 35.3446C54.1812 35.9766 54.3172 36.4566 54.5892 36.7846C54.8612 37.1046 55.2212 37.2646 55.6692 37.2646ZM60.6753 38.3806C60.1633 38.3806 59.9073 38.1246 59.9073 37.6126V33.0766C59.9073 32.5726 60.1513 32.3206 60.6393 32.3206C61.1273 32.3206 61.3713 32.5726 61.3713 33.0766V33.4486C61.6593 32.7606 62.2753 32.3766 63.2193 32.2966C63.5633 32.2566 63.7553 32.4526 63.7953 32.8846C63.8353 33.3086 63.6273 33.5446 63.1713 33.5926L62.9073 33.6166C61.9233 33.7126 61.4313 34.2166 61.4313 35.1286V37.6126C61.4313 38.1246 61.1793 38.3806 60.6753 38.3806ZM68.7763 38.3806C68.2643 38.3806 68.0083 38.1166 68.0083 37.5886V30.5206C68.0083 29.9926 68.2643 29.7286 68.7763 29.7286C69.2883 29.7286 69.5443 29.9926 69.5443 30.5206V37.5886C69.5443 38.1166 69.2883 38.3806 68.7763 38.3806ZM71.995 38.3806C71.499 38.3806 71.251 38.1246 71.251 37.6126V33.0766C71.251 32.5726 71.495 32.3206 71.983 32.3206C72.471 32.3206 72.715 32.5726 72.715 33.0766V33.3286C72.915 32.9926 73.183 32.7366 73.519 32.5606C73.863 32.3846 74.247 32.2966 74.671 32.2966C76.055 32.2966 76.747 33.1006 76.747 34.7086V37.6126C76.747 38.1246 76.499 38.3806 76.003 38.3806C75.499 38.3806 75.247 38.1246 75.247 37.6126V34.7806C75.247 34.3246 75.159 33.9926 74.983 33.7846C74.815 33.5766 74.551 33.4726 74.191 33.4726C73.751 33.4726 73.399 33.6126 73.135 33.8926C72.879 34.1646 72.751 34.5286 72.751 34.9846V37.6126C72.751 38.1246 72.499 38.3806 71.995 38.3806ZM79.0145 38.3806C78.5185 38.3806 78.2705 38.1246 78.2705 37.6126V33.0766C78.2705 32.5726 78.5145 32.3206 79.0025 32.3206C79.4905 32.3206 79.7345 32.5726 79.7345 33.0766V33.3286C79.9345 32.9926 80.2025 32.7366 80.5385 32.5606C80.8825 32.3846 81.2665 32.2966 81.6905 32.2966C83.0745 32.2966 83.7665 33.1006 83.7665 34.7086V37.6126C83.7665 38.1246 83.5185 38.3806 83.0225 38.3806C82.5185 38.3806 82.2665 38.1246 82.2665 37.6126V34.7806C82.2665 34.3246 82.1785 33.9926 82.0025 33.7846C81.8345 33.5766 81.5705 33.4726 81.2105 33.4726C80.7705 33.4726 80.4185 33.6126 80.1545 33.8926C79.8985 34.1646 79.7705 34.5286 79.7705 34.9846V37.6126C79.7705 38.1246 79.5185 38.3806 79.0145 38.3806ZM87.9661 38.4046C87.3581 38.4046 86.8301 38.2806 86.3821 38.0326C85.9341 37.7846 85.5861 37.4326 85.3381 36.9766C85.0901 36.5126 84.9661 35.9686 84.9661 35.3446C84.9661 34.7206 85.0901 34.1806 85.3381 33.7246C85.5861 33.2686 85.9341 32.9166 86.3821 32.6686C86.8301 32.4206 87.3581 32.2966 87.9661 32.2966C88.5741 32.2966 89.1021 32.4206 89.5501 32.6686C89.9981 32.9166 90.3461 33.2686 90.5941 33.7246C90.8421 34.1806 90.9661 34.7206 90.9661 35.3446C90.9661 35.9686 90.8421 36.5126 90.5941 36.9766C90.3461 37.4326 89.9981 37.7846 89.5501 38.0326C89.1021 38.2806 88.5741 38.4046 87.9661 38.4046ZM87.9661 37.2646C88.4141 37.2646 88.7741 37.1046 89.0461 36.7846C89.3181 36.4566 89.4541 35.9766 89.4541 35.3446C89.4541 34.7046 89.3181 34.2286 89.0461 33.9166C88.7741 33.5966 88.4141 33.4366 87.9661 33.4366C87.5181 33.4366 87.1581 33.5966 86.8861 33.9166C86.6141 34.2286 86.4781 34.7046 86.4781 35.3446C86.4781 35.9766 86.6141 36.4566 86.8861 36.7846C87.1581 37.1046 87.5181 37.2646 87.9661 37.2646ZM94.4629 38.3806C94.0629 38.3806 93.7669 38.1686 93.5749 37.7446L91.6669 33.3166C91.5549 33.0526 91.5509 32.8206 91.6549 32.6206C91.7669 32.4206 91.9869 32.3206 92.3149 32.3206C92.4989 32.3206 92.6469 32.3646 92.7589 32.4526C92.8709 32.5326 92.9709 32.6886 93.0589 32.9206L94.4989 36.5206L95.9869 32.9086C96.0749 32.6846 96.1749 32.5326 96.2869 32.4526C96.4069 32.3646 96.5669 32.3206 96.7669 32.3206C97.0229 32.3206 97.2029 32.4206 97.3069 32.6206C97.4109 32.8206 97.4069 33.0486 97.2949 33.3046L95.3509 37.7446C95.1749 38.1686 94.8789 38.3806 94.4629 38.3806ZM100.23 38.4046C99.8059 38.4046 99.4259 38.3246 99.0899 38.1646C98.7619 37.9966 98.5019 37.7726 98.3099 37.4926C98.1259 37.2126 98.0339 36.8966 98.0339 36.5446C98.0339 36.1126 98.1459 35.7726 98.3699 35.5246C98.5939 35.2686 98.9579 35.0846 99.4619 34.9726C99.9659 34.8606 100.642 34.8046 101.49 34.8046H101.91V34.5526C101.91 34.1526 101.822 33.8646 101.646 33.6886C101.47 33.5126 101.174 33.4246 100.758 33.4246C100.526 33.4246 100.274 33.4526 100.002 33.5086C99.7379 33.5646 99.4579 33.6606 99.1619 33.7966C98.9699 33.8846 98.8099 33.8966 98.6819 33.8326C98.5539 33.7606 98.4659 33.6526 98.4179 33.5086C98.3779 33.3566 98.3859 33.2046 98.4419 33.0526C98.5059 32.9006 98.6299 32.7886 98.8139 32.7166C99.1819 32.5646 99.5339 32.4566 99.8699 32.3926C100.214 32.3286 100.526 32.2966 100.806 32.2966C101.662 32.2966 102.298 32.4966 102.714 32.8966C103.13 33.2886 103.338 33.9006 103.338 34.7326V37.6126C103.338 38.1246 103.106 38.3806 102.642 38.3806C102.17 38.3806 101.934 38.1246 101.934 37.6126V37.3486C101.798 37.6766 101.582 37.9366 101.286 38.1286C100.99 38.3126 100.638 38.4046 100.23 38.4046ZM100.542 37.3726C100.934 37.3726 101.258 37.2366 101.514 36.9646C101.778 36.6926 101.91 36.3486 101.91 35.9326V35.6686H101.502C100.75 35.6686 100.226 35.7286 99.9299 35.8486C99.6419 35.9606 99.4979 36.1686 99.4979 36.4726C99.4979 36.7366 99.5899 36.9526 99.7739 37.1206C99.9579 37.2886 100.214 37.3726 100.542 37.3726ZM107.548 38.4046C105.996 38.4046 105.22 37.6366 105.22 36.1006V33.5446H104.596C104.196 33.5446 103.996 33.3566 103.996 32.9806C103.996 32.6046 104.196 32.4166 104.596 32.4166H105.22V31.3246C105.22 30.8206 105.472 30.5686 105.976 30.5686C106.472 30.5686 106.72 30.8206 106.72 31.3246V32.4166H107.992C108.392 32.4166 108.592 32.6046 108.592 32.9806C108.592 33.3566 108.392 33.5446 107.992 33.5446H106.72V36.0166C106.72 36.4006 106.804 36.6886 106.972 36.8806C107.14 37.0726 107.412 37.1686 107.788 37.1686C107.924 37.1686 108.044 37.1566 108.148 37.1326C108.252 37.1086 108.344 37.0926 108.424 37.0846C108.52 37.0766 108.6 37.1086 108.664 37.1806C108.728 37.2446 108.76 37.3806 108.76 37.5886C108.76 37.7486 108.732 37.8926 108.676 38.0206C108.628 38.1406 108.536 38.2246 108.4 38.2726C108.296 38.3046 108.16 38.3326 107.992 38.3566C107.824 38.3886 107.676 38.4046 107.548 38.4046ZM110.362 31.2166C110.082 31.2166 109.862 31.1486 109.702 31.0126C109.55 30.8686 109.474 30.6726 109.474 30.4246C109.474 30.1686 109.55 29.9726 109.702 29.8366C109.862 29.7006 110.082 29.6326 110.362 29.6326C110.954 29.6326 111.25 29.8966 111.25 30.4246C111.25 30.9526 110.954 31.2166 110.362 31.2166ZM110.362 38.3686C110.122 38.3686 109.938 38.2966 109.81 38.1526C109.682 38.0086 109.618 37.8086 109.618 37.5526V33.1486C109.618 32.6046 109.866 32.3326 110.362 32.3326C110.866 32.3326 111.118 32.6046 111.118 33.1486V37.5526C111.118 37.8086 111.054 38.0086 110.926 38.1526C110.798 38.2966 110.61 38.3686 110.362 38.3686ZM115.053 38.3806C114.653 38.3806 114.357 38.1686 114.165 37.7446L112.257 33.3166C112.145 33.0526 112.141 32.8206 112.245 32.6206C112.357 32.4206 112.577 32.3206 112.905 32.3206C113.089 32.3206 113.237 32.3646 113.349 32.4526C113.461 32.5326 113.561 32.6886 113.649 32.9206L115.089 36.5206L116.577 32.9086C116.665 32.6846 116.765 32.5326 116.877 32.4526C116.997 32.3646 117.157 32.3206 117.357 32.3206C117.613 32.3206 117.793 32.4206 117.897 32.6206C118.001 32.8206 117.997 33.0486 117.885 33.3046L115.941 37.7446C115.765 38.1686 115.469 38.3806 115.053 38.3806ZM121.78 38.4046C121.116 38.4046 120.544 38.2806 120.064 38.0326C119.584 37.7846 119.212 37.4326 118.948 36.9766C118.692 36.5206 118.564 35.9806 118.564 35.3566C118.564 34.7486 118.688 34.2166 118.936 33.7606C119.192 33.3046 119.54 32.9486 119.98 32.6926C120.428 32.4286 120.936 32.2966 121.504 32.2966C122.336 32.2966 122.992 32.5606 123.472 33.0886C123.96 33.6166 124.204 34.3366 124.204 35.2486C124.204 35.5446 124.012 35.6926 123.628 35.6926H120.004C120.116 36.7406 120.716 37.2646 121.804 37.2646C122.012 37.2646 122.244 37.2406 122.5 37.1926C122.764 37.1366 123.012 37.0446 123.244 36.9166C123.452 36.7966 123.628 36.7606 123.772 36.8086C123.916 36.8486 124.016 36.9326 124.072 37.0606C124.136 37.1886 124.144 37.3326 124.096 37.4926C124.056 37.6446 123.944 37.7766 123.76 37.8886C123.48 38.0646 123.156 38.1966 122.788 38.2846C122.428 38.3646 122.092 38.4046 121.78 38.4046ZM121.564 33.3166C121.124 33.3166 120.768 33.4526 120.496 33.7246C120.224 33.9966 120.06 34.3646 120.004 34.8286H122.956C122.924 34.3406 122.788 33.9686 122.548 33.7126C122.316 33.4486 121.988 33.3166 121.564 33.3166ZM47.4259 52.2846C46.8819 52.2846 46.6099 52.0126 46.6099 51.4686V44.6406C46.6099 44.0966 46.8819 43.8246 47.4259 43.8246H50.3059C51.1939 43.8246 51.8819 44.0206 52.3699 44.4126C52.8579 44.7966 53.1019 45.3326 53.1019 46.0206C53.1019 46.4766 52.9859 46.8686 52.7539 47.1966C52.5219 47.5246 52.2019 47.7646 51.7939 47.9166C52.2739 48.0526 52.6459 48.2926 52.9099 48.6366C53.1819 48.9726 53.3179 49.4006 53.3179 49.9206C53.3179 50.6726 53.0619 51.2566 52.5499 51.6726C52.0459 52.0806 51.3419 52.2846 50.4379 52.2846H47.4259ZM48.0859 47.4126H50.0419C51.0899 47.4126 51.6139 47.0086 51.6139 46.2006C51.6139 45.3926 51.0899 44.9886 50.0419 44.9886H48.0859V47.4126ZM48.0859 51.1206H50.2459C51.3019 51.1206 51.8299 50.6966 51.8299 49.8486C51.8299 49.0006 51.3019 48.5766 50.2459 48.5766H48.0859V51.1206ZM56.8516 52.4046C55.4116 52.4046 54.6916 51.5966 54.6916 49.9806V47.0766C54.6916 46.5726 54.9396 46.3206 55.4356 46.3206C55.9396 46.3206 56.1916 46.5726 56.1916 47.0766V50.0046C56.1916 50.4206 56.2756 50.7286 56.4436 50.9286C56.6116 51.1286 56.8796 51.2286 57.2476 51.2286C57.6476 51.2286 57.9756 51.0926 58.2316 50.8206C58.4876 50.5406 58.6156 50.1726 58.6156 49.7166V47.0766C58.6156 46.5726 58.8636 46.3206 59.3596 46.3206C59.8636 46.3206 60.1156 46.5726 60.1156 47.0766V51.6126C60.1156 52.1246 59.8716 52.3806 59.3836 52.3806C58.8956 52.3806 58.6516 52.1246 58.6516 51.6126V51.4086C58.2596 52.0726 57.6596 52.4046 56.8516 52.4046ZM63.8248 52.4046C63.4808 52.4046 63.1168 52.3686 62.7328 52.2966C62.3488 52.2246 62.0048 52.1006 61.7008 51.9246C61.5328 51.8286 61.4288 51.7126 61.3888 51.5766C61.3488 51.4326 61.3528 51.3006 61.4008 51.1806C61.4568 51.0526 61.5448 50.9606 61.6648 50.9046C61.7928 50.8486 61.9408 50.8606 62.1088 50.9406C62.4288 51.0926 62.7288 51.2006 63.0088 51.2646C63.2888 51.3206 63.5648 51.3486 63.8368 51.3486C64.2208 51.3486 64.5048 51.2846 64.6888 51.1566C64.8808 51.0206 64.9768 50.8446 64.9768 50.6286C64.9768 50.2926 64.7288 50.0766 64.2328 49.9806L63.0328 49.7526C62.0168 49.5606 61.5088 49.0326 61.5088 48.1686C61.5088 47.7846 61.6128 47.4526 61.8208 47.1726C62.0368 46.8926 62.3328 46.6766 62.7088 46.5246C63.0848 46.3726 63.5168 46.2966 64.0048 46.2966C64.7088 46.2966 65.3368 46.4526 65.8888 46.7646C66.0408 46.8446 66.1288 46.9566 66.1528 47.1006C66.1848 47.2366 66.1688 47.3686 66.1048 47.4966C66.0488 47.6166 65.9568 47.7046 65.8288 47.7606C65.7008 47.8086 65.5528 47.7926 65.3848 47.7126C65.1368 47.5846 64.8968 47.4926 64.6648 47.4366C64.4408 47.3806 64.2248 47.3526 64.0168 47.3526C63.6248 47.3526 63.3328 47.4206 63.1408 47.5566C62.9568 47.6926 62.8648 47.8726 62.8648 48.0966C62.8648 48.4486 63.0928 48.6646 63.5488 48.7446L64.7488 48.9726C65.2688 49.0686 65.6608 49.2446 65.9248 49.5006C66.1968 49.7566 66.3328 50.1006 66.3328 50.5326C66.3328 51.1166 66.1048 51.5766 65.6488 51.9126C65.1928 52.2406 64.5848 52.4046 63.8248 52.4046ZM68.2802 45.2166C68.0002 45.2166 67.7802 45.1486 67.6202 45.0126C67.4682 44.8686 67.3922 44.6726 67.3922 44.4246C67.3922 44.1686 67.4682 43.9726 67.6202 43.8366C67.7802 43.7006 68.0002 43.6326 68.2802 43.6326C68.8722 43.6326 69.1682 43.8966 69.1682 44.4246C69.1682 44.9526 68.8722 45.2166 68.2802 45.2166ZM68.2802 52.3686C68.0402 52.3686 67.8562 52.2966 67.7282 52.1526C67.6002 52.0086 67.5362 51.8086 67.5362 51.5526V47.1486C67.5362 46.6046 67.7842 46.3326 68.2802 46.3326C68.7842 46.3326 69.0362 46.6046 69.0362 47.1486V51.5526C69.0362 51.8086 68.9722 52.0086 68.8442 52.1526C68.7162 52.2966 68.5282 52.3686 68.2802 52.3686ZM71.3388 52.3806C70.8428 52.3806 70.5948 52.1246 70.5948 51.6126V47.0766C70.5948 46.5726 70.8388 46.3206 71.3268 46.3206C71.8148 46.3206 72.0588 46.5726 72.0588 47.0766V47.3286C72.2588 46.9926 72.5268 46.7366 72.8628 46.5606C73.2068 46.3846 73.5908 46.2966 74.0148 46.2966C75.3988 46.2966 76.0908 47.1006 76.0908 48.7086V51.6126C76.0908 52.1246 75.8428 52.3806 75.3468 52.3806C74.8428 52.3806 74.5908 52.1246 74.5908 51.6126V48.7806C74.5908 48.3246 74.5028 47.9926 74.3268 47.7846C74.1588 47.5766 73.8948 47.4726 73.5348 47.4726C73.0948 47.4726 72.7428 47.6126 72.4788 47.8926C72.2228 48.1646 72.0948 48.5286 72.0948 48.9846V51.6126C72.0948 52.1246 71.8428 52.3806 71.3388 52.3806ZM80.5063 52.4046C79.8423 52.4046 79.2703 52.2806 78.7903 52.0326C78.3103 51.7846 77.9383 51.4326 77.6743 50.9766C77.4183 50.5206 77.2903 49.9806 77.2903 49.3566C77.2903 48.7486 77.4143 48.2166 77.6623 47.7606C77.9183 47.3046 78.2663 46.9486 78.7063 46.6926C79.1543 46.4286 79.6623 46.2966 80.2303 46.2966C81.0623 46.2966 81.7183 46.5606 82.1983 47.0886C82.6863 47.6166 82.9303 48.3366 82.9303 49.2486C82.9303 49.5446 82.7383 49.6926 82.3543 49.6926H78.7303C78.8423 50.7406 79.4423 51.2646 80.5303 51.2646C80.7383 51.2646 80.9703 51.2406 81.2263 51.1926C81.4903 51.1366 81.7383 51.0446 81.9703 50.9166C82.1783 50.7966 82.3543 50.7606 82.4983 50.8086C82.6423 50.8486 82.7423 50.9326 82.7983 51.0606C82.8623 51.1886 82.8703 51.3326 82.8223 51.4926C82.7823 51.6446 82.6703 51.7766 82.4863 51.8886C82.2063 52.0646 81.8823 52.1966 81.5143 52.2846C81.1543 52.3646 80.8183 52.4046 80.5063 52.4046ZM80.2903 47.3166C79.8503 47.3166 79.4943 47.4526 79.2223 47.7246C78.9503 47.9966 78.7863 48.3646 78.7303 48.8286H81.6823C81.6503 48.3406 81.5143 47.9686 81.2743 47.7126C81.0423 47.4486 80.7143 47.3166 80.2903 47.3166ZM86.2662 52.4046C85.9222 52.4046 85.5582 52.3686 85.1742 52.2966C84.7902 52.2246 84.4462 52.1006 84.1422 51.9246C83.9742 51.8286 83.8702 51.7126 83.8302 51.5766C83.7902 51.4326 83.7942 51.3006 83.8422 51.1806C83.8982 51.0526 83.9862 50.9606 84.1062 50.9046C84.2342 50.8486 84.3822 50.8606 84.5502 50.9406C84.8702 51.0926 85.1702 51.2006 85.4502 51.2646C85.7302 51.3206 86.0062 51.3486 86.2782 51.3486C86.6622 51.3486 86.9462 51.2846 87.1302 51.1566C87.3222 51.0206 87.4182 50.8446 87.4182 50.6286C87.4182 50.2926 87.1702 50.0766 86.6742 49.9806L85.4742 49.7526C84.4582 49.5606 83.9502 49.0326 83.9502 48.1686C83.9502 47.7846 84.0542 47.4526 84.2622 47.1726C84.4782 46.8926 84.7742 46.6766 85.1502 46.5246C85.5262 46.3726 85.9582 46.2966 86.4462 46.2966C87.1502 46.2966 87.7782 46.4526 88.3302 46.7646C88.4822 46.8446 88.5702 46.9566 88.5942 47.1006C88.6262 47.2366 88.6102 47.3686 88.5462 47.4966C88.4902 47.6166 88.3982 47.7046 88.2702 47.7606C88.1422 47.8086 87.9942 47.7926 87.8262 47.7126C87.5782 47.5846 87.3382 47.4926 87.1062 47.4366C86.8822 47.3806 86.6662 47.3526 86.4582 47.3526C86.0662 47.3526 85.7742 47.4206 85.5822 47.5566C85.3982 47.6926 85.3062 47.8726 85.3062 48.0966C85.3062 48.4486 85.5342 48.6646 85.9902 48.7446L87.1902 48.9726C87.7102 49.0686 88.1022 49.2446 88.3662 49.5006C88.6382 49.7566 88.7742 50.1006 88.7742 50.5326C88.7742 51.1166 88.5462 51.5766 88.0902 51.9126C87.6342 52.2406 87.0262 52.4046 86.2662 52.4046ZM92.1256 52.4046C91.7816 52.4046 91.4176 52.3686 91.0336 52.2966C90.6496 52.2246 90.3056 52.1006 90.0016 51.9246C89.8336 51.8286 89.7296 51.7126 89.6896 51.5766C89.6496 51.4326 89.6536 51.3006 89.7016 51.1806C89.7576 51.0526 89.8456 50.9606 89.9656 50.9046C90.0936 50.8486 90.2416 50.8606 90.4096 50.9406C90.7296 51.0926 91.0296 51.2006 91.3096 51.2646C91.5896 51.3206 91.8656 51.3486 92.1376 51.3486C92.5216 51.3486 92.8056 51.2846 92.9896 51.1566C93.1816 51.0206 93.2776 50.8446 93.2776 50.6286C93.2776 50.2926 93.0296 50.0766 92.5336 49.9806L91.3336 49.7526C90.3176 49.5606 89.8096 49.0326 89.8096 48.1686C89.8096 47.7846 89.9136 47.4526 90.1216 47.1726C90.3376 46.8926 90.6336 46.6766 91.0096 46.5246C91.3856 46.3726 91.8176 46.2966 92.3056 46.2966C93.0096 46.2966 93.6376 46.4526 94.1896 46.7646C94.3416 46.8446 94.4296 46.9566 94.4536 47.1006C94.4856 47.2366 94.4696 47.3686 94.4056 47.4966C94.3496 47.6166 94.2576 47.7046 94.1296 47.7606C94.0016 47.8086 93.8536 47.7926 93.6856 47.7126C93.4376 47.5846 93.1976 47.4926 92.9656 47.4366C92.7416 47.3806 92.5256 47.3526 92.3176 47.3526C91.9256 47.3526 91.6336 47.4206 91.4416 47.5566C91.2576 47.6926 91.1656 47.8726 91.1656 48.0966C91.1656 48.4486 91.3936 48.6646 91.8496 48.7446L93.0496 48.9726C93.5696 49.0686 93.9616 49.2446 94.2256 49.5006C94.4976 49.7566 94.6336 50.1006 94.6336 50.5326C94.6336 51.1166 94.4056 51.5766 93.9496 51.9126C93.4936 52.2406 92.8856 52.4046 92.1256 52.4046ZM100.007 52.3806C99.4948 52.3806 99.2388 52.1166 99.2388 51.5886V44.6046C99.2388 44.0846 99.4988 43.8246 100.019 43.8246H102.911C103.839 43.8246 104.555 44.0566 105.059 44.5206C105.563 44.9846 105.815 45.6326 105.815 46.4646C105.815 47.2966 105.563 47.9486 105.059 48.4206C104.555 48.8846 103.839 49.1166 102.911 49.1166H100.775V51.5886C100.775 52.1166 100.519 52.3806 100.007 52.3806ZM100.775 47.9046H102.671C103.775 47.9046 104.327 47.4246 104.327 46.4646C104.327 45.5126 103.775 45.0366 102.671 45.0366H100.775V47.9046ZM108.574 52.4046C108.15 52.4046 107.77 52.3246 107.434 52.1646C107.106 51.9966 106.846 51.7726 106.654 51.4926C106.47 51.2126 106.378 50.8966 106.378 50.5446C106.378 50.1126 106.49 49.7726 106.714 49.5246C106.938 49.2686 107.302 49.0846 107.806 48.9726C108.31 48.8606 108.986 48.8046 109.834 48.8046H110.254V48.5526C110.254 48.1526 110.166 47.8646 109.99 47.6886C109.814 47.5126 109.518 47.4246 109.102 47.4246C108.87 47.4246 108.618 47.4526 108.346 47.5086C108.082 47.5646 107.802 47.6606 107.506 47.7966C107.314 47.8846 107.154 47.8966 107.026 47.8326C106.898 47.7606 106.81 47.6526 106.762 47.5086C106.722 47.3566 106.73 47.2046 106.786 47.0526C106.85 46.9006 106.974 46.7886 107.158 46.7166C107.526 46.5646 107.878 46.4566 108.214 46.3926C108.558 46.3286 108.87 46.2966 109.15 46.2966C110.006 46.2966 110.642 46.4966 111.058 46.8966C111.474 47.2886 111.682 47.9006 111.682 48.7326V51.6126C111.682 52.1246 111.45 52.3806 110.986 52.3806C110.514 52.3806 110.278 52.1246 110.278 51.6126V51.3486C110.142 51.6766 109.926 51.9366 109.63 52.1286C109.334 52.3126 108.982 52.4046 108.574 52.4046ZM108.886 51.3726C109.278 51.3726 109.602 51.2366 109.858 50.9646C110.122 50.6926 110.254 50.3486 110.254 49.9326V49.6686H109.846C109.094 49.6686 108.57 49.7286 108.274 49.8486C107.986 49.9606 107.842 50.1686 107.842 50.4726C107.842 50.7366 107.934 50.9526 108.118 51.1206C108.302 51.2886 108.558 51.3726 108.886 51.3726ZM113.972 52.3806C113.46 52.3806 113.204 52.1246 113.204 51.6126V47.0766C113.204 46.5726 113.448 46.3206 113.936 46.3206C114.424 46.3206 114.668 46.5726 114.668 47.0766V47.4486C114.956 46.7606 115.572 46.3766 116.516 46.2966C116.86 46.2566 117.052 46.4526 117.092 46.8846C117.132 47.3086 116.924 47.5446 116.468 47.5926L116.204 47.6166C115.22 47.7126 114.728 48.2166 114.728 49.1286V51.6126C114.728 52.1246 114.476 52.3806 113.972 52.3806ZM120.931 52.4046C119.379 52.4046 118.603 51.6366 118.603 50.1006V47.5446H117.979C117.579 47.5446 117.379 47.3566 117.379 46.9806C117.379 46.6046 117.579 46.4166 117.979 46.4166H118.603V45.3246C118.603 44.8206 118.855 44.5686 119.359 44.5686C119.855 44.5686 120.103 44.8206 120.103 45.3246V46.4166H121.375C121.775 46.4166 121.975 46.6046 121.975 46.9806C121.975 47.3566 121.775 47.5446 121.375 47.5446H120.103V50.0166C120.103 50.4006 120.187 50.6886 120.355 50.8806C120.523 51.0726 120.795 51.1686 121.171 51.1686C121.307 51.1686 121.427 51.1566 121.531 51.1326C121.635 51.1086 121.727 51.0926 121.807 51.0846C121.903 51.0766 121.983 51.1086 122.047 51.1806C122.111 51.2446 122.143 51.3806 122.143 51.5886C122.143 51.7486 122.115 51.8926 122.059 52.0206C122.011 52.1406 121.919 52.2246 121.783 52.2726C121.679 52.3046 121.543 52.3326 121.375 52.3566C121.207 52.3886 121.059 52.4046 120.931 52.4046ZM123.593 52.3806C123.097 52.3806 122.849 52.1246 122.849 51.6126V47.0766C122.849 46.5726 123.093 46.3206 123.581 46.3206C124.069 46.3206 124.313 46.5726 124.313 47.0766V47.3286C124.513 46.9926 124.781 46.7366 125.117 46.5606C125.461 46.3846 125.845 46.2966 126.269 46.2966C127.653 46.2966 128.345 47.1006 128.345 48.7086V51.6126C128.345 52.1246 128.097 52.3806 127.601 52.3806C127.097 52.3806 126.845 52.1246 126.845 51.6126V48.7806C126.845 48.3246 126.757 47.9926 126.581 47.7846C126.413 47.5766 126.149 47.4726 125.789 47.4726C125.349 47.4726 124.997 47.6126 124.733 47.8926C124.477 48.1646 124.349 48.5286 124.349 48.9846V51.6126C124.349 52.1246 124.097 52.3806 123.593 52.3806ZM132.76 52.4046C132.096 52.4046 131.524 52.2806 131.044 52.0326C130.564 51.7846 130.192 51.4326 129.928 50.9766C129.672 50.5206 129.544 49.9806 129.544 49.3566C129.544 48.7486 129.668 48.2166 129.916 47.7606C130.172 47.3046 130.52 46.9486 130.96 46.6926C131.408 46.4286 131.916 46.2966 132.484 46.2966C133.316 46.2966 133.972 46.5606 134.452 47.0886C134.94 47.6166 135.184 48.3366 135.184 49.2486C135.184 49.5446 134.992 49.6926 134.608 49.6926H130.984C131.096 50.7406 131.696 51.2646 132.784 51.2646C132.992 51.2646 133.224 51.2406 133.48 51.1926C133.744 51.1366 133.992 51.0446 134.224 50.9166C134.432 50.7966 134.608 50.7606 134.752 50.8086C134.896 50.8486 134.996 50.9326 135.052 51.0606C135.116 51.1886 135.124 51.3326 135.076 51.4926C135.036 51.6446 134.924 51.7766 134.74 51.8886C134.46 52.0646 134.136 52.1966 133.768 52.2846C133.408 52.3646 133.072 52.4046 132.76 52.4046ZM132.544 47.3166C132.104 47.3166 131.748 47.4526 131.476 47.7246C131.204 47.9966 131.04 48.3646 130.984 48.8286H133.936C133.904 48.3406 133.768 47.9686 133.528 47.7126C133.296 47.4486 132.968 47.3166 132.544 47.3166ZM137.14 52.3806C136.628 52.3806 136.372 52.1246 136.372 51.6126V47.0766C136.372 46.5726 136.616 46.3206 137.104 46.3206C137.592 46.3206 137.836 46.5726 137.836 47.0766V47.4486C138.124 46.7606 138.74 46.3766 139.684 46.2966C140.028 46.2566 140.22 46.4526 140.26 46.8846C140.3 47.3086 140.092 47.5446 139.636 47.5926L139.372 47.6166C138.388 47.7126 137.896 48.2166 137.896 49.1286V51.6126C137.896 52.1246 137.644 52.3806 137.14 52.3806ZM143.161 52.4046C142.817 52.4046 142.453 52.3686 142.069 52.2966C141.685 52.2246 141.341 52.1006 141.037 51.9246C140.869 51.8286 140.765 51.7126 140.725 51.5766C140.685 51.4326 140.689 51.3006 140.737 51.1806C140.793 51.0526 140.881 50.9606 141.001 50.9046C141.129 50.8486 141.277 50.8606 141.445 50.9406C141.765 51.0926 142.065 51.2006 142.345 51.2646C142.625 51.3206 142.901 51.3486 143.173 51.3486C143.557 51.3486 143.841 51.2846 144.025 51.1566C144.217 51.0206 144.313 50.8446 144.313 50.6286C144.313 50.2926 144.065 50.0766 143.569 49.9806L142.369 49.7526C141.353 49.5606 140.845 49.0326 140.845 48.1686C140.845 47.7846 140.949 47.4526 141.157 47.1726C141.373 46.8926 141.669 46.6766 142.045 46.5246C142.421 46.3726 142.853 46.2966 143.341 46.2966C144.045 46.2966 144.673 46.4526 145.225 46.7646C145.377 46.8446 145.465 46.9566 145.489 47.1006C145.521 47.2366 145.505 47.3686 145.441 47.4966C145.385 47.6166 145.293 47.7046 145.165 47.7606C145.037 47.8086 144.889 47.7926 144.721 47.7126C144.473 47.5846 144.233 47.4926 144.001 47.4366C143.777 47.3806 143.561 47.3526 143.353 47.3526C142.961 47.3526 142.669 47.4206 142.477 47.5566C142.293 47.6926 142.201 47.8726 142.201 48.0966C142.201 48.4486 142.429 48.6646 142.885 48.7446L144.085 48.9726C144.605 49.0686 144.997 49.2446 145.261 49.5006C145.533 49.7566 145.669 50.1006 145.669 50.5326C145.669 51.1166 145.441 51.5766 144.985 51.9126C144.529 52.2406 143.921 52.4046 143.161 52.4046Z" fill="#3F8EFC"/>
<path d="M53.9159 64.3979H52.6959V70.9179H51.6459V66.7779H49.9059C50.2059 67.1246 50.3559 67.5412 50.3559 68.0279C50.3559 68.4079 50.2692 68.7412 50.0959 69.0279C49.9225 69.3079 49.6825 69.5212 49.3759 69.6679C49.0759 69.8146 48.7392 69.8879 48.3659 69.8879C47.9792 69.8879 47.6259 69.8079 47.3059 69.6479C46.9859 69.4812 46.7325 69.2479 46.5459 68.9479C46.3659 68.6479 46.2759 68.2979 46.2759 67.8979C46.2759 67.4779 46.3692 67.1179 46.5559 66.8179C46.7492 66.5179 47.0092 66.2912 47.3359 66.1379C47.6692 65.9779 48.0425 65.8979 48.4559 65.8979H51.6459V64.3979H45.4459V63.5179H53.9159V64.3979ZM48.3859 68.9979C48.7192 68.9979 48.9892 68.8946 49.1959 68.6879C49.4092 68.4812 49.5159 68.2146 49.5159 67.8879C49.5159 67.5679 49.4092 67.3046 49.1959 67.0979C48.9825 66.8846 48.7125 66.7779 48.3859 66.7779C48.0459 66.7779 47.7659 66.8846 47.5459 67.0979C47.3325 67.3046 47.2259 67.5712 47.2259 67.8979C47.2259 68.2246 47.3325 68.4912 47.5459 68.6979C47.7592 68.8979 48.0392 68.9979 48.3859 68.9979ZM60.6341 63.5179V64.3979H59.4141V70.9179H58.3941V69.1079C58.2208 69.4012 57.9808 69.6346 57.6741 69.8079C57.3741 69.9746 57.0141 70.0579 56.5941 70.0579C56.1408 70.0579 55.7408 69.9579 55.3941 69.7579C55.0541 69.5579 54.7908 69.2779 54.6041 68.9179C54.4175 68.5579 54.3241 68.1446 54.3241 67.6779C54.3241 67.2312 54.4175 66.8346 54.6041 66.4879C54.7975 66.1346 55.0641 65.8612 55.4041 65.6679C55.7508 65.4679 56.1475 65.3679 56.5941 65.3679C57.0075 65.3679 57.3675 65.4512 57.6741 65.6179C57.9808 65.7846 58.2208 66.0146 58.3941 66.3079V64.3979H53.4341V63.5179H60.6341ZM56.8641 69.2179C57.1975 69.2179 57.4775 69.1446 57.7041 68.9979C57.9375 68.8512 58.1108 68.6646 58.2241 68.4379C58.3375 68.2112 58.3941 67.9746 58.3941 67.7279V67.7179C58.3941 67.4646 58.3375 67.2246 58.2241 66.9979C58.1108 66.7646 57.9375 66.5779 57.7041 66.4379C57.4775 66.2912 57.1975 66.2179 56.8641 66.2179C56.4308 66.2179 56.0708 66.3546 55.7841 66.6279C55.4975 66.9012 55.3541 67.2612 55.3541 67.7079C55.3541 68.1679 55.4941 68.5346 55.7741 68.8079C56.0608 69.0812 56.4241 69.2179 56.8641 69.2179ZM63.6429 63.5179V64.3979H62.4229V70.9179H61.3729V64.3979H60.1529V63.5179H61.4029V63.1079C61.4029 62.7212 61.3296 62.3979 61.1829 62.1379C61.0362 61.8712 60.7762 61.7379 60.4029 61.7379C60.0295 61.7379 59.7662 61.8712 59.6129 62.1379C59.4595 62.3979 59.3829 62.7212 59.3829 63.1079V63.7579H58.3629V63.1579C58.3629 62.4579 58.5262 61.9012 58.8529 61.4879C59.1795 61.0679 59.6962 60.8579 60.4029 60.8579C61.1229 60.8579 61.6396 61.0646 61.9529 61.4779C62.2662 61.8912 62.4229 62.4512 62.4229 63.1579V63.5179H63.6429ZM71.6307 64.3979H70.4107V70.9179H69.3607V66.7779H67.6207C67.9207 67.1246 68.0707 67.5412 68.0707 68.0279C68.0707 68.4079 67.984 68.7412 67.8107 69.0279C67.6374 69.3079 67.3974 69.5212 67.0907 69.6679C66.7907 69.8146 66.454 69.8879 66.0807 69.8879C65.694 69.8879 65.3407 69.8079 65.0207 69.6479C64.7007 69.4812 64.4474 69.2479 64.2607 68.9479C64.0807 68.6479 63.9907 68.2979 63.9907 67.8979C63.9907 67.4779 64.084 67.1179 64.2707 66.8179C64.464 66.5179 64.724 66.2912 65.0507 66.1379C65.384 65.9779 65.7574 65.8979 66.1707 65.8979H69.3607V64.3979H63.1607V63.5179H71.6307V64.3979ZM66.1007 68.9979C66.434 68.9979 66.704 68.8946 66.9107 68.6879C67.124 68.4812 67.2307 68.2146 67.2307 67.8879C67.2307 67.5679 67.124 67.3046 66.9107 67.0979C66.6974 66.8846 66.4274 66.7779 66.1007 66.7779C65.7607 66.7779 65.4807 66.8846 65.2607 67.0979C65.0474 67.3046 64.9407 67.5712 64.9407 67.8979C64.9407 68.2246 65.0474 68.4912 65.2607 68.6979C65.474 68.8979 65.754 68.9979 66.1007 68.9979ZM85.4327 64.3979H84.2127V70.9179H83.1627V68.9279C82.9627 69.2212 82.6861 69.4546 82.3327 69.6279C81.9794 69.8012 81.5594 69.8879 81.0727 69.8879C80.5927 69.8879 80.1694 69.8079 79.8027 69.6479C79.4427 69.4879 79.1494 69.2579 78.9227 68.9579C78.7361 69.2912 78.4727 69.5579 78.1327 69.7579C77.7994 69.9579 77.3961 70.0579 76.9227 70.0579C76.4094 70.0579 75.9594 69.9579 75.5727 69.7579C75.1927 69.5579 74.8994 69.2812 74.6927 68.9279C74.4861 68.5679 74.3827 68.1512 74.3827 67.6779C74.3827 67.2246 74.4861 66.8246 74.6927 66.4779C74.8994 66.1312 75.1927 65.8612 75.5727 65.6679C75.9527 65.4679 76.3894 65.3679 76.8827 65.3679C77.4294 65.3679 77.8861 65.4912 78.2527 65.7379C78.6194 65.9779 78.8861 66.2979 79.0527 66.6979C79.4594 66.6379 79.7627 66.4846 79.9627 66.2379C80.1694 65.9912 80.2727 65.6379 80.2727 65.1779V64.3979H73.4927V63.5179H85.4327V64.3979ZM83.1627 64.3979H81.3127V65.3579C81.3127 66.6046 80.6894 67.2779 79.4427 67.3779V67.3879C79.4427 67.8812 79.6061 68.2746 79.9327 68.5679C80.2661 68.8612 80.7194 69.0079 81.2927 69.0079C81.6527 69.0079 81.9727 68.9312 82.2527 68.7779C82.5394 68.6246 82.7627 68.4112 82.9227 68.1379C83.0827 67.8646 83.1627 67.5546 83.1627 67.2079V64.3979ZM76.9427 69.2179C77.2694 69.2179 77.5461 69.1479 77.7727 69.0079C77.9994 68.8612 78.1661 68.6746 78.2727 68.4479C78.3861 68.2146 78.4394 67.9679 78.4327 67.7079V67.6479C78.4194 67.5146 78.4127 67.4112 78.4127 67.3379C78.3594 67.0246 78.2027 66.7612 77.9427 66.5479C77.6827 66.3279 77.3494 66.2179 76.9427 66.2179C76.5027 66.2179 76.1361 66.3546 75.8427 66.6279C75.5561 66.9012 75.4127 67.2612 75.4127 67.7079C75.4127 68.1679 75.5561 68.5346 75.8427 68.8079C76.1294 69.0812 76.4961 69.2179 76.9427 69.2179ZM86.1776 64.3979H84.9576V63.5179H88.4476V64.3979H87.2276V70.9179H86.1776V64.3979ZM95.1654 63.5179V64.3979H93.9454V70.9179H92.9254V69.1079C92.7521 69.4012 92.5121 69.6346 92.2054 69.8079C91.9054 69.9746 91.5454 70.0579 91.1254 70.0579C90.6721 70.0579 90.2721 69.9579 89.9254 69.7579C89.5854 69.5579 89.3221 69.2779 89.1354 68.9179C88.9487 68.5579 88.8554 68.1446 88.8554 67.6779C88.8554 67.2312 88.9487 66.8346 89.1354 66.4879C89.3287 66.1346 89.5954 65.8612 89.9354 65.6679C90.2821 65.4679 90.6787 65.3679 91.1254 65.3679C91.5387 65.3679 91.8987 65.4512 92.2054 65.6179C92.5121 65.7846 92.7521 66.0146 92.9254 66.3079V64.3979H87.9654V63.5179H95.1654ZM91.3954 69.2179C91.7287 69.2179 92.0087 69.1446 92.2354 68.9979C92.4687 68.8512 92.6421 68.6646 92.7554 68.4379C92.8687 68.2112 92.9254 67.9746 92.9254 67.7279V67.7179C92.9254 67.4646 92.8687 67.2246 92.7554 66.9979C92.6421 66.7646 92.4687 66.5779 92.2354 66.4379C92.0087 66.2912 91.7287 66.2179 91.3954 66.2179C90.9621 66.2179 90.6021 66.3546 90.3154 66.6279C90.0287 66.9012 89.8854 67.2612 89.8854 67.7079C89.8854 68.1679 90.0254 68.5346 90.3054 68.8079C90.5921 69.0812 90.9554 69.2179 91.3954 69.2179ZM103.384 64.3979H102.154V70.9179H101.114V67.5679H96.7241V68.8879C96.7241 69.2546 96.8075 69.5512 96.9741 69.7779C97.1475 69.9979 97.4008 70.1079 97.7341 70.1079C98.0475 70.1079 98.2908 70.0079 98.4641 69.8079C98.6441 69.6012 98.7341 69.3279 98.7341 68.9879V68.8679H99.7441C99.7508 68.9146 99.7541 68.9712 99.7541 69.0379C99.7541 69.6446 99.5741 70.1246 99.2141 70.4779C98.8608 70.8312 98.3741 71.0079 97.7541 71.0079C97.0941 71.0079 96.5841 70.8079 96.2241 70.4079C95.8708 70.0079 95.6941 69.4846 95.6941 68.8379V66.8079H96.5641C97.1108 66.8079 97.5175 66.6679 97.7841 66.3879C98.0575 66.1079 98.1941 65.7246 98.1941 65.2379V64.3979H94.6841V63.5179H103.384V64.3979ZM101.114 64.3979H99.2341V65.2379C99.2341 65.8312 99.0741 66.3212 98.7541 66.7079H101.114V64.3979ZM104.127 64.3979H102.907V63.5179H106.397V64.3979H105.177V70.9179H104.127V64.3979ZM111.185 60.8279C112.498 60.8279 113.511 61.0712 114.225 61.5579C114.938 62.0379 115.295 62.7246 115.295 63.6179V63.7879H114.265V63.6479C114.265 62.9746 113.991 62.4812 113.445 62.1679C112.905 61.8479 112.148 61.6879 111.175 61.6879C110.215 61.6879 109.478 61.8279 108.965 62.1079C108.458 62.3879 108.195 62.8579 108.175 63.5179H109.405V64.3979H108.185V70.9179H107.135V64.3979H105.915V63.5179H107.135C107.161 62.6112 107.518 61.9379 108.205 61.4979C108.891 61.0512 109.885 60.8279 111.185 60.8279ZM116.832 64.3979H115.612V70.9179H114.562V68.9179C114.362 69.2112 114.086 69.4479 113.732 69.6279C113.379 69.8012 112.959 69.8879 112.472 69.8879C111.626 69.8879 110.969 69.6346 110.502 69.1279C110.042 68.6212 109.812 67.9346 109.812 67.0679C109.812 66.8946 109.822 66.7246 109.842 66.5579H109.972C110.546 66.5579 110.972 66.4379 111.252 66.1979C111.532 65.9512 111.672 65.5579 111.672 65.0179V64.3979H108.922V63.5179H116.832V64.3979ZM114.562 64.3979H112.712V65.1979C112.712 66.4112 112.089 67.0546 110.842 67.1279V67.1679C110.842 67.7279 111.006 68.1746 111.332 68.5079C111.659 68.8412 112.112 69.0079 112.692 69.0079C113.046 69.0079 113.366 68.9312 113.652 68.7779C113.939 68.6246 114.162 68.4112 114.322 68.1379C114.482 67.8646 114.562 67.5546 114.562 67.2079V64.3979ZM122.094 64.3979V66.3479C122.241 66.0612 122.451 65.8346 122.724 65.6679C123.004 65.4946 123.341 65.4079 123.734 65.4079C124.141 65.4079 124.501 65.5079 124.814 65.7079C125.127 65.9012 125.371 66.1712 125.544 66.5179C125.717 66.8579 125.804 67.2479 125.804 67.6879C125.804 68.1612 125.714 68.5712 125.534 68.9179C125.354 69.2579 125.107 69.5212 124.794 69.7079C124.481 69.8879 124.124 69.9779 123.724 69.9779C123.484 69.9779 123.271 69.9546 123.084 69.9079V69.0779C123.184 69.1046 123.307 69.1179 123.454 69.1179C123.827 69.1179 124.134 68.9946 124.374 68.7479C124.621 68.4946 124.744 68.1479 124.744 67.7079C124.744 67.2946 124.617 66.9579 124.364 66.6979C124.117 66.4379 123.804 66.3079 123.424 66.3079C122.984 66.3079 122.651 66.4546 122.424 66.7479C122.204 67.0412 122.094 67.3912 122.094 67.7979V70.9179H121.084V69.0879C120.931 69.3746 120.707 69.6046 120.414 69.7779C120.121 69.9512 119.767 70.0379 119.354 70.0379C118.941 70.0379 118.574 69.9412 118.254 69.7479C117.934 69.5546 117.684 69.2846 117.504 68.9379C117.331 68.5846 117.244 68.1746 117.244 67.7079C117.244 67.2479 117.334 66.8446 117.514 66.4979C117.694 66.1512 117.947 65.8846 118.274 65.6979C118.601 65.5046 118.974 65.4079 119.394 65.4079C119.794 65.4079 120.137 65.4912 120.424 65.6579C120.711 65.8246 120.931 66.0479 121.084 66.3279V64.3979H116.354V63.5179H126.684V64.3979H122.094ZM119.694 69.1579C119.994 69.1579 120.247 69.0879 120.454 68.9479C120.667 68.8079 120.824 68.6279 120.924 68.4079C121.031 68.1879 121.084 67.9612 121.084 67.7279C121.084 67.3479 120.964 67.0179 120.724 66.7379C120.484 66.4512 120.141 66.3079 119.694 66.3079C119.301 66.3079 118.971 66.4379 118.704 66.6979C118.437 66.9512 118.304 67.2912 118.304 67.7179C118.304 68.1579 118.434 68.5079 118.694 68.7679C118.954 69.0279 119.287 69.1579 119.694 69.1579ZM137.261 64.3979H136.031V70.9179H134.991V67.5679H130.601V68.8879C130.601 69.2546 130.684 69.5512 130.851 69.7779C131.024 69.9979 131.278 70.1079 131.611 70.1079C131.924 70.1079 132.168 70.0079 132.341 69.8079C132.521 69.6012 132.611 69.3279 132.611 68.9879V68.8679H133.621C133.628 68.9146 133.631 68.9712 133.631 69.0379C133.631 69.6446 133.451 70.1246 133.091 70.4779C132.738 70.8312 132.251 71.0079 131.631 71.0079C130.971 71.0079 130.461 70.8079 130.101 70.4079C129.748 70.0079 129.571 69.4846 129.571 68.8379V66.8079H130.441C130.988 66.8079 131.394 66.6679 131.661 66.3879C131.934 66.1079 132.071 65.7246 132.071 65.2379V64.3979H128.561V63.5179H137.261V64.3979ZM134.991 64.3979H133.111V65.2379C133.111 65.8312 132.951 66.3212 132.631 66.7079H134.991V64.3979ZM138.004 64.3979H136.784V63.5179H140.274V64.3979H139.054V70.9179H138.004V64.3979ZM148.822 64.3979H147.602V70.9179H146.572V68.4579L144.892 68.4479C145.138 68.7279 145.262 69.0779 145.262 69.4979C145.262 69.9446 145.115 70.3079 144.822 70.5879C144.528 70.8679 144.108 71.0079 143.562 71.0079C143.142 71.0079 142.805 70.9312 142.552 70.7779C142.298 70.6179 142.108 70.4512 141.982 70.2779V71.7079H140.992V69.2079H141.932C141.972 69.5079 142.105 69.7546 142.332 69.9479C142.558 70.1346 142.865 70.2279 143.252 70.2279C143.592 70.2279 143.848 70.1479 144.022 69.9879C144.202 69.8212 144.292 69.6146 144.292 69.3679C144.292 69.0679 144.185 68.8346 143.972 68.6679C143.758 68.4946 143.448 68.4079 143.042 68.4079H142.482C142.008 68.3879 141.608 68.2579 141.282 68.0179C140.955 67.7779 140.792 67.4179 140.792 66.9379C140.792 66.4312 140.965 66.0579 141.312 65.8179C141.658 65.5779 142.095 65.4579 142.622 65.4579H143.682V64.3979H139.792V63.5179H148.822V64.3979ZM146.572 67.6579V64.3979H144.692V66.2179H142.902C142.602 66.2179 142.348 66.2712 142.142 66.3779C141.942 66.4846 141.842 66.6746 141.842 66.9479C141.842 67.1946 141.928 67.3746 142.102 67.4879C142.282 67.6012 142.512 67.6579 142.792 67.6579H143.232H146.572ZM146.606 63.5579C146.28 63.0446 146.013 62.6779 145.806 62.4579C145.6 62.2312 145.4 62.0846 145.206 62.0179C145.006 61.9446 144.733 61.9079 144.386 61.9079H143.936V61.0479H144.366C144.88 61.0546 145.286 61.1112 145.586 61.2179C145.88 61.3179 146.18 61.5412 146.486 61.8879C146.786 62.2346 147.156 62.7912 147.596 63.5579H146.606ZM151.996 66.3079C151.503 66.3079 151.096 66.4379 150.776 66.6979C150.463 66.9579 150.306 67.3212 150.306 67.7879C150.306 68.2146 150.433 68.5546 150.686 68.8079C150.94 69.0612 151.28 69.1879 151.706 69.1879C152.046 69.1879 152.343 69.0812 152.596 68.8679C152.85 68.6546 152.976 68.3512 152.976 67.9579H153.946V71.1279H152.916V69.3379C152.77 69.5512 152.563 69.7212 152.296 69.8479C152.036 69.9679 151.743 70.0279 151.416 70.0279C151.003 70.0279 150.63 69.9412 150.296 69.7679C149.97 69.5879 149.71 69.3279 149.516 68.9879C149.33 68.6479 149.236 68.2379 149.236 67.7579C149.236 67.2512 149.353 66.8212 149.586 66.4679C149.82 66.1146 150.136 65.8512 150.536 65.6779C150.936 65.4979 151.39 65.4079 151.896 65.4079H152.516V64.3979H148.346V63.5179H154.926L154.916 64.3979H153.566V66.3079H151.996ZM155.67 64.3979H154.45V63.5179H157.94V64.3979H156.72V70.9179H155.67V64.3979ZM159.498 67.6479V68.8979C159.498 69.2646 159.581 69.5579 159.748 69.7779C159.914 69.9979 160.161 70.1079 160.488 70.1079C160.788 70.1079 161.024 70.0079 161.198 69.8079C161.378 69.6012 161.468 69.3279 161.468 68.9879V68.7679H162.478V68.9579C162.478 69.5846 162.301 70.0846 161.948 70.4579C161.601 70.8246 161.121 71.0079 160.508 71.0079C159.848 71.0079 159.341 70.8112 158.988 70.4179C158.641 70.0179 158.468 69.4946 158.468 68.8479V66.7879H159.508C160.594 66.7879 161.138 66.2679 161.138 65.2279V64.3979H157.458V63.5179H163.278V64.3979H162.178V65.2279C162.178 66.0012 161.991 66.5979 161.618 67.0179C161.244 67.4379 160.664 67.6479 159.878 67.6479H159.498Z" fill="#6E6F7A"/>
</g>
</svg>
