<svg
xmlns="http://www.w3.org/2000/svg"
width="8"
height="16"
viewBox="0 0 8 16"
>
<path
    d="M7.7,0,5.78,0C3.624,0,2.231,1.546,2.231,3.938V5.753H.3A.315.315,0,0,0,0,6.08V8.71a.315.315,0,0,0,.3.326H2.231v6.637a.315.315,0,0,0,.3.326H5.05a.315.315,0,0,0,.3-.326V9.036H7.607a.315.315,0,0,0,.3-.326V6.08a.341.341,0,0,0-.088-.231.291.291,0,0,0-.214-.1H5.352V4.214c0-.74.163-1.115,1.054-1.115H7.7A.315.315,0,0,0,8,2.772V.33A.315.315,0,0,0,7.7,0Z"
    fill="#fff"
></path>
</svg>