<svg width="166" height="108" viewBox="0 0 166 108" fill="none" xmlns="http://www.w3.org/2000/svg">
<g clip-path="url(#clip0)">
<path opacity="0.802502" fill-rule="evenodd" clip-rule="evenodd" d="M156.287 14.4456C155.833 10.7443 152.429 8.13678 148.737 8.66264L7.83327 28.7336C4.24223 29.2451 1.72097 32.5365 2.16224 36.1369L7.94919 83.3539C8.36106 86.7145 11.2289 89.2312 14.6145 89.2032L157.833 88.0173C161.81 87.9843 164.872 84.4954 164.388 80.5477L156.287 14.4456Z" fill="#F0F0F0"/>
<path fill-rule="evenodd" clip-rule="evenodd" d="M5.34406 77.1976C5.34406 80.7757 8.17139 83.7143 11.7468 83.8523L154.042 89.3458C157.818 89.4915 160.958 86.4698 160.958 82.6911V31.8645C160.958 28.4829 158.424 25.6382 155.065 25.2491L12.7699 8.76878C8.81471 8.3107 5.34406 11.4026 5.34406 15.3842L5.34406 77.1976Z" fill="white"/>
<mask id="mask0" mask-type="alpha" maskUnits="userSpaceOnUse" x="5" y="8" width="156" height="82">
<path fill-rule="evenodd" clip-rule="evenodd" d="M5.34406 77.1976C5.34406 80.7757 8.17139 83.7143 11.7468 83.8523L154.042 89.3458C157.818 89.4915 160.958 86.4698 160.958 82.6911V31.8645C160.958 28.4829 158.424 25.6382 155.065 25.2491L12.7699 8.76878C8.81471 8.3107 5.34406 11.4026 5.34406 15.3842L5.34406 77.1976Z" fill="white"/>
</mask>
<g mask="url(#mask0)">
<path d="M47.9558 38.5348C47.4278 38.5348 47.1638 38.2628 47.1638 37.7188V30.7948C47.1638 30.2508 47.4358 29.9788 47.9798 29.9788H52.1678C52.5838 29.9788 52.7918 30.1788 52.7918 30.5788C52.7918 30.9948 52.5838 31.2028 52.1678 31.2028H48.6998V33.5908H51.9158C52.3318 33.5908 52.5398 33.7908 52.5398 34.1908C52.5398 34.6068 52.3318 34.8148 51.9158 34.8148H48.6998V37.7188C48.6998 38.2628 48.4518 38.5348 47.9558 38.5348ZM56.2232 38.5588C55.6152 38.5588 55.0872 38.4348 54.6392 38.1868C54.1912 37.9388 53.8432 37.5868 53.5952 37.1308C53.3472 36.6668 53.2232 36.1228 53.2232 35.4988C53.2232 34.8748 53.3472 34.3348 53.5952 33.8788C53.8432 33.4228 54.1912 33.0708 54.6392 32.8228C55.0872 32.5748 55.6152 32.4508 56.2232 32.4508C56.8312 32.4508 57.3592 32.5748 57.8072 32.8228C58.2552 33.0708 58.6032 33.4228 58.8512 33.8788C59.0992 34.3348 59.2232 34.8748 59.2232 35.4988C59.2232 36.1228 59.0992 36.6668 58.8512 37.1308C58.6032 37.5868 58.2552 37.9388 57.8072 38.1868C57.3592 38.4348 56.8312 38.5588 56.2232 38.5588ZM56.2232 37.4188C56.6712 37.4188 57.0312 37.2588 57.3032 36.9388C57.5752 36.6108 57.7112 36.1308 57.7112 35.4988C57.7112 34.8588 57.5752 34.3828 57.3032 34.0708C57.0312 33.7508 56.6712 33.5908 56.2232 33.5908C55.7752 33.5908 55.4152 33.7508 55.1432 34.0708C54.8712 34.3828 54.7352 34.8588 54.7352 35.4988C54.7352 36.1308 54.8712 36.6108 55.1432 36.9388C55.4152 37.2588 55.7752 37.4188 56.2232 37.4188ZM61.2292 38.5348C60.7172 38.5348 60.4612 38.2788 60.4612 37.7668V33.2308C60.4612 32.7268 60.7052 32.4748 61.1932 32.4748C61.6812 32.4748 61.9252 32.7268 61.9252 33.2308V33.6028C62.2132 32.9148 62.8292 32.5308 63.7732 32.4508C64.1172 32.4108 64.3092 32.6068 64.3492 33.0388C64.3892 33.4628 64.1812 33.6988 63.7252 33.7468L63.4612 33.7708C62.4772 33.8668 61.9852 34.3708 61.9852 35.2828V37.7668C61.9852 38.2788 61.7332 38.5348 61.2292 38.5348ZM69.3303 38.5348C68.8183 38.5348 68.5623 38.2708 68.5623 37.7428V30.7588C68.5623 30.2388 68.8223 29.9788 69.3423 29.9788H72.2343C73.1623 29.9788 73.8783 30.2028 74.3823 30.6508C74.8863 31.0908 75.1383 31.7108 75.1383 32.5108C75.1383 33.1428 74.9743 33.6668 74.6463 34.0828C74.3183 34.4908 73.8463 34.7668 73.2303 34.9108C73.6383 35.0388 73.9743 35.3468 74.2383 35.8348L75.1383 37.5028C75.2743 37.7588 75.2983 37.9948 75.2103 38.2108C75.1303 38.4268 74.9263 38.5348 74.5983 38.5348C74.3823 38.5348 74.2063 38.4908 74.0703 38.4028C73.9343 38.3068 73.8143 38.1628 73.7103 37.9708L72.4983 35.7388C72.3543 35.4668 72.1823 35.2868 71.9823 35.1988C71.7903 35.1028 71.5423 35.0548 71.2383 35.0548H70.0983V37.7428C70.0983 38.2708 69.8423 38.5348 69.3303 38.5348ZM70.0983 33.9148H71.9703C73.0903 33.9148 73.6503 33.4588 73.6503 32.5468C73.6503 31.6428 73.0903 31.1908 71.9703 31.1908H70.0983V33.9148ZM79.3845 38.5588C78.7205 38.5588 78.1485 38.4348 77.6685 38.1868C77.1885 37.9388 76.8165 37.5868 76.5525 37.1308C76.2965 36.6748 76.1685 36.1348 76.1685 35.5108C76.1685 34.9028 76.2925 34.3708 76.5405 33.9148C76.7965 33.4588 77.1445 33.1028 77.5845 32.8468C78.0325 32.5828 78.5405 32.4508 79.1085 32.4508C79.9405 32.4508 80.5965 32.7148 81.0765 33.2428C81.5645 33.7708 81.8085 34.4908 81.8085 35.4028C81.8085 35.6988 81.6165 35.8468 81.2325 35.8468H77.6085C77.7205 36.8948 78.3205 37.4188 79.4085 37.4188C79.6165 37.4188 79.8485 37.3948 80.1045 37.3468C80.3685 37.2908 80.6165 37.1988 80.8485 37.0708C81.0565 36.9508 81.2325 36.9148 81.3765 36.9628C81.5205 37.0028 81.6205 37.0868 81.6765 37.2148C81.7405 37.3428 81.7485 37.4868 81.7005 37.6468C81.6605 37.7988 81.5485 37.9308 81.3645 38.0428C81.0845 38.2188 80.7605 38.3508 80.3925 38.4388C80.0325 38.5188 79.6965 38.5588 79.3845 38.5588ZM79.1685 33.4708C78.7285 33.4708 78.3725 33.6068 78.1005 33.8788C77.8285 34.1508 77.6645 34.5188 77.6085 34.9828H80.5605C80.5285 34.4948 80.3925 34.1228 80.1525 33.8668C79.9205 33.6028 79.5925 33.4708 79.1685 33.4708ZM85.1444 38.5588C84.8004 38.5588 84.4364 38.5228 84.0524 38.4508C83.6684 38.3788 83.3244 38.2548 83.0204 38.0788C82.8524 37.9828 82.7484 37.8668 82.7084 37.7308C82.6684 37.5868 82.6724 37.4548 82.7204 37.3348C82.7764 37.2068 82.8644 37.1148 82.9844 37.0588C83.1124 37.0028 83.2604 37.0148 83.4284 37.0948C83.7484 37.2468 84.0484 37.3548 84.3284 37.4188C84.6084 37.4748 84.8844 37.5028 85.1564 37.5028C85.5404 37.5028 85.8244 37.4388 86.0084 37.3108C86.2004 37.1748 86.2964 36.9988 86.2964 36.7828C86.2964 36.4468 86.0484 36.2308 85.5524 36.1348L84.3524 35.9068C83.3364 35.7148 82.8284 35.1868 82.8284 34.3228C82.8284 33.9388 82.9324 33.6068 83.1404 33.3268C83.3564 33.0468 83.6524 32.8308 84.0284 32.6788C84.4044 32.5268 84.8364 32.4508 85.3244 32.4508C86.0284 32.4508 86.6564 32.6068 87.2084 32.9188C87.3604 32.9988 87.4484 33.1108 87.4724 33.2548C87.5044 33.3908 87.4884 33.5228 87.4244 33.6508C87.3684 33.7708 87.2764 33.8588 87.1484 33.9148C87.0204 33.9628 86.8724 33.9468 86.7044 33.8668C86.4564 33.7388 86.2164 33.6468 85.9844 33.5908C85.7604 33.5348 85.5444 33.5068 85.3364 33.5068C84.9444 33.5068 84.6524 33.5748 84.4604 33.7108C84.2764 33.8468 84.1844 34.0268 84.1844 34.2508C84.1844 34.6028 84.4124 34.8188 84.8684 34.8988L86.0684 35.1268C86.5884 35.2228 86.9804 35.3988 87.2444 35.6548C87.5164 35.9108 87.6524 36.2548 87.6524 36.6868C87.6524 37.2708 87.4244 37.7308 86.9684 38.0668C86.5124 38.3948 85.9044 38.5588 85.1444 38.5588ZM89.5998 40.6948C89.1038 40.6948 88.8558 40.4428 88.8558 39.9388V33.2308C88.8558 32.7268 89.0998 32.4748 89.5878 32.4748C90.0838 32.4748 90.3318 32.7268 90.3318 33.2308V33.4828C90.4998 33.1708 90.7518 32.9228 91.0878 32.7388C91.4238 32.5468 91.8078 32.4508 92.2398 32.4508C92.7518 32.4508 93.1998 32.5748 93.5838 32.8228C93.9758 33.0708 94.2798 33.4228 94.4958 33.8788C94.7118 34.3268 94.8198 34.8668 94.8198 35.4988C94.8198 36.1228 94.7118 36.6668 94.4958 37.1308C94.2798 37.5868 93.9798 37.9388 93.5958 38.1868C93.2118 38.4348 92.7598 38.5588 92.2398 38.5588C91.8238 38.5588 91.4478 38.4708 91.1118 38.2948C90.7838 38.1108 90.5318 37.8668 90.3558 37.5628V39.9388C90.3558 40.4428 90.1038 40.6948 89.5998 40.6948ZM91.8198 37.4188C92.2678 37.4188 92.6278 37.2588 92.8998 36.9388C93.1718 36.6108 93.3078 36.1308 93.3078 35.4988C93.3078 34.8588 93.1718 34.3828 92.8998 34.0708C92.6278 33.7508 92.2678 33.5908 91.8198 33.5908C91.3718 33.5908 91.0118 33.7508 90.7398 34.0708C90.4678 34.3828 90.3318 34.8588 90.3318 35.4988C90.3318 36.1308 90.4678 36.6108 90.7398 36.9388C91.0118 37.2588 91.3718 37.4188 91.8198 37.4188ZM98.7271 38.5588C98.1191 38.5588 97.5911 38.4348 97.1431 38.1868C96.6951 37.9388 96.3471 37.5868 96.0991 37.1308C95.8511 36.6668 95.7271 36.1228 95.7271 35.4988C95.7271 34.8748 95.8511 34.3348 96.0991 33.8788C96.3471 33.4228 96.6951 33.0708 97.1431 32.8228C97.5911 32.5748 98.1191 32.4508 98.7271 32.4508C99.3351 32.4508 99.8631 32.5748 100.311 32.8228C100.759 33.0708 101.107 33.4228 101.355 33.8788C101.603 34.3348 101.727 34.8748 101.727 35.4988C101.727 36.1228 101.603 36.6668 101.355 37.1308C101.107 37.5868 100.759 37.9388 100.311 38.1868C99.8631 38.4348 99.3351 38.5588 98.7271 38.5588ZM98.7271 37.4188C99.1751 37.4188 99.5351 37.2588 99.8071 36.9388C100.079 36.6108 100.215 36.1308 100.215 35.4988C100.215 34.8588 100.079 34.3828 99.8071 34.0708C99.5351 33.7508 99.1751 33.5908 98.7271 33.5908C98.2791 33.5908 97.9191 33.7508 97.6471 34.0708C97.3751 34.3828 97.2391 34.8588 97.2391 35.4988C97.2391 36.1308 97.3751 36.6108 97.6471 36.9388C97.9191 37.2588 98.2791 37.4188 98.7271 37.4188ZM103.709 38.5348C103.213 38.5348 102.965 38.2788 102.965 37.7668V33.2308C102.965 32.7268 103.209 32.4748 103.697 32.4748C104.185 32.4748 104.429 32.7268 104.429 33.2308V33.4828C104.629 33.1468 104.897 32.8908 105.233 32.7148C105.577 32.5388 105.961 32.4508 106.385 32.4508C107.769 32.4508 108.461 33.2548 108.461 34.8628V37.7668C108.461 38.2788 108.213 38.5348 107.717 38.5348C107.213 38.5348 106.961 38.2788 106.961 37.7668V34.9348C106.961 34.4788 106.873 34.1468 106.697 33.9388C106.529 33.7308 106.265 33.6268 105.905 33.6268C105.465 33.6268 105.113 33.7668 104.849 34.0468C104.593 34.3188 104.465 34.6828 104.465 35.1388V37.7668C104.465 38.2788 104.213 38.5348 103.709 38.5348ZM112.133 38.5588C111.789 38.5588 111.425 38.5228 111.041 38.4508C110.657 38.3788 110.313 38.2548 110.009 38.0788C109.841 37.9828 109.737 37.8668 109.697 37.7308C109.657 37.5868 109.661 37.4548 109.709 37.3348C109.765 37.2068 109.853 37.1148 109.973 37.0588C110.101 37.0028 110.249 37.0148 110.417 37.0948C110.737 37.2468 111.037 37.3548 111.317 37.4188C111.597 37.4748 111.873 37.5028 112.145 37.5028C112.529 37.5028 112.813 37.4388 112.997 37.3108C113.189 37.1748 113.285 36.9988 113.285 36.7828C113.285 36.4468 113.037 36.2308 112.541 36.1348L111.341 35.9068C110.325 35.7148 109.817 35.1868 109.817 34.3228C109.817 33.9388 109.921 33.6068 110.129 33.3268C110.345 33.0468 110.641 32.8308 111.017 32.6788C111.393 32.5268 111.825 32.4508 112.313 32.4508C113.017 32.4508 113.645 32.6068 114.197 32.9188C114.349 32.9988 114.437 33.1108 114.461 33.2548C114.493 33.3908 114.477 33.5228 114.413 33.6508C114.357 33.7708 114.265 33.8588 114.137 33.9148C114.009 33.9628 113.861 33.9468 113.693 33.8668C113.445 33.7388 113.205 33.6468 112.973 33.5908C112.749 33.5348 112.533 33.5068 112.325 33.5068C111.933 33.5068 111.641 33.5748 111.449 33.7108C111.265 33.8468 111.173 34.0268 111.173 34.2508C111.173 34.6028 111.401 34.8188 111.857 34.8988L113.057 35.1268C113.577 35.2228 113.969 35.3988 114.233 35.6548C114.505 35.9108 114.641 36.2548 114.641 36.6868C114.641 37.2708 114.413 37.7308 113.957 38.0668C113.501 38.3948 112.893 38.5588 112.133 38.5588ZM116.588 31.3708C116.308 31.3708 116.088 31.3028 115.928 31.1668C115.776 31.0228 115.7 30.8268 115.7 30.5788C115.7 30.3228 115.776 30.1268 115.928 29.9908C116.088 29.8548 116.308 29.7868 116.588 29.7868C117.18 29.7868 117.476 30.0508 117.476 30.5788C117.476 31.1068 117.18 31.3708 116.588 31.3708ZM116.588 38.5228C116.348 38.5228 116.164 38.4508 116.036 38.3068C115.908 38.1628 115.844 37.9628 115.844 37.7068V33.3028C115.844 32.7588 116.092 32.4868 116.588 32.4868C117.092 32.4868 117.344 32.7588 117.344 33.3028V37.7068C117.344 37.9628 117.28 38.1628 117.152 38.3068C117.024 38.4508 116.836 38.5228 116.588 38.5228ZM122.287 38.5588C121.855 38.5588 121.471 38.4668 121.135 38.2828C120.799 38.0908 120.547 37.8348 120.379 37.5148V37.7668C120.379 38.2788 120.135 38.5348 119.647 38.5348C119.151 38.5348 118.903 38.2788 118.903 37.7668V30.6388C118.903 30.1348 119.151 29.8828 119.647 29.8828C120.151 29.8828 120.403 30.1348 120.403 30.6388V33.4348C120.579 33.1388 120.831 32.9028 121.159 32.7268C121.495 32.5428 121.871 32.4508 122.287 32.4508C122.807 32.4508 123.259 32.5748 123.643 32.8228C124.027 33.0708 124.327 33.4228 124.543 33.8788C124.759 34.3268 124.867 34.8668 124.867 35.4988C124.867 36.1228 124.759 36.6668 124.543 37.1308C124.327 37.5868 124.023 37.9388 123.631 38.1868C123.247 38.4348 122.799 38.5588 122.287 38.5588ZM121.867 37.4188C122.315 37.4188 122.675 37.2588 122.947 36.9388C123.219 36.6108 123.355 36.1308 123.355 35.4988C123.355 34.8588 123.219 34.3828 122.947 34.0708C122.675 33.7508 122.315 33.5908 121.867 33.5908C121.419 33.5908 121.059 33.7508 120.787 34.0708C120.515 34.3828 120.379 34.8588 120.379 35.4988C120.379 36.1308 120.515 36.6108 120.787 36.9388C121.059 37.2588 121.419 37.4188 121.867 37.4188ZM128.102 38.5588C126.766 38.5588 126.098 37.8108 126.098 36.3148V30.6388C126.098 30.1348 126.346 29.8828 126.842 29.8828C127.346 29.8828 127.598 30.1348 127.598 30.6388V36.2428C127.598 36.9628 127.898 37.3228 128.498 37.3228C128.562 37.3228 128.622 37.3228 128.678 37.3228C128.734 37.3148 128.79 37.3068 128.846 37.2988C128.958 37.2828 129.034 37.3148 129.074 37.3948C129.114 37.4668 129.134 37.6188 129.134 37.8508C129.134 38.0508 129.094 38.2068 129.014 38.3188C128.934 38.4308 128.802 38.4988 128.618 38.5228C128.45 38.5468 128.278 38.5588 128.102 38.5588ZM132.763 38.5588C132.099 38.5588 131.527 38.4348 131.047 38.1868C130.567 37.9388 130.195 37.5868 129.931 37.1308C129.675 36.6748 129.547 36.1348 129.547 35.5108C129.547 34.9028 129.671 34.3708 129.919 33.9148C130.175 33.4588 130.523 33.1028 130.963 32.8468C131.411 32.5828 131.919 32.4508 132.487 32.4508C133.319 32.4508 133.975 32.7148 134.455 33.2428C134.943 33.7708 135.187 34.4908 135.187 35.4028C135.187 35.6988 134.995 35.8468 134.611 35.8468H130.987C131.099 36.8948 131.699 37.4188 132.787 37.4188C132.995 37.4188 133.227 37.3948 133.483 37.3468C133.747 37.2908 133.995 37.1988 134.227 37.0708C134.435 36.9508 134.611 36.9148 134.755 36.9628C134.899 37.0028 134.999 37.0868 135.055 37.2148C135.119 37.3428 135.127 37.4868 135.079 37.6468C135.039 37.7988 134.927 37.9308 134.743 38.0428C134.463 38.2188 134.139 38.3508 133.771 38.4388C133.411 38.5188 133.075 38.5588 132.763 38.5588ZM132.547 33.4708C132.107 33.4708 131.751 33.6068 131.479 33.8788C131.207 34.1508 131.043 34.5188 130.987 34.9828H133.939C133.907 34.4948 133.771 34.1228 133.531 33.8668C133.299 33.6028 132.971 33.4708 132.547 33.4708ZM49.9718 52.5348C49.4598 52.5348 49.2038 52.2708 49.2038 51.7428V45.2628H46.8638C46.4238 45.2628 46.2038 45.0468 46.2038 44.6148C46.2038 44.1908 46.4238 43.9788 46.8638 43.9788H53.0798C53.5198 43.9788 53.7398 44.1908 53.7398 44.6148C53.7398 45.0468 53.5198 45.2628 53.0798 45.2628H50.7398V51.7428C50.7398 52.2708 50.4838 52.5348 49.9718 52.5348ZM56.4275 52.5588C55.7635 52.5588 55.1915 52.4348 54.7115 52.1868C54.2315 51.9388 53.8595 51.5868 53.5955 51.1308C53.3395 50.6748 53.2115 50.1348 53.2115 49.5108C53.2115 48.9028 53.3355 48.3708 53.5835 47.9148C53.8395 47.4588 54.1875 47.1028 54.6275 46.8468C55.0755 46.5828 55.5835 46.4508 56.1515 46.4508C56.9835 46.4508 57.6395 46.7148 58.1195 47.2428C58.6075 47.7708 58.8515 48.4908 58.8515 49.4028C58.8515 49.6988 58.6595 49.8468 58.2755 49.8468H54.6515C54.7635 50.8948 55.3635 51.4188 56.4515 51.4188C56.6595 51.4188 56.8915 51.3948 57.1475 51.3468C57.4115 51.2908 57.6595 51.1988 57.8915 51.0708C58.0995 50.9508 58.2755 50.9148 58.4195 50.9628C58.5635 51.0028 58.6635 51.0868 58.7195 51.2148C58.7835 51.3428 58.7915 51.4868 58.7435 51.6468C58.7035 51.7988 58.5915 51.9308 58.4075 52.0428C58.1275 52.2188 57.8035 52.3508 57.4355 52.4388C57.0755 52.5188 56.7395 52.5588 56.4275 52.5588ZM56.2115 47.4708C55.7715 47.4708 55.4155 47.6068 55.1435 47.8788C54.8715 48.1508 54.7075 48.5188 54.6515 48.9828H57.6035C57.5715 48.4948 57.4355 48.1228 57.1955 47.8668C56.9635 47.6028 56.6355 47.4708 56.2115 47.4708ZM61.9714 52.5588C61.5474 52.5588 61.1674 52.4788 60.8314 52.3188C60.5034 52.1508 60.2434 51.9268 60.0514 51.6468C59.8674 51.3668 59.7754 51.0508 59.7754 50.6988C59.7754 50.2668 59.8874 49.9268 60.1114 49.6788C60.3354 49.4228 60.6994 49.2388 61.2034 49.1268C61.7074 49.0148 62.3834 48.9588 63.2314 48.9588H63.6514V48.7068C63.6514 48.3068 63.5634 48.0188 63.3874 47.8428C63.2114 47.6668 62.9154 47.5788 62.4994 47.5788C62.2674 47.5788 62.0154 47.6068 61.7434 47.6628C61.4794 47.7188 61.1994 47.8148 60.9034 47.9508C60.7114 48.0388 60.5514 48.0508 60.4234 47.9868C60.2954 47.9148 60.2074 47.8068 60.1594 47.6628C60.1194 47.5108 60.1274 47.3588 60.1834 47.2068C60.2474 47.0548 60.3714 46.9428 60.5554 46.8708C60.9234 46.7188 61.2754 46.6108 61.6114 46.5468C61.9554 46.4828 62.2674 46.4508 62.5474 46.4508C63.4034 46.4508 64.0394 46.6508 64.4554 47.0508C64.8714 47.4428 65.0794 48.0548 65.0794 48.8868V51.7668C65.0794 52.2788 64.8474 52.5348 64.3834 52.5348C63.9114 52.5348 63.6754 52.2788 63.6754 51.7668V51.5028C63.5394 51.8308 63.3234 52.0908 63.0274 52.2828C62.7314 52.4668 62.3794 52.5588 61.9714 52.5588ZM62.2834 51.5268C62.6754 51.5268 62.9994 51.3908 63.2554 51.1188C63.5194 50.8468 63.6514 50.5028 63.6514 50.0868V49.8228H63.2434C62.4914 49.8228 61.9674 49.8828 61.6714 50.0028C61.3834 50.1148 61.2394 50.3228 61.2394 50.6268C61.2394 50.8908 61.3314 51.1068 61.5154 51.2748C61.6994 51.4428 61.9554 51.5268 62.2834 51.5268ZM69.3139 52.5588C68.6979 52.5588 68.1619 52.4348 67.7059 52.1868C67.2499 51.9308 66.8979 51.5708 66.6499 51.1068C66.4019 50.6428 66.2779 50.0988 66.2779 49.4748C66.2779 48.8508 66.4019 48.3148 66.6499 47.8668C66.8979 47.4108 67.2499 47.0628 67.7059 46.8228C68.1619 46.5748 68.6979 46.4508 69.3139 46.4508C69.5779 46.4508 69.8619 46.4868 70.1659 46.5588C70.4779 46.6308 70.7699 46.7508 71.0419 46.9188C71.2019 47.0148 71.2939 47.1388 71.3179 47.2908C71.3499 47.4428 71.3299 47.5828 71.2579 47.7108C71.1939 47.8388 71.0939 47.9308 70.9579 47.9868C70.8299 48.0428 70.6819 48.0228 70.5139 47.9268C70.1459 47.7188 69.7899 47.6148 69.4459 47.6148C68.9259 47.6148 68.5219 47.7788 68.2339 48.1068C67.9539 48.4268 67.8139 48.8868 67.8139 49.4868C67.8139 50.0788 67.9539 50.5468 68.2339 50.8908C68.5219 51.2268 68.9259 51.3948 69.4459 51.3948C69.7899 51.3948 70.1459 51.2948 70.5139 51.0948C70.6819 50.9988 70.8299 50.9788 70.9579 51.0348C71.0859 51.0908 71.1779 51.1868 71.2339 51.3228C71.2899 51.4508 71.3019 51.5908 71.2699 51.7428C71.2379 51.8868 71.1459 52.0068 70.9939 52.1028C70.7299 52.2628 70.4499 52.3788 70.1539 52.4508C69.8579 52.5228 69.5779 52.5588 69.3139 52.5588ZM73.006 52.5348C72.51 52.5348 72.262 52.2788 72.262 51.7668V44.6388C72.262 44.1348 72.51 43.8828 73.006 43.8828C73.51 43.8828 73.762 44.1348 73.762 44.6388V47.4228C73.962 47.1028 74.23 46.8628 74.566 46.7028C74.902 46.5348 75.274 46.4508 75.682 46.4508C77.066 46.4508 77.758 47.2548 77.758 48.8628V51.7668C77.758 52.2788 77.51 52.5348 77.014 52.5348C76.51 52.5348 76.258 52.2788 76.258 51.7668V48.9348C76.258 48.4788 76.17 48.1468 75.994 47.9388C75.826 47.7308 75.562 47.6268 75.202 47.6268C74.762 47.6268 74.41 47.7668 74.146 48.0468C73.89 48.3188 73.762 48.6828 73.762 49.1388V51.7668C73.762 52.2788 73.51 52.5348 73.006 52.5348ZM82.1736 52.5588C81.5096 52.5588 80.9376 52.4348 80.4576 52.1868C79.9776 51.9388 79.6056 51.5868 79.3416 51.1308C79.0856 50.6748 78.9576 50.1348 78.9576 49.5108C78.9576 48.9028 79.0816 48.3708 79.3296 47.9148C79.5856 47.4588 79.9336 47.1028 80.3736 46.8468C80.8216 46.5828 81.3296 46.4508 81.8976 46.4508C82.7296 46.4508 83.3856 46.7148 83.8656 47.2428C84.3536 47.7708 84.5976 48.4908 84.5976 49.4028C84.5976 49.6988 84.4056 49.8468 84.0216 49.8468H80.3976C80.5096 50.8948 81.1096 51.4188 82.1976 51.4188C82.4056 51.4188 82.6376 51.3948 82.8936 51.3468C83.1576 51.2908 83.4056 51.1988 83.6376 51.0708C83.8456 50.9508 84.0216 50.9148 84.1656 50.9628C84.3096 51.0028 84.4096 51.0868 84.4656 51.2148C84.5296 51.3428 84.5376 51.4868 84.4896 51.6468C84.4496 51.7988 84.3376 51.9308 84.1536 52.0428C83.8736 52.2188 83.5496 52.3508 83.1816 52.4388C82.8216 52.5188 82.4856 52.5588 82.1736 52.5588ZM81.9576 47.4708C81.5176 47.4708 81.1616 47.6068 80.8896 47.8788C80.6176 48.1508 80.4536 48.5188 80.3976 48.9828H83.3496C83.3176 48.4948 83.1816 48.1228 82.9416 47.8668C82.7096 47.6028 82.3816 47.4708 81.9576 47.4708ZM86.5535 52.5348C86.0415 52.5348 85.7855 52.2788 85.7855 51.7668V47.2308C85.7855 46.7268 86.0295 46.4748 86.5175 46.4748C87.0055 46.4748 87.2495 46.7268 87.2495 47.2308V47.6028C87.5375 46.9148 88.1535 46.5308 89.0975 46.4508C89.4415 46.4108 89.6335 46.6068 89.6735 47.0388C89.7135 47.4628 89.5055 47.6988 89.0495 47.7468L88.7855 47.7708C87.8015 47.8668 87.3095 48.3708 87.3095 49.2828V51.7668C87.3095 52.2788 87.0575 52.5348 86.5535 52.5348ZM92.5741 52.5588C92.2301 52.5588 91.8661 52.5228 91.4821 52.4508C91.0981 52.3788 90.7541 52.2548 90.4501 52.0788C90.2821 51.9828 90.1781 51.8668 90.1381 51.7308C90.0981 51.5868 90.1021 51.4548 90.1501 51.3348C90.2061 51.2068 90.2941 51.1148 90.4141 51.0588C90.5421 51.0028 90.6901 51.0148 90.8581 51.0948C91.1781 51.2468 91.4781 51.3548 91.7581 51.4188C92.0381 51.4748 92.3141 51.5028 92.5861 51.5028C92.9701 51.5028 93.2541 51.4388 93.4381 51.3108C93.6301 51.1748 93.7261 50.9988 93.7261 50.7828C93.7261 50.4468 93.4781 50.2308 92.9821 50.1348L91.7821 49.9068C90.7661 49.7148 90.2581 49.1868 90.2581 48.3228C90.2581 47.9388 90.3621 47.6068 90.5701 47.3268C90.7861 47.0468 91.0821 46.8308 91.4581 46.6788C91.8341 46.5268 92.2661 46.4508 92.7541 46.4508C93.4581 46.4508 94.0861 46.6068 94.6381 46.9188C94.7901 46.9988 94.8781 47.1108 94.9021 47.2548C94.9341 47.3908 94.9181 47.5228 94.8541 47.6508C94.7981 47.7708 94.7061 47.8588 94.5781 47.9148C94.4501 47.9628 94.3021 47.9468 94.1341 47.8668C93.8861 47.7388 93.6461 47.6468 93.4141 47.5908C93.1901 47.5348 92.9741 47.5068 92.7661 47.5068C92.3741 47.5068 92.0821 47.5748 91.8901 47.7108C91.7061 47.8468 91.6141 48.0268 91.6141 48.2508C91.6141 48.6028 91.8421 48.8188 92.2981 48.8988L93.4981 49.1268C94.0181 49.2228 94.4101 49.3988 94.6741 49.6548C94.9461 49.9108 95.0821 50.2548 95.0821 50.6868C95.0821 51.2708 94.8541 51.7308 94.3981 52.0668C93.9421 52.3948 93.3341 52.5588 92.5741 52.5588Z" fill="#3F8EFC"/>
<path d="M51.08 65.4621C51.08 65.8687 50.9833 66.2087 50.79 66.4821C50.5966 66.7487 50.3433 66.9121 50.03 66.9721V66.9921C50.4366 67.0854 50.76 67.3087 51 67.6621C51.2466 68.0087 51.37 68.4154 51.37 68.8821C51.37 69.3021 51.28 69.6754 51.1 70.0021C50.9266 70.3287 50.6733 70.5854 50.34 70.7721C50.0066 70.9521 49.61 71.0421 49.15 71.0421C48.6833 71.0421 48.2633 70.9487 47.89 70.7621C47.5233 70.5687 47.2366 70.3021 47.03 69.9621C46.8233 69.6154 46.72 69.2187 46.72 68.7721H47.72C47.72 69.1521 47.85 69.4687 48.11 69.7221C48.3766 69.9754 48.7066 70.1021 49.1 70.1021C49.4866 70.1021 49.7966 69.9821 50.03 69.7421C50.2633 69.5021 50.38 69.1887 50.38 68.8021C50.38 68.4421 50.2666 68.1321 50.04 67.8721C49.8133 67.6054 49.4766 67.4721 49.03 67.4721H48.53V66.5521H48.89C49.27 66.5521 49.56 66.4487 49.76 66.2421C49.9666 66.0354 50.07 65.7554 50.07 65.4021V64.5521H46V63.6721H52.2V64.5521H51.08V65.4621ZM59.6226 64.5521H58.4026V71.0721H57.3526V67.0121H55.9526C55.3793 67.0121 54.9293 67.1554 54.6026 67.4421C54.2759 67.7221 54.1126 68.1321 54.1126 68.6721C54.1126 69.1587 54.2593 69.5387 54.5526 69.8121C54.8459 70.0854 55.2659 70.2221 55.8126 70.2221H56.0126V71.0521H55.6526C55.1459 71.0521 54.6959 70.9621 54.3026 70.7821C53.9159 70.6021 53.6126 70.3421 53.3926 70.0021C53.1726 69.6554 53.0626 69.2421 53.0626 68.7621C53.0626 68.3621 53.1293 68.0154 53.2626 67.7221C53.4026 67.4221 53.5926 67.1787 53.8326 66.9921H52.2426V66.1121H57.3526V64.5521H51.7226V63.6721H59.6226V64.5521ZM61.1845 67.8021V69.0521C61.1845 69.4187 61.2678 69.7121 61.4345 69.9321C61.6012 70.1521 61.8478 70.2621 62.1745 70.2621C62.4745 70.2621 62.7112 70.1621 62.8845 69.9621C63.0645 69.7554 63.1545 69.4821 63.1545 69.1421V68.9221H64.1645V69.1121C64.1645 69.7387 63.9878 70.2387 63.6345 70.6121C63.2878 70.9787 62.8078 71.1621 62.1945 71.1621C61.5345 71.1621 61.0278 70.9654 60.6745 70.5721C60.3278 70.1721 60.1545 69.6487 60.1545 69.0021V66.9421H61.1945C62.2812 66.9421 62.8245 66.4221 62.8245 65.3821V64.5521H59.1445V63.6721H64.9645V64.5521H63.8645V65.3821C63.8645 66.1554 63.6778 66.7521 63.3045 67.1721C62.9312 67.5921 62.3512 67.8021 61.5645 67.8021H61.1845ZM68.1363 66.4621C67.643 66.4621 67.2363 66.5921 66.9163 66.8521C66.603 67.1121 66.4463 67.4754 66.4463 67.9421C66.4463 68.3687 66.573 68.7087 66.8263 68.9621C67.0796 69.2154 67.4196 69.3421 67.8463 69.3421C68.1863 69.3421 68.483 69.2354 68.7363 69.0221C68.9896 68.8087 69.1163 68.5054 69.1163 68.1121H70.0863V71.2821H69.0563V69.4921C68.9096 69.7054 68.703 69.8754 68.4363 70.0021C68.1763 70.1221 67.883 70.1821 67.5563 70.1821C67.143 70.1821 66.7696 70.0954 66.4363 69.9221C66.1096 69.7421 65.8496 69.4821 65.6563 69.1421C65.4696 68.8021 65.3763 68.3921 65.3763 67.9121C65.3763 67.4054 65.493 66.9754 65.7263 66.6221C65.9596 66.2687 66.2763 66.0054 66.6763 65.8321C67.0763 65.6521 67.5296 65.5621 68.0363 65.5621H68.6563V64.5521H64.4863V63.6721H71.0663L71.0563 64.5521H69.7063V66.4621H68.1363ZM71.8098 64.5521H70.5898V63.6721H74.0798V64.5521H72.8598V71.0721H71.8098V64.5521ZM81.5076 64.5521H80.2876V71.0721H79.2376V69.0721C79.0376 69.3654 78.7609 69.6021 78.4076 69.7821C78.0543 69.9554 77.6343 70.0421 77.1476 70.0421C76.3009 70.0421 75.6443 69.7887 75.1776 69.2821C74.7176 68.7754 74.4876 68.0887 74.4876 67.2221C74.4876 67.0487 74.4976 66.8787 74.5176 66.7121H74.6476C75.2209 66.7121 75.6476 66.5921 75.9276 66.3521C76.2076 66.1054 76.3476 65.7121 76.3476 65.1721V64.5521H73.5976V63.6721H81.5076V64.5521ZM79.2376 64.5521H77.3876V65.3521C77.3876 66.5654 76.7643 67.2087 75.5176 67.2821V67.3221C75.5176 67.8821 75.6809 68.3287 76.0076 68.6621C76.3343 68.9954 76.7876 69.1621 77.3676 69.1621C77.7209 69.1621 78.0409 69.0854 78.3276 68.9321C78.6143 68.7787 78.8376 68.5654 78.9976 68.2921C79.1576 68.0187 79.2376 67.7087 79.2376 67.3621V64.5521ZM84.5193 63.6721V64.5521H83.2993V71.0721H82.2493V64.5521H81.0293V63.6721H82.2793V63.2621C82.2793 62.8754 82.2059 62.5521 82.0593 62.2921C81.9126 62.0254 81.6526 61.8921 81.2793 61.8921C80.9059 61.8921 80.6426 62.0254 80.4893 62.2921C80.3359 62.5521 80.2593 62.8754 80.2593 63.2621V63.9121H79.2393V63.3121C79.2393 62.6121 79.4026 62.0554 79.7293 61.6421C80.0559 61.2221 80.5726 61.0121 81.2793 61.0121C81.9993 61.0121 82.5159 61.2187 82.8293 61.6321C83.1426 62.0454 83.2993 62.6054 83.2993 63.3121V63.6721H84.5193ZM92.1808 60.9621C93.7475 60.9621 94.9175 61.2054 95.6908 61.6921C96.4642 62.1721 96.8508 62.8754 96.8508 63.8021V63.9621H95.8208V63.8221C95.8208 63.1354 95.5142 62.6321 94.9008 62.3121C94.2942 61.9854 93.3808 61.8221 92.1608 61.8221C90.9675 61.8221 90.0875 61.9654 89.5208 62.2521C88.9608 62.5321 88.6675 63.0054 88.6408 63.6721H89.8708V64.5521H88.6508V71.0721H87.6008V64.5521H86.3808V63.6721H87.6008C87.6275 62.7521 88.0108 62.0721 88.7508 61.6321C89.4975 61.1854 90.6408 60.9621 92.1808 60.9621ZM91.5186 67.9721V68.9521C91.5186 69.3387 91.6086 69.6521 91.7886 69.8921C91.9753 70.1254 92.2586 70.2421 92.6386 70.2421C92.972 70.2421 93.232 70.1354 93.4186 69.9221C93.6053 69.7021 93.6986 69.4154 93.6986 69.0621V68.9221H94.7186V69.0721C94.7186 69.7187 94.5353 70.2287 94.1686 70.6021C93.802 70.9687 93.302 71.1521 92.6686 71.1521C91.9686 71.1521 91.4253 70.9487 91.0386 70.5421C90.652 70.1287 90.4586 69.5754 90.4586 68.8821V67.0821H91.8986C92.4453 67.0821 92.892 66.9654 93.2386 66.7321C93.592 66.4987 93.7686 66.1421 93.7686 65.6621C93.7686 65.3021 93.672 65.0187 93.4786 64.8121C93.2853 64.5987 93.022 64.4921 92.6886 64.4921C92.3553 64.4921 92.092 64.5987 91.8986 64.8121C91.7053 65.0187 91.6086 65.3021 91.6086 65.6621C91.6086 65.7487 91.6153 65.8854 91.6286 66.0721H90.5886C90.562 65.8721 90.5486 65.7254 90.5486 65.6321C90.5486 65.2254 90.6353 64.8687 90.8086 64.5621C90.982 64.2487 91.2286 64.0087 91.5486 63.8421C91.8753 63.6687 92.2553 63.5821 92.6886 63.5821C93.3353 63.5821 93.852 63.7721 94.2386 64.1521C94.632 64.5254 94.8286 65.0521 94.8286 65.7321C94.8286 66.4587 94.5886 67.0154 94.1086 67.4021C93.6353 67.7821 93.022 67.9721 92.2686 67.9721H91.5186ZM98.1286 63.6721V64.5521H96.9086V71.0721H95.8486V63.6721H98.1286ZM106.31 63.6721V64.5521H105.09V71.0721H104.08V67.4021H101.12C100.767 67.5687 100.497 67.7087 100.31 67.8221C100.13 67.9354 99.9737 68.0787 99.8404 68.2521C99.7137 68.4254 99.6504 68.6354 99.6504 68.8821C99.6504 69.1687 99.7437 69.4087 99.9304 69.6021C100.124 69.7954 100.377 69.8921 100.69 69.8921C101.024 69.8921 101.287 69.7854 101.48 69.5721C101.68 69.3521 101.78 69.0854 101.78 68.7721H102.66V71.6421H101.7V70.0621C101.6 70.2421 101.434 70.4054 101.2 70.5521C100.967 70.6921 100.68 70.7621 100.34 70.7621C99.8137 70.7621 99.387 70.6087 99.0604 70.3021C98.7337 69.9887 98.5704 69.5854 98.5704 69.0921C98.5704 68.7521 98.6437 68.4621 98.7904 68.2221C98.9437 67.9754 99.137 67.7721 99.3704 67.6121C99.6037 67.4454 99.8937 67.2754 100.24 67.1021C99.827 67.0021 99.487 66.8087 99.2204 66.5221C98.9604 66.2287 98.8304 65.8554 98.8304 65.4021C98.8304 65.0354 98.917 64.7154 99.0904 64.4421C99.2704 64.1621 99.5137 63.9487 99.8204 63.8021C100.134 63.6487 100.484 63.5721 100.87 63.5721C101.224 63.5721 101.544 63.6387 101.83 63.7721C102.124 63.9054 102.357 64.1021 102.53 64.3621C102.704 64.6154 102.79 64.9221 102.79 65.2821C102.79 65.5687 102.734 65.8221 102.62 66.0421C102.507 66.2554 102.35 66.4521 102.15 66.6321H104.08V63.6721H106.31ZM99.7704 65.4721C99.7704 65.8054 99.897 66.0787 100.15 66.2921C100.404 66.4987 100.734 66.6087 101.14 66.6221C101.387 66.4687 101.577 66.3021 101.71 66.1221C101.844 65.9421 101.91 65.7287 101.91 65.4821C101.91 65.1887 101.807 64.9487 101.6 64.7621C101.4 64.5754 101.147 64.4821 100.84 64.4821C100.54 64.4821 100.287 64.5687 100.08 64.7421C99.8737 64.9154 99.7704 65.1587 99.7704 65.4721ZM111.574 64.5521V66.5021C111.721 66.2154 111.931 65.9887 112.204 65.8221C112.484 65.6487 112.821 65.5621 113.214 65.5621C113.621 65.5621 113.981 65.6621 114.294 65.8621C114.607 66.0554 114.851 66.3254 115.024 66.6721C115.197 67.0121 115.284 67.4021 115.284 67.8421C115.284 68.3154 115.194 68.7254 115.014 69.0721C114.834 69.4121 114.587 69.6754 114.274 69.8621C113.961 70.0421 113.604 70.1321 113.204 70.1321C112.964 70.1321 112.751 70.1087 112.564 70.0621V69.2321C112.664 69.2587 112.787 69.2721 112.934 69.2721C113.307 69.2721 113.614 69.1487 113.854 68.9021C114.101 68.6487 114.224 68.3021 114.224 67.8621C114.224 67.4487 114.097 67.1121 113.844 66.8521C113.597 66.5921 113.284 66.4621 112.904 66.4621C112.464 66.4621 112.131 66.6087 111.904 66.9021C111.684 67.1954 111.574 67.5454 111.574 67.9521V71.0721H110.564V69.2421C110.411 69.5287 110.187 69.7587 109.894 69.9321C109.601 70.1054 109.247 70.1921 108.834 70.1921C108.421 70.1921 108.054 70.0954 107.734 69.9021C107.414 69.7087 107.164 69.4387 106.984 69.0921C106.811 68.7387 106.724 68.3287 106.724 67.8621C106.724 67.4021 106.814 66.9987 106.994 66.6521C107.174 66.3054 107.427 66.0387 107.754 65.8521C108.081 65.6587 108.454 65.5621 108.874 65.5621C109.274 65.5621 109.617 65.6454 109.904 65.8121C110.191 65.9787 110.411 66.2021 110.564 66.4821V64.5521H105.834V63.6721H116.164V64.5521H111.574ZM109.174 69.3121C109.474 69.3121 109.727 69.2421 109.934 69.1021C110.147 68.9621 110.304 68.7821 110.404 68.5621C110.511 68.3421 110.564 68.1154 110.564 67.8821C110.564 67.5021 110.444 67.1721 110.204 66.8921C109.964 66.6054 109.621 66.4621 109.174 66.4621C108.781 66.4621 108.451 66.5921 108.184 66.8521C107.917 67.1054 107.784 67.4454 107.784 67.8721C107.784 68.3121 107.914 68.6621 108.174 68.9221C108.434 69.1821 108.767 69.3121 109.174 69.3121Z" fill="#6E6F7A"/>
<path fill-rule="evenodd" clip-rule="evenodd" d="M23.3815 46.9827C22.8947 47.1887 22.3468 47.1965 21.8543 47.0047C21.3618 46.8128 20.9637 46.4362 20.7446 45.9552C20.5255 45.4742 20.5028 44.9267 20.6813 44.4292C20.8598 43.9317 21.2255 43.5236 21.7004 43.2916L33.2897 38.0322C33.5332 37.9132 33.7981 37.8442 34.0687 37.8294C34.3393 37.8145 34.6102 37.854 34.8653 37.9455C35.1204 38.037 35.3546 38.1788 35.554 38.3623C35.7534 38.5458 35.914 38.7675 36.0264 39.0141C36.1387 39.2608 36.2005 39.5274 36.208 39.7984C36.2156 40.0693 36.1688 40.339 36.0704 40.5915C35.972 40.844 35.824 41.0743 35.6351 41.2687C35.4463 41.4631 35.2204 41.6176 34.9708 41.7233L23.3815 46.9827Z" fill="#202020"/>
<path fill-rule="evenodd" clip-rule="evenodd" d="M42.049 34.7483C41.7552 34.2992 41.2961 33.9842 40.7713 33.8718C40.2466 33.7594 39.6987 33.8586 39.2467 34.148L33.2745 37.9909C32.7885 38.3074 32.4481 38.8038 32.328 39.3712C32.2079 39.9385 32.3178 40.5303 32.6338 41.0166C32.9047 41.4346 33.3302 41.7283 33.8171 41.8334C34.304 41.9385 34.8128 41.8465 35.232 41.5774L41.4499 37.5497C41.674 37.4058 41.8675 37.219 42.019 37C42.1706 36.7811 42.2773 36.5342 42.333 36.2738C42.3887 36.0134 42.3923 35.7445 42.3435 35.4827C42.2948 35.2209 42.1947 34.9713 42.049 34.7483Z" fill="#202020"/>
<path fill-rule="evenodd" clip-rule="evenodd" d="M42.0701 34.7311C41.7762 34.2821 41.3169 33.9673 40.7922 33.8551C40.2674 33.7429 39.7195 33.8424 39.2677 34.1318C39.2677 34.1318 38.4981 34.6241 38.0935 34.8865C36.4935 35.923 38.6349 39.3743 40.3356 38.2739C40.7204 38.0277 41.4709 37.5335 41.4709 37.5335C41.6957 37.3901 41.8897 37.2035 42.0417 36.9844C42.1937 36.7654 42.3007 36.5183 42.3565 36.2576C42.4122 35.9969 42.4156 35.7277 42.3665 35.4656C42.3173 35.2036 42.2166 34.9539 42.0701 34.7311Z" fill="#EAE7E7"/>
<path fill-rule="evenodd" clip-rule="evenodd" d="M39.424 35.2286C39.4956 35.7157 39.7101 36.1707 40.0403 36.536C40.3705 36.9012 40.8017 37.1603 41.2792 37.2804C41.7567 37.4006 42.2591 37.3765 42.7229 37.2111C43.1866 37.0456 43.591 36.7464 43.8846 36.3512C44.1783 35.956 44.3482 35.4825 44.3728 34.9907C44.3973 34.4989 44.2755 34.0109 44.0227 33.5884C43.7698 33.1659 43.3974 32.8278 42.9524 32.617C42.5074 32.4062 42.0099 32.3321 41.5228 32.4041C40.8724 32.5056 40.288 32.8585 39.8954 33.3868C39.5028 33.9152 39.3335 34.5766 39.424 35.2286Z" fill="#F7B9A9"/>
<path fill-rule="evenodd" clip-rule="evenodd" d="M2.7747 59.0409C2.76556 59.1118 2.77048 59.1838 2.78919 59.2528C2.8079 59.3219 2.84004 59.3865 2.88374 59.4431C2.92745 59.4997 2.98187 59.5471 3.04391 59.5827C3.10596 59.6182 3.1744 59.6412 3.24533 59.6503L22.7242 61.579L24.0493 48.196C24.3628 45.0298 22.1964 42.2207 19.2127 41.9253L10.0159 41.0147C7.03106 40.7191 4.357 43.049 4.0435 46.2151L2.7747 59.0409Z" fill="#202020"/>
<path d="M16.7185 46.0557C16.3681 47.4741 16.0305 48.9316 15.7057 50.4284C15.2478 52.5501 14.8476 54.6128 14.5052 56.6163L13.717 56.5383C13.8834 54.6529 13.9505 52.76 13.9181 50.8676C13.9037 49.1061 13.7956 47.5116 13.6656 46.1491C14.0056 46.4784 14.4443 46.6868 14.9144 46.7423C15.9333 46.8557 16.6306 46.1516 16.7185 46.0557Z" fill="#EAE7E7"/>
<path fill-rule="evenodd" clip-rule="evenodd" d="M14.9135 46.7502C15.1921 46.7781 15.4735 46.7508 15.7415 46.6698C16.0096 46.5888 16.259 46.4557 16.4755 46.2782C16.6921 46.1007 16.8715 45.8822 17.0035 45.6352C17.1355 45.3883 17.2175 45.1177 17.2448 44.839L17.2912 44.3706C17.3187 44.092 17.2912 43.8108 17.2101 43.5428C17.1289 43.2749 16.9958 43.0256 16.8184 42.8091C16.6409 42.5926 16.4225 42.4132 16.1757 42.2811C15.9289 42.1491 15.6585 42.0669 15.3799 42.0393C15.1014 42.0117 14.8201 42.0393 14.5522 42.1204C14.2842 42.2015 14.0349 42.3346 13.8184 42.5121C13.6019 42.6896 13.4225 42.9079 13.2904 43.1547C13.1584 43.4016 13.0762 43.672 13.0486 43.9505L13.0022 44.4189C12.9743 44.6976 13.0017 44.9789 13.0827 45.247C13.1637 45.515 13.2968 45.7645 13.4743 45.981C13.6518 46.1976 13.8703 46.377 14.1173 46.509C14.3642 46.641 14.6348 46.723 14.9135 46.7502Z" fill="#E2AA9F"/>
<path fill-rule="evenodd" clip-rule="evenodd" d="M12.3058 42.6445C12.1814 42.5352 12.0259 42.4676 11.8611 42.4513C11.6963 42.435 11.5305 42.4707 11.387 42.5535L11.1451 42.7001C11.0038 42.7724 10.8943 42.8945 10.8377 43.0427C10.781 43.191 10.7812 43.355 10.8382 43.5031L12.1073 46.9465C12.1604 47.0855 12.2566 47.2039 12.3818 47.2844C12.5069 47.365 12.6546 47.4033 12.8031 47.394C13.4899 47.3483 14.6492 47.122 14.8139 46.2287C15.0059 45.2426 13.1762 43.431 12.3058 42.6445Z" fill="#EAE7E7"/>
<path fill-rule="evenodd" clip-rule="evenodd" d="M19.1969 43.4973C19.3423 43.4286 19.5063 43.409 19.6639 43.4416C19.8214 43.4743 19.9641 43.5573 20.0704 43.6782L20.2578 43.8866C20.3652 44.0012 20.4289 44.1499 20.4377 44.3066C20.4465 44.4634 20.3998 44.6183 20.3059 44.7441L18.1206 47.6727C18.0339 47.7915 17.9102 47.8782 17.7689 47.9192C17.6275 47.9601 17.4766 47.953 17.3398 47.8989C16.72 47.6477 15.7302 47.1142 15.8213 46.1943C15.9588 45.1846 18.163 43.9828 19.1969 43.4973Z" fill="#EAE7E7"/>
<path fill-rule="evenodd" clip-rule="evenodd" d="M6.37555 42.0573C6.95273 42.1151 7.48343 42.3995 7.85107 42.8482C8.21871 43.2969 8.39325 43.8731 8.3364 44.4504L7.09892 56.9484C7.04569 57.4859 6.78114 57.9803 6.36342 58.3227C5.94571 58.6652 5.40905 58.8276 4.87154 58.7744C4.33403 58.7212 3.83968 58.4566 3.49724 58.0389C3.15479 57.6212 2.99229 57.0846 3.04551 56.547L4.09347 45.9631C4.16748 45.1855 4.40996 44.4332 4.80406 43.7587C5.19816 43.0842 5.7344 42.5036 6.37555 42.0573Z" fill="#202020"/>
<path d="M15.1281 47.075C14.8838 47.0508 14.6828 47.1628 14.6642 47.3509L14.1456 52.5876C14.1289 52.7565 14.3213 52.9268 14.5465 52.9491C14.7897 52.9732 14.9906 52.8612 15.0093 52.6732L15.5278 47.4364C15.5445 47.2675 15.3713 47.0991 15.1281 47.075Z" fill="#202020"/>
<path fill-rule="evenodd" clip-rule="evenodd" d="M7.83282 34.8032C7.30884 40.0951 11.0126 44.7972 16.1165 45.3025C21.2204 45.8079 25.7745 41.9224 26.2983 36.6315C26.8222 31.3407 23.1186 26.6376 18.0146 26.1322C12.9107 25.6268 8.35858 29.4932 7.83282 34.8032Z" fill="#F7B9A9"/>
<path fill-rule="evenodd" clip-rule="evenodd" d="M7.839 34.7413C8.05171 32.4907 9.02248 30.3792 10.5922 28.7525C8.59394 34.5807 8.51832 41.2814 15.2361 45.2154C10.59 44.2892 7.33977 39.7833 7.839 34.7413Z" fill="#E2AA9F"/>
<path fill-rule="evenodd" clip-rule="evenodd" d="M7.82507 34.3647C7.77273 34.7691 7.74306 35.1761 7.7362 35.5838C7.73839 36.3334 7.82069 37.0806 7.98167 37.8127C8.15428 38.6109 8.42106 39.3858 8.7764 40.1211C8.97493 39.6619 9.19806 39.2137 9.44485 38.7785C9.63688 38.425 9.85029 38.0835 10.0839 37.756C10.6366 36.9966 11.0938 36.6508 11.5294 35.9151C12.5313 34.2133 11.6312 33.3476 12.5031 32.2014C13.3767 31.0373 14.911 30.8481 16.4428 30.6962C21.1359 30.1944 24.2783 32.3441 25.3841 30.9368C25.5586 30.7109 25.6585 30.4363 25.67 30.1511C25.7611 28.4728 22.7653 26.9437 20.9817 26.3896C17.311 25.2462 12.2437 26.0827 9.81467 29.302C8.54873 30.9833 7.96054 33.3639 7.82507 34.3647Z" fill="#253051"/>
<path fill-rule="evenodd" clip-rule="evenodd" d="M10.243 35.541C10.3263 36.4213 10.8299 37.0772 11.383 37.0376C11.9361 36.998 12.334 36.2404 12.2487 35.3792C12.1652 34.5 11.6618 33.843 11.1075 33.8825C10.5526 33.9412 10.1577 34.6798 10.243 35.541Z" fill="#F7B9A9"/>
<path fill-rule="evenodd" clip-rule="evenodd" d="M19.1551 37.4763C19.3196 37.4884 19.4839 37.4516 19.6274 37.3704C19.771 37.2892 19.8872 37.1672 19.9614 37.0199C20.0356 36.8727 20.0645 36.7067 20.0444 36.543C20.0243 36.3794 19.9561 36.2253 19.8485 36.1004C19.7409 35.9755 19.5986 35.8852 19.4397 35.8411C19.2808 35.797 19.1124 35.801 18.9558 35.8527C18.7992 35.9043 18.6614 36.0011 18.5598 36.1311C18.4582 36.261 18.3975 36.4181 18.3852 36.5825C18.3702 36.8028 18.4426 37.0201 18.5867 37.1874C18.7308 37.3547 18.935 37.4585 19.1551 37.4763Z" fill="white"/>
<path fill-rule="evenodd" clip-rule="evenodd" d="M19.2568 37.185C19.394 37.1954 19.5313 37.1649 19.6512 37.0972C19.7711 37.0296 19.8683 36.9279 19.9304 36.8051C19.9925 36.6822 20.0167 36.5437 20.0001 36.4071C19.9835 36.2704 19.9267 36.1418 19.8369 36.0374C19.7472 35.9331 19.6285 35.8577 19.4958 35.8208C19.3632 35.7839 19.2226 35.7871 19.0919 35.8302C18.9611 35.8732 18.8461 35.954 18.7613 36.0625C18.6765 36.1709 18.6257 36.302 18.6154 36.4393C18.6038 36.6227 18.6644 36.8034 18.7842 36.9428C18.9041 37.0821 19.0737 37.1691 19.2568 37.185Z" fill="#253051"/>
<path fill-rule="evenodd" clip-rule="evenodd" d="M24.1869 37.8494C24.3514 37.8616 24.5157 37.8248 24.6592 37.7435C24.8028 37.6623 24.919 37.5404 24.9932 37.3931C25.0674 37.2458 25.0963 37.0799 25.0762 36.9162C25.0561 36.7525 24.9879 36.5985 24.8803 36.4736C24.7727 36.3486 24.6304 36.2584 24.4715 36.2143C24.3126 36.1702 24.1442 36.1742 23.9876 36.2258C23.831 36.2774 23.6932 36.3743 23.5916 36.5042C23.49 36.6341 23.4293 36.7912 23.417 36.9557C23.402 37.176 23.4744 37.3933 23.6185 37.5606C23.7626 37.7278 23.9668 37.8316 24.1869 37.8494Z" fill="white"/>
<path fill-rule="evenodd" clip-rule="evenodd" d="M24.2682 37.5573C24.4055 37.5677 24.5427 37.5371 24.6626 37.4695C24.7825 37.4019 24.8797 37.3002 24.9418 37.1774C25.0039 37.0545 25.0282 36.916 25.0115 36.7794C24.9949 36.6427 24.9381 36.5141 24.8484 36.4097C24.7586 36.3053 24.6399 36.2299 24.5073 36.193C24.3747 36.1562 24.2341 36.1594 24.1033 36.2025C23.9725 36.2455 23.8575 36.3263 23.7727 36.4347C23.6879 36.5432 23.6371 36.6743 23.6269 36.8116C23.6155 36.995 23.6762 37.1755 23.796 37.3148C23.9158 37.4541 24.0852 37.5411 24.2682 37.5573Z" fill="#253051"/>
<path fill-rule="evenodd" clip-rule="evenodd" d="M19.6137 38.8974C19.5899 39.3474 19.7459 39.7884 20.0473 40.1233C20.3487 40.4583 20.7708 40.6598 21.2207 40.6836C21.6707 40.7073 22.1117 40.5513 22.4467 40.2499C22.7816 39.9486 22.9831 39.5265 23.0069 39.0765L19.6137 38.8974Z" fill="#A58476"/>
<path fill-rule="evenodd" clip-rule="evenodd" d="M23.5106 34.3908L25.6133 35.1675C25.6647 35.1877 25.7112 35.2187 25.7496 35.2584C25.7881 35.2981 25.8176 35.3456 25.8361 35.3976L25.8497 35.4558C25.8575 35.4723 25.8613 35.4905 25.8606 35.5087C25.8599 35.527 25.8549 35.5448 25.8458 35.5606C25.8368 35.5765 25.824 35.5899 25.8086 35.5998C25.7933 35.6097 25.7757 35.6156 25.7575 35.6173C25.7395 35.6155 25.6993 35.6308 25.6832 35.6099L23.44 35.1035C23.3621 35.0896 23.2905 35.0518 23.235 34.9954C23.1795 34.939 23.1428 34.8667 23.1301 34.7886L23.1086 34.6159C23.1039 34.5803 23.1071 34.5441 23.1179 34.5099C23.1287 34.4757 23.147 34.4442 23.1712 34.4178C23.1955 34.3914 23.2254 34.3706 23.2586 34.3569C23.2918 34.3433 23.3276 34.3371 23.3634 34.3387C23.4134 34.3535 23.4625 34.3709 23.5106 34.3908Z" fill="#243051"/>
<path fill-rule="evenodd" clip-rule="evenodd" d="M20.0321 34.2931L17.6817 34.6858C17.6222 34.6953 17.5656 34.7182 17.5161 34.7526C17.4666 34.7871 17.4256 34.8323 17.396 34.8849L17.3724 34.9394C17.361 34.9552 17.3539 34.9738 17.3518 34.9932C17.3497 35.0126 17.3526 35.0322 17.3604 35.0502C17.3681 35.0681 17.3803 35.0837 17.3959 35.0955C17.4114 35.1073 17.4298 35.1149 17.4491 35.1175C17.4683 35.1194 17.5035 35.1422 17.5246 35.125L19.9579 35.043C20.0393 35.0452 20.1194 35.0228 20.188 34.979C20.2566 34.9351 20.3105 34.8717 20.3427 34.7969L20.3965 34.6317C20.4077 34.5977 20.4114 34.5617 20.4073 34.5261C20.4032 34.4906 20.3915 34.4563 20.3729 34.4258C20.3543 34.3952 20.3293 34.369 20.2996 34.349C20.27 34.329 20.2363 34.3156 20.201 34.3099C20.1484 34.2849 20.0887 34.279 20.0321 34.2931Z" fill="#243051"/>
<path fill-rule="evenodd" clip-rule="evenodd" d="M23.5989 31.3877C23.861 31.4054 24.118 31.4693 24.3579 31.5766C26.3683 32.5158 26.2521 36.9385 26.269 36.7685C26.3518 36.3294 26.4023 35.8849 26.42 35.4384C26.4357 34.6215 26.3314 33.8067 26.1103 33.0201C25.9071 32.2809 25.6004 31.5742 25.1994 30.9208C25.425 30.7544 25.5464 30.4822 25.4734 30.2658C25.4395 30.1663 25.3747 30.0802 25.2885 30.0201C24.7126 30.4747 24.156 30.9289 23.5989 31.3877Z" fill="#253051"/>
<path fill-rule="evenodd" clip-rule="evenodd" d="M7.77548 34.0278L7.82152 34.0108C8.15431 33.8879 8.48564 33.7684 8.82204 33.655C9.38725 33.4586 9.95467 33.2741 10.5243 33.1016C10.9207 32.9794 11.318 32.8637 11.7161 32.7546C11.8261 32.723 11.936 32.693 12.0457 32.6644C12.1029 32.6496 12.1624 32.6339 12.2172 32.62C12.9133 32.4342 13.6122 32.2654 14.3139 32.1136C14.9112 31.984 15.5107 31.866 16.1125 31.7595C16.3926 31.7088 16.6725 31.6615 16.9544 31.6155C17.1313 31.5864 17.3011 31.5589 17.4819 31.5359C17.7851 31.4942 18.0897 31.4607 18.3949 31.433C18.5921 31.4161 18.7905 31.3994 18.9893 31.3895C18.9961 31.389 19.003 31.3897 19.0095 31.3915L19.1032 31.3871C19.3137 31.3739 19.5236 31.3674 19.7333 31.362C20.1526 31.3535 20.5726 31.3598 20.9931 31.373C21.129 31.3785 21.2658 31.3864 21.4015 31.3941C22.0643 31.437 22.7243 31.5122 23.3814 31.6197C24.1404 31.7418 24.8916 31.9084 25.631 32.1187C25.6908 32.1349 25.7506 32.1511 25.8113 32.1696L25.812 32.1617L25.9046 28.2414L25.92 27.7757L25.9563 26.6627L26.0264 24.5424L26.0678 23.2628L26.1072 22.0843C26.116 21.8149 26.0521 21.5482 25.9221 21.3121C25.8497 21.1792 25.7569 21.0584 25.6472 20.954C25.5123 20.8243 25.3538 20.7218 25.1802 20.652C25.1683 20.646 25.1559 20.6409 25.1431 20.6369C24.938 20.5501 24.7158 20.5114 24.4935 20.5236C24.2712 20.5359 24.0546 20.5989 23.8604 20.7078L23.3177 21.0099L20.7274 22.4589L20.619 22.5198L20.2413 22.7291L20.0113 22.8587L19.3831 23.2092L18.5478 23.6757L16.9831 24.5509L16.6433 24.7446L15.2942 25.4979L14.5907 25.8853L14.1838 26.1133L12.411 27.1032L10.8392 27.9811C9.85172 28.5363 9.12021 29.4553 8.80052 30.5421L7.77548 34.0278Z" fill="#E3955C"/>
<path fill-rule="evenodd" clip-rule="evenodd" d="M22.9295 29.6262L23.6638 31.1326L25.1247 30.3302L25.9306 27.7722L25.9307 27.771L25.9671 26.657L25.9672 26.6559L25.4237 25.5424L23.9606 26.3446L22.9295 29.6262Z" fill="#F3C0B7"/>
<path fill-rule="evenodd" clip-rule="evenodd" d="M18.9963 31.3868C19.0031 31.3863 19.01 31.387 19.0166 31.3888L19.1102 31.3844C19.3207 31.3712 19.5306 31.3646 19.7403 31.3593C20.1596 31.3507 20.5796 31.3571 21.0001 31.3703C21.136 31.3758 21.2728 31.3837 21.4085 31.3914L21.9241 29.7552L21.1898 28.2487L19.7291 29.0501L18.9963 31.3868Z" fill="#20201F"/>
<path fill-rule="evenodd" clip-rule="evenodd" d="M18.5456 23.6755L18.9094 24.4221L20.3703 23.6196L20.7385 22.4498L20.6302 22.5107L20.2389 22.73L20.0091 22.8585L19.3807 23.2101L18.5456 23.6755Z" fill="#F3C0B7"/>
<path fill-rule="evenodd" clip-rule="evenodd" d="M14.1839 26.1133L14.6792 27.1277L16.14 26.3263L16.6392 24.7408L15.2901 25.494L14.5908 25.8853L14.1839 26.1133Z" fill="#20201F"/>
<path fill-rule="evenodd" clip-rule="evenodd" d="M11.9307 32.022L12.219 32.6133C12.915 32.4276 13.6139 32.2588 14.3157 32.1069L15.1535 29.4441L14.4181 27.9375L12.9626 28.7428L11.9307 32.022Z" fill="#20201F"/>
<path fill-rule="evenodd" clip-rule="evenodd" d="M9.4834 29.1805L10.1307 30.5089L11.5912 29.711L12.411 27.1032L10.8392 27.9811C10.3074 28.2803 9.84525 28.6892 9.4834 29.1805Z" fill="#F3C0B7"/>
<path fill-rule="evenodd" clip-rule="evenodd" d="M7.82313 34.0064C8.15592 33.8835 8.48725 33.764 8.82365 33.6506C9.38885 33.4542 9.95628 33.2697 10.5259 33.0972L10.6092 32.8303L9.87494 31.3239L8.41392 32.1274L7.82313 34.0064Z" fill="#F3C0B7"/>
<path fill-rule="evenodd" clip-rule="evenodd" d="M14.3214 32.1075C14.9187 31.9779 15.5182 31.8599 16.1199 31.7534C16.4001 31.7027 16.6799 31.6554 16.9619 31.6094C17.1387 31.5803 17.3086 31.5528 17.4894 31.5297C17.7925 31.4881 18.0971 31.4546 18.4023 31.4269C18.5996 31.41 18.7979 31.3933 18.9968 31.3834C19.0036 31.3829 19.0104 31.3836 19.017 31.3854L19.1107 31.381L19.7299 29.0547L21.1907 28.2522L21.925 29.7586L22.928 29.6306L23.959 26.349L25.4204 25.542L25.964 26.6544L26.0341 24.534L26.0755 23.2545L26.1149 22.0759C26.1237 21.8066 26.0598 21.5398 25.9298 21.3038C25.8574 21.1708 25.7646 21.05 25.6549 20.9457C25.52 20.816 25.3615 20.7134 25.1879 20.6436C25.176 20.6376 25.1636 20.6326 25.1508 20.6286C24.9457 20.5417 24.7235 20.503 24.5012 20.5153C24.2789 20.5275 24.0623 20.5905 23.868 20.6994L23.3254 21.0015L20.7351 22.4505L20.6267 22.5114L20.3666 23.6227L18.9058 24.424L18.6527 25.2357L17.1945 26.0339L16.1611 29.3164L15.1592 29.4446L14.3214 32.1075Z" fill="#C26262"/>
<path fill-rule="evenodd" clip-rule="evenodd" d="M24.9429 23.2208L25.6773 24.7261L26.0374 24.5343L26.0788 23.2548L26.1182 22.0762C26.1271 21.8069 26.0631 21.5402 25.9332 21.3041C25.8607 21.1711 25.768 21.0503 25.6582 20.946L24.9429 23.2208Z" fill="#F3C0B7"/>
<path fill-rule="evenodd" clip-rule="evenodd" d="M20.711 25.9319L21.7431 22.6504L23.2052 21.8481L23.9394 23.3545L22.9073 26.636L21.4464 27.4384L20.711 25.9319Z" fill="#20201F"/>
<path fill-rule="evenodd" clip-rule="evenodd" d="M16.1621 29.3165L17.1943 26.0351L18.6551 25.2326L19.3905 26.7392L18.3584 30.0206L16.8964 30.823L16.1621 29.3165Z" fill="#F3C0B7"/>
<path d="M16.8006 49.3259C16.9517 49.3408 17.0863 49.2305 17.1013 49.0793C17.1163 48.9282 17.0059 48.7936 16.8548 48.7786C16.7037 48.7637 16.569 48.8741 16.5541 49.0252C16.5391 49.1763 16.6495 49.3109 16.8006 49.3259Z" fill="#EAE7E7"/>
<path d="M16.3178 51.4111C16.4689 51.426 16.6035 51.3157 16.6185 51.1645C16.6335 51.0134 16.5231 50.8788 16.372 50.8639C16.2209 50.8489 16.0863 50.9593 16.0713 51.1104C16.0563 51.2615 16.1667 51.3961 16.3178 51.4111Z" fill="#EAE7E7"/>
<path d="M13.1753 51.0999C13.3265 51.1149 13.4611 51.0045 13.476 50.8534C13.491 50.7023 13.3806 50.5677 13.2295 50.5527C13.0784 50.5377 12.9438 50.6481 12.9288 50.7992C12.9138 50.9503 13.0242 51.0849 13.1753 51.0999Z" fill="#EAE7E7"/>
<path d="M13.1109 48.9605C13.262 48.9755 13.3967 48.8651 13.4116 48.714C13.4266 48.5629 13.3162 48.4283 13.1651 48.4133C13.014 48.3983 12.8794 48.5087 12.8644 48.6598C12.8495 48.8109 12.9598 48.9455 13.1109 48.9605Z" fill="#EAE7E7"/>
<path fill-rule="evenodd" clip-rule="evenodd" d="M14.7681 53.1916C14.7335 53.5406 14.5963 53.8714 14.3737 54.1424C14.1511 54.4133 13.8531 54.6122 13.5175 54.7138C13.1819 54.8154 12.8237 54.8152 12.4882 54.7133C12.1527 54.6113 11.8549 54.4121 11.6326 54.141C11.4103 53.8698 11.2734 53.5388 11.2392 53.1898C11.205 52.8408 11.2751 52.4895 11.4405 52.1803C11.606 51.8711 11.8594 51.618 12.1687 51.4528C12.4781 51.2877 12.8295 51.218 13.1784 51.2525C13.4102 51.2752 13.6353 51.3434 13.8407 51.4531C14.0461 51.5629 14.2279 51.7121 14.3756 51.8922C14.5232 52.0724 14.6339 52.2799 14.7013 52.5028C14.7686 52.7258 14.7913 52.9598 14.7681 53.1916Z" fill="#F7B9A9"/>
<path fill-rule="evenodd" clip-rule="evenodd" d="M12.4094 62.6488L22.4018 63.6382L13.3243 100.291L8.72738 99.8358L12.4094 62.6488Z" fill="#253051"/>
<path fill-rule="evenodd" clip-rule="evenodd" d="M2.53816 61.6714L12.5305 62.6608L3.45307 99.3136L-1.1439 98.8584L2.53816 61.6714Z" fill="#253051"/>
<path d="M22.68 61.076L2.79203 59.1068L2.08293 66.2684L21.2934 68.1705C21.6647 66.888 22.0118 65.603 22.3832 64.3205C22.467 63.2269 22.5722 62.1648 22.68 61.076Z" fill="#253051"/>
</g>
</g>
<defs>
<clipPath id="clip0">
<rect width="164.826" height="99.8946" fill="white" transform="translate(0.620819 7.14081)"/>
</clipPath>
</defs>
</svg>
