<svg width="149" height="130" viewBox="0 0 149 130" fill="none" xmlns="http://www.w3.org/2000/svg">
<path fill-rule="evenodd" clip-rule="evenodd" d="M67.0019 0.137028C68.4109 0.0461383 69.832 0 71.2637 0C72.6954 0 74.1164 0.0461383 75.5255 0.137028C76.2171 0.181643 76.7416 0.777486 76.6969 1.46788C76.6522 2.15827 76.0553 2.68178 75.3636 2.63717C74.0084 2.54975 72.6413 2.50535 71.2637 2.50535C69.886 2.50535 68.5189 2.54975 67.1638 2.63717C66.4721 2.68178 65.8752 2.15827 65.8305 1.46788C65.7858 0.777485 66.3103 0.181643 67.0019 0.137028ZM60.0311 2.22294C60.1656 2.90162 59.7235 3.56064 59.0436 3.69491C56.3394 4.2289 53.6979 4.93672 51.1313 5.8062C50.475 6.02854 49.7624 5.67769 49.5396 5.02256C49.3169 4.36743 49.6684 3.65609 50.3247 3.43375C52.9951 2.52912 55.7433 1.79271 58.5565 1.23718C59.2364 1.10292 59.8966 1.54426 60.0311 2.22294ZM82.4963 2.22294C82.6308 1.54426 83.291 1.10292 83.9709 1.23719C86.7841 1.79271 89.5323 2.52912 92.2027 3.43376C92.859 3.6561 93.2105 4.36743 92.9878 5.02256C92.765 5.67769 92.0524 6.02854 91.3961 5.8062C88.8294 4.93672 86.188 4.2289 83.4838 3.69491C82.8039 3.56064 82.3618 2.90162 82.4963 2.22294ZM44.1367 7.25904C44.4437 7.8793 44.1889 8.63055 43.5675 8.93701C41.109 10.1495 38.7416 11.5184 36.4784 13.0309C35.9025 13.4157 35.123 13.2617 34.7375 12.6868C34.3519 12.1119 34.5062 11.3339 35.0821 10.949C37.4359 9.37605 39.8983 7.95214 42.4557 6.69086C43.0771 6.3844 43.8297 6.63878 44.1367 7.25904ZM98.3907 7.25904C98.6977 6.63879 99.4503 6.3844 100.072 6.69086C102.629 7.95215 105.091 9.37605 107.445 10.949C108.021 11.3339 108.176 12.1119 107.79 12.6868C107.404 13.2617 106.625 13.4157 106.049 13.0309C103.786 11.5184 101.418 10.1495 98.9599 8.93701C98.3385 8.63055 98.0837 7.8793 98.3907 7.25904ZM30.0986 16.2451C30.5558 16.765 30.5042 17.5565 29.9832 18.0129C27.9291 19.8124 25.994 21.7441 24.1911 23.7945C23.7339 24.3144 22.941 24.366 22.4201 23.9096C21.8992 23.4533 21.8475 22.6618 22.3047 22.1418C24.1794 20.0097 26.1916 18.0012 28.3276 16.1299C28.8485 15.6735 29.6414 15.7251 30.0986 16.2451ZM112.429 16.2451C112.886 15.7251 113.679 15.6735 114.2 16.1299C116.336 18.0012 118.348 20.0098 120.223 22.1418C120.68 22.6618 120.628 23.4533 120.107 23.9096C119.586 24.366 118.793 24.3144 118.336 23.7945C116.533 21.7441 114.598 19.8124 112.544 18.0129C112.023 17.5565 111.972 16.765 112.429 16.2451ZM18.8554 28.5401C19.4313 28.9249 19.5856 29.703 19.2001 30.2779C17.6849 32.537 16.3135 34.9 15.0988 37.354C14.7918 37.9743 14.0391 38.2287 13.4178 37.9222C12.7964 37.6158 12.5415 36.8645 12.8485 36.2443C14.1121 33.6915 15.5386 31.2336 17.1144 28.8841C17.5 28.3092 18.2795 28.1552 18.8554 28.5401ZM123.672 28.5401C124.248 28.1552 125.027 28.3092 125.413 28.8841C126.989 31.2336 128.415 33.6915 129.679 36.2443C129.986 36.8645 129.731 37.6158 129.11 37.9222C128.488 38.2287 127.736 37.9743 127.429 37.354C126.214 34.9 124.842 32.537 123.327 30.2779C122.942 29.703 123.096 28.9249 123.672 28.5401ZM11.1772 43.3154C11.8335 43.5377 12.185 44.249 11.9623 44.9042C11.0912 47.4661 10.3821 50.1028 9.84713 52.8021C9.71262 53.4807 9.0524 53.9221 8.37249 53.7878C7.69257 53.6535 7.25043 52.9945 7.38494 52.3158C7.94148 49.5077 8.67922 46.7646 9.58551 44.099C9.80825 43.4439 10.5209 43.093 11.1772 43.3154ZM131.35 43.3154C132.007 43.093 132.719 43.4439 132.942 44.099C133.848 46.7646 134.586 49.5077 135.142 52.3158C135.277 52.9945 134.835 53.6535 134.155 53.7878C133.475 53.9221 132.815 53.4807 132.68 52.8021C132.145 50.1028 131.436 47.4661 130.565 44.9042C130.342 44.249 130.694 43.5377 131.35 43.3154ZM7.61606 59.5767C8.30771 59.6213 8.83217 60.2171 8.78747 60.9075C8.69989 62.2602 8.65542 63.6248 8.65542 65C8.65542 66.3752 8.69989 67.7398 8.78747 69.0925C8.83216 69.7829 8.30771 70.3787 7.61606 70.4233C6.92441 70.4679 6.32748 69.9444 6.28278 69.254C6.19173 67.8476 6.14551 66.4291 6.14551 65C6.14551 63.5709 6.19173 62.1524 6.28278 60.746C6.32748 60.0556 6.92441 59.5321 7.61606 59.5767ZM134.911 59.5767C135.603 59.5321 136.2 60.0556 136.245 60.746C136.336 62.1524 136.382 63.5709 136.382 65C136.382 66.4291 136.336 67.8476 136.245 69.254C136.2 69.9444 135.603 70.4679 134.911 70.4233C134.22 70.3787 133.695 69.7829 133.74 69.0925C133.827 67.7398 133.872 66.3752 133.872 65C133.872 63.6248 133.827 62.2602 133.74 60.9075C133.695 60.2171 134.22 59.6213 134.911 59.5767ZM8.37249 76.2122C9.0524 76.0779 9.71262 76.5193 9.84713 77.1979C10.3821 79.8972 11.0912 82.5339 11.9623 85.0958C12.185 85.751 11.8335 86.4623 11.1772 86.6846C10.5209 86.907 9.80825 86.5561 9.5855 85.901C8.67922 83.2354 7.94148 80.4923 7.38494 77.6842C7.25043 77.0055 7.69257 76.3465 8.37249 76.2122ZM134.155 76.2122C134.835 76.3465 135.277 77.0055 135.142 77.6842C134.586 80.4923 133.848 83.2355 132.942 85.901C132.719 86.5561 132.007 86.907 131.35 86.6846C130.694 86.4623 130.342 85.751 130.565 85.0958C131.436 82.5339 132.145 79.8972 132.68 77.1979C132.815 76.5193 133.475 76.0779 134.155 76.2122ZM13.4177 92.0778C14.0391 91.7713 14.7917 92.0257 15.0988 92.6459C16.3134 95.1 17.6849 97.463 19.2001 99.7221C19.5856 100.297 19.4313 101.075 18.8554 101.46C18.2795 101.845 17.5 101.691 17.1144 101.116C15.5386 98.7664 14.1121 96.3085 12.8485 93.7557C12.5415 93.1355 12.7964 92.3842 13.4177 92.0778ZM129.11 92.0778C129.731 92.3842 129.986 93.1355 129.679 93.7557C128.415 96.3085 126.989 98.7664 125.413 101.116C125.027 101.691 124.248 101.845 123.672 101.46C123.096 101.075 122.942 100.297 123.327 99.7221C124.842 97.463 126.214 95.1 127.429 92.646C127.736 92.0257 128.488 91.7713 129.11 92.0778ZM22.4201 106.09C22.941 105.634 23.7339 105.686 24.1911 106.206C25.994 108.256 27.9291 110.188 29.9832 111.987C30.5042 112.443 30.5558 113.235 30.0986 113.755C29.6414 114.275 28.8485 114.326 28.3276 113.87C26.1916 111.999 24.1794 109.99 22.3047 107.858C21.8475 107.338 21.8992 106.547 22.4201 106.09ZM120.107 106.09C120.628 106.547 120.68 107.338 120.223 107.858C118.348 109.99 116.336 111.999 114.2 113.87C113.679 114.326 112.886 114.275 112.429 113.755C111.972 113.235 112.023 112.443 112.544 111.987C114.598 110.188 116.533 108.256 118.336 106.206C118.793 105.686 119.586 105.634 120.107 106.09ZM34.7375 117.313C35.123 116.738 35.9025 116.584 36.4784 116.969C38.7416 118.482 41.109 119.851 43.5675 121.063C44.1889 121.369 44.4437 122.121 44.1367 122.741C43.8297 123.361 43.077 123.616 42.4557 123.309C39.8982 122.048 37.4359 120.624 35.0821 119.051C34.5062 118.666 34.3519 117.888 34.7375 117.313ZM107.79 117.313C108.175 117.888 108.021 118.666 107.445 119.051C105.091 120.624 102.629 122.048 100.072 123.309C99.4503 123.616 98.6977 123.361 98.3907 122.741C98.0837 122.121 98.3385 121.369 98.9599 121.063C101.418 119.851 103.786 118.482 106.049 116.969C106.625 116.584 107.404 116.738 107.79 117.313ZM49.5396 124.977C49.7624 124.322 50.475 123.971 51.1313 124.194C53.6979 125.063 56.3394 125.771 59.0436 126.305C59.7235 126.439 60.1656 127.098 60.0311 127.777C59.8966 128.456 59.2364 128.897 58.5565 128.763C55.7433 128.207 52.9951 127.471 50.3247 126.566C49.6684 126.344 49.3169 125.633 49.5396 124.977ZM92.9877 124.977C93.2105 125.633 92.859 126.344 92.2027 126.566C89.5323 127.471 86.7841 128.207 83.9709 128.763C83.291 128.897 82.6308 128.456 82.4963 127.777C82.3618 127.098 82.8039 126.439 83.4838 126.305C86.188 125.771 88.8294 125.063 91.396 124.194C92.0524 123.971 92.765 124.322 92.9877 124.977ZM65.8305 128.532C65.8752 127.842 66.4721 127.318 67.1638 127.363C68.5189 127.45 69.886 127.495 71.2637 127.495C72.6413 127.495 74.0084 127.45 75.3636 127.363C76.0553 127.318 76.6522 127.842 76.6969 128.532C76.7416 129.223 76.2171 129.818 75.5255 129.863C74.1164 129.954 72.6954 130 71.2637 130C69.832 130 68.4109 129.954 67.0019 129.863C66.3103 129.818 65.7858 129.223 65.8305 128.532Z" fill="#F5C143"/>
<path d="M6.07482 23.1636C4.40755 23.1636 3.00407 24.5851 2.80875 26.4716L0.703781 46.802C0.683439 46.9984 0.676745 47.1927 0.682784 47.3836L0.00186264 54.6774C-0.0250464 54.9656 0.244937 55.1682 0.466741 55.0262L7.00539 50.8405L61.2641 48.142C62.5792 48.0766 63.7335 47.1239 64.1979 45.7206L69.9855 28.2325C70.7965 25.7819 69.207 23.1636 66.9083 23.1636H6.07482Z" fill="#5DA6F5"/>
<path d="M8.22024 76.1094C7.00207 76.1094 5.97663 77.0149 5.83392 78.2167L4.29595 91.1679C4.28109 91.2931 4.2762 91.4168 4.28061 91.5384L3.7831 96.1848C3.76344 96.3684 3.9607 96.4975 4.12276 96.4071L8.90016 93.7406L48.5437 92.0215C49.5046 91.9799 50.3479 91.373 50.6873 90.479L54.9159 79.3385C55.5085 77.7773 54.3471 76.1094 52.6676 76.1094H8.22024Z" fill="#5DA6F5"/>
<path d="M141.184 46.5635C142.526 46.5635 143.655 47.5743 143.813 48.9158L145.506 63.373C145.523 63.5127 145.528 63.6508 145.523 63.7866L146.071 68.9733C146.093 69.1782 145.876 69.3223 145.697 69.2213L140.435 66.2448L96.7727 64.3259C95.7144 64.2794 94.7856 63.602 94.4118 62.604L89.7544 50.168C89.1018 48.4254 90.3809 46.5635 92.2307 46.5635H141.184Z" fill="#80C343"/>
<path d="M144.153 90.0547C145.393 90.0547 146.437 90.9918 146.583 92.2355L148.149 105.639C148.164 105.768 148.169 105.896 148.165 106.022L148.671 110.83C148.691 111.02 148.491 111.154 148.326 111.06L143.46 108.301L103.086 106.522C102.107 106.479 101.248 105.851 100.903 104.926L96.5961 93.3964C95.9926 91.7808 97.1754 90.0547 98.8859 90.0547H144.153Z" fill="#80C343"/>
<path d="M8.50928 27.7726C8.50928 27.3157 8.87966 26.9453 9.33655 26.9453H62.5184C62.9753 26.9453 63.3456 27.3157 63.3456 27.7726C63.3456 28.2295 62.9753 28.5999 62.5184 28.5999H9.33655C8.87966 28.5999 8.50928 28.2295 8.50928 27.7726Z" fill="white"/>
<path d="M95.4907 51.4088C95.4907 50.9519 95.8611 50.5815 96.318 50.5815H139.573C140.029 50.5815 140.4 50.9519 140.4 51.4088C140.4 51.8657 140.029 52.2361 139.573 52.2361H96.318C95.8611 52.2361 95.4907 51.8657 95.4907 51.4088Z" fill="white"/>
<path d="M97.8545 57.7907C97.8545 57.3338 98.2249 56.9634 98.6818 56.9634H140.518C140.975 56.9634 141.345 57.3338 141.345 57.7907C141.345 58.2475 140.975 58.6179 140.518 58.6179H98.6818C98.2249 58.6179 97.8545 58.2475 97.8545 57.7907Z" fill="white"/>
<path d="M101.164 95.6095C101.164 95.1526 101.534 94.7822 101.991 94.7822H142.645C143.102 94.7822 143.473 95.1526 143.473 95.6095C143.473 96.0664 143.102 96.4368 142.645 96.4368H101.991C101.534 96.4368 101.164 96.0664 101.164 95.6095Z" fill="white"/>
<path d="M116.764 102.7C116.764 102.243 117.134 101.873 117.591 101.873H143.355C143.811 101.873 144.182 102.243 144.182 102.7C144.182 103.157 143.811 103.527 143.355 103.527H117.591C117.134 103.527 116.764 103.157 116.764 102.7Z" fill="white"/>
<path d="M9.69092 81.191C9.69092 80.7342 10.0613 80.3638 10.5182 80.3638H49.2818C49.7387 80.3638 50.1091 80.7342 50.1091 81.191C50.1091 81.6479 49.7387 82.0183 49.2818 82.0183H10.5182C10.0613 82.0183 9.69092 81.6479 9.69092 81.191Z" fill="white"/>
<path d="M8.74561 87.0997C8.74561 86.6428 9.11599 86.2725 9.57288 86.2725H47.1547C47.6116 86.2725 47.982 86.6428 47.982 87.0997C47.982 87.5566 47.6116 87.927 47.1547 87.927H9.57288C9.11599 87.927 8.74561 87.5566 8.74561 87.0997Z" fill="white"/>
<path d="M7.56348 35.1002C7.56348 34.6433 7.93386 34.2729 8.39075 34.2729H60.8635C61.3204 34.2729 61.6908 34.6433 61.6908 35.1002C61.6908 35.5571 61.3204 35.9275 60.8635 35.9275H8.39075C7.93386 35.9275 7.56348 35.5571 7.56348 35.1002Z" fill="white"/>
<path d="M6.85449 42.4274C6.85449 41.9705 7.22487 41.6001 7.68176 41.6001H35.3363C35.7932 41.6001 36.1636 41.9705 36.1636 42.4274C36.1636 42.8843 35.7932 43.2546 35.3363 43.2546H7.68176C7.22487 43.2546 6.85449 42.8843 6.85449 42.4274Z" fill="white"/>
</svg>
