data/train/20180610_113407.jpg 66,22,75,29,0 94,16,105,26,0 126,13,132,23,0 231,6,237,14,0 296,3,304,13,0 329,2,339,12,0 627,31,634,42,0 469,447,479,456,0 502,439,511,452,0 535,433,541,444,0
data/train/20180610_114041.jpg 283,7,306,17,0 609,167,614,173,0
data/train/20180610_114011.jpg 189,243,201,255,0 230,239,242,249,0 191,287,210,298,0 237,284,255,309,0 277,233,286,244,0 321,234,332,239,0 426,223,434,233,0 616,208,626,218,0 630,247,637,273,0
data/train/20180610_113943.jpg 464,181,472,193,0 532,175,533,186,0 474,222,483,231,0 623,183,629,192,0
data/train/20180610_113939.jpg 350,5,358,14,0 537,484,547,489,0 575,472,581,483,0 580,503,592,511,0
data/train/20180610_113529.jpg 5,91,16,96,0 65,75,77,83,0 97,68,107,78,0 132,63,142,71,0 127,412,140,423,0
data/train/20180610_114329.jpg 39,29,51,48,0 18,13,27,22,0 45,6,53,16,0 11,38,25,49,0 157,6,166,21,0 167,3,175,12,0 77,238,88,246,0 70,279,82,294,0 148,232,158,242,0 144,276,156,292,0 434,213,443,227,0 441,286,454,302,0 521,208,533,222,0 555,209,569,221,0 591,204,600,216,0 600,271,608,282,0 561,270,576,292,0 522,270,543,289,0
data/train/20180610_113847.jpg 7,279,2,288,0 2,302,7,313,0 366,190,373,198,0 367,204,374,208,0 582,6,590,22,0 607,5,620,26,0
data/train/20180610_113309.jpg 552,502,560,511,0
data/train/20180610_113105.jpg 161,270,174,283,0 175,271,186,281,0 186,265,199,279,0 206,265,223,277,0 373,159,384,168,0 503,211,512,221,0 536,207,545,218,0
data/train/20180610_113649.jpg 532,206,541,215,0 563,201,574,215,0 600,203,609,212,0 631,199,637,212,0 543,269,553,281,0 574,249,584,262,0 607,246,620,262,0 623,412,631,426,0 557,427,567,442,0 347,453,359,466,0 306,459,318,472,0 264,462,275,473,0 223,463,232,474,0 184,462,197,476,0
data/train/20180610_113749.jpg 42,22,53,35,0 44,3,56,6,0 101,36,109,46,0 103,24,113,29,0 465,218,469,225,0 558,491,565,500,0 587,481,592,488,0 524,499,537,507,0
data/train/20180610_113155.jpg 73,29,81,36,0 11,39,17,46,0 236,255,244,266,0
data/train/20180610_113147.jpg 158,246,168,257,0 583,223,588,230,0 350,7,357,14,0
data/train/20180610_114211.jpg 181,27,192,38,0 186,1,196,7,0 443,231,450,238,0 328,240,334,253,0 457,268,467,302,0
data/train/20180610_114151.jpg 29,271,34,276,0 61,269,68,278,0 298,248,309,264,0 549,5,561,27,0 565,9,574,27,0 308,298,315,313,0
data/train/20180610_113151.jpg 469,239,477,248,0 573,41,581,49,0 94,265,99,270,0
data/train/20180610_114253.jpg 516,139,539,146,0 543,139,548,149,0 570,141,574,147,0 525,196,532,202,0 539,188,552,206,0 554,191,559,202,0 580,189,588,201,0 571,396,577,403,0 581,396,586,405,0 573,450,586,464,0 589,452,593,458,0
data/train/20180610_113149.jpg 318,241,326,252,0 469,18,477,26,0
data/train/20180610_114019.jpg 100,233,110,245,0 148,230,159,241,0 105,285,119,311,0 149,277,161,292,0
data/train/20180610_113225.jpg 519,234,531,247,0 434,2,444,13,0 465,6,472,13,0
data/train/20180610_113139.jpg 2,215,11,222,0 412,159,421,166,0
data/train/20180610_113651.jpg 323,227,334,236,0 367,221,377,233,0 408,220,420,227,0 449,216,457,225,0 538,211,544,221,0 414,266,424,277,0 370,273,381,284,0 328,293,339,305,0 11,470,4,462,0 31,461,41,474,0 62,463,72,475,0 94,466,106,475,0 133,467,142,479,0 348,463,358,475,0 429,452,440,468,0 471,446,481,461,0 548,436,556,448,0
data/train/20180610_114135.jpg 111,18,119,31,0 104,62,113,83,0 320,35,332,54,0 326,11,317,1,0 245,5,255,14,0 368,26,378,44,0
data/train/20180610_114111.jpg 429,194,437,202,0 29,42,36,48,0 440,232,446,241,0 438,250,456,262,0
data/train/20180610_113207.jpg 445,228,452,237,0 506,226,514,232,0
data/train/20180610_113959.jpg 199,271,207,279,0 160,271,164,279,0 241,262,251,274,0 199,316,220,341,0 371,255,380,267,0 424,249,434,257,0 464,249,477,252,0 507,243,514,253,0 609,234,613,243,0 621,266,629,292,0 512,289,533,316,0 434,288,441,303,0 438,319,446,326,0
data/train/20180610_113219.jpg 409,14,418,22,0 439,14,448,22,0 549,22,558,28,0 573,25,581,29,0
data/train/20180610_114243.jpg 50,50,55,57,0 44,96,51,108,0 74,92,81,101,0 80,45,87,53,0 109,40,117,51,0 173,33,181,39,0 171,57,177,68,0 173,282,186,288,0 7,293,13,302,0 7,354,20,366,0 176,326,196,344,0 464,23,471,36,0 491,26,500,37,0 467,52,478,57,0 501,49,507,59,0 572,31,580,39,0 588,55,593,64,0 617,38,622,44,0 540,249,549,256,0 551,293,566,314,0
data/train/20180610_113433.jpg 451,231,464,244,0 582,224,592,237,0 608,219,618,235,0
data/train/20180610_113555.jpg 304,136,317,146,0 343,136,355,144,0 420,133,432,144,0 624,16,631,24,0 584,472,601,484,0 558,483,567,492,0 528,492,538,502,0 493,499,506,508,0 22,162,33,172,0 7,467,17,475,0 214,1,223,9,0
data/train/20180610_113423.jpg 22,249,35,260,0 502,181,515,190,0 532,178,540,188,0 574,215,582,222,0 573,5,582,13,0 623,31,631,41,0
data/train/20180610_113117.jpg 16,273,26,281,0 48,270,56,276,0 148,256,159,263,0 186,252,194,260,0 224,248,231,253,0 310,236,319,246,0 419,224,432,232,0 460,219,467,228,0 579,405,587,412,0
data/train/20180610_113511.jpg 4,249,15,259,0 36,248,46,256,0 27,247,36,257,0
data/train/20180610_114039.jpg 81,7,102,16,0 443,153,452,161,0
data/train/20180610_113823.jpg 135,14,154,25,0 118,245,129,257,0 236,233,247,249,0 321,226,334,236,0 536,212,543,226,0 240,275,253,285,0 323,282,336,292,0 328,302,339,313,0
data/train/20180610_113157.jpg 170,11,181,17,0 242,6,252,13,0 431,231,439,239,0
data/train/20180610_114223.jpg 180,27,187,37,0 442,6,462,22,0 477,5,492,23,0 590,16,606,28,0
data/train/20180610_113607.jpg 12,13,21,21,0 46,21,53,29,0 45,35,50,42,0 9,39,15,47,0 32,242,39,252,0 171,173,179,182,0 133,248,141,255,0 255,241,260,251,0 174,245,178,256,0 448,163,455,171,0 452,228,460,239,0 389,24,394,28,0 408,21,416,30,0 575,14,586,22,0 601,16,608,25,0 620,22,627,26,0 631,43,638,53,0 612,41,618,50,0 587,36,594,44,0 619,163,626,171,0 595,162,600,171,0 608,221,616,231,0 564,161,573,172,0 538,160,548,172,0 473,441,482,450,0 564,421,576,433,0 590,415,603,426,0 632,404,638,413,0
data/train/20180610_114139.jpg 23,35,29,40,0 47,26,55,36,0 16,65,26,86,0 43,55,49,70,0 378,252,387,261,0
data/train/20180610_113533.jpg 51,221,61,231,0 62,236,71,246,0 85,218,95,225,0 119,212,130,221,0 193,201,205,214,0 233,196,241,208,0 268,193,282,206,0
data/train/20180610_113213.jpg 67,23,75,28,0 95,16,105,24,0 364,246,375,255,0 507,235,513,243,0
data/train/20180610_113525.jpg 564,484,575,492,0
data/train/20180610_113709.jpg 206,221,220,232,0 208,263,218,274,0 299,215,309,228,0 301,263,316,279,0 429,426,436,435,0 571,404,579,411,0 583,418,590,427,0 599,397,610,406,0 628,387,634,398,0 247,467,257,479,0 172,484,182,494,0 161,449,172,459,0 80,449,91,457,0 43,448,57,459,0
data/train/20180610_114001.jpg 131,253,140,260,0 24,261,31,280,0 184,249,188,263,0 222,243,235,252,0 265,240,279,248,0 394,229,412,238,0 408,273,421,295,0 274,286,292,315,0 186,292,204,301,0 193,315,203,327,0
data/train/20180610_113829.jpg 599,199,610,211,0 611,124,623,136,0 628,159,633,172,0 629,182,638,194,0 612,248,618,262,0 611,234,619,244,0
data/train/20180610_113637.jpg 292,5,303,1,0 295,45,307,52,0 331,42,342,51,0 296,256,311,266,0 269,278,278,288,0 41,495,48,504,0 267,301,281,312,0 296,295,310,311,0 351,273,362,284,0 352,296,368,306,0 527,467,538,477,0
data/train/20180610_114209.jpg 39,24,45,35,0 37,9,47,16,0 28,53,43,69,0 249,246,258,254,0 259,287,273,320,0 127,260,139,265,0
data/train/20180610_114047.jpg 112,7,120,21,0
data/train/20180610_113217.jpg 226,5,236,11,0 261,3,269,9,0 390,1,403,8,0 421,1,434,7,0
data/train/20180610_113243.jpg 75,1,82,11,0 244,244,260,255,0 518,235,531,245,0
data/train/20180610_113755.jpg 132,9,138,24,0 301,9,307,16,0 302,24,308,32,0 551,19,558,29,0 593,32,608,40,0 600,42,607,49,0 588,5,594,12,0 551,5,539,3,0
data/train/20180610_113507.jpg 119,242,131,251,0 157,239,167,249,0 195,236,204,246,0 231,233,243,242,0 314,227,323,237,0 391,222,402,232,0 418,219,427,230,0 430,221,441,229,0 555,147,560,155,0
data/train/20180610_113545.jpg 344,202,361,214,0 386,202,400,212,0 317,279,330,294,0 358,276,368,287,0 115,51,124,59,0 118,23,127,29,0 628,443,638,452,0 308,206,323,217,0
data/train/20180610_114051.jpg 513,16,519,27,0
data/train/20180610_113343.jpg 527,493,537,503,0 581,220,591,231,0
data/train/20180610_114319.jpg 48,199,56,208,0 79,194,87,203,0 74,228,83,236,0 74,252,83,257,0 43,257,55,267,0 326,16,337,31,0 359,14,373,27,0 397,16,405,24,0 597,227,609,238,0 607,296,615,306,0 563,231,574,240,0
data/train/20180610_113831.jpg 384,147,396,158,0 478,147,483,156,0 518,144,520,156,0 398,192,408,196,0 400,206,412,212,0 392,217,405,227,0 351,234,363,241,0 363,275,372,285,0 358,294,368,300,0 487,186,494,196,0 491,208,498,221,0 493,226,501,233,0 530,219,539,229,0 501,274,504,285,0 540,273,548,285,0 573,258,584,281,0 569,217,573,232,0
data/train/20180610_113049.jpg
data/train/20180610_113957.jpg 396,242,402,253,0 405,288,411,324,0 584,230,593,244,0 614,228,627,235,0 597,267,601,277,0 600,292,608,302,0 543,235,560,248,0 433,241,448,253,0 356,246,362,257,0 312,252,321,264,0
data/train/20180610_113531.jpg 1,368,12,375,0 35,367,48,378,0
data/train/20180610_114121.jpg 536,51,554,61,0 524,7,541,17,0 613,21,621,27,0 626,65,631,75,0 412,246,421,255,0
data/train/20180610_113543.jpg 97,189,109,195,0 98,261,110,274,0 138,259,149,272,0 136,183,149,194,0 176,181,189,193,0 509,171,519,178,0 534,172,547,179,0 592,170,599,179,0 604,196,612,208,0 604,19,615,27,0 596,472,607,484,0 472,445,481,456,0 502,438,513,449,0
data/train/20180610_113903.jpg 602,216,611,225,0 629,216,635,225,0 632,254,639,270,0 606,254,622,278,0 404,488,413,499,0 407,504,416,511,0
data/train/20180610_113335.jpg 8,405,2,419,0
data/train/20180610_113837.jpg 509,205,517,213,0 511,245,525,260,0
data/train/20180610_114233.jpg 54,25,63,30,0 123,14,129,19,0 116,61,122,64,0 155,12,160,17,0 149,57,157,65,0 218,30,229,39,0 219,7,228,19,0 386,34,390,38,0 381,7,388,15,0 532,19,537,26,0 549,5,553,12,0 553,21,559,27,0 627,239,633,245,0 105,262,113,271,0 70,263,80,271,0 28,264,35,270,0 23,329,35,336,0 74,317,80,326,0 72,306,82,309,0 250,286,254,291,0 110,298,118,328,0
data/train/20180610_113639.jpg 112,7,119,12,0 103,54,111,63,0 133,48,144,57,0 82,259,92,268,0 54,278,62,289,0 53,298,60,310,0 76,297,90,311,0 124,273,134,286,0 124,295,136,308,0 410,233,424,241,0 416,278,426,289,0 297,482,311,491,0 592,437,604,449,0 542,269,551,281,0 560,265,576,274,0 560,225,570,231,0 533,226,547,233,0 579,222,587,232,0 142,0,159,6,0
data/train/20180610_114331.jpg 12,23,20,36,0 20,23,27,32,0 7,51,12,64,0 11,47,18,55,0 306,234,316,244,0 347,229,357,240,0 387,231,404,238,0 347,302,363,318,0 393,301,406,311,0 303,301,319,315,0 215,312,226,324,0 212,242,226,249,0 632,145,639,153,0
data/train/20180610_113707.jpg 432,211,442,221,0 514,204,523,218,0 521,252,533,268,0 613,407,624,418,0 462,455,470,469,0 448,433,460,444,0 372,446,388,458,0 387,481,395,492,0 281,456,294,466,0 239,456,252,468,0
data/train/20180610_113615.jpg 125,181,138,187,0 334,166,345,176,0 373,165,379,175,0 408,164,419,173,0 508,163,520,172,0 478,163,486,172,0 608,444,617,451,0 579,449,586,462,0 273,479,282,486,0
data/train/20180610_113107.jpg 287,265,298,273,0 329,257,341,267,0 3,335,11,341,0 11,333,19,339,0
data/train/20180610_114325.jpg 232,11,245,23,0 374,2,390,12,0 513,3,524,17,0 22,258,31,268,0 19,325,29,334,0 197,243,205,255,0 233,241,243,252,0 276,238,288,249,0 316,236,329,248,0 272,292,293,303,0 316,288,329,304,0 483,225,491,237,0 478,265,492,282,0 551,218,567,233,0 560,264,568,274,0
data/train/20180610_114221.jpg 22,7,30,18,0 8,58,14,68,0 224,12,233,17,0 261,11,278,19,0 298,8,316,21,0 443,5,459,18,0 510,14,519,25,0
data/train/20180610_114203.jpg 588,53,600,61,0 609,57,614,67,0 580,492,598,501,0 603,484,613,495,0
data/train/20180610_114015.jpg 157,233,168,245,0 204,232,213,238,0 166,279,176,315,0 351,216,362,229,0 400,216,408,223,0 359,265,373,269,0 367,291,380,303,0 578,249,588,278,0 611,242,625,260,0 598,198,608,214,0 561,203,575,218,0
data/train/20180610_113547.jpg 12,189,23,201,0 49,186,60,197,0 129,179,139,190,0 164,177,182,185,0 525,165,533,176,0 553,166,562,173,0 511,237,520,245,0 539,234,550,241,0 61,23,74,32,0 71,18,81,29,0 296,4,308,14,0
data/train/20180610_113449.jpg 46,197,55,209,0 73,199,89,211,0 228,232,237,238,0 307,262,318,271,0 345,256,357,273,0 385,257,399,266,0 456,215,468,228,0 96,473,106,484,0 130,473,140,488,0
data/train/20180610_113539.jpg 118,184,129,193,0 155,181,168,193,0 244,176,254,186,0 254,208,264,221,0 328,194,338,205,0 481,169,496,179,0 591,171,598,179,0 599,183,607,192,0 613,170,621,178,0 633,173,639,181,0 301,14,311,24,0 370,19,388,31,0 341,456,355,468,0 72,480,86,487,0 108,478,124,486,0 146,476,156,484,0
data/train/20180610_113931.jpg 32,21,43,43,0 137,25,149,35,0 137,5,151,17,0 172,4,186,28,0 608,29,615,48,0 592,3,603,11,0 550,212,558,220,0 562,208,564,220,0 570,211,577,217,0 567,252,584,260,0
data/train/20180610_113945.jpg 594,207,598,216,0 597,248,609,258,0
data/train/20180610_113559.jpg 0,259,10,274,0 271,244,283,252,0 266,167,278,180,0 302,167,314,176,0 344,166,352,173,0 379,164,393,174,0 416,163,427,172,0 124,481,133,491,0 161,479,170,488,0 332,469,340,479,0 409,457,418,467,0 536,5,544,13,0 559,10,569,16,0 582,14,593,19,0 550,43,559,52,0 568,37,579,47,0 592,37,601,46,0
data/train/20180610_113813.jpg 346,236,354,250,0 352,276,363,287,0 293,243,310,249,0 297,279,309,292,0 257,264,271,277,0 258,245,266,252,0 256,286,274,292,0 217,281,230,295,0 218,258,227,271,0
data/train/20180610_113759.jpg 20,16,32,24,0 23,7,31,13,0 50,11,61,27,0 95,7,106,13,0 454,6,466,23,0 581,28,587,41,0 570,2,578,12,0 36,307,45,317,0 35,236,51,245,0 16,238,1,250,0 8,307,0,319,0 446,489,453,498,0 471,483,481,495,0
data/train/20180610_113517.jpg 459,221,467,230,0 530,223,542,238,0 536,159,547,166,0 301,162,315,168,0 339,161,348,169,0 11,7,17,14,0 36,4,48,9,0
data/train/20180610_113413.jpg 324,434,337,444,0 378,498,390,510,0 414,494,426,506,0 545,467,556,477,0 574,462,582,470,0 565,4,558,1,0
data/train/20180610_113141.jpg 133,253,144,259,0
data/train/20180610_113131.jpg 28,61,37,67,0 545,9,551,17,0
data/train/20180610_113357.jpg 11,0,18,6,0
data/train/20180610_114141.jpg 172,272,180,281,0 404,24,414,47,0
data/train/20180610_113351.jpg 535,1,545,11,0
data/train/20180610_114333.jpg 31,48,39,63,0 39,22,47,31,0 80,14,87,22,0 110,7,119,16,0 103,33,115,43,0 272,13,287,25,0 439,157,450,169,0 439,200,457,220,0 444,232,456,242,0 445,270,464,294,0 156,253,169,262,0 117,254,130,267,0 83,259,96,267,0 77,319,101,337,0 113,319,132,337,0 156,318,170,337,0 15,260,22,271,0 12,328,23,337,0
data/train/20180610_113917.jpg 316,205,323,216,0 359,201,367,210,0 327,243,336,259,0 285,450,292,462,0 381,439,390,450,0 468,501,477,511,0 385,483,392,491,0 390,501,400,511,0 295,493,311,502,0 424,434,430,443,0
data/train/20180610_114305.jpg 76,66,83,77,0 78,41,90,50,0 27,55,35,57,0 21,77,32,89,0 172,48,180,63,0 171,23,179,29,0 141,31,155,34,0 205,19,212,33,0 203,45,210,53,0 3,273,13,286,0 1,309,8,321,0 310,253,321,261,0 350,254,360,263,0 312,293,326,304,0 351,293,361,303,0 470,241,477,251,0 475,279,490,298,0 502,243,517,255,0 538,238,548,252,0 540,269,553,289,0 586,504,595,510,0
data/train/20180610_113515.jpg 607,214,622,226,0 481,155,491,166,0 513,157,521,165,0 539,158,549,165,0
data/train/20180610_113307.jpg 103,188,110,196,0 135,184,145,193,0 173,179,184,187,0
data/train/20180610_114301.jpg 30,51,40,59,0 37,23,44,30,0 63,19,69,24,0 91,13,97,21,0 83,38,96,48,0 216,23,227,33,0 247,23,257,29,0 361,231,368,237,0 360,268,370,281,0 286,235,292,242,0 246,237,258,245,0 248,271,257,284,0 249,305,258,319,0 208,305,222,319,0 210,238,220,252,0 69,247,76,255,0 64,304,73,318,0 4,313,17,317,0 23,311,43,319,0 12,251,31,259,0 37,246,44,256,0
data/train/20180610_114007.jpg 107,247,121,256,0 234,233,244,244,0 322,225,338,235,0 277,230,289,240,0 242,286,254,296,0 331,271,346,283,0 335,296,347,302,0 616,203,623,215,0 623,239,637,257,0
data/train/20180610_113249.jpg 17,267,25,277,0 617,234,609,224,0 530,161,537,166,0
data/train/20180610_113113.jpg 386,236,395,243,0 424,232,431,243,0 526,222,533,232,0 558,218,565,228,0 585,217,593,225,0
data/train/20180610_114323.jpg 19,34,33,44,0 15,61,28,77,0 38,53,51,71,0 43,26,49,36,0 68,23,75,28,0 61,52,72,58,0 430,6,441,18,0 555,7,571,22,0 500,232,509,239,0 460,232,473,246,0 536,233,552,242,0 543,282,554,298,0 509,283,526,297,0 207,248,219,258,0 207,322,223,333,0 170,252,182,259,0
data/train/20180610_113751.jpg 284,10,292,24,0 613,200,619,211,0
data/train/20180610_114043.jpg 494,15,470,4,0
data/train/20180610_113715.jpg 14,455,8,462,0 14,468,24,478,0 38,458,46,464,0 70,456,75,468,0 138,460,141,468,0 168,456,178,468,0 204,454,218,468,0
data/train/20180610_114109.jpg 238,176,252,192,0 240,222,257,254,0 611,492,614,501,0
data/train/20180610_114315.jpg 28,276,41,284,0 31,311,47,326,0 64,275,71,283,0 203,16,211,22,0 198,40,213,55,0 243,11,251,15,0 244,37,253,55,0 276,7,283,20,0 280,37,285,52,0 616,11,624,21,0 628,36,634,46,0 398,181,406,186,0 433,175,444,181,0 438,212,447,227,0 406,246,415,253,0 199,306,208,315,0 201,267,208,277,0 444,237,451,247,0
data/train/20180610_114239.jpg 153,3,164,9,0 187,2,195,7,0 180,223,188,233,0 182,272,192,297,0 424,214,436,223,0 429,276,438,289,0 524,212,532,222,0 558,212,564,220,0 583,212,592,218,0 613,211,620,218,0 621,266,632,283,0
data/train/20180610_113631.jpg 32,468,44,478,0 168,405,202,429,0 227,398,245,411,0 451,385,462,399,0 486,381,500,394,0 527,375,538,388,0 623,363,636,373,0
data/train/20180610_114201.jpg 379,239,394,248,0 382,284,397,305,0 28,477,33,486,0
data/train/20180610_113429.jpg 199,232,210,243,0 319,222,331,235,0 359,222,371,234,0 396,218,407,228,0 561,213,571,225,0 588,209,598,223,0
data/train/20180610_114127.jpg 71,75,82,84,0 12,40,2,51,0 85,26,89,37,0 111,22,121,32,0 102,71,112,76,0 273,2,286,12,0 275,33,286,52,0 599,11,608,16,0 612,42,623,57,0 367,258,374,270,0 210,496,220,504,0
data/train/20180610_113253.jpg 134,161,141,172,0 205,223,218,234,0 244,219,255,230,0
data/train/20180610_113953.jpg 112,263,119,271,0 111,303,124,323,0 142,262,150,270,0 234,253,240,258,0 270,247,280,258,0 237,295,250,303,0 237,318,246,338,0 277,288,287,301,0 276,308,293,324,0 397,236,404,249,0
data/train/20180610_113319.jpg 99,250,111,259,0 179,245,191,256,0
data/train/20180610_113929.jpg 21,37,32,54,0 22,13,36,19,0 11,21,1,17,0 498,19,506,35,0 612,10,619,16,0 396,231,403,240,0 409,227,412,236,0 419,228,427,236,0 413,275,422,286,0 428,272,437,286,0 589,486,601,492,0 527,504,540,511,0
data/train/20180610_113737.jpg 452,6,460,15,0
data/train/20180610_113221.jpg 87,38,95,44,0 118,32,125,39,0 568,22,574,30,0 590,24,599,31,0 116,284,125,293,0 364,264,370,272,0
data/train/20180610_113921.jpg 24,38,33,53,0 28,4,37,12,0 122,15,131,29,0 10,6,0,24,0 589,34,598,42,0 538,19,544,28,0 582,23,592,26,0
data/train/20180610_113629.jpg 224,411,237,420,0 447,317,463,329,0 633,299,639,309,0
data/train/20180610_113801.jpg 211,235,220,243,0 250,232,263,237,0 214,307,226,317,0 256,302,264,317,0 200,8,218,17,0 237,4,242,16,0 170,7,185,20,0 283,3,296,16,0 584,8,591,16,0 592,35,607,45,0 525,482,538,491,0 618,453,622,461,0 631,448,639,461,0 619,490,628,500,0 631,478,639,496,0
data/train/20180610_113653.jpg 117,242,127,250,0 156,239,164,249,0 198,237,209,248,0 238,233,250,242,0 338,226,347,235,0 196,285,207,297,0 156,289,167,303,0 116,309,129,327,0 218,473,229,484,0 139,475,147,484,0 260,473,269,489,0 346,466,360,477,0
data/train/20180610_113535.jpg 74,201,84,210,0 231,187,244,194,0 246,201,253,213,0 270,181,282,192,0 306,181,319,190,0 378,174,390,186,0 411,172,421,181,0 442,173,454,181,0
data/train/20180610_113855.jpg 140,437,148,450,0 44,181,56,201,0 9,186,20,203,0 3,230,14,237,0 4,244,11,252,0 38,225,46,245,0
data/train/20180610_113919.jpg 529,217,541,226,0 562,216,572,223,0 543,252,553,269,0 510,443,518,455,0 581,423,598,433,0 614,417,623,428,0 588,460,599,469,0 590,483,601,496,0 623,482,630,497,0 518,482,533,492,0 522,496,532,506,0 602,505,593,497,0 377,4,392,16,0 448,20,460,26,0 443,3,453,8,0 630,12,625,0,0 633,24,637,29,0
data/train/20180610_113327.jpg 534,219,544,228,0
data/train/20180610_113613.jpg 137,167,144,179,0 173,166,182,173,0 212,163,223,169,0 290,158,299,166,0 326,155,338,164,0 510,17,517,26,0 528,18,536,26,0 559,26,567,32,0 557,11,562,18,0 582,215,588,221,0 610,199,617,212,0 409,469,414,482,0 446,467,454,478,0 76,474,84,481,0 584,476,590,483,0 294,481,301,494,0
data/train/20180610_113417.jpg 152,10,162,17,0 184,6,195,18,0 217,6,229,13,0 17,244,23,253,0 134,453,146,461,0
data/train/20180610_113301.jpg 9,248,17,256,0 37,243,47,256,0 174,228,185,239,0 213,222,226,236,0
data/train/20180610_113859.jpg 224,282,230,293,0 262,275,275,287,0 266,322,277,348,0 223,326,241,336,0 226,343,232,353,0 62,295,70,307,0
data/train/20180610_113521.jpg 98,257,111,269,0 177,255,185,272,0 200,184,211,192,0 9,207,16,213,0 31,201,43,208,0
data/train/20180610_113601.jpg 98,4,105,11,0 130,1,137,6,0 159,0,169,4,0 92,29,107,38,0 92,39,101,43,0 128,23,138,34,0 159,24,171,33,0 156,34,166,42,0 13,185,26,195,0 56,181,64,192,0 53,251,60,258,0 89,178,99,187,0 124,175,132,184,0 122,243,128,254,0 159,241,167,254,0 197,239,207,249,0 198,169,207,178,0 459,159,467,168,0 470,226,479,234,0 491,159,497,166,0 520,160,528,167,0 548,158,556,167,0 576,159,582,169,0 577,415,582,423,0 607,469,613,478,0 580,476,588,483,0 522,494,533,502,0 518,429,527,437,0 372,452,382,461,0 333,455,343,464,0 66,467,77,476,0 12,466,25,477,0
data/train/20180610_113807.jpg 502,132,508,140,0 504,149,511,155,0 531,138,536,148,0 532,154,547,161,0 555,123,560,135,0 559,153,568,167,0 584,130,590,138,0 594,156,601,164,0 559,382,564,388,0 585,377,596,384,0 589,438,597,453,0 562,445,572,456,0 393,403,400,410,0
data/train/20180610_113115.jpg 181,261,189,269,0 218,257,228,266,0 338,243,346,252,0 375,239,386,251,0 415,237,421,245,0 493,230,500,238,0 580,223,589,231,0 607,219,614,228,0
data/train/20180610_114013.jpg 4,253,12,261,0 8,298,13,313,0 39,250,49,259,0 74,246,81,254,0 126,244,132,254,0 167,235,172,247,0 390,218,400,228,0 345,226,360,234,0 565,208,581,217,0 439,215,447,225,0 407,268,414,292,0 576,248,581,258,0 582,273,587,282,0 603,207,609,216,0
data/train/20180610_113757.jpg 448,3,454,16,0 454,17,461,26,0 630,6,636,18,0 563,448,569,462,0 533,457,546,469,0 504,465,516,473,0 279,502,287,510,0 506,493,521,505,0 538,491,550,498,0 564,484,577,495,0
data/train/20180610_113841.jpg 89,245,99,257,0 87,290,96,299,0 608,221,612,230,0 607,247,617,256,0
data/train/20180610_113711.jpg 19,259,27,268,0 96,253,104,265,0 87,295,102,309,0 17,301,28,307,0 448,227,454,238,0 408,230,417,239,0 527,430,537,437,0 558,423,569,432,0 587,416,598,427,0 460,441,469,452,0 425,448,438,457,0 387,452,398,462,0 399,466,409,477,0 224,466,237,476,0 57,490,66,497,0 8,493,0,506,0
data/train/20180610_114131.jpg 269,16,280,39,0 496,21,502,32,0
data/train/20180610_113311.jpg 272,499,282,511,0 353,497,363,506,0
data/train/20180610_114219.jpg 70,26,81,42,0 44,38,50,46,0 46,4,58,14,0 19,14,24,21,0 78,2,86,8,0 104,28,112,39,0 246,6,256,17,0 322,7,332,14,0 556,37,564,48,0 607,43,622,54,0 632,51,639,61,0 595,6,608,12,0 619,10,623,18,0 476,235,483,242,0 487,236,494,241,0 507,234,512,239,0 484,277,488,281,0 480,287,492,293,0 500,286,510,295,0 484,303,514,312,0
data/train/20180610_113719.jpg 57,410,70,422,0
data/train/20180610_113611.jpg 16,188,24,198,0 82,184,89,191,0 117,182,126,192,0 342,16,349,26,0 366,17,374,24,0 340,4,348,9,0 402,7,412,14,0 405,20,414,26,0 586,16,589,22,0 593,40,599,44,0 407,233,414,240,0 447,215,456,224,0 538,224,547,235,0 542,205,545,209,0 550,162,557,170,0 567,225,573,232,0 616,220,622,227,0 598,480,605,491,0 188,504,198,509,0 228,506,235,511,0
data/train/20180610_114227.jpg 54,15,61,28,0 84,12,91,14,0 563,49,570,57,0 544,5,560,12,0 93,269,101,277,0 100,328,108,333,0 94,340,102,349,0 214,259,219,269,0 348,256,357,263,0 389,251,398,261,0 430,248,437,257,0 467,248,472,255,0
data/train/20180610_113935.jpg 10,15,5,22,0 398,20,417,40,0 263,18,273,29,0 494,23,501,33,0 498,39,507,46,0 522,25,533,46,0 511,1,517,12,0 484,2,492,7,0 584,472,592,484,0 582,505,596,509,0
data/train/20180610_114249.jpg 391,4,419,13,0 423,4,428,12,0 452,5,457,12,0 399,47,407,57,0 416,44,429,59,0 432,47,439,58,0 460,47,469,58,0 568,15,573,21,0 592,18,600,25,0 600,33,607,45,0 613,19,621,24,0 607,60,616,67,0 581,58,590,64,0 462,243,470,254,0 474,240,482,248,0 472,306,484,320,0 491,303,498,313,0 577,302,583,307,0 564,234,572,243,0 595,234,604,247,0 601,294,613,305,0
data/train/20180610_113257.jpg 390,171,399,182,0 447,241,459,252,0 487,236,502,249,0 629,221,639,231,0
data/train/20180610_113353.jpg 609,7,619,16,0
data/train/20180610_114157.jpg 23,39,39,44,0 15,72,37,90,0 304,19,317,27,0 303,36,318,45,0 77,273,85,283,0 88,273,93,283,0 72,316,85,326,0 89,313,99,323,0 474,494,482,500,0
data/train/20180610_113211.jpg 139,282,149,289,0 300,268,312,278,0
data/train/20180610_113103.jpg 7,295,17,304,0 356,251,373,263,0 373,250,384,259,0 386,247,397,259,0 401,246,422,256,0 533,164,547,171,0 635,218,639,224,0
data/train/20180610_113421.jpg 315,181,328,196,0 349,180,362,191,0 402,217,412,232,0 518,413,529,425,0 577,462,588,472,0 604,455,614,465,0 494,12,503,19,0 519,14,529,24,0 543,18,555,24,0 583,4,590,12,0
data/train/20180610_114045.jpg 621,22,636,34,0 623,8,606,5,0
data/train/20180610_113549.jpg 101,183,112,191,0 139,180,156,189,0 225,173,242,185,0 268,173,285,182,0 353,166,367,179,0 395,167,406,175,0 484,15,492,26,0 261,7,275,15,0 274,5,284,16,0 113,17,126,29,0 148,7,159,17,0 147,26,159,34,0
data/train/20180610_114017.jpg 8,253,17,258,0 42,247,43,258,0 132,237,136,252,0 171,236,177,244,0 131,286,142,293,0 134,312,142,317,0 354,221,365,231,0 364,269,381,299,0 416,266,421,273,0 401,215,410,226,0
data/train/20180610_113441.jpg 53,231,63,239,0 115,225,129,236,0 154,221,163,234,0 232,216,243,226,0 550,197,560,206,0 526,129,540,138,0 15,502,25,511,0 372,507,381,511,0 410,499,422,509,0
data/train/20180610_114053.jpg 607,22,614,29,0 619,43,624,53,0 23,34,17,21,0
data/train/20180610_113647.jpg 10,256,19,265,0 38,253,49,264,0 71,249,77,258,0 9,289,21,299,0 4,304,17,310,0 39,285,48,299,0 69,287,84,299,0 69,304,79,312,0 25,459,34,468,0 54,461,66,471,0 121,465,131,473,0 409,453,420,464,0 450,445,461,461,0 488,441,503,453,0 525,434,536,447,0 561,428,573,440,0
data/train/20180610_113551.jpg 5,179,17,187,0 322,1,332,9,0 357,1,367,6,0 361,12,368,21,0 458,7,469,18,0 466,6,477,19,0 615,8,624,17,0 624,33,633,43,0 446,156,463,167,0 485,156,497,168,0 547,159,558,169,0 576,160,587,170,0 330,158,344,168,0 374,158,387,169,0
data/train/20180610_114259.jpg 90,33,94,37,0 85,56,95,71,0 207,44,213,58,0 204,16,213,23,0 237,13,242,19,0 268,8,277,15,0 270,37,283,49,0 404,4,411,13,0 407,28,414,34,0 440,30,447,39,0 434,5,441,8,0 567,233,569,241,0 568,269,577,280,0 500,238,510,244,0 467,241,476,247,0 430,242,438,254,0 437,309,447,318,0 473,306,481,315,0 273,252,283,257,0 274,314,283,332,0 234,315,243,328,0 198,322,202,332,0 212,317,229,326,0 200,255,228,265,0 234,254,244,261,0 578,494,585,504,0
data/train/20180610_114207.jpg 464,204,476,218,0 411,90,421,100,0 451,94,462,99,0 476,92,486,105,0 546,93,559,99,0 614,96,619,103,0 629,95,635,102,0
data/train/20180610_113623.jpg 568,195,592,209,0 618,191,629,202,0
data/train/20180610_113445.jpg 124,163,134,173,0 130,231,144,241,0 441,161,453,170,0 479,165,492,179,0 620,203,629,214,0 498,447,510,458,0 532,442,541,452,0
data/train/20180610_113119.jpg 4,277,12,284,0 31,274,41,282,0 62,271,68,277,0 133,260,144,269,0 244,246,253,255,0 282,243,292,251,0 421,439,432,448,0
data/train/20180610_113617.jpg 98,246,110,258,0 315,161,336,172,0 506,157,517,165,0 538,161,544,167,0 563,158,573,171,0 462,446,479,456,0 31,478,46,487,0
data/train/20180610_113811.jpg 473,212,483,217,0 517,208,526,217,0 527,242,534,253,0 480,250,489,257,0 444,250,459,257,0 443,233,455,241,0 404,232,421,239,0 407,249,420,259,0 497,497,511,501,0 463,505,474,509,0
data/train/20180610_113431.jpg 529,219,539,228,0
data/train/20180610_113435.jpg 393,202,379,213,0 418,200,427,210,0 612,187,621,197,0 574,422,586,434,0 634,409,639,422,0
data/train/20180610_113947.jpg 244,246,255,256,0 326,231,336,240,0 249,288,254,303,0 457,235,468,248,0 469,279,477,288,0 563,227,576,239,0 596,229,604,238,0 531,232,541,241,0
data/train/20180610_113913.jpg 600,483,608,491,0
data/train/20180610_113235.jpg 436,171,451,180,0 627,172,636,181,0
data/train/20180610_113625.jpg 252,277,279,291,0 311,278,320,293,0 585,277,597,286,0 504,495,516,509,0
data/train/20180610_113209.jpg 66,253,76,262,0 603,222,611,228,0
data/train/20180610_113455.jpg 136,13,146,22,0 124,184,137,192,0 102,253,113,261,0 231,174,243,185,0 261,170,281,178,0 321,167,336,178,0 558,154,570,165,0 586,153,598,164,0 572,218,581,226,0 599,217,611,226,0 626,214,636,224,0
data/train/20180610_114217.jpg 48,19,59,34,0 122,12,126,19,0 378,23,386,34,0 449,23,463,31,0 481,32,496,37,0 517,31,525,42,0 244,238,254,250,0 259,238,268,245,0 280,236,284,247,0 247,287,254,293,0 247,296,256,304,0 268,297,276,307,0 248,315,260,326,0 267,316,280,328,0 590,225,597,233,0 561,225,569,235,0 530,227,533,236,0 592,261,603,272,0 596,284,607,294,0
data/train/20180610_113843.jpg 381,255,390,266,0 379,233,393,241,0
data/train/20180610_113905.jpg 583,430,594,437,0 583,441,594,454,0
data/train/20180610_113345.jpg 41,16,52,27,0
data/train/20180610_113245.jpg 24,16,31,25,0 50,12,59,18,0 35,263,43,272,0 288,249,296,261,0 455,242,465,249,0
data/train/20180610_113051.jpg
data/train/20180610_113059.jpg 148,221,160,232,0 396,261,409,272,0 472,248,484,260,0
data/train/20180610_113201.jpg 482,1,494,8,0 538,6,545,16,0
data/train/20180610_113109.jpg 13,224,18,231,0 114,280,125,288,0 152,275,163,282,0
data/train/20180610_114009.jpg 36,249,44,262,0 104,242,116,248,0 39,295,51,309,0 110,282,119,292,0 109,305,123,313,0 418,211,428,220,0 461,207,470,213,0 503,203,510,215,0 422,255,442,265,0 472,252,483,266,0
data/train/20180610_113439.jpg 251,212,263,224,0 329,207,343,219,0 372,205,383,216,0 449,201,462,213,0 325,138,336,149,0 571,472,581,481,0 603,463,609,475,0 402,499,391,508,0 365,499,354,511,0
data/train/20180610_114137.jpg 77,22,80,28,0 107,17,111,22,0 139,8,144,19,0 179,7,184,11,0 219,7,210,1,0 131,53,146,66,0 177,33,186,55,0 216,25,217,44,0 587,235,594,246,0
data/train/20180610_113247.jpg 30,16,41,24,0 58,11,67,19,0 68,259,77,271,0 216,252,228,261,0
data/train/20180610_113251.jpg 344,166,352,177,0 434,234,445,245,0 473,231,483,241,0
data/train/20180610_113501.jpg 24,187,32,197,0 51,183,62,191,0 187,166,197,177,0 259,159,269,167,0 263,227,273,241,0 301,223,314,234,0 188,236,199,246,0 48,247,58,259,0 79,245,87,255,0 21,251,26,260,0
data/train/20180610_113641.jpg 104,478,120,489,0 411,463,424,476,0 531,448,541,459,0 567,439,577,452,0 615,216,627,225,0 625,248,638,261,0 343,236,357,244,0 377,235,387,241,0 347,285,362,292,0 373,278,389,288,0 212,247,221,253,0 612,504,622,511,0
data/train/20180610_114205.jpg 44,86,51,93,0 140,62,148,69,0 142,97,152,117,0 136,369,153,377,0 132,411,152,437,0 196,401,213,433,0
data/train/20180610_113233.jpg 249,99,262,107,0 481,94,492,105,0 595,101,603,111,0
data/train/20180610_113955.jpg 44,305,52,314,0 78,303,83,315,0 46,342,58,352,0 46,365,57,380,0 72,342,88,371,0 183,294,189,303,0 605,251,612,259,0 620,289,628,322,0
data/train/20180610_114313.jpg 32,264,39,275,0 107,261,117,271,0 71,263,81,271,0 104,333,111,341,0 139,329,150,338,0 141,297,151,319,0 215,294,225,303,0 140,256,150,267,0 210,254,222,263,0 413,281,421,289,0 408,237,415,247,0 384,15,400,32,0 429,14,444,42,0 462,21,474,39,0 582,159,593,170,0 592,223,600,231,0 618,193,626,205,0 609,161,613,172,0 621,216,629,224,0
data/train/20180610_113753.jpg 103,16,110,27,0 384,6,396,1,0 452,21,461,29,0 450,7,458,17,0
data/train/20180610_114113.jpg 202,18,212,26,0 585,187,593,194,0 597,218,603,228,0 600,236,608,250,0
data/train/20180610_113703.jpg 31,247,40,255,0 11,252,0,261,0 9,291,0,301,0 200,471,206,477,0 238,467,247,479,0 280,462,291,476,0 621,411,632,421,0
data/train/20180610_113425.jpg 169,229,180,243,0 207,229,217,239,0 13,3,20,12,0 628,175,635,182,0 424,495,432,506,0
data/train/20180610_113633.jpg 29,452,41,464,0 224,458,238,473,0 266,458,280,472,0 308,454,323,468,0 436,444,446,455,0
data/train/20180610_113111.jpg 361,248,371,256,0 578,224,585,231,0 608,223,613,230,0
data/train/20180610_114257.jpg 199,36,206,48,0 200,66,207,83,0 326,34,337,44,0 392,38,397,48,0 330,61,339,80,0 394,63,409,79,0 511,46,519,52,0 537,48,543,56,0 546,72,552,83,0 517,71,530,82,0 339,283,371,291,0 376,279,383,290,0 342,350,351,357,0 356,347,378,357,0 380,347,387,353,0 413,345,427,353,0 411,281,421,285,0 550,273,559,282,0 579,271,587,280,0 587,329,596,343,0 560,333,568,345,0
data/train/20180610_113635.jpg 81,496,91,507,0 114,499,125,508,0 150,500,160,509,0 269,502,282,511,0 540,243,552,252,0 516,264,528,271,0 519,286,532,298,0 358,301,368,308,0 541,278,558,292,0 585,256,601,270,0 588,277,604,289,0 512,42,519,51,0 543,41,552,52,0
data/train/20180610_113339.jpg 237,269,248,276,0
data/train/20180610_113825.jpg 34,254,43,266,0 102,247,115,263,0 34,294,48,305,0 101,316,113,333,0 103,303,116,315,0 319,231,328,243,0 322,290,335,302,0
data/train/20180610_113933.jpg 209,12,221,38,0 74,31,84,37,0 322,15,332,22,0 321,28,334,38,0 355,12,366,25,0 356,29,365,38,0 568,471,575,476,0
data/train/20180610_113405.jpg 275,480,288,491,0 318,477,327,486,0 355,472,367,482,0 162,7,169,15,0 129,12,138,18,0 69,19,78,26,0 515,12,524,18,0 541,15,549,21,0 566,17,572,26,0 588,22,597,29,0 633,30,639,36,0
data/train/20180610_113145.jpg 416,219,424,226,0
data/train/20180610_113153.jpg 59,285,67,294,0 626,236,634,245,0
data/train/20180610_114145.jpg 64,52,78,59,0 61,91,73,103,0 157,33,161,37,0 549,253,558,262,0 554,293,564,314,0
data/train/20180610_114225.jpg 384,30,391,37,0 117,256,127,265,0 156,252,163,262,0 198,253,206,261,0 242,249,248,257,0 3,262,14,269,0 601,32,617,44,0 629,34,638,48,0 614,8,626,15,0 594,5,598,8,0
data/train/20180610_113915.jpg 116,220,124,234,0 156,222,168,230,0 122,259,132,282,0 89,464,100,474,0 184,462,189,470,0 224,461,235,468,0 189,505,197,511,0 103,506,114,511,0
data/train/20180610_113203.jpg 61,237,69,245,0 131,231,141,239,0 583,5,594,14,0 627,17,631,22,0
data/train/20180610_113713.jpg 233,234,242,244,0 196,236,200,241,0 410,438,418,448,0 368,444,381,452,0 332,449,343,459,0 254,452,267,461,0 219,455,231,463,0 180,454,192,464,0 195,486,202,472,0 36,454,50,466,0
data/train/20180610_113315.jpg 525,198,535,210,0 597,197,607,204,0
data/train/20180610_113415.jpg 524,408,533,417,0 564,465,575,474,0 593,458,600,467,0 12,21,21,29,0 41,19,54,26,0
data/train/20180610_113619.jpg 0,247,12,259,0 33,245,46,258,0 318,226,331,236,0 504,151,521,159,0 247,465,261,476,0 627,399,636,413,0
data/train/20180610_113457.jpg 52,187,61,197,0 75,185,89,192,0 131,178,138,186,0 139,8,147,16,0 201,1,211,9,0 381,157,389,165,0 417,155,426,165,0 387,225,395,235,0 421,224,435,232,0 459,222,469,227,0 554,150,563,158,0 567,213,578,223,0 625,209,634,220,0
data/train/20180610_113325.jpg 521,473,531,482,0
data/train/20180610_113659.jpg 39,249,51,257,0 73,246,82,254,0 40,291,48,298,0 73,284,82,291,0 72,305,81,311,0 193,235,209,242,0 187,276,211,286,0 451,211,461,221,0 459,250,469,264,0 332,461,342,474,0 288,462,298,479,0 201,471,213,482,0 161,472,179,485,0 88,471,98,476,0 54,468,61,475,0
data/train/20180610_114307.jpg 116,270,128,278,0 112,308,131,317,0 148,267,161,278,0 149,302,157,315,0 270,256,277,271,0 19,56,28,59,0 17,80,22,90,0 46,45,53,55,0 43,70,47,84,0 345,256,357,261,0 311,254,314,263,0 273,296,286,312,0 347,288,359,307,0 610,494,618,504,0
data/train/20180610_113255.jpg 17,275,27,282,0 45,272,52,280,0 542,162,548,168,0 597,228,605,239,0 627,224,635,232,0
data/train/20180610_113857.jpg 623,442,632,451,0
data/train/20180610_113925.jpg 142,11,150,32,0 393,4,407,24,0 330,15,343,26,0 327,2,338,6,0 486,5,504,19,0 11,254,17,263,0 5,252,2,262,0 21,301,13,307,0 8,296,3,312,0
data/train/20180610_113101.jpg 171,279,184,289,0 251,264,265,275,0 581,210,594,219,0 594,210,601,216,0 601,207,612,218,0 607,203,628,216,0
data/train/20180610_113451.jpg 94,16,101,24,0 134,3,140,10,0 220,1,227,8,0 55,262,66,269,0 120,289,129,303,0 156,287,165,296,0 192,285,204,297,0 268,244,278,256,0 502,226,513,236,0 514,160,524,169,0 603,157,611,166,0 625,156,637,167,0
data/train/20180610_114311.jpg 5,268,14,272,0 4,296,12,316,0 230,248,243,258,0 320,245,330,252,0 325,314,333,326,0 363,312,375,325,0 359,239,370,250,0 434,238,448,245,0 441,273,458,289,0 613,262,622,272,0 608,226,616,236,0 603,22,613,39,0 566,15,582,32,0 616,4,623,6,0 626,21,633,34,0
data/train/20180610_113609.jpg 160,30,168,37,0 159,15,169,22,0 188,3,197,8,0 187,28,194,34,0 230,27,237,31,0 230,14,237,19,0 547,43,552,51,0 563,44,568,55,0 557,20,562,27,0 555,0,562,12,0 452,7,463,14,0 538,17,543,23,0 604,172,611,178,0 613,229,620,237,0 464,236,472,247,0 382,172,393,178,0 353,245,364,251,0 396,243,401,248,0 361,221,368,231,0 244,233,253,244,0 194,253,202,261,0 636,412,638,422,0 620,483,626,489,0
data/train/20180610_113527.jpg 208,465,220,475,0
data/train/20180610_113443.jpg 29,16,38,22,0 312,153,324,163,0 325,222,337,233,0 27,247,36,257,0 604,165,616,174,0 633,168,639,177,0
data/train/20180610_113227.jpg 83,16,92,25,0 568,24,576,32,0 590,27,598,35,0
data/train/20180610_113447.jpg 228,173,241,186,0 266,175,279,189,0 432,213,444,222,0 510,241,522,254,0 542,238,552,251,0 573,236,582,247,0 624,203,633,211,0 286,466,299,479,0 325,463,334,476,0 120,182,132,194,0
data/train/20180610_113845.jpg 155,293,164,302,0 153,316,165,332,0 532,203,540,208,0 537,214,543,222,0
data/train/20180610_113135.jpg 261,75,269,83,0 626,73,631,79,0
data/train/20180610_113819.jpg 130,250,139,260,0 169,244,180,253,0 136,285,149,311,0 331,234,346,248,0 336,281,349,298,0 339,311,347,318,0 628,217,638,231,0 509,11,527,21,0
data/train/20180610_113627.jpg 93,334,114,345,0 137,333,150,346,0 433,327,445,335,0 624,238,637,249,0
data/train/20180610_113949.jpg 67,261,77,267,0 68,296,77,309,0 73,319,78,329,0 137,247,147,255,0 261,244,275,256,0 278,293,280,299,0 390,234,393,253,0 540,223,547,236,0 551,265,563,295,0
data/train/20180610_114153.jpg 380,16,392,43,0 402,21,408,37,0 103,274,109,282,0 104,322,115,333,0 531,242,540,251,0 545,243,551,250,0 536,282,552,297,0 558,283,567,295,0
data/train/20180610_113121.jpg 16,206,25,213,0 45,202,57,209,0 177,396,187,405,0 502,417,511,424,0
data/train/20180610_113453.jpg 58,22,71,31,0 147,8,156,16,0 325,159,336,173,0 301,235,311,245,0 75,252,89,262,0 18,291,26,300,0 434,158,442,166,0 462,157,478,166,0 516,155,526,163,0 598,5,588,1,0
data/train/20180610_113505.jpg 332,236,344,247,0 371,233,384,242,0 410,230,421,241,0 448,227,458,237,0 520,225,531,235,0 581,219,592,227,0 603,218,611,225,0 612,216,621,226,0
data/train/20180610_113331.jpg 136,235,147,245,0 408,497,417,506,0
data/train/20180610_113851.jpg 175,7,182,33,0 210,6,220,19,0
data/train/20180610_114129.jpg 117,23,126,31,0 114,49,130,76,0 473,19,480,46,0 173,268,179,279,0 46,486,58,494,0
data/train/20180610_113329.jpg 318,212,331,223,0 126,492,134,503,0 574,455,583,466,0
data/train/20180610_113411.jpg 107,475,117,487,0 370,1,377,8,0 398,0,411,10,0 428,4,438,12,0 515,12,525,22,0 565,19,572,26,0 583,22,591,31,0
data/train/20180610_113803.jpg 350,3,360,18,0 383,7,398,15,0 416,9,423,17,0 453,5,463,21,0 420,217,430,230,0 453,216,468,225,0 462,283,471,292,0 428,286,439,292,0 225,229,238,236,0 269,228,278,236,0 436,499,447,511,0 480,502,491,511,0
data/train/20180610_113605.jpg 93,25,102,33,0 89,54,99,62,0 200,46,208,58,0 198,14,207,26,0 222,14,231,23,0 218,44,228,53,0 242,16,245,22,0 431,19,435,24,0 442,43,449,48,0 468,44,480,53,0 458,19,468,26,0 487,22,494,30,0 495,46,507,53,0 570,241,576,248,0 554,178,561,185,0 498,180,505,191,0 468,181,473,193,0 436,184,441,188,0 448,248,452,257,0 513,246,518,251,0 542,242,548,248,0 392,184,402,192,0 358,187,367,194,0 248,193,255,202,0 239,262,253,272,0 45,277,54,284,0 471,456,479,466,0 414,468,431,475,0 382,474,392,483,0 263,492,279,499,0
data/train/20180610_113541.jpg 1,198,10,209,0 336,177,344,188,0 372,175,381,185,0 445,173,457,185,0 461,205,473,217,0 520,195,528,202,0 629,177,639,184,0 544,42,557,52,0 536,11,545,21,0 474,5,485,13,0 484,28,495,44,0 531,428,538,439,0 512,501,526,511,0 283,472,298,480,0 324,467,334,478,0 359,462,372,472,0
data/train/20180610_114229.jpg 49,41,57,50,0 54,14,59,23,0 306,244,311,259,0 422,241,432,246,0 316,306,323,313,0 309,321,319,324,0 539,232,546,242,0 570,233,578,239,0 600,231,606,238,0 627,230,636,239,0
data/train/20180610_114155.jpg 191,10,197,21,0 200,13,208,16,0 217,8,220,16,0 184,42,193,61,0 200,44,212,62,0 507,24,517,29,0 508,39,518,43,0 300,265,308,271,0 314,262,320,272,0 303,307,314,324,0 323,310,330,318,0
data/train/20180610_114245.jpg 37,39,64,45,0 66,36,75,42,0 97,31,103,39,0 32,88,36,93,0 43,83,55,92,0 60,81,66,89,0 92,76,96,87,0 232,14,239,22,0 231,64,238,71,0 265,14,272,22,0 268,62,274,71,0 364,13,369,21,0 366,38,374,44,0 611,29,619,38,0 630,32,639,41,0 620,52,624,61,0 392,256,400,264,0 396,298,410,317,0 207,340,212,345,0 201,265,211,278,0 163,269,171,281,0 166,343,177,349,0 52,339,72,349,0 53,278,59,286,0 62,278,69,287,0
data/train/20180610_113317.jpg 295,243,304,253,0 385,239,394,249,0 578,496,586,506,0
data/train/20180610_113403.jpg 4,16,12,23,0 91,459,103,471,0 131,461,139,473,0 165,461,175,470,0
data/train/20180610_113523.jpg 44,203,54,211,0 21,268,27,280,0 19,279,29,287,0 16,11,23,20,0
data/train/20180610_113901.jpg 273,233,281,245,0 432,221,444,233,0 469,217,476,226,0 434,264,448,273,0 437,278,447,289,0 471,258,480,282,0
data/train/20180610_114119.jpg 513,59,519,66,0 513,35,531,43,0 553,62,561,72,0 529,61,544,72,0 625,48,630,56,0 576,183,590,190,0 592,225,601,233,0 514,424,522,433,0
data/train/20180610_113259.jpg 142,158,150,165,0 184,226,196,235,0 224,220,234,231,0 389,206,399,216,0 432,203,441,211,0
data/train/20180610_113817.jpg 357,245,367,255,0 360,284,373,306,0 395,244,404,247,0 543,232,552,241,0 550,278,563,292,0
data/train/20180610_114031.jpg 71,47,86,57,0 68,71,81,91,0 567,243,579,256,0
data/train/20180610_114143.jpg 190,26,203,49,0
data/train/20180610_113241.jpg 489,274,500,285,0 278,4,291,12,0 422,5,431,11,0 455,6,465,14,0 611,25,620,31,0
data/train/20180610_113509.jpg 215,231,228,239,0 204,232,213,238,0 177,232,188,242,0 103,238,114,248,0 38,244,46,253,0 9,246,17,256,0
data/train/20180610_113231.jpg 92,92,104,103,0 319,82,329,93,0 451,85,463,94,0
data/train/20180610_113427.jpg 13,257,22,269,0 114,249,125,257,0 151,245,162,257,0 189,239,203,251,0 386,228,400,243,0 424,229,437,239,0 164,5,154,0,0 98,14,91,6,0
data/train/20180610_113409.jpg 593,399,603,410,0 614,393,624,403,0
data/train/20180610_114107.jpg 49,208,38,204,0 195,16,188,10,0 44,277,37,251,0
data/train/20180610_114309.jpg 83,272,92,282,0 83,306,96,326,0 117,269,124,279,0 149,269,161,277,0 148,303,162,327,0 419,252,429,259,0 503,246,511,256,0 537,243,544,253,0 512,314,518,327,0 545,311,554,323,0 604,275,620,286,0 600,241,610,249,0 547,294,556,298,0
data/train/20180610_113553.jpg 78,179,91,190,0 117,174,131,188,0 198,169,211,180,0 511,162,519,172,0 541,162,552,173,0 593,163,605,173,0 618,162,628,174,0 586,33,603,43,0 578,5,592,15,0 482,17,489,27,0 511,17,519,27,0 83,22,93,31,0 49,27,58,36,0 13,47,25,55,0 21,0,36,8,0 579,505,590,511,0
data/train/20180610_114123.jpg 206,271,213,283,0 364,58,388,68,0 363,13,384,22,0 469,18,477,26,0 500,21,508,26,0 477,66,485,75,0 510,66,518,78,0 629,468,638,478,0
data/train/20180610_113701.jpg 204,233,211,245,0 206,277,216,291,0 58,469,64,484,0 90,472,101,484,0 472,444,482,458,0 503,441,517,452,0
data/train/20180610_113133.jpg 424,40,436,48,0
data/train/20180610_114215.jpg 183,36,191,43,0 262,28,277,37,0 302,31,314,38,0 339,31,347,37,0 560,31,578,39,0 552,3,564,9,0 403,235,419,246,0 367,238,376,245,0 323,238,331,248,0 409,278,422,289,0 406,302,419,321,0 39,259,45,269,0 48,259,55,269,0 68,261,74,266,0 34,304,46,321,0 53,312,62,323,0 37,332,64,339,0
data/train/20180610_113341.jpg 418,226,429,237,0
data/train/20180610_113355.jpg 519,496,530,508,0 586,481,597,489,0
data/train/20180610_114237.jpg 1,61,8,68,0 29,52,36,60,0 18,79,31,87,0 121,62,130,74,0 122,36,128,46,0 183,29,191,36,0 180,51,190,65,0 485,16,492,23,0 510,16,520,23,0 500,58,507,68,0 526,62,536,66,0 575,45,585,54,0 564,22,572,29,0 5,294,10,304,0 3,336,16,360,0 224,274,233,284,0 228,348,238,362,0 343,269,351,278,0 383,267,392,275,0 424,263,432,273,0 459,259,470,269,0 468,326,481,337,0 503,257,515,267,0 513,298,524,318,0 538,251,544,262,0
data/train/20180610_114003.jpg 49,256,61,272,0 18,260,25,272,0 167,244,173,256,0 51,300,66,335,0 163,285,184,319,0 556,211,566,223,0
data/train/20180610_114005.jpg 339,231,346,237,0 465,216,477,230,0 546,211,554,225,0 556,254,570,264,0 558,278,570,287,0 480,269,492,291,0
data/train/20180610_113923.jpg 210,3,226,16,0 144,12,155,26,0 145,4,154,11,0
data/train/20180610_113603.jpg 61,18,67,26,0 83,14,88,21,0 52,48,63,55,0 71,41,83,49,0 99,14,104,19,0 96,42,101,49,0 293,21,307,28,0 292,29,299,36,0 328,16,341,28,0 357,18,370,27,0 359,29,366,39,0 86,185,92,196,0 76,255,83,265,0 191,174,197,184,0 224,172,236,179,0 274,168,281,178,0 280,239,287,248,0 310,168,318,176,0 348,164,356,173,0 356,235,364,243,0 391,229,400,239,0 427,227,437,236,0 418,158,427,168,0 627,154,632,164,0 576,411,584,419,0 547,418,556,427,0 581,475,589,484,0 608,467,617,475,0 553,484,559,493,0 303,461,310,468,0 238,464,252,474,0 204,467,215,475,0 96,470,103,479,0
data/train/20180610_113951.jpg 61,267,67,278,0 92,265,100,275,0 126,264,134,269,0 164,257,172,268,0 202,253,210,264,0 320,244,329,255,0 331,296,338,313,0 453,233,463,244,0 491,231,501,243,0 501,268,511,296,0 461,270,478,286,0 463,301,478,316,0
data/train/20180610_113745.jpg 38,248,51,259,0 623,28,635,45,0 617,9,622,14,0 608,31,614,39,0 584,27,593,36,0 502,9,514,19,0 503,22,508,26,0 574,486,579,498,0 601,482,611,492,0
data/train/20180610_114037.jpg 521,24,530,31,0 220,161,229,173,0
data/train/20180610_114235.jpg 17,46,23,56,0 13,69,23,94,0 303,18,312,25,0 337,18,344,26,0 309,63,313,69,0 342,62,349,71,0 408,43,418,52,0 400,19,408,29,0 554,54,559,61,0 544,31,549,37,0 320,265,328,274,0 283,272,292,282,0 292,314,299,317,0 291,328,299,336,0 330,308,337,332,0 233,341,248,352,0 231,271,238,281,0 191,272,206,285,0 152,275,166,285,0 19,281,26,288,0 14,343,21,356,0
data/train/20180610_113305.jpg 259,169,274,181,0 305,167,317,176,0
data/train/20180610_114035.jpg 339,15,357,27,0
data/train/20180610_113459.jpg 4,37,11,46,0 53,27,67,34,0 78,20,86,27,0 105,13,116,22,0 194,174,205,181,0 231,167,240,177,0 386,155,396,165,0 460,152,467,161,0 503,216,514,226,0 467,220,479,227,0 395,224,406,235,0 233,238,242,247,0 269,234,283,244,0 193,239,209,252,0
data/train/20180610_114255.jpg 477,81,485,99,0 489,115,498,123,0 489,127,501,134,0 596,76,605,85,0 610,104,619,124,0 622,76,628,83,0
data/train/20180610_113215.jpg 69,23,76,30,0 98,18,111,26,0 231,1,238,8,0 264,0,273,6,0 538,234,547,243,0
data/train/20180610_113741.jpg 544,491,552,498,0 451,224,459,238,0 124,12,130,22,0 129,3,138,13,0 253,8,240,2,0 287,7,277,1,0 324,9,312,1,0 570,483,580,489,0
data/train/20180610_113657.jpg 225,236,234,249,0 267,232,279,241,0 227,284,237,292,0 269,272,277,281,0 271,296,281,300,0 404,262,428,274,0 399,219,424,232,0 630,203,638,212,0 538,441,551,451,0 500,450,508,461,0 418,461,427,474,0 373,468,385,481,0 284,477,296,488,0 241,481,250,491,0
data/train/20180610_113519.jpg 281,245,292,256,0 366,243,374,254,0 364,255,375,262,0 383,172,394,182,0 131,192,139,199,0 163,188,172,197,0
data/train/20180610_114125.jpg 169,56,180,67,0 182,52,189,63,0 175,10,182,17,0 187,7,194,18,0 281,3,290,11,0 317,2,326,8,0 282,49,289,61,0 314,45,329,61,0 478,1,494,10,0 490,31,507,45,0 588,252,599,260,0 447,478,460,489,0
data/train/20180610_113143.jpg 13,9,23,15,0 212,236,222,246,0
data/train/20180610_113927.jpg 189,249,197,257,0 203,247,209,256,0 216,247,224,256,0 205,297,213,307,0 221,296,229,305,0 555,28,564,50,0 334,18,345,32,0 541,2,549,5,0 609,14,616,17,0 622,33,628,44,0 500,24,507,26,0 602,490,609,503,0
data/train/20180610_113223.jpg 254,1,266,5,0 289,0,298,5,0 319,245,327,256,0
data/train/20180610_113721.jpg 529,149,537,160,0
data/train/20180610_113815.jpg 113,247,126,258,0 120,285,131,297,0 72,253,82,262,0 69,288,83,304,0 36,276,51,287,0 38,293,54,304,0 6,291,17,302,0 8,273,20,278,0 549,219,552,233,0 552,261,566,277,0
data/train/20180610_113937.jpg 171,6,181,17,0 563,22,572,41,0 622,11,626,15,0 632,33,636,38,0 557,6,549,2,0
data/train/20180610_113705.jpg 17,474,3,482,0 37,474,50,482,0 71,473,83,482,0 605,207,611,219,0 558,426,563,433,0 568,456,580,467,0 624,430,631,442,0 479,439,491,453,0 443,447,454,460,0
data/train/20180610_113743.jpg 497,22,488,9,0 459,9,468,17,0 429,6,439,13,0 317,8,327,13,0 538,499,523,507,0
data/train/20180610_114149.jpg 58,276,65,284,0 90,277,99,283,0 87,314,97,333,0 260,267,272,274,0 220,269,232,280,0 526,248,534,253,0 537,298,547,306,0
data/train/20180610_113313.jpg 77,506,85,511,0
data/train/20180610_114321.jpg 160,15,172,28,0 188,11,196,23,0 225,8,234,15,0 419,218,430,229,0 378,223,391,235,0 423,286,438,303,0
data/train/20180610_113747.jpg 244,226,252,231,0 484,507,478,509,0 96,20,103,31,0 621,26,628,38,0 611,1,620,8,0 627,0,632,6,0
data/train/20180610_114317.jpg 64,36,73,46,0 98,29,109,37,0 129,24,139,35,0 123,51,129,67,0 98,54,104,76,0 59,60,76,84,0 39,271,48,284,0 37,309,45,316,0 216,255,227,268,0 256,222,266,231,0 256,187,264,199,0 216,190,231,196,0 256,247,264,257,0 502,24,512,40,0 491,0,501,7,0 519,1,527,7,0 529,27,538,39,0 549,3,557,11,0 563,33,571,37,0
data/train/20180610_114247.jpg 217,18,242,24,0 251,16,257,24,0 284,15,294,23,0 287,58,298,70,0 253,61,260,71,0 215,67,223,74,0 232,63,251,74,0 432,56,437,62,0 422,9,430,17,0 452,10,459,17,0 464,56,471,65,0 536,12,543,21,0 547,38,552,46,0 592,238,598,246,0 603,279,611,289,0 429,255,441,260,0 390,255,399,263,0 265,265,273,273,0 279,264,286,272,0 271,334,288,344,0 288,328,300,337,0 400,325,410,337,0 438,320,445,332,0
data/train/20180610_114133.jpg 90,22,100,29,0 84,54,98,75,0 299,37,310,47,0 516,29,527,48,0 555,21,563,38,0 580,20,592,35,0
data/train/20180610_113839.jpg 304,220,312,232,0 311,264,319,282,0
data/train/20180610_113835.jpg 45,157,53,166,0 42,195,51,205,0 41,221,47,235,0 37,285,44,302,0 38,240,51,244,0 74,226,84,239,0 119,224,124,234,0 79,150,92,159,0 115,272,128,294,0 74,289,83,296,0
data/train/20180610_113941.jpg 628,319,638,327,0 600,341,609,347,0 626,350,632,357,0 602,354,612,363,0 572,361,579,368,0 575,341,581,349,0 601,324,608,330,0
data/train/20180610_114117.jpg 436,17,444,24,0 558,486,564,492,0
data/train/20180610_113621.jpg 193,235,222,248,0 248,232,262,242,0 522,216,532,227,0 470,437,481,449,0 507,499,523,511,0 572,484,586,497,0
data/train/20180610_113833.jpg 178,153,183,162,0 186,195,191,202,0 181,211,190,220,0 176,224,181,232,0 177,236,182,242,0 136,242,141,250,0 141,283,144,292,0 134,303,144,307,0 273,147,279,154,0 273,186,282,193,0 276,206,288,209,0 276,214,285,222,0 277,228,285,232,0 287,284,282,293,0 329,284,339,292,0 325,222,333,235,0 369,221,382,228,0 374,264,385,288,0
data/train/20180610_113557.jpg 83,158,94,168,0 156,149,168,161,0 118,154,129,162,0 193,146,209,155,0 235,144,251,153,0 505,135,514,144,0 533,134,546,145,0 590,137,601,146,0 81,229,93,242,0 141,458,151,468,0 222,455,237,466,0 413,4,421,13,0 453,8,444,0,0 484,6,476,1,0
data/train/20180610_114303.jpg 56,30,64,38,0 51,59,61,68,0 81,31,93,36,0 79,57,88,62,0 171,15,177,27,0 168,43,169,47,0 303,4,309,11,0 230,14,239,17,0 233,32,239,39,0 339,27,349,35,0 333,1,342,8,0 369,4,371,9,0 498,236,504,240,0 529,232,537,244,0 493,271,513,281,0 532,268,543,279,0 627,226,636,236,0 540,497,551,508,0 159,292,167,302,0 161,253,172,265,0 196,254,201,264,0 94,258,103,266,0 63,261,73,269,0 63,295,71,302,0 36,264,44,270,0 33,326,46,336,0 59,323,72,331,0
data/train/20180610_113849.jpg 118,217,123,228,0 116,232,127,239,0 419,3,429,21,0 381,3,396,20,0
data/train/20180610_113347.jpg 146,0,159,8,0 222,1,232,7,0
data/train/20180610_114033.jpg 121,8,133,23,0 592,201,603,213,0 618,201,626,207,0
data/train/20180610_113437.jpg 463,126,475,139,0 535,125,545,138,0 564,128,578,139,0 403,427,414,437,0 513,413,522,426,0 545,408,558,424,0 576,404,588,417,0 631,130,639,143,0 524,62,539,72,0
data/train/20180610_113739.jpg 598,11,608,20,0 277,223,289,237,0
data/train/20180610_113821.jpg 119,254,127,264,0 114,301,129,320,0 123,331,117,341,0 453,226,466,236,0 460,262,478,277,0 328,238,346,247,0 530,221,539,232,0 538,271,543,281,0 543,291,548,303,0 318,4,344,16,0
data/train/20180610_113159.jpg 573,216,579,227,0 395,1,406,5,0
data/train/20180610_113733.jpg 78,6,85,15,0 556,497,564,509,0 613,475,626,486,0
data/train/20180610_113655.jpg 7,260,1,269,0 28,257,34,266,0 109,249,116,257,0 446,223,453,236,0 484,220,494,231,0 450,266,460,281,0 488,261,499,271,0 494,282,500,286,0 595,215,607,225,0 600,254,614,262,0 608,432,615,443,0 574,438,583,452,0 500,456,511,466,0 461,462,472,476,0 117,483,127,493,0 47,481,61,492,0 16,479,23,490,0
data/train/20180610_113303.jpg 23,258,34,269,0 494,143,505,154,0 530,144,541,152,0
data/train/20180610_114213.jpg 52,41,69,54,0 64,1,78,6,0 88,41,103,52,0 123,36,138,46,0 379,12,391,24,0 157,243,171,252,0 156,291,168,326,0 532,219,539,228,0 617,216,625,228,0 629,253,636,275,0 120,247,129,257,0
data/train/20180610_113205.jpg 262,224,272,236,0 337,222,345,229,0
data/train/20180610_113643.jpg 99,241,109,250,0 126,241,136,247,0 99,286,109,302,0 120,283,134,291,0 391,217,404,229,0 431,214,446,225,0 469,212,484,224,0 402,251,412,270,0 440,254,453,263,0 473,252,493,264,0 479,268,488,279,0 157,466,172,482,0 275,463,297,476,0 317,459,336,469,0 417,449,428,464,0 456,444,474,456,0 536,434,547,443,0 537,504,550,511,0
data/train/20180610_114231.jpg 16,23,23,29,0 69,14,76,24,0 65,39,77,46,0 4,71,14,75,0 226,22,233,29,0 505,234,513,243,0 524,289,530,294,0 512,299,523,305,0 596,231,604,234,0
data/train/20180610_114159.jpg 112,12,123,20,0 104,42,113,68,0 547,16,562,33,0 586,245,595,255,0 587,287,600,304,0
data/train/20180610_114327.jpg 71,27,83,41,0 78,4,83,11,0 192,5,211,17,0 167,12,174,24,0 85,243,94,254,0 55,246,64,256,0 27,248,34,259,0 54,291,63,302,0 84,290,100,305,0 117,296,132,308,0 119,241,129,253,0 271,226,285,237,0 267,273,286,287,0 358,216,368,233,0 357,265,370,277,0 620,204,630,213,0 631,267,639,284,0
data/train/20180610_113419.jpg 125,188,138,201,0 163,185,172,196,0 210,225,220,235,0 346,434,357,445,0 424,491,435,502,0 459,487,469,495,0 616,8,608,2,0 414,6,407,0,0 384,6,373,1,0 352,5,342,0,0
data/train/20180610_113827.jpg 96,252,104,264,0 97,312,109,321,0
data/train/20180610_113645.jpg 166,239,179,251,0 204,238,217,248,0 243,234,259,245,0 170,279,180,288,0 210,278,222,288,0 245,276,261,287,0 248,294,253,301,0 68,464,80,476,0 102,468,113,477,0 153,469,160,477,0 188,469,196,476,0 228,469,239,479,0 309,466,320,476,0 592,424,602,436,0 598,494,607,506,0 628,415,632,428,0
data/train/20180610_113537.jpg 38,203,47,213,0 44,233,54,245,0 114,214,122,227,0 294,179,304,193,0 443,174,453,181,0 453,190,463,196,0 471,172,484,182,0 501,172,509,181,0 552,170,563,182,0 576,172,587,178,0 598,169,608,180,0 98,7,112,13,0 178,0,189,7,0 136,485,147,494,0 172,25,185,39,0 95,32,107,42,0
data/train/20180610_114147.jpg 325,251,333,258,0 325,289,339,316,0 506,236,512,245,0 280,251,288,264,0
data/train/20180610_113503.jpg 17,3,27,7,0 9,42,15,50,0 13,271,21,276,0 15,206,20,213,0 74,196,82,205,0 68,262,78,273,0 102,260,111,269,0 518,226,528,235,0 554,225,562,233,0 584,223,593,233,0 614,221,623,228,0
data/train/20180610_113137.jpg 131,164,139,172,0 544,121,552,126,0
