# Created at 2021-10-28T20:31:14.648
org.testng.TestNGException: 
Listener demoMavenUtility.AnnoatationTransformer was not found in project's classpath
	at org.testng.TestNG.addListeners(TestNG.java:966)
	at org.testng.TestNG.initializeConfiguration(TestNG.java:930)
	at org.testng.TestNG.initializeEverything(TestNG.java:1018)
	at org.testng.TestNG.run(TestNG.java:1029)
	at org.apache.maven.surefire.testng.TestNGExecutor.run(TestNGExecutor.java:284)
	at org.apache.maven.surefire.testng.TestNGXmlTestSuite.execute(TestNGXmlTestSuite.java:75)
	at org.apache.maven.surefire.testng.TestNGProvider.invoke(TestNGProvider.java:119)
	at org.apache.maven.surefire.booter.ForkedBooter.runSuitesInProcess(ForkedBooter.java:428)
	at org.apache.maven.surefire.booter.ForkedBooter.execute(ForkedBooter.java:162)
	at org.apache.maven.surefire.booter.ForkedBooter.run(ForkedBooter.java:562)
	at org.apache.maven.surefire.booter.ForkedBooter.main(ForkedBooter.java:548)


