C:\Users\vijayma\eclipse-workspace\demoMaven\src\test\java\demoMaven\Listeners\TestListener.java
C:\Users\vijayma\eclipse-workspace\demoMaven\src\test\java\demoMaven\Reporting\ExtentTestManager.java
C:\Users\vijayma\eclipse-workspace\demoMaven\src\test\java\demoMaven\TestCases\Sample.java
C:\Users\vijayma\eclipse-workspace\demoMaven\src\test\java\demoMaven\Reporting\ExtentManager.java
C:\Users\vijayma\eclipse-workspace\demoMaven\src\test\java\demoMaven\Utility\RetryMechanism.java
C:\Users\vijayma\eclipse-workspace\demoMaven\src\test\java\demoMaven\Utility\AnnoatationTransformer.java
