%YAML 1.1
%TAG !u! tag:unity3d.com,2011:
--- !u!162 &1
EditorUserSettings:
  m_ObjectHideFlags: 0
  serializedVersion: 4
  m_ConfigSettings:
    RecentlyUsedSceneGuid-0:
      value: 00520c0400500f5d59585c7a467a5b4414164c7e7f292731752a4a30bbb3626a
      flags: 0
    RecentlyUsedSceneGuid-1:
      value: 5505500256030b08080f5d27117a0c44414f4d7f2f7027657a2f1b65e7e26768
      flags: 0
    RecentlyUsedSceneGuid-2:
      value: 5002005553510a0a0b0a092646260644154f4b7a79792335297d4831b2b76c6b
      flags: 0
    RecentlyUsedSceneGuid-3:
      value: 5a005550550c590f555e5e7b4077074442164b287f787169282f1e60e1b1616f
      flags: 0
    RecentlyUsedSceneGuid-4:
      value: 00540c075c075e5d0b5f5e2640210c444716192c2a2b73362e7e4460b7b83761
      flags: 0
    RecentlyUsedSceneGuid-5:
      value: 0753575e01540a5f5e5d087213255e44404e492b2d7b25347d7c1b35b3b56d39
      flags: 0
    vcSharedLogLevel:
      value: 0d5e400f0650
      flags: 0
  m_VCAutomaticAdd: 1
  m_VCDebugCom: 0
  m_VCDebugCmd: 0
  m_VCDebugOut: 0
  m_SemanticMergeMode: 2
  m_DesiredImportWorkerCount: 4
  m_StandbyImportWorkerCount: 2
  m_IdleImportWorkerShutdownDelay: 60000
  m_VCShowFailedCheckout: 1
  m_VCOverwriteFailedCheckoutAssets: 1
  m_VCProjectOverlayIcons: 1
  m_VCHierarchyOverlayIcons: 1
  m_VCOtherOverlayIcons: 1
  m_VCAllowAsyncUpdate: 1
  m_ArtifactGarbageCollection: 1
