function [y1] = fonction_matrices_solution(x1)
%MYNEURALNETWORKFUNCTION neural network simulation function.
%
% Auto-generated by MATLAB, 25-Oct-2021 00:54:46.
%
% [y1] = myNeuralNetworkFunction(x1) takes these arguments:
%   x = Qx4 matrix, input #1
% and returns:
%   y = Qx1 matrix, output #1
% where Q is the number of samples.

%#ok<*RPMT0>

% ===== NEURAL NETWORK CONSTANTS =====

% Input 1
x1_step1.xoffset = [384.7;36;1019.43;83.03];
x1_step1.gain = [0.00366918617450649;0.0656167979002625;0.0954198473282436;0.125234815278647];
x1_step1.ymin = -1;

% Layer 1
b1 = [1.9766430327792570143;3.7153613161618226357;0.38303703994543791822;-2.027036688064336456];
IW1_1 = [0.13328347296274470346 1.9962519279657799931 -0.035330731227004412431 -0.3400606133312287227;6.5306689763370497914 -0.10242395960358652296 -0.22211572642980351167 0.24832611127429304876;-1.098029355855874023 0.47775157243730614898 -0.8100432003163503536 -0.23477626190090028491;-0.60347858642656060368 0.99700873177381432733 -0.9378878213646331119 -1.2678401009722035653];

% Layer 2
b2 = -0.55615209167914247956;
LW2_1 = [-0.31635074198892310093 8.164442550258129927 -2.0324320831644060448 -0.081842746654680248453];

% ===== SIMULATION ========

% Dimensions
Q = size(x1,1); % samples

% Input 1
x1 = x1';
xp1 = mapminmax_apply(x1,x1_step1);

% Layer 1
a1 = tansig_apply(repmat(b1,1,Q) + IW1_1*xp1);

% Layer 2
a2 = logsig_apply(repmat(b2,1,Q) + LW2_1*a1);

% Output 1
y1 = a2;
y1 = y1';
end

% ===== MODULE FUNCTIONS ========

% Map Minimum and Maximum Input Processing Function
function y = mapminmax_apply(x,settings)
y = bsxfun(@minus,x,settings.xoffset);
y = bsxfun(@times,y,settings.gain);
y = bsxfun(@plus,y,settings.ymin);
end

% Sigmoid Positive Transfer Function
function a = logsig_apply(n,~)
a = 1 ./ (1 + exp(-n));
end

% Sigmoid Symmetric Transfer Function
function a = tansig_apply(n,~)
a = 2 ./ (1 + exp(-2*n)) - 1;
end
