<?xml version="1.0" encoding="UTF-8"?>
<beans xmlns="http://www.springframework.org/schema/beans"
	xmlns:xsi="http://www.w3.org/2001/XMLSchema-instance"
	xsi:schemaLocation="http://www.springframework.org/schema/beans http://www.springframework.org/schema/beans/spring-beans-3.0.xsd"
	default-lazy-init="true" >

 	<!-- Process LOG bean -->
	<bean id="processLogRepositoryJDBCForBR"
		class="com.example.connect.database.repository.log.ProcessLogRepositoryJDBC">
		<constructor-arg ref="dataSourceBR" />
	</bean>
	

</beans>