D:\work-cognizant\application-booking-rest-api\src\main\java\com\ar\toyota\rest\api\service\UserController.java
D:\work-cognizant\application-booking-rest-api\src\main\java\com\ar\toyota\rest\api\security\RestAuthenticationEntryPoint.java
D:\work-cognizant\application-booking-rest-api\src\main\java\com\ar\toyota\rest\api\security\RestAuthenticationSuccessHandler.java
D:\work-cognizant\application-booking-rest-api\src\main\java\com\ar\toyota\rest\api\SpringSecurityConfig.java
D:\work-cognizant\application-booking-rest-api\src\main\java\com\ar\toyota\rest\api\WebConfig.java
D:\work-cognizant\application-booking-rest-api\src\main\java\com\ar\toyota\rest\api\entity\User.java
