{
 "roots": {
  "bookmark_bar": {
   "children": [ ],
   "description": "Bookmarks located in Bookmarks Toolbar",
   "expanded": true,
   "expanded_sidebar": true,
   "name": "Bookmarks Toolbar",
   "type": "folder"
  },
  "bookmark_menu": {
  "children": [
  {
   "description": "",
   "keyword": "astian",
   "name": "Astian, Inc",
   "type": "url",
   "url": "https://astian.org/",
   "visit_count": 0
  },
  {
  "description": "",
  "keyword": "expedia",
  "name": "Expedia",
  "type": "url",
  "url": "https://ww55.siteplug.com/sssdomweb?enk=6dcb5e1882081e781dfea2fda5e6f34dced4b6a43c77e30c51d582b994f202498fe0f1c6fca5e818e36e8f9d48a6b2da19ab4a07a125566e059ffb046ea460ca624088d3c99c3f60",
  "visit_count": 0
  }
  ],
   "description": "Bookmarks located in Bookmarks Menu",
   "expanded": true,
   "expanded_sidebar": true,
   "name": "Bookmarks Menu",
   "type": "folder"
  },
  "other": {
   "children": [],
   "description": "All other bookmarks",
   "expanded": true,
   "expanded_sidebar": true,
   "name": "Unsorted Bookmarks",
   "type": "folder"
  }
 },
 "version": 1
}
