runid                 	all	nop
num_q                 	all	162
num_ret               	all	1620
num_rel               	all	1600
num_rel_ret           	all	291
map                   	all	0.0977
gm_map                	all	0.0037
Rprec                 	all	0.1796
bpref                 	all	0.1796
recip_rank            	all	0.3192
iprec_at_recall_0.00  	all	0.3502
iprec_at_recall_0.10  	all	0.3502
iprec_at_recall_0.20  	all	0.2426
iprec_at_recall_0.30  	all	0.1823
iprec_at_recall_0.40  	all	0.1173
iprec_at_recall_0.50  	all	0.0677
iprec_at_recall_0.60  	all	0.0409
iprec_at_recall_0.70  	all	0.0153
iprec_at_recall_0.80  	all	0.0062
iprec_at_recall_0.90  	all	0.0062
iprec_at_recall_1.00  	all	0.0062
P_5                   	all	0.1975
P_10                  	all	0.1796
P_15                  	all	0.1198
P_20                  	all	0.0898
P_30                  	all	0.0599
P_100                 	all	0.0180
P_200                 	all	0.0090
P_500                 	all	0.0036
P_1000                	all	0.0018
recall_5              	all	0.0988
recall_10             	all	0.1796
recall_15             	all	0.1796
recall_20             	all	0.1796
recall_30             	all	0.1796
recall_100            	all	0.1796
recall_200            	all	0.1796
recall_500            	all	0.1796
recall_1000           	all	0.1796
infAP                 	all	0.0977
gm_bpref              	all	0.0071
Rprec_mult_0.20       	all	0.2068
Rprec_mult_0.40       	all	0.1944
Rprec_mult_0.60       	all	0.1893
Rprec_mult_0.80       	all	0.1852
Rprec_mult_1.00       	all	0.1796
Rprec_mult_1.20       	all	0.1497
Rprec_mult_1.40       	all	0.1283
Rprec_mult_1.60       	all	0.1123
Rprec_mult_1.80       	all	0.0998
Rprec_mult_2.00       	all	0.0898
utility               	all	-6.4074
11pt_avg              	all	0.1259
binG                  	all	0.1011
G                     	all	0.0498
ndcg                  	all	0.1797
ndcg_rel              	all	0.1861
Rndcg                 	all	0.1620
ndcg_cut_5            	all	0.1685
ndcg_cut_10           	all	0.1797
ndcg_cut_15           	all	0.1797
ndcg_cut_20           	all	0.1797
ndcg_cut_30           	all	0.1797
ndcg_cut_100          	all	0.1797
ndcg_cut_200          	all	0.1797
ndcg_cut_500          	all	0.1797
ndcg_cut_1000         	all	0.1797
map_cut_5             	all	0.0641
map_cut_10            	all	0.0977
map_cut_15            	all	0.0977
map_cut_20            	all	0.0977
map_cut_30            	all	0.0977
map_cut_100           	all	0.0977
map_cut_200           	all	0.0977
map_cut_500           	all	0.0977
map_cut_1000          	all	0.0977
relative_P_5          	all	0.1975
relative_P_10         	all	0.1796
relative_P_15         	all	0.1796
relative_P_20         	all	0.1796
relative_P_30         	all	0.1796
relative_P_100        	all	0.1796
relative_P_200        	all	0.1796
relative_P_500        	all	0.1796
relative_P_1000       	all	0.1796
success_1             	all	0.1667
success_5             	all	0.5185
success_10            	all	0.6543
set_P                 	all	0.1796
set_relative_P        	all	0.1796
set_recall            	all	0.1796
set_map               	all	0.0688
set_F                 	all	0.1796
num_nonrel_judged_ret 	all	0
