runid                 	all	nop
num_q                 	all	162
num_ret               	all	1620
num_rel               	all	1600
num_rel_ret           	all	291
map                   	all	0.0977
gm_map                	all	0.0037
Rprec                 	all	0.1796
bpref                 	all	0.1796
recip_rank            	all	0.3192
iprec_at_recall_0.00  	all	0.3502
iprec_at_recall_0.10  	all	0.3502
iprec_at_recall_0.20  	all	0.2426
iprec_at_recall_0.30  	all	0.1823
iprec_at_recall_0.40  	all	0.1173
iprec_at_recall_0.50  	all	0.0677
iprec_at_recall_0.60  	all	0.0409
iprec_at_recall_0.70  	all	0.0153
iprec_at_recall_0.80  	all	0.0062
iprec_at_recall_0.90  	all	0.0062
iprec_at_recall_1.00  	all	0.0062
P_5                   	all	0.1975
P_10                  	all	0.1796
P_15                  	all	0.1198
P_20                  	all	0.0898
P_30                  	all	0.0599
P_100                 	all	0.0180
P_200                 	all	0.0090
P_500                 	all	0.0036
P_1000                	all	0.0018
