2738.483435582822
1632.1815181518152
6544.575679462034
2519.5162337662337
1577.5737051792828
1423.645739910314
3734.6402048655573
1834.9829059829058
7178.864940517846
4179.057938299473
3553.414296134209
3375.8027649769588
4762.031867431485
3815.495184997466
7565.001120936605
7550.007262569831
4677.370843989771
2058.4567164179107
3281.4286926994905
3961.389659520807
3794.398959236773
3131.9375
2131.5042735042734
3405.464895635673
4234.226271186441
3962.8688783570296
16806.860201241703
9509.189887379542
4059.9962462462463
2446.4963235294117
1497.322206095791
5759.6615092290995
3757.565674255692
6452.735542168674
6643.716618635926
6726.7582513028365
5784.211739594451
2689.666167664671
5745.016885942194
2443.5428388746805
4019.4365325077397
6841.908333333334
4640.383773928897
1840.942307692308
3357.6008303677345
3900.7502396931927
2924.822120285423
4385.511766162992
4253.566365007541
4647.233285509326
3512.4556962025317
2754.602287166455
4326.71875
2740.810941828255
14649.860580325547
6546.678640401699
1865.4532871972322
5308.761519302615
2947.176845459373
2796.46783625731
1709.5148741418766
1808.1188004613612
11972.205236768803
3351.380188679245
12403.466835187055
940.453744493392
2454.950937950938
5160.609876543211
4832.2926235212235
3079.246963562753
3260.5938547486035
1072.3385416666667
4155.275933609959
1507.576388888889
2998.71875
2105.9665427509294
2755.034917555771
7749.171681415929
2965.523070641078
2972.081996434937
2903.968421052632
2903.968421052632
4072.562919463088
1738.375366568915
8035.880647194789
3353.580404354588
2325.5611814346
7675.30539725109
4656.042396834368
3429.212121212121
4349.532043530834
4326.9974779319045
4310.91736066624
1985.2269129287602
4045.214285714286
2355.4233009708732
1962.4628099173556
7605.119228118539
3292.2104377104383
8585.623216351716
21715.94424807198
1423.3290734824284
3887.864936793081
2754.2023399862355
1840.8947368421047
3424.367408906883
3622.3843941028413
3860.0953177257534
9028.909367816093
2863.3606403013177
1971.7602862254025
1615.4697986577182
2788.9432773109247
2176.41638225256
1762.8665254237287
1726.9484978540772
3005.1636253041356
2437.0291666666667
3387.0925737538146
2296.8976
5834.511879049676
1798.0580357142858
5172.668585526316
2466.345195729537
3609.469994391475
8038.979027012677
2515.079501915709
5965.481971465629
995.1798941798943
2685.151283205764
3053.885936487363
1874.6646586345387
2132.562189054727
2320.3599348534203
