-2.84147758270795
-3.180040905088898
-2.7888374276030974
-2.5489768453368606
-2.2419193122948036
-2.8485478248755305
-3.103829363829992
-2.710839203479863
-2.4579691513808473
-2.859327740676556
-2.940919602271115
-3.1266366919641135
-2.512511451964237
-3.2514711871558264
-2.7556488878427223
-2.447817390380578
-3.3817068729598434
-3.041916199859338
-3.3514330718180747
-2.604506862479992
-3.07183726847978
-2.841884628597707
-3.4008525724552894
-3.269995818021849
-3.696132928147737
-3.4766836439195696
-3.3075872173488183
-2.989350085076948
-3.122968878218881
-2.8602069777863086
-3.0299692946346934
-3.573998490248735
-3.6074467297394253
-3.27299910406826
-3.247822700028278
-2.429794482091479
-2.2769148316350067
-2.859041725956142
-3.5030004232669554
-2.9280715940252637
-2.684096715164218
-2.3168402082988746
-3.251487962254249
-2.976524452818776
-3.10087045482054
-2.3343343715503835
-3.0322730519679486
-2.4878180221063344
-2.4927720831472198
-2.4344955667948445
-2.293800610999261
-3.4242102596737203
-3.326500271183919
-3.056721443664446
-2.8211749534343897
-2.3168346285510677
-2.452858492343343
-2.6294956866442774
-3.342347046196427
-2.8221805892849314
-2.1763241731365075
-3.0372257511929304
-2.9177089473503313
-2.8003089812474533
-2.9291213038518946
