38.0
40.0
39.0
47.0
41.0
26.0
30.0
34.0
33.0
51.0
65.0
64.0
70.0
90.0
37.0
61.0
67.0
32.0
43.0
68.0
76.0
74.0
43.0
48.0
47.0
54.0
83.0
68.0
66.0
51.0
52.0
55.0
44.0
63.0
68.0
57.0
41.0
43.0
76.0
77.0
83.0
83.0
64.0
46.0
43.0
37.0
42.0
52.30000000000018
46.0
44.0
49.0
46.0
47.0
39.0
39.0
37.0
38.0
49.0
40.0
61.0
52.0
54.0
51.0
51.0
49.0
37.0
46.0
50.0
49.0
51.0
49.0
41.0
29.0
47.0
45.0
39.0
37.0
43.0
59.0
49.0
45.0
45.0
36.0
24.0
54.0
41.0
57.0
41.0
44.0
30.0
28.0
44.0
32.0
26.0
49.0
57.0
61.0
49.0
36.0
39.0
40.0
35.0
38.0
38.0
35.0
32.0
44.0
36.0
55.0
56.0
50.0
51.0
41.0
34.0
43.0
48.0
43.0
41.0
46.0
45.0
48.0
51.0
53.0
70.0
71.0
53.0
36.0
36.0
30.0
32.0
35.0
43.0
41.0
45.0
