0.9347692307692308
0.939586983065244
0.8943971108860675
0.914366920326396
0.8964278964278963
0.9106280193236718
0.8913131723158106
0.9359386594113284
0.924483125570082
0.9306061552340308
0.9286879848844868
0.9284157768577032
0.9275215512786056
0.9187293326828208
0.9206389119692132
0.9105160026126716
0.9396151452778708
0.9239326804221736
0.9072622194346132
0.9288091715976332
0.9385135135135136
0.9425243770314194
0.9223512336719883
0.8971083660864683
0.9038062283737024
0.9190716180371352
0.922221379915312
0.9169229692894294
0.93331148018648
0.9384967166979362
0.9322775263951736
0.9311989560600266
0.9399282259322828
0.9283498759305212
0.9247103134187821
0.9206706315048124
0.9093042236278309
0.8881614839061647
0.922131128062546
0.914717882376356
0.908491643309457
0.9021587602852844
0.9220589537045232
0.9366710875331564
0.9176520159060384
0.9074986224975372
0.9195712850284696
0.9320886725731016
0.9226314479252652
0.9133550346274004
0.9143474503025064
0.9265266766659525
0.9135722297656296
0.9359043546847108
0.8997854734906526
0.8943346422694017
0.9091415830546266
0.9226338018417226
0.9108095118211156
0.9272559852670351
0.9271051204585951
0.9276572355851024
0.8696116329149189
0.9023572303239452
0.8787499092031671
0.9237935977066412
0.9288307418316324
0.9262414800389482
0.8953736036049088
0.8966642113016944
0.89409442684257
0.9388322520852642
0.8960969714204463
0.923919146546884
0.9285293250810492
0.9307500479570306
0.9318523718784474
0.9432463864429308
0.9223390040086956
0.930565010211028
0.908947445684087
0.9154288240495136
0.8858618233618235
0.9317546698043828
0.8969435059322701
0.9122025278957244
0.9193397695421986
0.9175933737249788
0.92228519724027
0.9290279920652414
0.9410815516252998
0.9257606622045464
0.9015759564122092
0.92221477152984
0.9232142039994508
0.9165855241804608
0.9243253625276098
0.8930756843800322
0.9063391944747876
0.8828132475679126
0.8748748181320031
0.9275464596565514
0.9092085075659578
0.9087611452622252
0.9085891686788548
0.9255699867304676
0.8905231800409606
0.8910762292949441
0.9046479875298458
0.93290214278661
0.9284199813417012
0.927455845861918
0.937070938215103
0.9412087912087912
0.9013026528477704
0.9403017010805608
0.9275913275913276
0.9112568104164744
0.9260542413251772
0.9630248978075066
0.9036137208847131
0.9198902363459326
0.9364786324786324
0.9516129032258066
0.9359177407957896
0.9224838293886732
0.9306809262166404
0.9506134434960056
0.9616773118578172
0.946750840595622
0.9431323393587546
0.9324255665074688
0.922408555109977
0.9418137785991968
