2.234309570619052
2.0077777900404676
2.10159980077039
1.9735061010524997
1.7109626362254373
1.7110610611527672
2.037907021257204
2.165161709824605
2.4524794476333405
2.304161552472104
2.121002566692235
2.0887723667351232
2.1874997982450184
2.1648088092311824
2.3359473647726743
2.3424577365199015
2.3767221099550504
2.0335592485665352
2.00238936119678
2.0718255984992524
2.055892474202151
2.0187402998298163
2.0045811113749914
1.9636165589504226
2.059632619111774
2.100020178454822
2.6411897800076773
2.4083191730994526
2.191552263416322
2.154986607458991
1.8593391453627026
2.2560713871313074
2.275343962708972
2.331244437121218
2.3182661412082597
2.253032312593907
2.147034030531836
1.7456004303377317
2.188651642604978
1.955846087462492
2.097524481896661
2.1190691140447444
2.110358964350659
2.0992115247616936
2.1517815407654335
2.079080130298969
2.1121524205397266
2.2900028691689966
2.1595703461905313
2.172844330387012
2.0317646483627883
2.154082394760913
2.2060926469327407
2.0539788283727423
2.385390464462944
2.0424825194365206
1.8408493361861302
2.213037139377188
2.101321247560887
2.106880197191807
1.8831294779261654
2.0147289467385074
2.188668338282993
2.026303400609856
2.182406499686639
1.5207143792842912
2.0593089501077833
2.262879076738214
2.079863606360458
1.9827600534648981
2.0409672915296793
1.6973543213144673
1.8978030759916953
1.8422493393669859
2.070980678202547
1.8999147629742734
2.15589166314688
2.4735014975115632
2.141699202510014
2.089909052955979
1.9400820186453005
1.9400820186453005
1.7983830923592525
1.7380066800957137
2.1415989640328243
1.9882891278122374
1.8530619796854404
2.228116449530247
2.184074324480619
2.1722790708334254
2.361739455378705
2.078829053955061
2.137930700266719
2.041119659896762
2.1759469949744448
1.9791394519560594
2.031611147979712
2.096660778668923
1.955257146555625
2.1764686412218155
2.2308325734448653
2.0407412957678903
2.1276758456592875
1.8637405255214157
1.9319688227959388
2.101208400190847
1.8849818112428065
1.85203331410742
2.251968467227346
2.105264311037947
1.9898826163105885
2.0061472683136636
2.1800001440612844
2.1480251713663794
1.6775009426578824
2.0411167629159053
2.1609917652617776
1.9226208687352178
2.1939250334308387
2.0392726580899683
2.2155254994049125
1.884583650788803
2.3356615477471734
2.2660663165378523
2.244943790061308
2.4375710908037154
1.9882233950328763
2.5670113814991082
2.14064280818837
2.2889547091625277
2.3256976461412253
1.9642888291161942
1.9634516217659648
2.0774617084832787
