1.7663273544757936
1.7569451081591743
1.9344179120636116
1.7154674898900586
1.7554298928119534
1.7572918759614933
1.7714550808522298
1.786121732077207
1.7935643277029971
1.7800383851449437
1.7898262049769347
1.737335035552347
1.7945312747671007
1.7757499674878852
1.8602656680641032
1.7438765210214158
1.8008539436123965
1.8155787471538765
1.6506326764719863
1.809124472951189
1.9024156370529548
1.8527175206596938
1.853860011337141
1.849289508401739
1.8548912776787647
1.760362836270249
1.8217873101308286
1.9460764309297467
1.870558118391112
1.9184530963880555
1.7326493950225945
1.8251250809398971
1.8696097586602913
1.8498686308507604
1.8637914001064735
1.7770051869750862
1.670101674160287
1.7554298928119534
1.8666170629107999
1.793300666946842
1.749878522920914
1.7601524331176126
1.8621610346345538
1.8472311685175762
1.8690287713604905
1.7627791409179405
1.807009122206394
1.7414542052191981
1.824427022646356
1.7647448909891288
1.727690836930179
1.9277786791024822
1.8320403847150364
1.7956307672533007
1.7309164432973818
1.7057592846525353
1.7421365835399207
1.8495601153281833
1.665385212271716
1.8450438369097546
1.7691339109039712
1.889326270490845
1.760362836270249
1.8728757976904291
1.7554298928119534
