547.0
657.0
671.0
766.0
757.1
597.0
763.3
856.0
1029.0
407.7000000000001
693.4000000000002
683.8
1066.0
753.0
861.0
701.0
816.4
873.8
765.0
750.0
944.0
861.6000000000001
788.0
1083.7
590.0
715.2
1003.8
756.0
871.0
782.0
556.0
867.4000000000002
706.0
725.5999999999998
650.5999999999998
836.5
574.8
925.1
961.8
764.5
970.0
793.6
943.0
760.1000000000001
739.9
767.2
846.0
745.0
857.7
983.2
610.8
967.0
724.5
684.6
703.3
793.8
586.3
1233.0
967.3
1386.5
597.0
733.5
843.2
564.3000000000002
987.0
