6.124920322135309
6.298942033651354
7.50235930447068
6.0524461662113875
6.230429284287083
5.8505957695664765
6.076378458959918
5.860825292094592
6.38550098144579
6.291891685801295
6.5110092374288335
6.366940500798656
6.486727583809476
7.091789459148349
7.036503983315562
6.524701238722639
6.471132090701
5.762933573627249
6.316690796172299
6.072883324178388
6.273751364379055
6.213160455563633
6.155575301458382
6.388638566610867
6.58553821696841
6.578142069579555
7.058252948269084
7.466571734144541
6.836674811599808
6.454524812655632
6.723958044579008
7.011538989366007
6.255131226596417
6.478701192519991
6.961806659788416
6.802470838730727
6.7160256840995105
6.2118184576547195
7.289642300936823
6.610249082898178
6.604525474176911
7.375024092369905
6.586370535932449
5.246471013466352
6.472685112219946
6.394022388657882
6.534000055483565
6.815538525685957
7.004451771777291
7.081840766049057
6.579841698126228
7.125442053017211
6.726016651988346
6.742027771158862
6.744316429205976
6.98301797007289
6.143160717136226
7.015541244990412
6.805259922723915
6.626195658945809
6.407053379673688
6.509040703073307
7.510063499270082
6.923964051162633
7.39811981019572
6.360411733324064
6.730452171586814
6.732706329517245
7.021398768634053
6.806199801464854
6.7246861147663815
6.182151971209309
6.632847507931075
5.673013974973405
5.458795562578786
6.0028456118862366
5.857444551380176
6.121849061472805
6.530420126156965
6.4029738037796085
6.80830433168982
6.262226282304927
6.501526214036082
6.217951416720791
7.316070333237249
6.970845653147881
5.457019700100163
6.916427328184278
6.925819477446651
6.314063556626481
6.629294873004984
6.408454538973134
6.5335681324405135
5.946454008709056
6.278932134270712
5.8753683127021
5.815228084287444
6.701706344482514
6.394022388657882
6.799896317019332
7.052213459222589
5.516751793231867
6.126277291804593
6.390932692041823
5.983633601284999
6.280271514594992
6.677954442177838
6.006575874846498
7.4435197990167135
6.532377498648166
6.316086218658709
6.294899627365916
6.101791872145517
5.571895306226575
6.0904178324293206
6.187360885468021
6.476409574608618
6.227864575430671
6.372319250744407
5.9597701060074195
6.914016846230447
6.2176868874728255
6.494206834546353
5.479556172680668
6.372835454981239
7.425031443690477
6.053268644182476
6.992575492263806
6.334560028939231
6.8842021357876915
6.787546633205381
6.242000422351575
6.268495324983978
6.258459512454169
