6.308178998734567
6.3569680807346085
6.865148252275453
5.96333656165096
6.239566439369174
5.313012225422204
5.6440781762633385
5.83349697819394
6.218311915845812
6.615323836608861
6.090292313963483
6.102644642815276
6.420374974217725
7.6285814607116675
6.916837543005358
6.99412512344994
7.064644256267734
6.023188572839143
5.971246680821223
6.290243216355579
6.462490236473307
6.387965497509692
5.8919773133409965
6.120684522267497
6.145661449506631
6.231289028459548
6.964363002591324
7.0375123187826265
6.625914994832266
6.17997886373035
6.153849220147202
6.6717393883066585
5.744932257421565
6.81819032843791
7.006255378195027
6.969587786292061
6.279490117167213
5.368674688197179
6.864414881175778
6.5388530727114285
6.6681025816334465
7.02614117240122
6.404596393346745
5.1132060534761035
6.348403928977523
6.660369874494445
6.235902087879883
6.765519784565887
6.414516727402855
6.543777352403575
6.1672879086316295
6.573343792751182
6.705583673793986
5.876425095736695
6.061406694023818
6.190262164298682
5.581541497716774
6.774769612843213
6.700247839229263
6.707478038225073
6.4644375185546465
6.4024807716014465
6.6924150800686375
6.451409676948465
6.7116858282717375
5.512175033284281
6.039598757727032
6.104115923551659
6.202028579472122
6.2440401451520895
6.112241235100014
5.6779718488338355
5.90137557753243
5.180253888695758
5.707661721059631
5.674542606724796
5.796816495892456
6.4965684444834855
6.1220869819663655
5.90751200266873
6.1987896284710775
5.983991914714284
5.978533695424702
5.668334893178012
6.662397743446292
6.579661151411263
5.851442871269316
6.334646379488597
6.3841842602910726
5.9577083130835184
6.238937985519747
6.625037510281826
6.2009732924922805
5.057624195646052
6.543809424895298
6.286963395918307
6.1102601826995535
6.780594260186647
6.118833484708871
6.4622178647042725
6.6504911607324635
5.322215965880668
5.859337888072981
5.8026568750102365
5.790387389557776
6.055621919867357
6.540950072313933
5.500791376654184
6.934461192144724
6.479980875768371
5.956982599737593
6.266863122703856
6.530443676112504
5.353166379604775
5.685544515057941
6.308430675330428
6.336507531258481
6.012466575720353
6.323777952845139
6.079420289241898
6.933787033970398
6.279809712625357
6.6244231276916885
5.834149317309276
6.856587554880312
7.037816896322306
6.236800479931405
6.553580914746004
5.909803974117647
6.3232051204653
6.231878398410269
6.258375025225513
6.207231758593513
6.321846172528537
