0.4938841552172685
0.5784590275610622
0.3304380049684336
0.24702069358772435
0.3274742048349563
0.3122570633877748
0.4429134234060748
0.537540570957427
0.4584119744660228
0.36515163198319744
0.2302436814873797
0.3266322947764084
0.1248052465174036
0.44985189182023816
0.3092747621451364
0.6653627395863325
0.4351189482648951
0.2556098445304372
0.4949302955624662
0.2705071985719885
0.1909013493193436
0.2719616406796627
0.19470014655595325
0.3418066670154529
0.2164182267097388
0.2720921274774157
0.5212760183919188
0.43284562143347255
0.4751831567289111
0.14971137820528008
0.25525220274989857
0.3582196951857229
0.09973583389509792
0.45808859296131604
0.2278446319242265
0.21311287338549506
0.2982149427102013
0.3247196233263517
0.4292261945571516
0.21941908898927634
0.1351641936027667
0.3314193393652557
0.3512609806518626
0.31806755218433536
0.4700155576627499
0.459169411753873
0.4120712674202479
0.5353213653446885
0.21275785698537647
0.3513630478297425
0.2975854657542273
0.18678665071799352
0.27762581918052986
0.13252855125967294
0.25999119874448035
0.3402666403955292
0.22456345470220446
0.27300346090674543
0.32094840141835856
0.4112776126659489
0.3158833000729377
0.15279797462464392
0.4406784193041559
0.1193607047319094
0.3959322184856783
0.0831666464512212
0.08906851913637008
0.17734292304598134
0.3498094235572997
0.21105923602993332
0.3744036906951353
0.18943450095752648
0.44729389683784543
0.12850368890716254
0.4061207386334594
0.07827680286111625
0.4402951596734243
0.3162070800316167
0.29202813065246863
0.14528058260342416
0.1886695516726456
0.4147001107551296
0.12645940678457487
0.1044373354935882
0.4330551871303249
0.24445698227236284
0.11191041930762592
0.1343612633918013
0.23730036933659684
0.3835508786654796
0.2196602132318293
0.277736556486516
0.3416639937709928
0.3978809875218038
0.32085560304332444
0.4524723438807178
0.4426693285664211
0.4345918926111373
0.1988607086163902
0.8234804582409981
0.5694617922161043
0.12747986721106702
0.31907014690096314
0.21704181055310726
0.3401132195282115
0.2938709370529653
0.2586596456517963
0.39077001706295067
0.2819566113105783
0.2878857854653593
0.08970566711701926
0.09263572516427653
0.40738766162436174
0.21865298485997947
0.376318465822144
0.25146490355058043
0.266946786867968
0.5573017550516792
0.468762386904577
0.008834344663080248
0.4656872804259456
0.3700654995603927
0.4951851155850898
0.4734224122795272
0.2807219892857582
0.4361250821371817
0.1422846560677247
0.4804512642087255
0.19106111631542932
0.28268312123397005
0.2702414520079581
0.21078744794706544
0.3696532037049701
0.09852671570801723
