2.857639377570465
2.61889222633133
3.204948077920013
3.3545479113050582
2.9291020812482778
2.4452475890397496
3.2000756564240858
2.8093219403727825
2.970692796680112
2.677178690236176
3.2670756391383002
3.404263597226679
2.74671572207463
3.362725535582198
3.1974316207983455
2.8665971082361295
2.6847200729941667
2.7209594810940687
2.886605837717359
3.1475282906443174
2.6920866139226316
2.560116569394991
2.681174004527015
3.041066267787333
2.92863991396132
2.7350223407195475
2.8751437528050587
2.914061425035868
2.8444768859836045
2.6568198699893664
2.0296477420573766
2.9010194313847206
2.6650601417512196
2.785898896707241
2.882561274123326
2.7628308626769917
2.9035940296458014
2.6178497437099177
2.3929293582338764
2.4381877863151464
3.219966195695323
3.300256467418832
2.6761970724678967
2.906429833692409
2.821164528941074
2.320250922726806
2.5349686392361925
3.5842475475282902
2.9769223798103246
3.005085203584231
2.4617847384014135
2.881939277068311
2.7322176063054755
2.634377243406311
2.3152834184727697
2.685825947796809
2.9232097315962475
3.213990771498496
2.8971972788515097
3.0383288767367276
3.0474837999217077
2.9091144263560023
2.589084216308859
2.682522203381772
3.2320118157524926
