-5.041397462912083
-4.894677921314092
-7.2235488292748515
-4.9749191259114225
-5.240364228647834
-5.548589554570387
-5.579166453387611
-5.220360371917731
-5.791670526362373
-5.378341225544677
-5.871961589601607
-5.398294489322572
-5.879894227191323
-4.796390033530958
-6.6475464789476915
-5.168970938805003
-5.330569854009085
-5.198847196171735
-3.5713545457953138
-5.940200328792865
-5.905956082770603
-6.0840043503235295
-6.095735654224752
-5.896240993650395
-5.4446790188412795
-4.7737405914794095
-5.727929219593872
-7.192959590896899
-6.272795946265307
-6.820863439112081
-4.0844490763626755
-5.512875715639126
-6.195189675182285
-5.809958981404724
-5.853364381429845
-5.488499011290806
-4.326887205980019
-5.271787990458898
-5.789607225565367
-4.613938566481066
-5.3876468399795305
-3.836098336584175
-6.354786181740726
-6.0318820318278235
-6.3526885017258286
-5.194490390979884
-6.091810051910031
-4.869888551683963
-6.1197866575436715
-5.462565132661608
-4.6961377302181075
-7.4645986254941255
-5.163642003131066
-4.75295696168372
-4.094228601020408
-4.459121268131599
-5.308940596102613
-6.38755601066898
-4.194548126496043
-5.938293322943743
-5.417337838237014
-6.067524529476926
-4.453218493395086
-5.660876163265934
-4.874049813518465
