9.817260190104669
9.220813184731387
9.504511768360693
9.017887685827665
8.490413225792482
8.162848344871836
9.15667718950032
8.273354326952282
9.809385577507257
9.901071225926707
9.07382740450693
8.948638628595141
9.166485154307411
9.904638896898176
9.801358167121206
10.143512895425634
10.308118558454328
8.645763543491594
9.704886802588446
9.7046655885085
9.978325363024904
10.000357478694578
9.166731583198024
9.161361757039517
9.721616769511636
9.97305132497588
10.43696010260179
10.552911240273906
9.931416198852727
9.53635254512062
8.740125004453116
10.20424952477333
9.150086050223916
9.869401399096963
10.154294226667004
9.824250376185855
9.827451967118149
8.5643203770615
10.428625464739484
9.79179949277549
9.161825849218062
10.151631643059293
9.47394186006783
7.657539045241898
9.56260388246001
9.4052252887251
9.555364536967193
10.217571172368721
9.260081465865069
9.3576582552602
8.429784384175912
9.168188655277081
8.948885295763839
9.102617661386764
8.678795406291586
8.819005475967414
8.036153208033985
9.377134068097753
9.188883231402821
9.427642589888912
8.46020768250666
9.135475671861856
9.719787307458098
9.554957378867432
9.497824906119165
7.3092653062011825
9.617511575294275
9.770730847077486
9.365574610377497
9.183476013239053
9.41049305491618
7.462687965215125
9.025379896200407
7.580522055301758
9.067832793972483
8.245710506349429
9.507705815604467
9.809579429656754
9.658178785065008
8.679085772281859
9.297340780975322
9.297340780975322
8.57225522797623
8.388648780346067
9.391538211214495
9.28549205935442
7.906231774482085
9.305248982715533
9.601963221550198
9.06654604412932
9.847782734982918
9.096962723211037
8.849766402470625
8.422890736865911
9.211659765126504
8.844868373812648
8.670781650897581
9.46778678099957
9.161073861497004
9.564777948190788
8.97429488021284
8.194990516443102
9.166319203852376
9.394629474245773
8.478805928181655
9.125119394207164
9.295092940583679
8.912410081458404
9.637057507208198
9.530835012192977
8.887394657786244
8.676749706330062
8.882009325944837
8.421229674566103
8.794768082876196
8.977133653554851
9.604675975628778
8.824024483119182
9.67934500923383
9.051635780750576
9.576511281955328
8.522860335545673
9.738538325738505
8.563274611613085
9.308612180959406
10.142812621016011
8.71553083543693
9.939840622587628
8.779582232584527
9.369140548744816
8.995617412688173
8.87153117386868
9.287308504147983
9.156902496144628
