27.122385408090572
28.636224226099692
100.75006260825964
23.3376090329382
24.685934517047247
15.496700799597814
27.206883348875593
15.36271938824695
30.530958600606947
30.46340846954543
33.27264414554789
31.00845501121612
36.72814323143185
45.69081802920068
55.57006892537946
32.970363705909435
34.140384291885056
21.21383628462673
27.89126943843739
22.125176091509037
27.10190733475404
26.38279775821765
24.177553947487223
29.43299783319685
37.59431751068555
32.03511804534138
60.58312468368806
97.44575020431652
37.49748129397067
31.085957452594446
28.39258734025889
55.1110134608072
28.49328894660398
29.405706099518
46.884695650552295
41.11049182594064
44.30344724970439
25.172497650629893
72.55037573467409
38.34350101468939
36.060384913925795
79.74794386879155
32.98462743572343
13.55258261786725
37.45155939184983
38.320250447231324
34.74274536052054
43.231925176948174
50.604638640130084
51.2457943453794
32.3891019826563
43.557703360199596
40.079845832305566
35.00082835327572
36.162954972665936
46.67517720401376
24.783741907780144
49.40857439839868
47.709175406623075
36.73590567730201
31.23724338249652
44.54533784585415
86.23210977883669
47.313513922084645
89.04776181019011
18.613331241712874
41.725267790367276
39.218979950764435
47.70952184004162
46.53519587390278
39.46472608542045
15.445904451449215
30.592535997817816
13.90516964492448
28.70689956450241
16.84630924468219
24.30773408973728
29.17470876262173
45.772538023654135
26.158409069414848
45.31289679514439
27.65685042810237
35.39549314057085
18.74236674906223
77.95638410362542
56.98995768108821
18.403211197671173
50.666181110553524
61.66170721792414
27.676627884166965
34.804040881423475
31.86541237597183
34.18656955084797
22.023950623085685
27.213656188882407
22.511845893498613
20.145607828263735
42.544908977824825
31.775764686427024
44.67695794935049
60.320214273232715
14.526507852364508
30.444827665497712
31.494094125832127
24.30954642818181
30.109180877274305
44.13782167365152
21.256898225562136
95.02159933402943
30.94755569120367
26.657969291169
21.95831632828452
23.77313337152048
19.58002338444947
19.542625480674747
20.670344690667086
31.096050687756147
23.50176514368617
26.904804763304266
21.31860082910316
39.139210545033606
22.566107055784286
42.838018798610975
17.31446118055855
29.81223154452992
94.78940243121812
29.91721004849772
52.649095835902855
26.040322606352106
45.36615004139253
35.041930842158216
20.86950531458177
22.86858077322389
24.412661670338373
