-0.1764055536590049
-0.20927764376846494
-0.028558520776916337
-0.17673580867440208
-0.129374912114991
-0.28632515866526304
-0.14252998555935215
-0.3807679873488076
-0.11644666058974015
-0.11905250606657525
-0.0946311177619674
-0.13682161801978002
-0.08352686038828099
-0.06376984771139478
-0.03201536775956453
-0.1333010948673891
-0.09659068909156214
-0.13249520238419515
-0.11997505446891228
-0.21267073275394985
-0.19526869061839036
-0.2078377346970036
-0.15379265037649845
-0.10129720926480798
-0.05174864468558206
-0.07978214311981434
-0.11133024204894294
-0.04996001515744603
-0.1575542119879954
-0.14591034931646976
-0.1734707696483429
-0.0694253585806074
-0.17596526111040633
-0.20332530695957646
-0.05707936396083186
-0.08091404503464929
-0.048792573722516164
-0.11559726860981755
-0.06294828274973642
-0.10557616671872123
-0.11752415813655324
-0.041123655990331714
-0.16072932783762187
-0.5007426756528817
-0.09614464753857567
-0.07414113562090065
-0.07578231723967882
-0.10096700530277268
-0.04994548059514329
-0.0556913188056359
-0.08688756141876497
-0.06265711845897592
-0.07504424353750852
-0.1070171288414256
-0.07234933579354838
-0.06053638424997601
-0.1748363407207476
-0.04992914887281514
-0.07380764368769856
-0.16490002962310846
-0.17390593089310366
-0.056095126204804065
-0.04863321163882007
-0.03433229189712525
-0.042060527625837126
-0.26067834159492903
-0.1107153319233769
-0.08414015299267752
-0.06101029256353396
-0.04913586517146944
-0.0862363706181804
-0.3737213113789811
-0.12437358744721334
-0.3139624681734502
-0.19651473171334846
-0.2570621931699665
-0.15712449246314358
-0.1167040204121962
-0.06622750485095649
-0.1563039360635525
-0.045869140301725786
-0.12981713860340574
-0.043633767791756164
-0.21857933760792764
-0.04531654589895783
-0.039533872516833636
-0.20957681545606816
-0.04211920144903174
-0.050207120318557535
-0.09797177894860032
-0.06684815264065598
-0.08266768325638241
-0.06449046288584571
-0.17164556940218295
-0.10524993314857012
-0.1363565969172684
-0.1720766288185877
-0.06971035479049162
-0.06487924196794814
-0.1802067270066029
-0.07438291385349785
-0.24103876254514395
-0.07674018458734846
-0.07406951869323927
-0.12499897355136795
-0.07992266849517579
-0.042791294885369285
-0.15598801154615846
-0.027180057077267502
-0.13914736879686995
-0.17119025680488598
-0.23926795854303096
-0.1971632182536052
-0.23785944471422485
-0.1845943849301741
-0.2338834367823225
-0.08625143201110533
-0.2048012792624392
-0.16058056055085032
-0.540623851309848
-0.06921827633206029
-0.1701533230562236
-0.10145779314625544
-0.3177521047381247
-0.060086597556848385
-0.05057778451159997
-0.09018632387707594
-0.0867171307480763
-0.17667052281473086
-0.06975923445027292
-0.07430480916416186
-0.1945703850796228
-0.15693213127307545
-0.14104821512046328
