0.007601485795506281
0.0065447172580623955
0.002522048757956388
0.007802932035648792
0.014808421305118412
0.008624773948068128
0.014965696341757385
0.01214285122996492
0.004286407063967648
0.003113555838911145
0.002232037773867461
0.0015714461450388325
0.0032147892794679995
0.002415184387103223
0.002849528492609794
0.0046531140856615385
0.004951117223685437
0.005561208198952101
0.003633265375663446
0.0074925868169476405
0.007443994649412666
0.005007266126782995
0.004657060220735384
0.002867948179545901
0.003451919181687243
0.002966547458417702
0.0026122497181387807
0.002712986511017436
0.004831344720269584
0.003824647142346431
0.0094318297730935
0.002292971271841744
0.004913577352527291
0.006731386322663121
0.006765861441220064
0.01044009678069104
0.0035085338169491267
0.0066827865820500605
0.0009243104219139047
0.004223579585771135
0.005214626376472168
0.0009782967424468254
0.0034491731874861857
0.010999808767221902
0.003558310578635118
0.0039635295589663675
0.011283970814169632
0.004228007672018765
0.003454482906940132
0.003778266435019979
0.002954052688801158
0.0021016282911078513
0.004293155090066961
0.002385438339947099
0.005449611092843832
0.002390208052452759
0.006644047711269894
0.003972081965804677
0.005640640077393822
0.007199395297108986
0.003634499389338187
0.008630711394917466
0.0014427756426097255
0.004382257666527072
0.0011077397473458763
0.004580102181324203
0.010397124699491837
0.0045947338391413295
0.0019913730583058513
0.0021708399101862826
0.006777211340899952
0.00561521249921559
0.0034062250151905547
0.021039784052888182
0.014647231745281184
0.006352707778315579
0.01378474020928926
0.003841116327787092
0.004665509058886124
0.008434604361681095
0.004598524691232551
0.0027869761760493067
0.004836258752141381
0.0046025299550331075
0.001858226270965633
0.002826210240610103
0.02112503462366397
0.005144603512958994
0.003921762498335068
0.004819734042862867
0.0042899252291587866
0.007691638205563527
0.0029338641655156945
0.007604636298990028
0.012638280432365704
0.005759318804706012
0.007258285433023325
0.0030009780924589217
0.003191350186014105
0.004857054708470586
0.0028786873322841572
0.014037393639291492
0.0132427002277141
0.003739929210978857
0.011631893786662606
0.0032002814099043445
0.003179500010860493
0.006049791470058097
0.00232278606985972
0.006581191654191443
0.0038054583238105537
0.0040780631156463795
0.00984129723003366
0.027665933163095083
0.004047275535823837
0.006824528474545425
0.0042119217658948965
0.007856419768498272
0.010005237680226958
0.011721198361742848
0.002814719653076597
0.0072179675791004235
0.005856793840089052
0.015755382172325257
0.012760398176623831
0.0015810688745040093
0.024485709458288853
0.004961199111991217
0.005879884882380458
0.005471428376556911
0.007989802731920213
0.00767737876214717
0.00635485392329808
0.00736064409634088
