362.81701469831086
353.5222128959425
8905.735634456643
206.39131877924618
363.67403619866127
494.1223062600993
545.0542037510734
510.64833018617287
910.2071350717013
739.0838273048047
788.0885540385724
355.86683916492376
1058.5843370498385
237.88363587748145
2027.3299148175101
338.5203272021905
364.9846047844416
419.37888608875136
60.32068665797479
842.7307557007541
1684.4310261021494
1121.0096940621197
1344.756243970985
816.2978062624152
524.6687832007474
241.55815390412047
729.0122904836212
9100.990135094502
1334.5347279189364
5064.518372795737
76.66378425892596
552.3537049390281
1269.1507933006046
1047.7307082480631
730.458854122408
519.9723413125058
97.86041204745182
370.58336516615424
927.311433811396
219.14058114702655
431.94787076973097
131.08162066940693
1501.1118790097494
1467.692170156607
1492.100061554145
435.7678362295712
900.4061119422992
295.64286687729486
1531.4415419154182
536.6747609264792
267.6168754427976
8012.900171968119
369.2801164355999
218.57769401326917
198.75315242825766
172.16635817469262
338.2729084716674
1551.7780946610135
123.54096310193873
784.0502209783466
382.6274799424495
1498.0823619603987
198.6165958745989
700.5018214928576
317.32508766851237
