36.99803769288506
33.26010207056272
63.89855883079564
23.752409134722363
26.39327066099026
46.77012418642861
70.70447966401319
68.77032349598247
37.55982941588866
40.68619672166418
38.36946070399027
53.38769668625641
52.08352468896685
50.74087484638586
47.484886996248036
42.55059289218863
85.80176828666312
64.96701171001783
46.94254720605935
47.801343173624325
77.03314897593718
63.485097884990594
74.97140763063595
77.39599426814083
92.6509510356893
79.12482284552362
71.19196198048246
74.97948616834458
47.95777946821526
93.68167263924832
33.4229333539432
83.03353341179296
76.44922016819919
83.26099319631966
72.83401911934719
53.42484889084669
35.932913333346
42.997498097856464
58.99367873476736
83.98648754024828
49.22781563168958
21.247118902940745
68.63698060845904
55.74350955283342
57.58150760040666
36.352901320531615
39.781047663181006
37.59487995879872
51.741832040881214
39.09292481698543
38.86230569664907
88.76944266715313
56.43937813828261
36.936925522806135
36.039333862721634
19.88094157376808
47.84944114476734
43.17541729954222
56.21127437357855
37.38942046498497
28.30701523698955
101.18022075943432
32.23953400070636
48.0979902273413
43.113543451456735
