3395.2879515417294
2900.8498603680414
5165.087045235769
3180.4144400994255
3144.004779251708
2804.6957963343107
4940.4113076058065
4102.256333393048
5608.721522242833
3655.528312351625
5584.85787766522
4803.407788716541
3132.5045762628774
3565.936416551988
5100.370307396761
2501.538044216771
3002.281360254571
3248.25149443706
1087.8284043271703
5162.358521534695
3385.509441306664
2506.8901412189516
3883.622630241122
5213.169038957616
4179.254401038523
2637.2160817992435
4475.661654164136
4441.632950603597
3667.0109822161244
3089.956211139855
659.3831127753507
3438.3416011635645
3111.1783698394584
3477.704410579325
3590.9260112954967
3108.6095971632744
1619.399819833831
3595.975939435134
2998.2216976534305
2182.991211493943
4617.376738437706
2206.6787633983813
4565.825804781727
4513.991828890671
4269.600295935417
2558.1365217523157
3617.182688807408
4544.191805442392
5375.257187452852
3962.8572157214026
2121.156632909881
4026.8799136033344
2438.401635225817
1844.795132486962
2033.8919901725187
2525.955215239142
3912.3884815134497
6080.281411533504
2143.0361114464645
5844.928836091546
3474.0843728386744
4620.6134467685315
2026.084932354284
3338.6862820855986
4326.72418707129
