-0.06745886339235445
-0.05781319561057021
-0.05002565538299539
-0.06122808800685469
-0.0661759175302098
-0.06486114154986382
-0.06295837373095511
-0.05442185991503081
-0.06470069859780958
-0.06242445168843385
-0.04856638075024937
-0.04541288581067901
-0.05299799276541283
-0.05481948371832214
-0.05450155757743345
-0.05535752261046846
-0.06972416431124828
-0.07211618280366798
-0.05761877605576911
-0.06555998914590785
-0.07565047766923773
-0.06382345347334437
-0.0552517674217003
-0.055094571082937464
-0.06110592466622708
-0.050991917474555254
-0.060404889238816505
-0.04870713919472987
-0.053677279945922224
-0.06021590320652114
-0.05293792639340883
-0.054625344989022315
-0.06824366637954822
-0.07346833515532633
-0.07247017847571989
-0.07294555613748586
-0.055641592369588544
-0.061997680554871176
-0.047174959401381965
-0.05855485975559443
-0.06867058533705485
-0.03921656135194219
-0.06858996984751096
-0.06697863354459989
-0.05481054216928833
-0.061134396347869734
-0.06394287227387244
-0.0548726394227324
-0.03782657199483889
-0.0395173773913411
-0.06084227348896181
-0.045251887461536536
-0.05652585322861151
-0.05046605584813426
-0.05756164481155918
-0.04922465016817114
-0.0562789020286516
-0.05162564591517031
-0.05155791179880193
-0.06077008719420953
-0.06417027715937411
-0.06924806936238542
-0.04068953387594277
-0.06231192881432933
-0.038537285695209283
-0.06178425727036973
-0.058860683484955996
-0.05453191960375078
-0.056079946083880505
-0.046648663926984184
-0.0497543167882257
-0.06000278776014735
-0.049769779452119634
-0.06836104977333854
-0.06877176535860194
-0.062053703193784934
-0.07319959512597946
-0.051876768469127324
-0.06123823629602838
-0.03491321703604255
-0.058681785542374236
-0.06315272290505668
-0.05400926627200376
-0.04504843136851413
-0.042767755316790085
-0.04397979420251334
-0.09390031814231241
-0.06474181059429295
-0.05776083110339387
-0.055389126423811955
-0.0471018431361091
-0.048812607800918055
-0.052980372428627645
-0.06317219076718897
-0.07029380909714904
-0.06749821097253376
-0.0676369551452623
-0.04866369588997765
-0.05578608986617579
-0.045750984623171356
-0.039955040819930794
-0.07525398702268915
-0.06470461647376925
-0.041267012073678326
-0.06812795587151825
-0.056648242882702024
-0.05825419563380934
-0.06270226477747637
-0.03584447429240159
-0.06662007231286408
-0.06693135220854082
-0.06386421753848653
-0.06304184096682662
-0.07215491831061481
-0.05941318215160676
-0.060757100688863266
-0.0663091999969914
-0.06614326565056326
-0.0572140731381101
-0.07949812223897218
-0.05153683046372449
-0.06393082522092855
-0.06634068022912752
-0.08317373432838691
-0.07384807973868461
-0.04507033591674938
-0.07817416077755526
-0.040319308953584904
-0.06369300232127847
-0.05738018800189283
-0.05383121187192022
-0.06657567925358543
-0.06051372108903336
-0.07064706928433132
