9656.310081481934
7375.7171630859375
578505.9928894043
8203.625679016113
11879.324913024902
19853.353500366207
16600.01277923584
17102.479934692383
23977.160453796387
26913.28525543213
24790.76385498047
14183.878898620604
33754.706382751465
13325.214385986328
71015.23876190187
11362.195014953611
25669.097900390625
29341.220855712887
1479.8641204833984
28081.655502319336
111595.63064575195
92338.80043029784
98050.11749267578
57555.1986694336
35464.52522277832
13192.176818847656
48732.51914978027
610116.0049438478
89015.00701904297
338737.24937438965
6700.5157470703125
35169.83985900879
85151.91078186035
50158.73908996582
51973.34289550781
15845.775604248047
3601.670265197754
13775.82550048828
64117.6700592041
15595.436096191406
15067.219734191896
4554.033279418944
96801.2809753418
90232.37228393556
102713.58489990234
16177.29663848877
33437.49046325684
7797.360420227051
46697.258949279785
18262.982368469242
6925.463676452637
550812.0059967041
27563.09509277344
15141.248703002932
6953.001022338867
5895.853042602539
12967.944145202637
51361.79924011231
3516.1972045898438
26828.885078430176
15862.584114074707
113704.91981506348
13555.526733398438
46684.74197387695
7938.981056213379
