17.883857735506552
16.64045310785074
23.988789424028017
14.228043743415274
15.133557071010506
20.379456304032367
25.138701168242196
24.77909056387336
18.721501562589804
19.002788784701963
18.43156274449368
21.762737303660924
20.923890015831
21.407352547396503
20.777367301330667
19.35870813921277
26.962349934268694
23.87848477169918
20.745469548463234
19.859128782735848
26.638221502505168
23.001131044720555
25.824639187264346
26.329093472905036
29.18602118933732
26.753117080921207
25.562750539491905
25.842415114305556
20.526439141650705
28.25457362902114
17.03961100503936
27.015770755402208
25.738286669041358
26.569726539392953
25.414170005386065
20.902654851481163
16.96388630415746
19.34191721181676
23.059510987013777
27.16200483973389
21.429779982977227
12.988602358119747
24.653357224209586
22.138146280241827
22.614244894797856
17.028241318654967
18.086012434011945
18.188988884119038
21.258296232116383
18.0149208738253
17.83347314868999
27.973404591479373
22.191179519160652
18.259557037269502
17.89554263608092
12.673268798284308
20.009279536996893
19.154349988365265
22.61762006556711
18.47266332066295
15.457151103013945
29.007977034508205
16.62494412528619
20.40538614709425
19.702045666778563
