-0.22868716262201652
-0.2329645304048782
-0.19666686205726913
-0.22873438199590784
-0.22098742574947838
-0.24010300013531247
-0.22334471373332446
-0.24479237896475067
-0.21850523293623583
-0.2190191233536616
-0.2139231507972028
-0.22234218524128876
-0.21139087663596623
-0.206531820877295
-0.19770744206436047
-0.22170840176608422
-0.21435570588710393
-0.22156163791287012
-0.21919939540405875
-0.23335970013743576
-0.2312435285824757
-0.2327943237273487
-0.22523379075312122
-0.2153774211977305
-0.2033433043798928
-0.21050523143358357
-0.21747587912382133
-0.2028533436589142
-0.22583908138318418
-0.22392395809162702
-0.22826358589973428
-0.20797026546565842
-0.2286240702878671
-0.2322511109598815
-0.20477950453693675
-0.2107746426006786
-0.20253133974339596
-0.21833622208373524
-0.20631961931358414
-0.21628549829154148
-0.21871856535320064
-0.20037230417434487
-0.22634023751935492
-0.24697723292061702
-0.21425761908225277
-0.2091402554408226
-0.2095412354483108
-0.2153065254584202
-0.20284934546362582
-0.20440898499302923
-0.21217197937455806
-0.20624421586370792
-0.209361300015968
-0.21658688724581468
-0.20869883234000694
-0.20569185557798905
-0.22846156747829283
-0.20284485257968835
-0.20905838592112533
-0.2269851369478571
-0.22832684443413137
-0.20451702501335955
-0.2024872488808745
-0.1983958301741311
-0.20064017160185568
-0.2381237138438663
-0.2173503338235867
-0.21153438320331958
-0.20581576984530733
-0.20262620777910795
-0.2120216345763395
-0.2445574124214687
-0.22004706633953722
-0.2418598414245129
-0.23140257117779853
-0.23781506180043693
-0.22577057094007758
-0.21855629558109826
-0.2071616817303111
-0.2256392935831923
-0.20171730702518004
-0.22106938565923825
-0.20108740090284336
-0.23402830074962352
-0.20156219541170062
-0.19991511604963316
-0.23299970597288425
-0.20065690911876408
-0.20292127648117575
-0.21465802833167802
-0.20731958154844357
-0.21118910785350417
-0.20671726764445048
-0.2279965359929547
-0.2162169567372977
-0.22225915224764353
-0.22805985717913912
-0.2080417286070102
-0.20681705445065635
-0.22922523578942977
-0.2091995276248853
-0.23635312751963755
-0.20977379779526875
-0.20912268518733257
-0.22016601145995152
-0.2105387596611026
-0.2008483113832899
-0.22558859041083845
-0.19624737389088007
-0.22275436904474297
-0.22792948254746512
-0.23618181735436727
-0.2314848744379831
-0.23604413080617886
-0.22983173672485951
-0.2356485802559021
-0.2120251173511767
-0.23243043833738802
-0.22631695424866705
-0.24720951749724143
-0.20791827807517804
-0.22777612265034763
-0.21541185635243898
-0.2420731026907305
-0.2055739914526826
-0.20302303116865042
-0.2129262073257776
-0.21213267748225267
-0.22872505464990442
-0.20805397543367016
-0.20918038774682024
-0.2311538785044161
-0.22573984958478827
-0.22308743754095767
