0.7347495117404306
0.3780172374974464
0.8522436243654041
0.3708654074103481
0.6155620707963563
0.6288430141042792
0.7371401967114528
0.6199037379833803
0.42236158453429656
0.7921084490963585
0.6348270834731784
0.5407834524438956
0.5568016390538496
0.5048397904496981
0.6526662049946469
0.6880251863551063
0.41694538605130976
0.5557322299569026
0.5557397419847899
0.5059769964050129
0.4177307543395871
0.4789301166960687
0.6758073649259043
0.6073725280661306
0.6755941797013801
0.4415065637508468
0.6315528406259178
0.80781540082414
0.4439839519928236
0.6451505535289616
0.4344790023270843
0.4510028544610567
0.6013342499899205
0.4912648706720618
0.5660431167431621
0.4535600700754042
0.2599252320280223
0.4494886112032356
0.5822639287839133
0.6947421484806787
0.6901387173692156
0.27121330359052725
0.5467437949042064
0.5127079172001876
0.5529587126349352
0.4639809584958351
0.4480826628499552
0.7779889254185386
0.7067557122342212
0.4299772279149002
0.31720806423475995
0.7589122138516967
0.5830188245226882
0.5341420079033872
0.4898314349043815
0.1903247666150884
0.5285581453542433
0.6787946660380554
0.6372448471566953
0.6768620755221245
0.5813707692814949
0.7839107395369754
0.3157244395931249
0.5832501401584289
0.6234303189849947
