0.4199625634781885
0.378434119404024
0.2154364800872254
0.2960446957036892
0.24227635128704186
0.26424904054069165
0.21845609963316914
0.520616736577485
0.33395192432195336
0.35869311233175605
0.3104318825186613
0.30290128355349905
0.3229731538586868
0.3136255800661033
0.2800326847608912
0.27332038407263765
0.3644001983467027
0.3571074536108599
0.27497273876041306
0.2532592472181704
0.2729123143317643
0.31818643717966305
0.3155710848299295
0.2285814514102754
0.2276839469493311
0.28451574610609803
0.3245552348108977
0.29591437960532896
0.3415357394018091
0.3867202933958652
0.3247653961876493
0.3079986928965028
0.3958613795455129
0.3250472919272931
0.3078089042925808
0.27188282887683224
0.2406949059950044
0.18421138831631453
0.2638553076871469
0.3023828019967013
0.26497016039876325
0.21690777995268545
0.2622253715332601
0.4639840392879066
0.3068695808876229
0.2682699141085568
0.3180268308507199
0.3276078994081599
0.2806166896360496
0.2733178440668849
0.27217158574067074
0.3313786825884489
0.31218395618714834
0.28965923163430257
0.2286918508342646
0.2040106690129645
0.2763160087799405
0.3073781325287417
0.30115981552097343
0.3177833996734579
0.3007720248593264
0.3569422607304623
0.20927144329912725
0.28297930218439965
0.20182079906702802
0.20805845394630168
0.33645632554782684
0.3231712134789107
0.25564637810771274
0.2615837678504397
0.26007891868995514
0.3300490687911963
0.21335756644021586
0.3177163051861533
0.2720570094919975
0.30283684890558443
0.3227789400315476
0.38207167092802297
0.318705976589163
0.2803184440822965
0.3073060440814755
0.3073060440814755
0.1927049660196873
0.25611378955251823
0.19874370506457145
0.2462484704761223
0.2141364192840257
0.2835355043316404
0.3099109912279365
0.3174587983876354
0.3853326707377178
0.3024473035139473
0.2768015513358875
0.3053327940281293
0.3226251236919813
0.2971971410951122
0.3622168036740139
0.21241375884947547
0.25059338074539045
0.22426441378381196
0.18865094584365089
0.4048128848380067
0.28631761208858875
0.262385723689949
0.2930869929997201
0.3017937172651906
0.20931071560578188
0.21514782534106727
0.22451999335758635
0.3166005988720273
0.27548889513165303
0.3268779522065237
0.38176310777590106
0.4006421935224773
0.25740880749235073
0.3707689431733918
0.30993934837462456
0.2860923277625787
0.3307060688287136
0.32511691190692515
0.26288293052534983
0.28560807562622675
0.33904563780101266
0.4540808920559514
0.3422745791572484
0.3227219954049444
0.3270869734805393
0.4210709565384356
0.5265004363956803
0.4069979129540085
0.4148977734464264
0.32678516813030617
0.3046194961335579
0.3631513042344913
