0.007436111473269801
0.00496024534219134
0.0004163090992954826
0.00827203619813918
0.006405992052504984
0.00497565642262186
0.00473440129708411
0.004425846158507278
0.002046433147685862
0.004200157250630848
0.0029975795431246
0.004928680282826915
0.0018965893773668946
0.008407188339835612
0.0011887753377300045
0.007110695892509554
0.005355395527882895
0.005262936378251184
0.037516853596030485
0.002310201021418045
0.0009782152199547488
0.0015488986828451345
0.001828479231876893
0.0026640904509586533
0.00502687851465181
0.007383331909733218
0.0034180768525408464
0.0003605507644410648
0.0013647312373417108
0.0004764966082683036
0.023875512072665417
0.003490176427760631
0.0017394784020809538
0.0020756888543606773
0.0031489572735278327
0.003589126569346107
0.016289158089821537
0.0053373367952284645
0.002475527892409902
0.010679049832988535
0.005961600177070622
0.01313107776232438
0.001432851784040882
0.0013974972854501168
0.0013899616746270089
0.00420882321750335
0.0019356351899912309
0.010667286278011312
0.0015956509889421785
0.003389717633040092
0.005680364586403307
0.00034999348967929255
0.005810172390086467
0.009274236979255968
0.010352126189833223
0.00932522189507868
0.0057762360973042225
0.001659474821593862
0.015787542369027182
0.0032819675734493143
0.00540903449034447
0.002028608618795681
0.008649091000579147
0.003039651159963171
0.007672203645785445
