-0.7926095715037184
-0.8187330543247912
-1.5758032073088826
-1.1471444402259952
-1.432124972422832
-1.6177397797440127
-1.5113230326969143
-0.6902096311391767
-1.1930056698382536
-0.954407535231806
-1.3330259331844454
-1.5297291712911072
-1.403440755317
-1.2121011907307833
-1.4282561656328876
-1.4976491552986828
-0.9840355667735128
-0.931082416882297
-1.0605649186209962
-1.1569558154120287
-0.9302080472960136
-0.7458991516058178
-0.8769104373647677
-1.4107907486177416
-1.2590158993021536
-0.987897026768422
-1.0347167040372873
-1.1677612771296033
-0.9286764036718713
-0.8324731532748367
-0.894039115314533
-1.0234779370405829
-0.820619426353045
-1.046548595758431
-1.1073495713893438
-1.1636452127473564
-1.384780860741125
-1.7009138760133529
-1.0690756552401908
-0.8720321805193794
-1.0154948745932493
-1.2881373600932424
-1.155989423287397
-0.3806767971100085
-1.4231006670433592
-1.524318687211188
-1.2417056131915547
-1.2225007496902596
-1.6155324174423245
-1.5498989161142471
-1.516425239055354
-1.2604476211666373
-1.3862276991693587
-1.2649939256949527
-1.505030960671962
-1.7427233547430059
-1.6452782758083446
-1.4137116800484895
-1.585768736620501
-1.3074127604764205
-1.6444487054348156
-1.1010191103574756
-1.6218959655653709
-1.1658350476486712
-1.6187660682599194
-1.4456019425482343
-0.9306556487557043
-0.9699386266871408
-1.24672224704437
-1.2485363625039396
-1.3133627907950336
-0.9750862932370273
-1.5830382489127854
-1.0966451802109387
-1.3490540637373827
-1.0063413395912368
-1.0973904031464417
-0.9391668119477361
-1.0199472521455255
-1.2908218020034739
-1.1759903503078486
-1.1759903503078486
-1.3973741826775121
-1.1193292714322858
-1.6265659038412128
-1.4138343082403124
-1.7600424392647007
-1.2946755258846783
-1.1690858408156288
-1.2360274202479333
-1.1076037591534404
-1.3482798734221333
-1.4355091126005464
-1.5162230431290378
-1.1449902296123624
-1.5753422305933813
-1.182352433461968
-1.539412807923087
-1.34306817795888
-1.7616930443775438
-1.9072416334466586
-0.7841636566436245
-1.4826872839732943
-1.0035659497427076
-1.3615204630599451
-1.3755411424812138
-1.6658316901873707
-1.2497959302406343
-1.465139250111131
-1.0280866817876035
-1.435949022649116
-1.040139584599475
-0.961398291435318
-0.9992612194485961
-1.389213577494274
-1.0309013557872995
-1.1716388312276602
-1.537866032068481
-0.9872098183049463
-1.0675978862448874
-1.4314670270261272
-1.579898684313508
-1.3804382737483731
-1.0487242839928737
-1.4382421776461456
-1.2585005502999589
-1.2165797375428928
-1.2364107854031612
-0.8444686360508885
-1.499253875130751
-1.4986731535064073
-1.120169312325526
-1.1899111642292282
-0.8937454754410561
