4.192712813057407
4.181202207654275
4.641228078232155
4.086748498290988
4.197761922827812
4.215560115126799
4.229246841057051
4.245564487252188
4.296057043762739
4.269918151283414
4.2874979143461305
4.168796656859098
4.326430220885003
4.214850842830871
4.426366180509988
4.157391229400878
4.274602507476471
4.293871976369507
3.857350224738587
4.313821957991561
4.4948103077541335
4.4221603831708585
4.449672723725071
4.393745605008505
4.353204924631055
4.215161875819365
4.374536295073075
4.653555702850157
4.444330011659704
4.592313363421741
4.039959282231525
4.336721130455051
4.458759106881853
4.433036069259644
4.398398474262876
4.238632670197891
3.9495845250024617
4.181076891892036
4.421732470090499
4.210494616954489
4.197617456546429
4.092877802520311
4.4588677464029205
4.44473331872562
4.466131318508513
4.202339386638802
4.311437586662695
4.143465186273733
4.370854319147574
4.2341077913020415
4.131260434169754
4.640489956940469
4.304227004353067
4.221985425370845
4.079531660426044
4.060174375603478
4.1734316227693515
4.401022780381899
3.9793749342459805
4.305185449331888
4.245456810537954
4.475225761065278
4.181784571102007
4.382141646820497
4.148939921876627
