0.21420123378484557
-0.022170208379976648
0.2265456834604763
-0.025641111617591607
-0.07763820336639182
0.06220341908471736
0.08524098701396203
-0.40240708590196167
0.7229138306196803
0.6342637209832989
0.043398921511582186
-0.572392496939128
0.08731766341605086
0.40307133300219317
0.49293608104151154
-0.04667721405797749
0.29329109107051615
0.6518184903715333
0.16831307314374988
-0.1352707174970923
0.41301291912874627
-0.4129555888389694
-0.26533476557488495
-0.8428735825998633
0.4241880843147509
-0.22386233300462463
0.33231112558736636
1.0418396377664285
1.6167289978933626
0.4465260738771033
-0.3178943365809376
0.6205775660721777
0.4615189104632025
0.4622571318910838
0.38216727417837965
0.31719474050370633
0.054114308172906696
0.3051165722987328
0.6892169893124173
-0.4155610631173446
-0.6593348898300504
-0.1793630034890991
0.9187775351868852
0.7759199878978523
0.6323831289192718
0.38391394447740973
0.06843630923290694
-0.8871005376853923
-0.24752785706401156
0.37386124384773495
0.12320915823070276
-0.17316334606149175
-0.3544934202164609
0.5336649930956544
-0.20739997361878149
0.6391031734112214
-1.4021250803904175
-0.057404917851342864
-1.017011233455931
-0.41614029298384564
0.12188338991134477
-0.023442354088286356
-0.19836884005999605
1.0554108132794626
-0.5538353460046043
