5.030535216809566
5.083630781434545
5.335380723346149
5.077146873940553
4.644171474473842
3.975617102350527
3.8595428997165535
4.400137925341771
4.699133464429161
5.462368959883532
4.797910993784842
4.651370888798784
5.1694281517874225
6.881522628797611
5.440455988935285
6.028968520966848
6.479370408866371
5.056206354554145
4.663204886472418
5.055852228931697
5.4525095130847765
5.6077412868318675
4.465926951636969
4.661298445013569
4.814986919309028
4.7690680411613675
5.6833602176637195
5.8497336417024615
5.472537958823272
4.895111452994191
4.887556812208743
5.503624241328106
4.3876004480418
5.914797188665983
5.91949383056475
5.7791574695375525
4.724178553789676
3.977816167505608
5.258446557885977
5.192074749473927
5.496959877682097
5.439339364467556
5.318813082453281
4.2347688660008185
5.151014177389196
5.354275847092435
5.119707230023423
5.569627636147417
4.8230906251044265
5.038131808410885
4.819904412659506
5.13983844072438
5.529162959135164
4.611008860906712
4.46747449527964
4.6136355099770485
4.068538278709565
5.510918792743984
5.167678833200555
5.870734773557925
5.439152492406995
5.631542485570152
4.944909420540052
4.80488889611714
5.008142918918332
3.844280164370709
4.559346988494707
4.701012582595445
4.689508882682569
4.709115362054282
4.633427179568974
4.322612320891776
3.9365945678608147
4.535136531131436
4.752336762391137
4.236580524231325
4.480634712068798
5.5939512437963215
5.103394885054887
4.505286807292863
4.726819483561145
4.643927818627267
4.529803221304787
4.1653787778946905
5.14655132989887
5.244332405801638
5.075218029173882
4.7079102317421535
4.845074162340366
4.413707415328291
4.958273073337893
5.314181650948544
4.7415399053732505
3.5429305267330258
5.468912749791862
5.158078743715049
5.128073849058737
5.236977578438466
4.582689193154665
4.720664433110573
5.076955331123009
4.323900926694234
4.463148966460553
4.189704656779578
4.48460559613784
5.000577210415703
5.22020424015865
3.759817747671356
5.4369230470674905
5.524380264417673
4.801946639719271
4.905034217991839
5.217527995031147
4.04015642953616
4.257873463663189
5.3518026294538
5.162144771158818
4.9966072731095945
5.3011654051119415
4.741748551345452
5.446733293011102
5.1121158350729194
5.3667464007960515
5.379161346707283
6.024441205796945
5.842166144234611
5.245870736679539
5.447053309119396
4.913511447296363
5.1495638264865
5.1529518076680025
5.0514880443203145
5.001552498347867
5.0238820959663615
