3.0206898307715893
3.0696258301388486
2.9268600662382593
2.802123138973142
2.8163916253758825
2.8163916253758825
2.8163916253758825
3.028607348920442
3.0128192886015914
3.0184644801721907
2.919218574501165
3.0018081312379934
3.035583704640933
3.0067992017387013
2.9878305853597125
2.9783967897844716
3.021425897533514
2.8648505995407714
2.985001356692462
2.9020596169362842
2.9090721250234455
2.9602660491372266
2.8133841137369555
2.8440276501556077
2.915693761606444
2.9554064016214636
3.2426947970847273
3.152028925085647
3.0847614104563643
2.914274903664676
2.930541456089054
3.006455627792721
2.8659603555022
3.0263258634423322
2.964230072043369
2.9525313977146848
2.9704262678362494
2.816243550284489
3.221712272242167
2.9251552151019324
2.8532518037983987
2.95746231989574
2.9083822953996634
2.8743125131318097
2.9808686250070573
2.9374583134732006
2.9663512502197653
3.1575640842615487
3.070796656588093
3.0950307533655526
2.8865650020463303
2.9042016103648307
2.91953155133816
2.9027527041317724
3.02677479130979
2.901454517432975
2.802626491234868
3.0070372357192072
3.0394003354000656
3.139719296384787
2.951914540225746
2.954569200176554
3.132200229880338
2.988883052435825
3.000397729540251
2.6334349703670576
2.9952905638343643
2.874924816916944
3.0159152818809725
2.841998530798738
2.925638910048615
2.7716760430946654
2.938234109196128
2.7614288401231035
3.036699850474901
2.8147243920956333
3.061978032626829
3.1314145797522124
2.946289925694117
2.8593639052622337
3.058189800436271
2.891915742826391
2.714563528217998
2.6925757349001302
2.9519414593549658
2.9423705616543825
2.82060991275391
2.9972124961866085
3.0820194033782866
2.961748958351365
3.0476270929399916
3.027932711541048
2.908961339446777
3.0413322334229473
2.9415020154584504
2.9415020154584504
2.9690007171965864
2.941445629378358
2.8456348019251436
3.2175977155112476
3.11978414268735
2.793918890131665
2.8878978459838467
2.8952785181713008
2.913989981195948
2.9187222890107964
2.899500161779119
2.7987761228345223
2.9989204632828073
2.9270892752620843
2.83380018429235
2.8290186372583204
2.985863609177853
2.9495759907027144
2.8518045773501735
2.9482170215429964
2.961050334381947
2.9359865869242605
2.9564554403219607
2.915887304965861
3.0129457813288285
2.9416221054516
3.2371280940704583
3.0764078898350995
2.978536754040043
3.155300930391841
2.876081050595627
3.1760225967252613
3.032739363679786
3.0884541625403648
3.1233721516217936
2.9090689689741844
3.0693646091410054
2.9458264588860095
