7.734572737322578
8.727780994899867
11.124711041252795
11.542599564063492
10.210568997169442
7.089904548834585
11.285793380819833
7.577379553108803
7.741428381065734
9.87403007721891
11.061389040518701
10.960697718788479
8.74617402057131
9.21945519031268
12.352403153695372
9.461743696843298
8.109783670999862
6.711680038772637
6.913021998771562
10.30824085980118
7.583280536917673
8.846601385856228
8.148481530540455
10.491754393507978
9.065002685092978
8.482643204911888
8.940729741835433
13.314869074839198
11.9409682724108
9.475598531855619
5.78203320108994
8.591765464892074
9.551803338201754
8.872808946883408
9.964706622213143
9.216780277075994
8.831086337854469
6.980603921041548
6.541054514066487
6.318035630254034
9.667961219878887
4.889430053675015
9.748882842948694
9.83032573507112
9.715618733647894
6.3496373023089445
9.01398052348233
11.153145854862142
8.627494303858935
9.93452875838517
6.242551611579173
11.30118404838566
7.448128791982211
6.3235057087651425
5.776754533657282
7.28539342030133
8.651915830840856
11.146963372165798
7.498298957622455
10.462451068870926
9.132919233336363
8.525079934743008
6.730791547692052
8.568878482401644
10.85396369028774
