23.785121480021022
26.710370109501525
12.415112622102944
11.137929060304439
11.394867106075964
11.767825943432705
11.446417031768418
21.793193219034173
17.938744463918603
18.2822788811048
15.195042246153136
16.492372674409552
15.636810984769287
18.106547959804573
15.749914919747965
18.26441044471661
20.949046221257795
12.922983451318151
13.9589762697476
15.943413096884955
18.026098546202558
16.24661102031757
11.733838905029481
9.887860042154452
11.853225265644847
13.920722260411404
21.743400831988026
17.793651584604984
19.271558359391662
15.002926869676767
14.51272361102737
17.90382008780744
15.560021789182013
17.831263705058163
15.010605553322758
13.443479810563392
13.40437472054382
10.392059109024473
18.14980007239781
12.72942364490247
10.581887570586453
13.590936995487466
14.264431418783738
19.104479218363835
15.571383181057449
15.192484693537974
15.538929398058116
24.6082512506739
14.288024733891525
14.147011455566652
12.466532274263447
13.903983337039186
12.352582377909426
14.263137802257841
11.022467927448652
11.845403769778967
10.625358894472843
15.153503272848713
14.796369483501378
24.239345854759122
16.736487106493964
13.820579823395104
11.712429438219333
11.095012173088053
11.144201848642316
8.144544205485756
15.124643864397173
13.268257415739761
11.682662249030585
10.494344510329192
12.364664555105579
11.359279559383154
13.94336883858845
10.794802561224332
16.5007463060468
12.514056347326413
22.140350099394933
20.27253232755445
14.443524545119839
13.973466784075146
12.641999764834098
15.807785968829664
8.423038177482429
8.424820507557781
13.215859214372475
13.190554381029994
12.337125104549576
13.852974980457569
14.846447632780528
17.17391420234966
19.867966581782426
15.801804169758848
12.183383511620047
16.107125533267972
16.83376871919249
17.466239937408506
16.944239168517445
12.916179882162215
11.575310205762973
23.802282323482427
13.009615725630542
10.649779408664736
12.68041922104818
12.311100757517275
14.66908707932528
14.765938624281475
10.55043309015617
10.973627821032386
13.161050000995667
15.810253925596573
12.825888299648087
12.351950663541567
19.85010434179568
19.158107514902344
11.959047558110326
19.817697618387847
17.20941117675998
16.921859025676866
19.4888472800652
17.844130508650906
15.534871686987126
16.888460293787418
24.06256386996026
27.98854055003307
17.001016736214098
18.91430668427144
13.103051836760635
30.599170715106133
24.3515707322279
23.49477205502099
20.66923061141101
15.464419880261312
16.9261790330418
15.3252747413817
