0.8992823838427145
0.6984741977621252
0.7865137512820681
0.8106271932213491
0.9007963331293071
0.530367179426117
0.7450242306171464
0.7647503790227783
0.9749934864884596
0.8849490517344473
0.7730127483071432
0.7184848829010158
0.8908915655289761
0.8456435770809926
0.8699953425569867
0.8018416865757114
0.8871188761764013
0.9023493990941924
0.9467099408505067
0.5702595581317335
0.8138779934719165
0.5707445430450222
0.8321678282037348
0.8332781602217187
0.7797312509181769
0.8185477851746679
0.5720813128064864
0.9150282634141516
0.8100199732515757
0.8856780938926256
0.9025464246202556
0.6579889157028246
0.7544722060464513
0.8318276298416667
0.7092857968775594
0.6741839900957316
0.6817608771445539
0.8796929226750111
0.8888496118639265
0.8644949378532526
0.8133589580745657
0.7280227516820286
0.6798771160819979
0.6482514156184721
0.8770973788165505
0.9112929889323816
0.7901387073349709
0.9113889917372866
0.9371548310649584
0.5899323766952701
0.7303621517377791
0.9104422333148948
0.8374006110161583
0.8035683112611747
0.5038585437917692
0.84748278322576
0.8725223958926365
0.8635685867405872
0.8310151191599919
0.6354823225959082
0.82338963555237
0.8676882269047431
0.5605423199404572
0.6458731407203548
0.8825372942870247
0.736498398472621
0.8488347346860075
0.626209456736786
0.6692137025550146
0.9116218316105272
0.6230942384768438
0.4637020818127247
0.8810992808782255
0.8154088214324182
0.6351060028675355
0.9753330700657687
0.5958429871249641
0.721573142983153
0.6998810954261405
0.8614032713713881
0.813080049483588
0.813080049483588
0.8041754789159801
0.8226276127536921
0.7808190310439721
0.906547589812412
0.6589178804018285
0.8548440218922497
0.9119060975202016
0.9678575060615386
0.8985573212896807
0.9150203669706064
0.9581510341054912
0.6025385197429527
0.90771131310599
0.7944383303781326
0.9161343712663784
0.8738155545476128
0.9305648371628872
0.8128661962160443
0.9142663347199684
0.8231475714636304
0.5721875594118111
0.7725684239978162
0.9216640636898882
0.7167180422860401
0.8986762117625071
0.7889804247035576
0.8926521694510563
0.5739942141537362
0.8204895779638676
0.7967223104927086
0.7511973541879671
0.7740657439253982
0.7109039841211335
0.9125131471617663
0.7147015786777619
0.899249757943785
0.8635893181932147
0.8375627390954407
0.6471269011366603
0.8803452471219589
0.8285585281943452
0.956627228893535
0.5542340727883528
0.9222364107216351
0.9376677192392704
0.5963369257745555
0.8116164885348277
0.6566518055683758
0.4326783301984557
0.9459567400200763
0.6452561372653287
0.8770508011729494
