0.3169259245904828
0.2945262469656994
0.38632629821777503
0.3857020084521901
0.41286676227994656
0.3986065525459845
0.4222972906681978
0.32613754376261017
0.3375242904259643
0.3196659733721654
0.3295769651549542
0.33320369314957393
0.320863837367492
0.337046759573344
0.3294793832015784
0.3643916030375151
0.2921846595470717
0.35354687452594136
0.3941189788443289
0.3375798843026221
0.3002918366102936
0.3275535742184164
0.3714643950726492
0.4188745291477832
0.3766845949749808
0.3522172302768985
0.338507220030537
0.3387290033673278
0.32591507652743296
0.3233697580164242
0.3460755904238658
0.3227456085649753
0.3124990069940142
0.34080967708639753
0.3321530664982024
0.35133210406561083
0.3613125060904206
0.42635507930141786
0.3295515777201258
0.3695965201621943
0.3865776739107391
0.36972753463944574
0.35811702146370905
0.3269841808384327
0.3577148781098594
0.3686385648039199
0.35116050993403003
0.3065797689544676
0.3403120522790656
0.3625325698336802
0.3771060656871328
0.3425929652132884
0.3737687521470713
0.32601170157629256
0.4001860342519037
0.40176257124318177
0.4242908812107301
0.33843842566532323
0.3662661230118933
0.3273506711647029
0.3404669604509868
0.3388357793365361
0.4258876501599532
0.3790536280231572
0.4147532494426436
0.4414091614012859
0.3207363577077919
0.3530815226646272
0.4045212794045364
0.40857822155095214
0.4106489298391438
0.3826415202888129
0.3912495360797074
0.3900786978119624
0.34991372386756264
0.3478303839190789
0.3159061506165214
0.2915345585992735
0.35060441966897665
0.3384095693637582
0.3631759189473259
0.3612196684145533
0.429398838321253
0.4198152910882844
0.3866784486635991
0.3592673511160997
0.4251090333584061
0.34349675672538804
0.3419852656651896
0.33118538119250823
0.28945400234354063
0.3409676783304981
0.3876639241857128
0.3559005512830874
0.3461666481297433
0.3614511832724341
0.3487580432523144
0.3917344171618881
0.3760588645327595
0.4123759683356504
0.4202217566020243
0.3709720944468226
0.3786369266740532
0.37478103498841775
0.3763098978466231
0.34331364037252016
0.4046013716561788
0.4284786160796539
0.3633289573809616
0.3318987189801522
0.3508868397207381
0.3703419964498456
0.3185735919913713
0.308749497609734
0.4072106267918937
0.3032194523629567
0.3239220182590705
0.3823248163400289
0.3379787935331935
0.2443729275407721
0.3737745574100376
0.3543923743658585
0.304833040701461
0.2786670773598875
0.3135214667875407
0.3230257294687701
0.3510417920949621
0.2599128307897389
0.2467328009842906
0.26804958471157325
0.295087628466004
0.32906557230803524
0.3452903720773749
0.3066580434357368
