-7.9646049519446045
-7.175872656199197
-8.804699129688315
-7.080200446284886
-6.723741856090794
-7.805002311509615
-8.41692672071866
-7.822628190942855
-7.721750992349111
-8.415377536794622
-7.9893481587299755
-8.042978049196075
-8.096983578104712
-6.893376316504663
-7.866836362449602
-6.508497944571296
-7.978061269959764
-8.201312430172027
-4.955069891398192
-8.67618036858768
-7.773662026132113
-8.721512504878413
-9.338834981458808
-8.033237869444937
-8.6978390598172
-6.949992859344313
-8.561757949111378
-10.741883434423313
-9.240427536976062
-9.602349517716421
-6.678518134783622
-8.444125330882926
-9.3238947839061
-9.278189066840998
-8.852339616571802
-7.954683471560875
-4.89053631990859
-7.69951659700264
-8.90557382453387
-7.437191547819873
-6.701236609311002
-6.598970240181689
-8.902893902452801
-9.358110714065322
-9.452219147581614
-7.11564254567031
-8.379735664131797
-7.073431108602779
-8.129780714948108
-8.096270285449618
-6.171940536852928
-10.946691523900814
-8.644648413239434
-7.527322654112578
-6.757740670394061
-6.52380879938232
-7.982773344154783
-8.93620542807864
-6.317488555640588
-7.398504010732556
-7.14021515216977
-10.187502475518274
-6.7605838983026585
-7.858136425843357
-7.703562231406285
