0.7421259914623651
0.6800656213895705
0.7148792952226289
0.7914639646486114
0.7653597939766814
0.7631917221520825
0.7193249917118788
0.6477965412739477
0.798230013819578
0.7520377281528211
0.7841297686164207
0.6547706064415502
0.7600873890991308
0.7910696815051177
0.6978635973664151
0.7310213369136129
0.7105662975240186
0.7378848715868777
0.7608987269400391
0.6475651495363313
0.6504890561184821
0.7449139955622449
0.7354672773313017
0.6380285150004091
0.6104229321960625
0.7318278093894316
0.7223394842618102
0.6863769469288248
0.6938605032809021
0.6960077033515611
0.8097928455028783
0.6967931164171636
0.6313640032594866
0.6673746053010485
0.7090381684324231
0.7435391524339195
0.8129585666144171
0.7699959750207303
0.6756721164646793
0.7893925240553564
0.7521181527604859
0.7182510184103191
0.6848075500171218
0.7762888585939263
0.7036407717773658
0.7634275280145442
0.700435273296439
0.7740323076720462
0.6972558661405862
0.7591189001490641
0.7560341919130968
0.6708230369743182
0.7472166391588688
0.7813469902462269
0.7601469707200459
0.7043677921238773
0.7933010080396199
0.6522880943773379
0.8324651830010079
0.6723771904754077
0.6590188243962838
0.6746187242768206
0.7227187568084007
0.6914346580760398
0.7772925191260763
