-7.10129563799416
-7.20494472622095
-9.728431055631212
-5.930691020400479
-6.873342896454285
-8.130367849891408
-9.088677115579609
-8.975854934726334
-7.431534887225692
-7.394319057917039
-7.685497098625387
-7.7929554468885645
-9.132380433679119
-7.883282343834732
-8.850712222590355
-7.660899191436546
-8.813764011400458
-8.646985349068157
-6.147316658172447
-8.881793485185307
-9.753864267834087
-9.41469480667748
-9.591723180662445
-9.21610065891997
-8.909831627132625
-7.893000625679841
-9.01692214209031
-10.110063314369514
-8.658329723062282
-11.272894699791912
-6.045749913676119
-9.247888802265312
-9.388004933272551
-10.070690469892691
-9.004198231220249
-8.747438332153752
-6.714561750601957
-7.984409095621038
-8.556516310226067
-8.161779964343555
-7.656803721160427
-6.138098868389416
-9.852787136455758
-9.529138197234417
-9.469122473615052
-7.888802354665435
-7.563028417729902
-7.302060794987589
-8.425224086079748
-8.244083358665097
-7.786511875235998
-10.573895541426683
-8.470796992666044
-6.749506105758421
-6.346892952575432
-5.942985622785051
-7.578469505838666
-8.79444461105277
-6.796894527693832
-7.221145471672534
-7.096763144640822
-10.309232297313319
-6.086121525905614
-8.218456183317798
-6.972806533811962
