2.410024405145597
2.6356103068290295
2.7547349593677395
3.916831770113056
2.476995082457485
2.8393833813935685
4.893864702308555
3.3216640653287164
3.8569673915359375
17.967706088391175
11.76258846675467
5.579245646217707
2.8407524085002436
2.400260394100228
4.517691143251995
2.588702792162306
3.0027861174131965
4.479725448737172
2.401490699500413
2.3511141525139245
4.4988841001187065
3.8429571832126874
3.6141127887324447
3.6057805722815175
2.8143655865658577
9.69956202160198
4.201433007857303
5.804775026291536
3.4113919418601157
4.932398171902665
2.4205980266336127
4.003916207081619
3.9651219582354775
2.65328520364962
3.7736314645827114
2.7897806616145004
6.63390107921009
2.3022219994848814
3.619272160445045
3.281902632866212
2.5857979079054894
6.876361083434836
3.449204442748155
2.4388996285746845
2.6159642285929823
2.4418328028985314
14.378266038520115
2.1844787175649083
4.503946197290684
3.698581667494992
2.7146872568978258
9.855133452388216
4.873966420903587
3.28887455034878
2.4950039307193346
3.0462094038955434
2.7185956042905364
3.093035950719872
2.578852093773266
3.9275144706260936
2.4462559324234645
2.8633920161011384
3.1913216214816824
3.7861830039430986
2.2614215929318906
