7.042692306746186
7.2720483354988295
6.208832839935709
5.403308175668597
5.414333207707514
5.346411721427315
5.2985811451096945
6.690485567589009
6.69967729315225
7.02138611808774
6.336355791808996
6.7831872479393
6.978399718423262
6.893505699872421
6.791364834197276
6.607328392693899
7.150147396550573
5.847208346314488
6.407419355880881
6.180114327039033
6.46433487672614
6.140476419797737
5.588660199430919
5.576568658368738
6.030999156551243
6.340154683855537
8.244815341615295
7.672195677869535
7.178608005166294
6.361590399264607
6.343236537108976
6.8729548178626505
6.118060189226202
6.934941625146535
6.672932064258818
6.359055195684245
6.560335399883845
5.39338364723804
8.136290646114379
6.213117891035777
5.765833058670226
6.436362325077783
6.177710561479495
6.071894020306214
6.638876600356472
6.293326048837806
6.506589800663739
7.903024206261069
7.031034151834363
7.279348984372
5.997231096353779
6.264426202846576
6.175425531654983
6.355000453121314
6.555241056952054
5.987088429910587
5.3928028001964865
6.900350957917443
7.023275343471315
7.670360237741624
6.473777142023871
6.435716769127719
7.606058898028801
6.567953246150366
6.569454099406349
4.52315969918047
6.731346137713215
6.066312818164072
6.599840509896361
5.70133162192224
5.9791185896798105
5.178319086034169
6.267799262554028
5.226380638277628
6.439588919294628
5.686200410069932
7.317346663022632
7.473371799650216
6.428849601488395
6.014773758105014
6.806050967041059
6.087459095241053
4.909860845949533
4.694090993589251
6.3672088682698895
6.4187908363544866
5.401895492060085
6.921012679274612
7.30286522667117
6.7030873692637405
7.462038298216154
6.77592806690343
6.151077205893242
6.302664053040314
6.437402112696451
6.343119247775698
6.602018254201206
6.2437989873362705
5.701835788858184
7.798377971378499
7.4636942810264895
5.35669153779571
5.950140066354128
5.9904697068143635
6.284670609191017
6.176279486447291
5.983405075790587
5.268504353200089
6.759258935671497
6.465082936732232
5.647035818876775
5.607483045197493
6.7143949710926645
6.579740296542575
5.414947179881307
6.6673590919455075
6.737175005810502
6.342453854639718
6.602730458094137
6.346776222782658
6.753811019983812
6.5699296126720235
8.346110645564625
7.398551593592455
6.7305895427290965
7.95738367459197
5.960003378758587
8.324272869576856
7.223280434277303
7.722247132613485
7.695237665104317
6.258998505327517
7.062745885650887
6.488574736811127
