164.12252964426878
218.42268041237114
1193.0188549091745
100.8854961832061
95.45070422535211
277.632911392405
355.54507337526206
375.22538293216627
593.9927641099855
345.3907815631262
507.22033898305085
245.80745341614903
409.00952380952384
80.02325581395348
1141.269113149847
110.4559585492228
114.58356164383562
122.47712418300655
38.83018867924528
511.1639824304538
643.7880205896116
258.53083434099153
549.1199095022623
372.76740237691
382.1825396825397
144.5641646489104
416.1114893617021
2256.829410835571
375.05668016194335
1201.152401987852
27.424242424242426
241.73968705547654
469.91388174807196
337.2244094488189
258.27547169811317
222.79479326186834
46.31147540983606
282.0323529411765
338.8801571709234
69.35483870967742
304.04214559386975
76.4046511627907
629.1609837898268
459.98621745788665
464.57172848145564
261.64817518248174
713.286717378584
155.57582417582418
538.5432887855899
205.00327332242225
132.23857868020306
2483.393016255268
118.07407407407408
70.34975369458128
55.91845493562232
74.74107142857143
250.10789049919484
720.0339476236662
135.47750865051904
583.2732394366197
259.5008025682183
740.1692913385826
102.74570446735396
369.4805447470817
162.0843373493976
