10.543218394567837
10.348906477958376
12.197493118968247
9.53572225320633
9.59993838119056
11.343291269566105
12.665755048150565
12.61964418507366
12.366461497450086
10.777385162733786
10.846533728947545
11.764470027724643
10.931700140485914
11.845624830551667
12.21369532617059
10.670998033726192
13.416382976600472
12.964648464126833
11.246713285008958
11.170254404445117
14.814766039589792
12.131381071232749
13.082966407944653
13.95172116748122
14.494626489983347
13.309464174811536
13.541075984456166
14.529768486612326
12.991170432888733
13.942578882437436
10.162762485843741
14.11756778569225
13.619286449192769
13.386098606688117
13.459302637678567
10.841991788831308
9.424691493201497
11.511615896412314
12.85450704964501
12.560272652857561
11.723159957340092
8.520026766330533
13.750735978597953
12.264105424554728
12.81575880687849
10.04481695268463
11.077300459698272
9.837090882780197
11.509189451809759
10.273261927859464
9.951474747555812
14.215066821578095
11.690798114489132
11.592433124162122
10.573347503485321
8.801379997285267
10.89695961198672
10.429680964474608
11.711398414009974
11.012384684887977
9.648710915597505
13.116013241766524
10.299283954421483
12.646989932915751
11.088259068916729
