71.60224203091991
159.5267423187695
184.24143736016896
172.6939781037415
57.45745506300784
20.896852772711426
18.59814710251708
41.58798762758647
108.41831791009544
167.325306108326
50.968832929662206
87.94787478748601
144.87798500536394
709.2840973154935
147.15906804696624
243.02391467200653
455.6340522253632
83.44368246924175
41.925085682760184
223.69869731528772
106.22665854333955
233.9043727924875
41.54783129460228
57.928943596934346
47.06851865199115
80.44477510896837
379.9474233723981
289.2659669215545
177.62190186367545
222.65391544446373
250.80091906925634
334.4432072167072
60.79424248866213
265.89700440336134
293.8336443091019
184.4529523643341
41.104538490594685
28.595533389619824
189.45492110495732
306.2451286032146
256.8761789156377
249.14865613363853
127.40308520852214
28.49965378591299
57.39309030175067
95.45889771773523
66.82167374288002
613.5227419400662
108.89697064326404
82.11231908982845
102.33620057158844
125.42866211530212
173.4807021889082
82.0507084898931
41.17342505109333
76.24907826981335
35.35471357215216
184.9825757680631
86.77564368688076
294.93698642435777
138.66658514972684
328.91411032276613
166.16149782727405
83.23274648063729
85.0073568881848
27.229479803276462
70.70931431936741
74.544498676531
61.54993059128184
137.29320332646478
70.54792303333818
32.15761383381586
19.134340237926267
32.936418136699125
99.712678879942
45.6280188453923
42.93881759444571
282.2497931613676
231.671105061103
62.608255861139966
73.52682130745707
55.638066774641715
39.80106810986607
43.51054207889071
223.94427928
205.85530317746225
133.5253442879499
59.651880984015115
63.886323296049106
59.076201108956106
95.30167387362094
106.05594840652735
48.613575475457324
11.278618660148265
178.29737149801502
183.49448238367737
299.49341620775294
111.05057459616394
63.96352391009089
59.54221753373725
78.7674472157442
58.71020056497175
48.178663307371856
51.325509078949544
39.535888064735055
114.03736382918707
197.50717541466602
23.649050963396558
119.15147413095804
242.2056004652267
124.51204216914809
132.11648947074872
97.01673460414958
29.608604493398445
59.689908613255454
171.6899631887742
146.77873423341498
205.2311004968383
204.7073846538873
37.48439981819976
140.52991473799216
118.8614149074592
137.63662673227
404.2893678479144
720.2724794048712
382.6466462404484
143.02339541685754
244.11853741535538
222.14145638113385
279.5842838171764
140.67242485808237
100.16547345616024
53.499735743818256
119.95126918871458
