292.04476719973815
535.0333503839039
237.24112735171758
114.48876318296853
121.27372845985715
105.94162596781663
117.73019567690099
183.96827434108508
269.52551482604116
337.5346311377407
190.9870383869407
285.1150540171327
306.645023837505
310.46240880463137
355.94714299581267
536.2345088099331
464.24285794460496
202.10132218176813
157.0420323794612
202.7315313033566
222.74647810396985
204.9889181969973
146.4818068419637
246.29396696999973
164.06048516066508
225.1652454876006
879.1956324007547
604.3406370889575
483.123587115256
182.0945425100573
158.43492306761541
319.86206255229536
153.02486175071246
380.8064932216038
272.63966070168726
245.92066193229908
339.30252100183475
118.7271145132394
365.2380749169587
183.00092726377338
146.80561137377637
281.70521521182116
246.863265937246
183.67750373088847
262.9896443704475
249.91208589586174
241.24106891473363
691.6438220822902
231.51854228464802
246.74858890465094
199.23302693943683
217.7193113033366
245.3674896569001
220.6454232454492
710.4561353557968
190.9833070289404
99.609475891284
347.7482120795742
224.88470926232384
362.02322559352666
202.2705881684965
195.52980109793117
306.0818273341773
145.10217996717017
307.93975167622943
57.70319618574714
170.14867736442264
172.0458558057541
190.92814802241432
146.73041976105725
164.0581764097573
81.60093503327587
195.6364116314371
117.09830958567758
293.3542645224913
120.45478894052059
321.1947788732772
604.8577496588221
222.68225626790928
169.5129562683358
177.0031887296997
163.22153542582691
121.84272033698684
83.90655240382033
251.8446511566909
224.89405383846008
77.83407345292396
233.3578653442423
376.7007975985108
276.8426880552006
355.21812041238684
237.73409530395801
154.35195176338638
223.01731125212686
193.48355321271333
187.65734820056588
219.8730588557976
278.14998602738854
174.44717279190198
295.67674374556753
221.53915530432582
127.63069152290971
188.0715180862931
185.98785115805626
147.626473218098
200.44128063810436
122.09092148695306
129.12794182542223
351.83918077568467
279.61790336257826
165.66602292887336
203.30469025408073
296.8875963042972
253.66435111397237
116.8561350625466
172.195165130942
206.89539146913523
146.05043051877664
208.3128743454612
168.97725744053386
253.43119419663205
160.1311671997181
398.5350724471483
375.21840655675214
284.8440690876715
471.8391732040848
129.743697536262
615.5980503006283
466.04562618016695
415.5128667722628
372.974307224798
126.7468570727187
293.1655231457959
170.71042521470258
