0.06574352785294216
0.027753038120841872
0.17719460911960824
0.02470558830629752
0.11148361929870396
0.21512626381245653
0.39115609936471263
0.12471617054284173
0.04917900352980404
0.05007871374513458
0.14706550300468116
0.06301945327941931
0.04192229569960396
0.03093858008870003
0.048147966727036334
0.08902755281217878
0.035750041534498386
0.10060735085066093
0.2042911290648168
0.02933325770229377
0.09311460204052263
0.029794230978151308
0.1877818652157599
0.17172297248453364
0.1405696690525222
0.05782182310647845
0.01342439917917694
0.0224729726493828
0.03506740184472044
0.019161643471036185
0.019733297097833717
0.014674244003930074
0.07909094465960227
0.03633829017002358
0.019642604217614937
0.040568592662153465
0.1347775483034091
0.2148012771846413
0.029270613022025438
0.01401832611763062
0.03015195746409728
0.017964816235088818
0.06421585019153281
0.19297161597590115
0.16465360906622206
0.07368667375748847
0.1241095142209663
0.006403501037898289
0.06251433893664657
0.09642574130928597
0.056965365831935164
0.055409547740150784
0.07586143349793377
0.08768734018363605
0.15156535669221635
0.10303037733562684
0.2123582801687816
0.032519187792609504
0.0780926708620122
0.02224861615509715
0.05389876059176497
0.014085901673700522
0.0385766932804182
0.08390589035088414
0.10722122712903
0.19303528139048756
0.08027565862637606
0.07574116739638323
0.0948324867289894
0.035472355629682734
0.07620688819735393
0.18441129678888832
0.3134749493305343
0.15370065300474406
0.05532449630308881
0.10962770248171473
0.25845784818056816
0.031027414831614693
0.021788051184166952
0.22225474483644653
0.07559230878679303
0.11755190886286974
0.25116954680466824
0.1835041300580761
0.02451798030954321
0.03329560400727216
0.045399632468376416
0.1065703054084145
0.1107244721163155
0.0812360140164532
0.059632439155260765
0.1061459077603976
0.1503920315227849
0.48431265619948
0.028685725913563723
0.03631053395191
0.01319917165381944
0.1059613540886846
0.07309903458257752
0.1468887700446159
0.11343698480442355
0.11592328415041772
0.1121639442143131
0.10046163784141017
0.15332578064907856
0.058113656625314536
0.026737410412267355
0.26780718646249496
0.051991396713792284
0.02151667322229313
0.04348466678215498
0.052557209031627965
0.0600759822358399
0.1833634571408358
0.09703013668315594
0.02491909275283722
0.03461029313784968
0.019012683351734862
0.02309893845452
0.21050481251574904
0.034293526601506336
0.045307409347731815
0.04870180539906223
0.010887578335374279
0.007780240529204704
0.016573051560453533
0.04117975190821705
0.02303310976737569
0.02090384198865377
0.019848609985798238
0.033311188598559714
0.05489638066052318
0.10208952019520304
0.03864196618215002
