-0.2375889798099191
-0.2223222246798331
-0.024404010494669233
-0.14675700919654405
-0.11051088011681902
-0.2512711524820144
-0.13801692355261533
-0.4414356312938821
-0.1176390215488171
-0.1294474888750118
-0.06579330696651559
-0.08997904777571403
-0.05277423142889525
-0.0648607409493889
-0.031936276381261425
-0.18625676829179036
-0.1159489229065396
-0.2271209647884724
-0.12461985955364058
-0.21267062065262488
-0.17712558278606244
-0.204911539390506
-0.14887328505991249
-0.10647046632173772
-0.06551249797612797
-0.0719974350280743
-0.11503819735820416
-0.05836391707442235
-0.17792542070107684
-0.17847998405420046
-0.1507572810336756
-0.07381968659001725
-0.23681326558039545
-0.1020015976899871
-0.05380987717771138
-0.05849040555902104
-0.047374483716459664
-0.1103825234184851
-0.045121963485083495
-0.1085663576111162
-0.1195447999901224
-0.04906668987638163
-0.1323730257897443
-0.6042303920088279
-0.11472176334366327
-0.07292846079963236
-0.07449976333903124
-0.10334282534620333
-0.05892498823051377
-0.06612254535042662
-0.07008442854461835
-0.055137821280831854
-0.07603106048742435
-0.07339122899790332
-0.06681752998183374
-0.045852691473004886
-0.17603854690627646
-0.04794760834423861
-0.06981192734623218
-0.1552948256620292
-0.17911551374410195
-0.053816799983436435
-0.051769159767900884
-0.04514691390395048
-0.044531962551891915
-0.18245423253264856
-0.11305304207699045
-0.08622587421906053
-0.06876293013201577
-0.07618300064981158
-0.09090397987788762
-0.2973765376484005
-0.1027696119602618
-0.3671465988224985
-0.22439623006237155
-0.23746842741472515
-0.12691750427037782
-0.08890555174512517
-0.06481643461295104
-0.14950047491001364
-0.11642560403600337
-0.11642560403600337
-0.056882161989328675
-0.20590797641070413
-0.041180484807097975
-0.03784492431721186
-0.1914580186763914
-0.04577605040178112
-0.05451840176209074
-0.09604999116657577
-0.0705460919561304
-0.0796349271901542
-0.0714481208715645
-0.21255627137633834
-0.10777547296099574
-0.16417853732780668
-0.251935565621905
-0.07902764626360402
-0.0778424688869692
-0.15988346958959052
-0.06840047625541736
-0.2333959109644718
-0.08350916034704535
-0.09073367690547583
-0.14897185682172825
-0.09533114049819423
-0.040785087772972406
-0.1879532502898609
-0.02797922902777564
-0.11329049784205025
-0.15275479120516336
-0.21602725689039956
-0.21261692266960056
-0.23297394276692154
-0.16388470928514245
-0.23619502800904416
-0.09059241370834044
-0.1865233664352033
-0.15874089360343194
-0.15791677612137825
-0.06498290118016456
-0.16146087005207968
-0.1107196353809346
-0.3085053860835477
-0.06887527110764312
-0.042374536615333296
-0.07217060199727572
-0.08675435247235166
-0.18176845267347
-0.06735761549953914
-0.07537766828133921
-0.16613965910272135
-0.1808325261514892
-0.18437979831850326
