-0.9461368161940447
-0.8311123048003493
-1.5938670357028082
-0.9524065303994697
-1.0075448620867273
-1.1057228064201363
-1.0370919347008654
-0.9799990484312612
-1.165248658228199
-1.153793179449446
-1.1616226576193884
-0.9479731658224191
-1.1999604869041418
-1.049936552023912
-1.2828981825925407
-0.970493410244845
-1.1137046387743252
-1.1591204228260696
-0.5215573279743918
-1.077984580258994
-1.3219880797023733
-1.3561618469593828
-1.3595265850509173
-1.2014477505230734
-1.0887185007968554
-1.0015907882570092
-1.2370901968744832
-1.5853000305333695
-1.3168005484617826
-1.5144716262997795
-0.9243279211012981
-1.160802178447943
-1.263162251410482
-1.2009834773813448
-1.238562311605419
-1.0474636500857113
-0.7899899015030056
-1.0405807472956157
-1.2496657556273287
-1.0791330168699502
-1.044336511106567
-0.7582706466252679
-1.3239045079059537
-1.371675384136502
-1.3461124052790845
-1.066881994002886
-1.1544841705318918
-0.927736378408424
-1.2114530817956954
-1.0868838623769361
-0.8872464484768962
-1.5636846300740341
-1.154622103488647
-1.067541772728027
-0.8916279172506203
-0.8043236519813922
-1.0462738221953085
-1.193081948460579
-0.8007698355792028
-1.0907998649007067
-0.9751371200120817
-1.3422429686007642
-0.9994907445472092
-1.2070198819484934
-0.9341941389481934
