0.7139507018971489
0.7210460705165027
0.5272977158073031
0.6939172458225084
0.6562502934575775
0.7648766322814811
0.7686045802398832
0.5303536597069894
0.777258816612402
0.8456939841368066
0.7319532969124298
0.880890978101162
0.8273578928863599
0.7003844085851386
0.5315171562775345
0.8347888111729731
0.5762921682359033
0.5660574025197246
0.5034996133666872
0.6862963582804356
0.4768256907229488
0.7683406403372062
0.8276602535835063
0.5071697385298113
0.3757065731494572
0.7123661415093389
0.7995498758090088
0.4995026082577018
0.532712874775175
0.6901948004385791
0.4014051973269246
0.5782060586115972
0.5964456713916673
0.8243672484998705
0.4108745157239433
0.6692410629567517
0.6676851872673092
0.6932608709501477
0.6049297011359331
0.6844738838639886
0.8215916393118711
0.5094349838606458
0.7151790252571636
0.8107737031032798
0.5947534032950912
0.7556366186440129
0.6828978369047095
0.676314039087916
0.7181202517337217
0.8243253762341229
0.7688000704999368
0.7305534632528683
0.4440512420737856
0.5468518527077434
0.6577667151236177
0.6604835268562569
0.8204382337143498
0.5784303818631298
0.7979324050933952
0.3873646388414429
0.7768829500043289
0.4725529869903528
0.8005578065571465
0.3461915818960161
0.6276929167766401
