0.5989622665718993
0.6427395728793575
0.6768757992029417
0.6734720922959421
0.6637125881182759
0.6359529691626112
0.6509068211233945
0.6803019005565117
0.6295317688285789
0.7357211018701338
0.6571630346601531
0.7922818530082254
0.7139536429134571
0.534670647830717
0.7212722161519302
0.7798632194663359
0.5763055906301875
0.6005843552264876
0.6828224442151446
0.7072738878166706
0.592842690793701
0.6983784759511508
0.772910329453447
0.6172592118298587
0.5957692621887418
0.7728931967165316
0.6961939535713495
0.6614350289192724
0.7394054381754442
0.7161841880539647
0.7769809600628343
0.6933638625429644
0.6721168728729807
0.5860711976601982
0.6105946572623008
0.6184122235880833
0.6263078111634406
0.6347406364236978
0.6962239604979574
0.6965202177077439
0.6492850076479671
0.7548538364061284
0.5287826481767182
0.7062990230233342
0.720635755955124
0.6033176659788825
0.6895425792046298
0.6646422436302704
0.8528584266860414
0.769217425462767
0.6872760987492476
0.6977833606240497
0.8366707039390782
0.8136264674592261
0.7354872001573748
0.8079919169568698
0.7685096469941298
0.7988418404173849
0.7595670459069624
0.6679238202975145
0.7128811312992062
0.6397024842813487
0.7557330375198146
0.6813909455847955
0.8313625088523016
0.6508006880827418
0.7228597564981324
0.7117645674829142
0.6780820832469461
0.7502893766834124
0.8218921631682314
0.6001713814424516
0.7219159528705558
0.6888859323884212
0.6128584049196595
0.6768660887210348
0.5815661784353341
0.7139920915109368
0.6931266983414156
0.8687428044929755
0.6490185908143402
0.6526778065384004
0.7310939642538704
0.8292016278677655
0.7373320202100356
0.8156054693405448
0.5092436101370581
0.6425502123886657
0.6710443789103736
0.7271051519280862
0.7651667341104678
0.8031614721126044
0.6901508490023064
0.6592898319942125
0.5953143812016217
0.6134524977910799
0.6208220584968845
0.8175785346984628
0.726964910296672
0.8284727541328263
0.7332025142863654
0.5888304125211002
0.6678529216219669
0.8426899191379422
0.6167386341445734
0.6945226860825108
0.673949506430361
0.6785565802859364
0.7270258506304093
0.5824046598669352
0.6430218418902149
0.6945080033501483
0.7199185390815434
0.5851423411269436
0.7142075936498486
0.6230322852597417
0.6469933564208277
0.627628578043341
0.6753665160551882
0.6468174995290282
0.6089118769271262
0.6072791765183267
0.6781397689658741
0.5364865816399691
0.5494024175719058
0.759401488797717
0.620437955361177
0.8425770124101596
0.783627547911661
0.7731820798204373
0.7071398978800032
0.6001782203537998
0.6588954179988554
0.6028036162134941
