0.00490499190164602
0.0022372635502876694
0.0010375910075626801
0.004504593623425977
0.0044204015129527255
0.006327033891090284
0.007873697127194448
0.007084247579579063
0.0018878165732033128
0.0021137230286152704
0.004231246731988044
0.002306417401683117
0.001785651091353134
0.0009652373336153096
0.0011478759439983574
0.0028528528823126664
0.0024791908978773263
0.002625160795723893
0.0032472476733558906
0.0015314146891245231
0.003730087617066304
0.0027229868494493244
0.0034107322863459453
0.0025599800762904626
0.0015698666221781053
0.0019814321727377538
0.0007843863147801291
0.0009410146380137883
0.0022382747898985434
0.0013572082431846065
0.0008987702665556784
0.0007309178877359429
0.006007988256066194
0.0031175227804044387
0.0017933608273014746
0.00522513569800087
0.002899818241454871
0.002773011719268161
0.001021864928235016
0.0010554045091667496
0.002150387647465756
0.0007611337081359622
0.004191120092895668
0.014400514319905374
0.0031858081357298675
0.0012805574503288884
0.0037122875591533476
0.0005181777748944605
0.0015743804388667038
0.0016388941361989006
0.0021876405292565087
0.0014726826807829267
0.003127370112688449
0.002982663320100678
0.0024582475501045307
0.0014096600425753374
0.0058691965284738854
0.0015622614632283401
0.004577361689164875
0.0018632955556765066
0.0026928657993603505
0.002092285860998216
0.00045179091087440946
0.0025763334245195147
0.0011272631982731582
0.002816926572355353
0.0028232422355135376
0.0033570342720313853
0.0019555684144160943
0.0011588105473077461
0.0024023140971524515
0.0032682828432241
0.002454330614298506
0.006480686153776406
0.007722712342527788
0.0034826564220783265
0.007787826990784634
0.00275745989092242
0.00202394521421647
0.0058731519043475145
0.0015616232879454592
0.004003555408847291
0.004999898558124386
0.003425493745384105
0.0004488003672033706
0.0009031598272098443
0.007916088139372085
0.002759706940393097
0.002553495735015136
0.002686118196242397
0.002887563665614657
0.004479912671253306
0.004033242094593748
0.006306716134646739
0.002203660232580046
0.0029146285550149024
0.002417430663051416
0.0021575809583994697
0.002267623944156485
0.0020665533979215282
0.0012940990366186538
0.007114637740644325
0.004223935302777193
0.0016245694050210527
0.0038493578270044695
0.003238904384708434
0.0009746650109600783
0.004094877887816666
0.0014576382117907146
0.0014235793582844589
0.002281320898230535
0.002821520288570221
0.0033680293407716906
0.010303529317882424
0.003085882445531733
0.002779504364549365
0.0015411786155187872
0.0020934515612866128
0.0024442444698661273
0.01119311081733997
0.0010214782568392117
0.0026005770373819827
0.00248545419156367
0.0053273011691749176
0.0009455058363015613
0.0007874807295947242
0.0034337437957015805
0.0011848799202776694
0.001503162531360504
0.0007460186768079356
0.002819243288880471
0.0027094686954770453
0.004993486146847306
0.0018005093935435574
