34.48717948717949
31.04991948470209
32.395617737179855
33.164532019704424
31.792729591836732
20.60347551342812
20.231627906976744
32.276234567901234
31.407996560619093
36.63333333333333
40.53537225826383
42.06811005863779
43.3767303889255
51.66668579956377
28.19724457782021
45.19654556283503
34.560975609756106
25.65125240847784
44.03591585428425
52.030018761726076
45.958810068649896
39.367509986684425
31.018419033000768
38.338592750533046
33.762313715584746
41.052835051546396
58.56496238684177
46.8230908195106
49.098731658791344
41.628140703517595
40.806396148555706
40.29051266941661
37.42326139088729
36.14343434343434
39.466912394994004
28.608570251339106
25.482679796026027
28.84435537742151
59.718731117824774
59.23418319169027
57.25083932853717
62.278684817511646
41.878024193548384
40.10404624277457
33.43209031816627
25.921783010933556
31.107464420563463
40.716212642158155
34.85004516711834
30.670496269098663
37.08876346844536
33.410155846836616
34.29094017094017
32.90362626592617
34.5491723466407
32.18051760167176
34.79113924050633
39.439464493597214
33.27683923705722
43.12110257568911
38.98292682926829
40.40434782608696
45.71827025811168
45.65533141210375
41.79542322629139
35.344954128440364
37.00236326806212
40.880576987588064
39.17135915392311
40.122554347826096
41.13864104323953
37.581595974119345
28.527506654835854
38.85411764705882
38.179104477611936
36.554323725055426
32.947122861586315
35.2725
49.14486803519062
42.62695152013147
36.99149223497637
37.938162544169614
29.01425855513308
18.864473684210527
56.21805716813181
38.60366972477064
48.73782771535581
36.25722145804677
39.6008788689339
27.162190082644628
22.661290322580644
32.29485621709194
25.240186100610643
22.230379746835442
42.962168266516095
56.71492537313433
58.39554794520548
39.08641523251556
29.62237174095879
32.69447903694479
30.25393010263739
24.57425742574257
32.41302555647156
32.821534548537514
31.09396751740139
29.463702870005626
32.112524461839534
30.585714285714282
42.342408153084136
38.390898483080505
42.18088386433711
39.75488069414317
29.45931758530184
26.75366568914956
39.110611510791365
39.71611071682044
34.741869918699194
35.604621309371
38.25
37.97055214723925
40.3002474022761
42.87162606978275
45.15670436187399
62.65714285714286
53.46601510439805
38.017794676806076
29.478859390363816
28.370023419203747
24.61666666666667
25.88775951557093
28.779466590192147
34.21995043370508
33.751304347826085
36.80856123662307
