0.15382807424000267
0.23795721348990082
0.80456640061934
0.9755591687063953
0.30809559758629107
-0.4953880906387815
-0.3000249228773382
-0.42262420089690267
-0.15465551630401464
1.2649159906037986
0.6882721479535057
0.6825117504427772
1.0777578161234616
2.414059084600782
0.8656128194220502
1.8200279697760908
2.153946830933028
0.4054400557852718
0.29306108992810664
1.485623297752079
1.7514289979503368
1.9456371747269616
0.45464164162670057
0.7100349916877278
0.7446793065474451
0.7689195154305525
1.5365449099394137
1.6424773644043698
1.2227570843658366
0.5966239037728753
0.5821084634182754
1.2019643237233326
0.12697946702724058
1.854550674222941
1.8586366807942545
1.7593334828972633
0.6130824240104085
-0.22447121299892644
1.4187259900288398
1.5341066964318808
1.7544796555619648
1.5721980511555056
1.5508077636334847
0.3205666056027392
0.5873825466766723
0.6739595730627067
0.5456774082206368
0.8919987111799758
0.8756970673693475
0.5254320804460169
0.4004956860296948
0.6889784912822894
1.5118726721941815
0.46103327387099485
-0.0051227805685133245
0.43543870790580824
-0.19666709445633676
1.020986715138845
0.5607326626520956
1.325007241548579
1.0179134139512875
1.104018366653684
0.7540931002601519
0.6533034331968042
0.9441868354678643
-0.4876999572512788
0.3091587315045828
0.44870072135524636
0.3565189068533067
0.495774499019011
0.3796503463594101
0.016687452920514805
-0.45820153698671423
0.513318810304134
0.8707211854276953
0.037355109388572914
-0.5719565189528405
0.7565130334834727
0.8531004104937309
0.6119958160067861
0.4110023979626832
0.4329953248955034
0.0075955975861039075
-0.3407367111175625
0.7012008097595674
0.8369395652768022
1.053159353860967
0.42618515873244267
0.5427349593366024
-0.7898921938686746
-0.12185652042305298
0.710973833066584
-0.03304197359128693
-1.3651748945876012
0.869489023290953
0.6343820258288538
0.730595825218986
1.6361064194321864
0.25029204608369693
0.24677692131819257
0.5121890901844138
0.01044601341721513
-0.036986784191707846
0.005947200458638237
-0.34388778885923754
0.41049149369876076
0.7296410093095144
-0.8678242481827824
1.2489845924942826
1.4031783466626038
0.7653360436672718
1.0329350056624844
0.38660558175168375
-0.8625942712544116
0.23418871412083772
0.7875026272078604
0.4632283441697974
0.5010591099694447
0.9270659114500979
0.3468058348216934
0.841875789683653
0.6052596433390448
0.5693489579506978
1.0318326811884513
1.4318560973375947
1.3301488894724178
0.3545886284709182
0.16860420457264075
-0.4780433930194169
-0.16655509600780743
-0.2962102229203622
0.5166169356566661
0.45480296476748316
0.4504370632744561
