4.881054411789523
5.043386443783438
4.253279245304264
3.982113910728612
4.04519392517757
4.0265418896201135
4.140108770166797
4.699900566353564
4.612801479321091
4.607511863370894
4.369020720074025
4.485862487967097
4.445749821586609
4.6399223714425
4.47258248784385
4.652315692758421
4.743843676346122
4.126656380729013
4.316136562582392
4.408790914845215
4.49754610382348
4.351071205902493
4.005441579708187
3.8970686428585695
4.132783320869971
4.28285994600177
4.902166621804079
4.671578887629453
4.673370704700578
4.290279330420589
4.264971564196807
4.607473078307651
4.291627534134968
4.614864734799144
4.3863028588062365
4.234619089796611
4.3016229852378025
3.988884332048473
4.671718287443047
4.192548475614962
3.952074194475745
4.351045660432193
4.30648367620363
4.425120959945644
4.4750044498189565
4.45591168402694
4.464901491573662
5.007016094323159
4.331821878781164
4.354059074927859
4.134594852586459
4.256107215165177
4.153515167816097
4.238119655094654
4.072610913935839
4.1926392407285515
3.9060229809547566
4.425141274274735
4.404179194190086
4.933621734584848
4.496861071312939
4.2600154300056605
4.29737809038537
4.0532405322323015
4.1723875525464935
3.426520132471997
4.305212660326866
4.1984121870448
4.160790795199501
4.0032761335088844
4.197672638663956
3.8210202212124096
4.401417217801918
3.8704835742803674
4.447129707212072
4.039406682840273
4.81036146643594
4.720956289065659
4.313006566756456
4.204227289921142
4.220742729182399
4.4438540412275165
3.734709128034917
3.4541252166815712
4.333641171419481
4.257685279865859
4.0022409238149015
4.318242245977654
4.413161533757667
4.535070173220956
4.710243600272029
4.464186628525153
4.196076214785704
4.403429726116877
4.510430393207134
4.537771417509784
4.507537655904709
4.33441535662862
4.084763884766208
5.017753134305712
4.3789047845454565
3.8083369981002115
4.216463130768839
4.162918611268875
4.3742325731309055
4.325668778607069
4.015103768423587
4.02126293400143
4.2973190984038965
4.361285333169518
4.058047044001746
4.017144858880823
4.659032713113963
4.551719961134827
4.070194371125684
4.562564867750361
4.527534031611086
4.525603337622201
4.645198045494165
4.316441373705223
4.532901160361073
4.465505948114814
4.992123975226178
4.970166004684121
4.49268098906631
4.738143714345021
4.136095301639451
5.2315085358652915
4.7926025215293935
4.88962629281097
4.70881736021167
4.332916152945044
4.524149180961282
4.2926161079613765
