85.54403249669558
93.82641019859102
223.713326004275
157.16987104221144
176.19253632378968
68.02509420473794
167.9624618020469
83.17724235496951
103.10447697675043
97.44200793547749
163.54152897116606
226.51886698720256
181.29389374771682
168.04668066484845
224.08937597797302
176.86026170097904
93.51387003269579
106.57408392960009
61.73146139600245
143.05395888019873
159.1626485307039
145.1619733550591
103.97610249715049
161.45527282604885
111.45978284913859
113.83754082050608
149.72917167251572
205.1957720566011
247.5011058497627
177.64306748361898
98.45616064000878
125.18213321813404
99.7434937584638
121.91921984325943
109.44159740045208
153.9328084360054
92.5570309185562
71.3953157813864
87.81897356035206
68.0652389807215
206.7600133179649
18.14884283709989
120.1103670874666
130.69975994672464
121.27060575851877
55.59758387351194
51.22146838776607
279.1808830676425
100.1952273474819
236.07772910930507
67.11967252130225
181.9808289988951
138.4267530803916
109.79414104345557
37.33130146019129
66.29429558053305
99.59918470607113
242.7171434581801
98.46748348283887
126.30876271197336
129.6323568447908
100.9831068350601
86.13529079487513
59.65279866037414
247.93846923242782
