178794555.63085613
91554796.42876999
603525042.782368
2751214.360107507
26352007.668733746
258818098.79333764
106468185.05272548
165742974.1566444
84676272.78260598
320656692.58386165
53490882.53585983
29476502.6525602
55255494.38937894
33264039.253149074
80363944.64796829
8810049.122489419
307829882.2463691
345231737.0142408
14545851.91199736
106983363.6972006
558481785.2133299
245696452.79584217
505648937.6255559
234047506.72762537
424741670.3001829
132870582.65936236
142229770.96910027
1153331123.289124
97843574.44119456
362492896.836289
3133584.0665281387
402244129.91497177
703917174.9451225
221531795.73197076
297403810.095984
146073448.34464556
13903064.96660974
278050825.5528192
539763753.0719881
110309898.49135512
87177602.11941347
1338856.0576617413
345278519.08687264
75938533.8074126
163038456.48471612
135791185.27297467
366923084.95855737
14598786.945760962
44911651.63241497
13716357.5081898
92432183.0078295
2078852157.1805992
87954892.99043125
55170651.24133567
27248599.35541741
49359639.01053631
60986942.57279579
262297448.43808663
52996989.49837344
174807100.0058284
8317095.89450922
3613301657.7501655
323009585.5366105
960061113.0293722
42742145.637335695
