29.32171103281249
38.55196028507323
213.00639989900475
209.7983928172996
62.88026046053774
8.248907220112637
8.68736091311417
7.770028630718719
18.478536289666078
976.1357739483577
101.32041936836427
186.67788629998168
295.9486209595052
18594.935141465077
239.8881153377509
4437.023919841775
9259.14392723594
60.44057713152336
52.193002020495264
832.5250654348564
1430.813302275751
3302.0975906377253
62.667302732068464
176.50838220926738
107.7262934880542
112.97643837381835
1198.076323794458
1481.3985819101945
562.9128356889007
92.48763767020279
73.2330178797213
387.8121630374402
17.853176224801853
2724.8302732780803
2810.0366832258824
1888.89194141064
85.88401817051516
22.028457278112512
1108.2950079047216
1341.2219162507447
2384.8314860384617
1378.2880455333866
898.721352439668
33.46665856815883
105.46398542535059
126.376259923575
81.28236672253527
177.59054743417977
1105.564906480643
103.60262327870159
54.000637998737844
114.69707356398709
3761.714248165481
90.8309050612914
23.40773828190381
150.86590402255976
29.56899687282051
826.2602139442297
143.51876771337194
462.836162099076
218.55182924347287
316.7042065422413
224.17831365824375
161.55304841979768
862.8268731222197
7.9676459020283215
60.52638100134398
57.28437444906506
47.272992667330215
74.94319635971063
50.882066947833394
24.90734135883061
15.310532028729787
72.55022934694175
161.7926132246164
21.715475455711317
13.872423383464493
197.7730751619801
142.3446832331947
798.9614737160093
64.21901539721074
45.83520071815163
43.27263973819849
15.909630450905436
222.08182616976814
316.49433203871865
192.8594826810598
52.960551825376406
100.48550670063335
5.428753073347759
19.848784422997085
231.38140682882062
30.73304636381789
1.4678424465205815
172.90016212864006
125.3696182205255
149.7809207645289
5716.209750307304
59.178867121371354
64.93393370605078
131.126209773579
16.564393238800502
19.658437611324853
42.882172264631684
11.120171776730091
49.79733506615803
140.15681441457883
3.5617829792989344
558.1110392713485
619.7101632535282
109.25657948824251
257.68776538069335
85.70175854941094
3.3497314648611387
47.91744038852657
123.73631277024691
68.09668940410944
63.64159558659532
147.44310199594833
45.89254127922136
186.45795201870212
102.10537037639999
102.14540450138892
150.8416661538249
2237.1785963639486
1524.6769058490781
55.07011236959307
50.558288691947496
8.912616452326636
25.339731877722702
14.142999792634274
63.64498426996724
58.760760936609174
61.287629887543204
