6.268191358348307
6.363600826984232
7.705237013425342
6.064235832469914
6.340651632832304
5.954585045802508
6.143975695396885
5.917812404863656
6.530982920526269
6.426799020932775
6.629034125469035
6.502073375629204
6.67180532931381
7.272630661344429
7.150692142596748
6.608819658127208
6.614750283058423
6.037179465100383
6.381230366058744
6.310906014426344
6.283474557683158
6.2550764885970125
6.304663430527291
6.345129382305283
6.782427797471775
6.58016238522461
7.190571305003593
7.590951604915967
6.955086551635958
6.5901080458078365
6.808541080347828
7.159503208956345
6.430811456284552
6.649160133843966
7.12635383702679
6.974101759836241
6.90637947908455
6.326447761254749
7.469499071462876
6.782934805788993
6.773892219695817
7.509333260942906
6.547716810220393
5.3481602373384005
6.581567445242444
6.790035295840971
6.636465049399201
6.9131073815033215
7.1228951959028635
7.223019142630132
6.707415698861952
7.229709490949464
6.9114634086576325
6.671696948547557
6.859506982546039
7.073157344456476
6.359204689545341
7.171969814086873
6.949918476757724
6.774537795814004
6.467495696896234
6.599317727399144
7.686115952477289
7.098811031895165
7.550305149341653
6.502726649867578
6.87239249267771
6.853293581203671
7.151576631071307
6.925962983330825
6.830958064353666
6.2582409472845315
6.624420517542559
5.580414920460188
5.558113595213067
6.040189521792644
5.976598411629124
6.224790879726603
6.561515153993229
6.4852929891228985
6.98023493614167
6.36582502131423
6.6030362679171315
6.310697241458468
7.516289309542468
7.111919723200047
5.73705234743594
7.101169500903228
7.0726477107931585
6.433074219388773
6.689793310266743
6.542581172573853
6.609212942126507
6.100917496557434
6.4342882383246405
6.074197050755366
5.971443511562739
6.87564080773035
6.4916311928266355
7.015662434481291
7.137439343826836
5.554731339931218
6.301099267826434
6.5807956219838415
6.1164618058767894
6.224689403976654
6.8519430334077684
6.09314532445371
7.584784160497252
6.703454294322243
6.391295582741563
6.443126300732738
6.279732255937932
5.76785282449201
6.154499619993017
6.306603217130387
6.647315778204906
6.21723894222524
6.345775349789885
6.1091055546660815
7.027047927883392
6.283760924592623
6.582616254232995
5.567196788511341
6.5821424378058175
7.586407512529582
6.272534166914244
7.089945871997811
6.563177028063136
7.0025304899536485
6.862167830446424
6.305816731548991
6.323688053615044
6.448056100269322
