2.680918741411742
2.8099492262262866
3.5090903141247196
2.9879464845993176
2.4915629651233244
2.2702078225693763
1.5783420366285859
2.426805376860226
2.8156722236463816
3.5516195351214046
3.094781600005648
3.644603242928384
3.288941571995494
4.38710448208929
3.0670279592529366
3.762750284660807
3.855082884454681
2.8713288569607855
3.049047419529026
3.400294103838553
3.65533311475656
3.7421291403653494
3.2555551959934323
3.3162295203095558
3.0422370386477864
3.9334119320653955
3.8727987883636388
3.8134666933740977
3.3992377082348844
3.5122913209218036
2.8503306586048542
3.9186250689436086
3.287396457191788
3.841575262548756
3.953572579963643
3.472334508349859
2.7537191393563005
2.08914409685595
4.388494459512741
3.708199929804175
3.845603523790983
4.440180530916781
3.612539663741082
2.2373096348627928
3.0237960306278544
2.8024841922590453
2.470250932858722
3.169739219451181
2.827818388557498
2.8095089306179357
2.906592420438612
3.3063298684946125
3.4998700992868486
3.2894563581252085
2.7243913972168334
3.2244745482806296
2.1794442822446904
3.1375540228886982
2.664498002399589
3.1274599315879184
3.1088042559573457
3.205685924905242
3.680198662154701
3.2139933284342925
3.738117342685114
2.695715733250432
2.5477231710137107
3.1603063306664967
3.5838243280920943
3.6106686625445947
2.8854309001280205
2.4531135650860225
2.4938437542324574
2.259444625026359
2.6429117118764838
2.8728655396402774
2.1888392077739827
3.538163653887543
3.403586888172025
2.6978310496694573
2.872695509830773
3.5422348150860627
2.650899190793291
2.664205407141648
3.711518122467239
3.633834150909251
3.216262112612619
2.8944362268476884
3.1129056446855135
2.406920677633918
2.490010514012919
2.4957700246929564
2.6472840229527743
1.8734153324339062
3.0574736389568713
3.7568764098858454
3.3589761650736447
3.540440472709204
3.049688450013957
2.600655009714152
2.7451328810525664
2.314730727078433
2.5614092737161207
2.9292643604191038
2.3445058263378633
3.062917931924533
3.2394339334514726
2.275361925884274
3.5509615713672553
3.437342689629484
3.5535279104483943
3.4416124301780346
2.2861262179123263
1.8568734128832256
3.321097619410307
3.060030560694197
3.3641237283385785
2.7284196219976153
3.0130402370493163
2.718543946642023
3.3735282702725384
3.2631279255900836
2.857786418553155
3.653438649044459
2.796850605684771
3.8024537742228888
2.354036878176473
2.6274084551857944
2.6346787787775043
2.401645997210447
2.092593705724568
2.7207736158418334
3.033121597260977
2.919872936805228
