2.624122052851739
2.3843847653510926
3.055177977027353
3.135545387627989
2.7098795178940187
2.201470002712562
2.8406643827970965
2.5545430994971396
2.7071972776127122
2.306844343912447
2.861678878242171
3.1693135332742934
2.5307197884381716
3.0405241001926804
2.932236173539476
2.6712778082353377
2.3575028321950127
2.4781915022893646
2.6568917964140994
2.98045425527179
2.4775538919166067
2.3353515858894474
2.4577747508699046
2.775450425322327
2.72263423795585
2.373858691589899
2.5966437896144763
2.5675144743114098
2.597985338075253
2.3862126741107943
1.7314475045425157
2.708754904510194
2.4045318261008046
2.5857186463180413
2.632736506306271
2.5794573153109073
2.6629327149921
2.407256359305412
2.123221218853114
2.20260757611846
3.062332148340467
3.076494015266718
2.4112520561562323
2.7217297568855927
2.5726258201202707
2.0476078624291176
2.261904728922069
3.4611431592913324
2.7124838930728
2.8060934640942787
2.191326330729247
2.618403139631566
2.536305284108081
2.410522254627267
2.0845180185262207
2.489046420776076
2.803144917880151
3.049507793216151
2.719884008980662
2.7935953181350026
2.9270109707805476
2.7360229521818833
2.325923273621757
2.4119469479521864
3.1160370217362203
