0.0071836406527742815
0.006379644925890635
0.01072876625420693
0.0066195313174867935
0.006371603943718996
0.009037172902077768
0.0034049250413163467
0.008359890511733867
0.007086249695969255
0.006000030233939822
0.003904010661485648
0.00295132513464717
0.009348678898539985
0.004251558895221711
0.008223524910452472
0.0075036897855106565
0.007732147370950586
0.009825488892070104
0.0016714150047483385
0.005852566676816319
0.012481731503304656
0.016620888018669455
0.008578441648846497
0.0058818631641374035
0.006519616243931486
0.004251741031596063
0.006256975250312929
0.012998412600462843
0.00830691479550543
0.015962564617166938
0.013546638462661091
0.008775721847644514
0.01756593120396594
0.012727648313125627
0.009245016787742154
0.006887820419936865
0.0034962092027995572
0.0053842943630998605
0.008933427235614307
0.011034710334781723
0.006612405681927168
0.01861995328260896
0.010125036822970364
0.007300118495669277
0.007319729702407176
0.007995125878524715
0.01043378864046884
0.003388165599875839
0.01042139331898002
0.006292996481041785
0.013338891226127015
0.011764744167498743
0.00862933108585275
0.010044573593768064
0.007995536996297372
0.0022622676538230713
0.003845921356097078
0.00556826354896612
0.004480083118482434
0.0052130681015465094
0.008038499516985062
0.009250938744839638
0.008252245741355227
0.007979781948186337
0.0009736923518882726
