302.0
245.0
144.0
144.0
156.0
183.0
206.0
327.0
282.0
228.0
231.0
238.0
179.0
132.0
221.0
285.0
210.0
248.0
273.0
297.0
258.0
224.0
182.0
266.0
209.0
190.0
304.0
234.0
297.0
256.0
280.0
223.0
229.0
187.0
185.0
168.0
179.0
173.0
270.0
297.0
326.0
304.0
328.0
371.0
159.0
152.0
189.0
222.0
230.0
197.0
212.0
178.0
168.0
203.0
247.0
182.0
235.0
185.0
175.0
216.0
221.0
144.0
207.0
186.0
196.0
206.0
252.0
255.0
246.0
205.0
226.0
228.5
219.0
203.0
202.0
194.0
306.0
219.0
183.0
208.0
170.0
170.0
151.0
156.0
174.0
191.0
154.0
183.0
194.0
208.0
211.0
198.0
189.0
267.0
125.0
123.0
158.0
185.0
155.0
191.0
181.0
158.0
163.5
205.0
242.0
182.0
132.0
184.0
190.0
203.0
201.0
227.0
238.0
253.0
274.0
230.0
185.0
204.0
158.0
177.5
145.0
189.0
230.0
193.0
175.0
244.0
108.0
206.0
205.0
186.0
207.0
194.0
205.0
191.0
