0.027697763763539832
0.00934081670750772
0.0030369201840517077
0.007356264001623095
0.00603171554030856
0.01675186979495124
0.003524930570410742
0.021795917629243714
0.011175845858168358
0.005975941677811723
0.004132605081361479
0.007800289387122455
0.008522981349552193
0.0156466234166135
0.0015177985094888555
0.01073084235532873
0.009057426307990451
0.03027688903920243
0.04900831733768116
0.004622845826017668
0.013433827369636218
0.011520573600477285
0.011034856155224544
0.006918592467005719
0.014902018674955896
0.02249495181173549
0.012571681835139157
0.001045573015444662
0.0021349774859337925
0.004301374076670176
0.038646731049609855
0.010640250775229707
0.005577739264774179
0.00863146399283055
0.005239497090854231
0.007660324621857806
0.014232594449880504
0.028050796106832053
0.02115137337131506
0.04279013262792427
0.016783906224474475
0.12454209900814522
0.004016707168791923
0.00886266027198491
0.004984871817269632
0.035432674464793236
0.00494961414130436
0.014179486413352203
0.008136203224025251
0.010013294327683005
0.0404044665897504
0.0017490953769384169
0.025983127863154102
0.03413560118594758
0.048901691958114335
0.032888189478540865
0.017010996440009692
0.0033623669983661704
0.05710043015865841
0.003364676923323789
0.014698580690692712
0.01691117034368277
0.05074410050810014
0.015095336504262506
0.02005130897771153
