41.97255553199635
61.313924663929825
152.41305404210448
87.06470931619802
114.37355033006662
44.18186232046527
84.55657460235876
52.57470347152026
75.18445044623323
37.09776323605588
62.65762321249089
103.71833263350952
131.78325189833296
83.33519188494887
155.4632165178268
130.07854018690537
66.17999324655031
72.12214037397324
24.54688803240167
81.16969468292078
130.0850339773929
117.46749384619787
68.68516839580207
102.59950577688515
50.539120719576815
66.43255558082238
100.47203811829321
154.21242107509866
189.6838163324419
126.87666693182504
76.54416723944814
86.14802136315308
69.22921127121087
85.54377814558372
68.77602885803385
104.68028064237407
55.52999712352197
42.178972649156
63.22042493097799
40.28362411576714
79.27797583177872
-1.2315808204486074
84.75795667204682
83.61848390438328
73.42828991165734
26.672527857972273
26.245589761801945
154.4205035448884
51.679440740432604
174.1672455689088
36.97534390586465
134.08690669073522
95.09745008246789
78.49883440888178
18.86929002174052
30.358404744252912
36.539673823707155
175.42696895026612
51.21096297116515
72.81618847525539
78.99880032647346
55.558636471282966
50.76483897139777
29.90534174216753
154.38223941932702
