4.190237292794387
4.682380870044658
5.18914970233119
4.060701719104627
3.6451429586817867
5.19136910741785
5.685146134026833
6.27223520292035
5.802326584899698
4.157106072450835
4.553122521090016
5.954109094425209
4.791443288855117
5.389021240881032
5.346174602633478
4.7859548950561095
6.886230015872447
6.272795686774279
5.766009643877525
4.531080439079443
7.629659315713197
5.530563032767096
6.131404022261363
6.625609710388356
7.387598575058485
7.162409258529963
6.658176976157469
6.08230549795459
5.781145730755061
5.991345024043967
4.849727977706613
7.112440408936163
6.709721889600738
6.375972162444052
6.651459169156305
4.6939261435214075
4.437904266941901
5.432136583598709
6.067759579942818
6.317873955482626
5.471731428895067
3.308105802735497
6.27095096932355
5.5843894940075645
5.81329533952085
4.160204722312336
4.768253921880161
3.9454180037928377
4.951716714142193
4.0637963077644
4.104563601707276
6.535182650708004
5.482791364021963
5.385125481805674
5.051937107239863
3.7592544478515877
5.145448528409733
4.199759215213953
6.03935860163518
5.088759231881545
3.5713871854398316
5.766336517932238
4.952966524351783
5.449055665518555
4.891678114278342
