2.095709733169829
2.0738674427627948
2.5628790029883777
2.013664573384382
2.1286459913771485
2.2243663263498634
2.1958451121352125
2.153096125477532
2.255320251186147
2.2666932282749643
2.243700854732667
2.1860453386630603
2.270034385217641
2.1509289930163034
2.336195118704733
2.152968504636832
2.1705902682829628
2.223615499871417
1.7031095284431177
2.197878067201927
2.3940515539579312
2.411661414957374
2.4540357158691917
2.254470504982732
2.18348397363658
2.1421479080040724
2.320073373254309
2.5907377634836646
2.384205968448208
2.5417305547873994
1.9422264878509121
2.2202821801463997
2.361853353622835
2.362228883852391
2.2786944286154744
2.1682094042565447
1.9777893969470808
2.125879767827983
2.3399478996271417
2.185478429886989
2.1867150732323446
1.92642131285383
2.40633868392947
2.4337313695942835
2.420277271686456
2.1921554176903353
2.2398276765903518
2.0932482343567385
2.3349955936845643
2.201937185166198
2.117499591840459
2.6193374380644516
2.197990941457006
2.1714605080093383
2.051738637434013
2.028777068945129
2.160545439366955
2.3312246919603563
1.9324165835187923
2.149999145565996
2.204794137791919
2.361043145093669
2.1895534197256086
2.2436219280143224
2.055297318682288
