56.59489654595191
50.322851812608654
-71.15655002489598
-42.41641194076863
-6.3562685235288345
20.985658328741785
-55.1826964494804
-27.37157324222537
-3.399344261804264
-21.202264471514248
-69.0324606453879
-62.6305126335386
-36.268488559892134
-20.143671367654086
-79.79120445285
-57.96672813666872
36.06774867552181
66.03940895574902
16.259599747677456
-55.081555341665506
-9.252962656831192
-11.061051858123118
-29.59127191643337
-40.6334737244833
4.015429238501189
-1.5056716655237758
-38.95313866673658
-60.64907431703579
-50.10388808938854
-72.88149034110657
-33.23159012515296
27.625262065503158
13.702928236120632
-10.750401694974318
7.991201536886777
-24.967428608598922
-12.564949778763854
57.90875356172658
27.366191398950626
13.693618377083455
-54.21746829922064
-29.12989726087985
-11.895560167489915
-45.14910948028971
-37.31181883248807
8.813096661096505
-4.865544341298946
-89.63178212929827
-72.46458357219016
-74.15987746587356
18.710339713725407
-40.04854591907434
-14.497225932019884
8.840987599462927
1.8460545677235825
61.0852458393848
-38.89880954686705
-42.972019023239326
-24.78298687355761
-55.966475206986324
-50.861538035992744
8.393404643600935
92.315755358126
54.91557732230506
-23.73636464192587
