-1.0134739280705385
-1.0334599796899477
-1.698565337681043
-0.9340602945621291
-1.004545701172579
-1.1495901550227843
-1.165888228853642
-1.0741574812268846
-1.2711902934934896
-1.2367503025229323
-1.2184386839474841
-1.0676921998796662
-1.2819714266633078
-1.1161409091534271
-1.3333808021785472
-1.0768271503314932
-1.205901611250645
-1.2309222201769678
-0.6498017990847985
-1.1828412106375812
-1.3940725837203136
-1.4077400664325306
-1.411000222067558
-1.3091544641330426
-1.1813643380415229
-1.119967992813792
-1.3080888569493356
-1.6729817007688177
-1.424918372851966
-1.6164235549879105
-0.8390185248155442
-1.2648615976269977
-1.3616155304610595
-1.335964473802038
-1.2383592336720257
-1.1176336598936771
-0.7862197658073138
-1.0647573802347647
-1.302231972767375
-1.0811170774179935
-1.110326889683732
-0.5501548204509219
-1.4414060996804223
-1.4661519415105189
-1.4160584695232201
-1.1100927679081924
-1.2267786572766595
-1.0201852744465505
-1.35042602022165
-1.1423332231704277
-1.004153703170284
-1.6616615992536967
-1.1280377147547593
-1.0486199127919775
-0.9448593687733895
-0.8817512338399581
-1.0243701349410004
-1.2639261080903714
-0.8660929185590974
-1.1577142794594777
-0.8876586668033167
-1.3927900504092598
-1.103561837079894
-1.2667373329077218
-1.0509863373624508
