32.450762905637305
30.656220755758127
130.86643083116542
25.74534849066552
27.325529843812838
30.12079099152119
33.675625928421354
18.873379993403436
32.94821763040678
34.28851964912443
42.13494722510942
42.21396238517211
39.85119243316701
50.86358440786688
64.28310211514969
36.580293437753134
40.120861720937796
24.40181990111516
33.12528255870838
42.2572955417581
27.900157289054988
42.472485315382976
27.077984392452464
35.006191807644896
41.294762088007495
37.703058760049856
87.59909997931355
103.14335884096596
45.1145595532407
36.83814334993783
33.720784149501554
86.63752070949337
35.56654926763187
41.154931059911924
71.22380798347301
47.41010244995413
66.73093876107193
28.808814552092038
84.79264925609115
42.9584671963922
42.193474657974896
100.34204500612637
48.23085956970858
21.006740860496922
40.34754082183847
43.946853138268956
43.751337159635604
47.28946031752638
59.07182474775126
90.71500920002056
53.192712402893676
51.96892986734401
42.706605533744586
44.35913549120193
64.94198394979144
57.10800364894417
31.89529117332839
58.36016922799274
61.24045272709843
66.21741252522479
33.5460682183751
46.175189015134706
149.32870579509574
75.23224317360996
93.78801136153946
31.605158617413373
48.77185200431451
52.69046864534192
70.81093623201555
55.35178313531392
70.18037911043581
33.73234510058632
36.838257690299045
26.421441765221463
289.3816394821812
21.547587679688096
33.713812417410665
46.91617436209214
62.02423233763986
35.93591367461124
45.685233216524274
31.09397849293436
38.59936158131594
33.17122173817665
105.77403343657421
63.47703491269011
29.772280107062546
59.50500607577557
65.42288018519281
32.3164424227306
43.76984466365153
38.07086700873345
36.503525099890986
29.19023138898708
32.973174206168125
31.55615491670888
28.096089495312857
49.67298645949793
32.47276368068565
55.87039924713581
69.83602733104657
21.97753412008964
51.17600969024456
38.94570039247747
28.209939129041015
35.83652643662483
46.63629497028524
24.90270381863305
110.18162741435877
58.08719653657249
42.41392644125854
28.14235910483244
27.805528485226073
22.12956360447204
28.43328220086468
25.970906055190746
39.024910508840726
24.065995514738702
28.974355382859308
24.11159923347989
61.667046771255045
25.25423090437291
52.344116062188604
20.88407332018308
58.66129261728757
106.24869581127527
31.70752164668292
82.85965946078241
31.50932121731921
73.51328626915381
80.42351579276523
23.163891341677036
33.466935120795824
34.74832151273003
