-6.814148905896819
-6.2128278926565965
-11.117502173234865
-6.517116837321997
-7.141907258726843
-7.745236574130436
-7.747024692853057
-7.341845501413442
-7.627606448197952
-8.428319224621797
-8.49359235445256
-7.5067576586978495
-8.246938576779076
-6.347828745450133
-9.364107069104815
-6.96759198328694
-7.144242871785702
-7.197941604515739
-4.402976531163199
-8.682989076156783
-8.317773277250021
-7.886515772465281
-8.65942286672186
-8.419024969109687
-7.722559538928664
-6.291598295494001
-8.308410388367898
-10.371668233054645
-8.630965186175438
-9.343870877695341
-4.740476094979787
-7.324519529513755
-7.790075056460891
-7.821411184535189
-7.936931646720687
-7.669013616175649
-5.421043091818582
-7.389606517777597
-7.578014054308643
-6.146732050724913
-7.562649977131708
-5.182850289181732
-8.637602114200645
-8.730218275314572
-9.222013340764928
-7.4545130359724245
-8.194251731603028
-6.763870301256071
-8.881343483988848
-7.872860087432348
-5.966469867688012
-10.446593069738464
-6.990688575094929
-6.259587990056994
-6.180135770128924
-5.931215255146412
-7.4781854885792685
-9.082595083327305
-5.508166190106793
-8.374708086233593
-7.358621018805132
-9.029766167415522
-5.986172898464646
-7.634825411201432
-7.1224422528869455
