13.589312156684008
11.34132324126547
12.838574768579079
9.024601899611152
10.000956911000927
13.43852470423972
15.743392527199765
14.391017237886498
12.638651614908822
15.206854405657921
13.904051943073547
13.628202613264923
12.040763119387393
10.339203690836303
13.925870472176305
12.303610304781449
10.762677101834152
10.370029864858006
12.779228125364847
13.222821188240907
13.796460781598611
10.127390085070516
13.804170873942375
14.6001338133591
16.689511674344413
14.012357193434088
14.793473352926547
14.680761935790347
11.423858381741613
12.593423883149383
8.641859471849708
13.030607315788664
12.234843271090247
11.267707975049444
11.86963917786604
11.509134605725874
10.00471786900887
13.227539882991355
11.87507092265096
12.519056145565647
15.312114930230306
7.83739269205617
13.037109767420247
11.121702548774126
12.015067892994516
12.423137852112154
13.784107061830586
15.203156447596404
13.91622440518374
11.16433970033193
11.37614116848558
14.251779639191776
10.112095699741104
10.903826894126139
11.000157865928497
8.89595870449884
14.01456103899322
13.500857771136298
17.328514701909683
15.10421570392223
11.773650896355488
15.83156668013418
9.821961202732595
14.221298353880822
13.42535883681803
