36.05498459384639
42.41016344581776
151.09084800607974
36.05498459384639
37.928239223122475
27.615840722554086
28.1180007024144
26.626875117362623
39.180490746065686
35.979873965404686
55.86358826440004
44.66755523556954
43.807657493896414
81.26167668874795
73.38346790535594
45.50408732741464
43.773584777159435
23.769528361236468
42.6913495987935
47.539056722472935
39.47938656439556
40.726338637465034
39.47938656439556
35.979873965404686
51.11741854315049
51.366831034884825
82.11598311673275
130.05483204548344
76.0150083479613
45.39372451363433
55.48533106597613
87.61531498779283
39.01644961364503
50.87498695317132
78.95877312879112
60.73901167340888
50.318604055185205
34.628180072053155
102.892885157527
50.87498695317132
52.19741730713461
114.49199985057976
49.58131588376437
19.003752086990325
49.965056759425934
42.6913495987935
44.94398640599763
61.65333212257393
74.61710212358349
96.47934648143793
48.73009299704831
85.12392313944073
50.46071085957967
55.55251831059879
74.86367860007384
70.23222077219776
40.547832546797906
73.27467914720593
66.91116877955646
44.950754982927215
42.597848785958746
52.7901280797903
131.81938026816172
76.81529942153274
115.95070001770031
38.00750417398065
70.94524324479056
63.87884545741772
79.99819953799765
70.94524324479056
73.97797303099358
35.59210056572475
47.539056722472935
23.95427193978225
21.28357297343717
27.615840722554086
25.221552772245488
35.979873965404686
43.78475199708557
43.385560786575354
57.26876923176618
37.47167896215972
44.387873799655026
43.0178873871545
96.30990432717077
81.05077136623994
25.221552772245488
65.02741602274172
82.73115145101124
37.47167896215972
50.87819007413419
41.72654439857546
43.0178873871545
28.96944211855237
39.180490746065686
28.645599549235417
26.01096640909669
53.34868593179606
38.817491195087094
57.12890625
74.4515593068912
22.33377761778477
31.93942272870886
40.52538568311997
31.78495462406863
38.6259228247365
57.94896280909102
27.642842188225945
120.87290572489313
59.14925746629011
42.41016344581776
35.65429254185471
34.27275832933464
23.7606896687608
38.46074071907815
32.53917058993152
48.38662650981157
37.47167896215972
39.47938656439556
35.38307383569862
76.55038807257935
33.094237816577014
49.80703257346711
18.027492296923192
38.46074071907815
122.54858033047802
31.02069213370491
78.95877312879112
39.963789953485254
77.19211075946153
50.46071085957967
35.47262162239528
37.47167896215972
36.75080901831927
