0.08537904071772599
0.035080993157992665
0.12758207837820412
0.2273768332375111
0.3142885554869909
0.32065871333185764
0.36458427777224106
0.32735834214180304
0.08607843539821558
0.058718860418365326
0.10401475388994824
0.06503949818083399
0.05668188479009411
0.07583419343842658
0.05267853999548407
0.048455591210916735
0.03269229966218342
0.09199080563371498
0.21336696031551367
0.115540819040357
0.08109446752814943
0.0763863250955418
0.1380621046684076
0.11153712555957512
0.17196717050481805
0.09375206209253588
0.021642425400903036
0.03207841223267198
0.033013568572372656
0.08760899293030626
0.11687489917198915
0.0559789824720783
0.12347957164889588
0.04646208320880995
0.06954882585725726
0.07754274249633558
0.06737780373573776
0.33950855474655
0.056640512590191226
0.13256952574078718
0.16407725045784546
0.09773967782585946
0.08440607378000865
0.14060471354368734
0.0892267319444379
0.118868432638591
0.0958947230539629
0.025468501280471543
0.08542563369377162
0.0954803889576601
0.11132313919978457
0.08191515310722568
0.08988010163652609
0.06963701431963115
0.034261060729189614
0.16875247815123984
0.29628337875664484
0.05395855149659429
0.12651226094115978
0.07723759285854069
0.1494312249392997
0.09690098608137676
0.13950292906539427
0.19181978613601505
0.11650876248587205
0.3390072855536235
0.12581608770070676
0.11243994574219007
0.16232021023609672
0.21432145508796308
0.2293471387054061
0.25739050881206205
0.2109322796453332
0.1998829811371801
0.06683163912775397
0.1776173220629277
0.0685158486729548
0.0184709160412715
0.09323587361013873
0.1381735871217064
0.14841284787507647
0.1998566367596412
0.2854033581666597
0.18551516765567613
0.11675399599824506
0.10167157170044913
0.465388311296688
0.090717648562409
0.04789452944866325
0.07049789265968875
0.0402565242285871
0.08753178357763068
0.21034724628629195
0.11815967498593655
0.14746827464384954
0.1749761360572941
0.119172180851335
0.1186427470939872
0.15096248910856508
0.22633803248523854
0.2036062319962703
0.13049091056873915
0.13549160467376767
0.14069811983099928
0.2350319121044837
0.1057521581680204
0.3077561890772429
0.30464455241656085
0.06843480094721914
0.05320099191252315
0.10337104630246867
0.08092560356100767
0.06597309177747918
0.08291862458841177
0.30861793960328704
0.15399737003938171
0.114408280265809
0.2825736034033857
0.1503195985065273
0.07100049239995962
0.12562534535909842
0.20688632497693388
0.05015091712857909
0.05015145118781285
0.056658162795095036
0.04012071744168235
0.1688481456648412
0.02180678046641273
0.019798945667127102
0.033758560257710964
0.03983683337109279
0.2256332218367455
0.07524960199530069
0.09118273850273724
