25.220641688237535
24.318314005425176
1287.1457800212027
36.6478812743576
41.09601648212154
16.351004122476958
50.03036871037097
8.746865114627242
67.1667894400672
53.718848378183814
104.15242872434912
83.90665914290297
117.05478140275778
202.62512380581302
506.3248530272049
77.58724363333809
77.49529000946637
20.122075163378717
53.370968174429706
30.411216649889823
40.10653865015805
30.808098184653307
36.13088135760485
69.07407094306579
131.94758209211204
118.41105056653379
174.0227670809031
706.0632738133299
49.255937632814046
32.350889300048465
42.70209925562651
158.96197761862382
24.047187022250444
76.41799228135504
294.06757837521275
183.14345298725587
274.791444942889
58.355778911191656
410.31419643344856
68.0167706902046
57.211748284563896
658.7470802500686
53.89225576434247
4.402817080990764
92.04702378872162
143.66469720302922
113.53769844066946
170.5864963991988
203.39975349952635
244.7325357212687
85.2227234478113
166.92318841738825
97.35124306856385
101.13615227246994
133.9464372061359
255.58641898826343
27.597495213970042
225.57735943307537
133.7545691539897
64.56606492593751
32.42274583950394
117.50355008326086
1256.1655783239098
194.8783148039756
747.123303627189
27.142790126869453
65.10424091417656
94.12402417341723
180.09269160745419
117.0054999293635
106.67049344392422
14.681762254477432
72.16123863953716
9.592516747001344
22.763714496603516
18.117183747465848
50.05665508334463
81.33168733705085
133.41635028513372
38.62448372695393
59.09518889612711
59.09518889612711
114.6042737973297
22.964147174770158
731.6945305816245
231.93013352830002
22.77366626738185
212.35014830047757
213.19278719287442
75.48998876015537
124.65827975405622
116.61869399664594
129.41044955866408
26.470108266444413
58.16649926844044
33.49988423563393
18.432098694068078
198.44682386613056
86.04850251809118
168.40820451657967
650.3304852485422
20.0942352999356
103.61325610428842
85.24572561429781
35.20828312055058
67.76340149732746
212.0955661386093
39.043910985479535
1192.8048309429519
53.65661639376815
35.51691914677242
24.19795623694702
23.789191535969128
17.781611381756445
31.979054028131237
21.598749192835776
86.75012231240031
29.419548641992925
39.93631909507892
35.587633219577604
205.58191538891083
33.51720313110948
131.45130218929324
13.72157389384528
119.5286692842392
776.8683484695413
86.56927501649479
197.33967800218258
31.36910527140181
146.49985133433532
117.00232917554035
27.533774405813173
29.333477428364738
29.208726150648545
