18.377777777777773
22.38568129330254
221.08850272782382
22.477203647416417
22.910828025477706
41.99376299376299
30.02422907488987
37.64394829612221
43.54273504273504
30.303749043611322
46.051282051282044
31.052631578947373
59.99332697807436
14.9915611814346
111.05751014884979
21.852941176470583
27.16230366492147
21.812664907651715
5.071428571428571
63.3151227236738
70.97560975609754
56.457420924574215
83.56062992125985
51.574387947269294
28.759239704329467
15.327683615819211
45.115193644488585
261.6143809388739
62.03437967115097
168.44932529428652
10.134328358208956
37.06666666666667
73.41198979591837
44.4722598105548
40.38108108108108
28.255813953488367
10.327731092436977
23.566666666666666
59.12930310663308
10.665024630541874
22.34877384196185
13.264367816091953
67.42723631508679
64.11587982832619
80.63466666666666
32.102521008403365
67.38643371017471
15.465608465608465
70.85874587458746
36.36119402985074
15.99622641509434
319.91426374471365
25.271428571428572
12.116751269035532
16.704545454545453
13.805194805194805
25.39766081871345
96.32428765264585
8.43939393939394
44.66917293233081
34.66268656716418
71.93951093951094
21.355704697986575
37.45
16.36950904392765
