7024.536164973839
5704.476146506618
151325.62774551663
580.758881517763
4876.568558673469
4549.890606420928
7708.5496383957925
3297.30859375
19436.1596
3557.690460933829
7831.456526193568
5962.231176184621
3989.282947769167
10517.338060619257
70867.90303382202
4866.09833885122
1997.7840267092465
4360.989298454221
8733.985579234097
609.2397864008545
373.8295608872793
132.930624426079
4234.811436672968
3841.604197666223
21242.314243448858
6409.56388723578
3370.337492747981
15512.788811657869
3967.3313137755104
3033.903162901308
6077.355306122448
6753.817824053116
2587.5222618575767
384.15157585753695
1847.7708320106037
1602.5303131732844
23271.9455681681
11070.669822485204
15426.218154140483
688.4718095700205
536.4327149810711
14029.329416606886
210.1387062738414
276.6172839506173
27145.89645726808
40261.15182761585
18612.78288564389
12235.58324114582
25426.92475468434
36624.484175900274
4972.765655651125
29247.266217283952
6754.221796982167
4678.90818809416
20066.4704
31781.280106363803
4340.3367346938785
23785.321565679613
17762.504077122387
2132.677109935852
3096.2739334027056
1336.5050300156245
141081.85104912086
15237.862424473846
86627.24763838446
9014.735493058028
7670.139483772886
7598.180731245667
23363.303151330874
10473.624930555558
7577.623605442178
6034.0
34265.672114158166
1146.5066666666667
343.46484375
2916.418654325383
6041.044642857143
2020.4814394270245
1643.9944224765866
4879.435595567867
31313.56230081929
3425.551811860479
16580.07514821343
9978.925733024693
88456.16767387303
16993.211779389436
105.40845070422534
25529.008714350384
20229.192251050637
20766.52484375
29451.15931714788
9823.460188119308
26320.832871652816
13761.848888888891
3863.796515593031
1418.015061688832
822.0046450863698
15391.540481400438
14912.966204986149
51715.68728503076
71945.2732006938
563.538888888889
8644.945179584121
14357.278526662234
8122.877869605141
4278.080936322159
16357.170756239448
8050.966469428006
49317.3343850056
1433.621558596074
1340.61234375
1446.4740142416833
9184.104575163396
3441.44
3326.510140616549
1941.010247271107
9964.576728796304
1938.5599857600569
1953.4852861602496
3413.089866863905
46583.63082680839
4490.752783028775
11666.424720293211
81.24972222222223
3177.959127141161
49556.28475578001
4674.122076186233
34030.41863105536
8378.294822061058
32205.74221453287
16191.249811753736
5235.6675900277005
8170.37213010204
8170.658562885992
