113.29781510592508
189.64788329663585
38.502772004114846
27.91618747618237
26.90154631720459
28.175163882179287
19.54164516167432
81.7420842550233
79.00545195186109
107.74591073276736
56.93215771749575
85.91070955491104
88.43094608086872
81.74262216833345
82.15231136572807
95.47338563564179
150.1118569223594
50.16484254810084
40.450333811357474
62.12913833234207
73.83792761064636
76.62480337348163
37.3897912899922
39.677995255729925
33.93448449359248
55.85314768084116
243.64675822821945
133.50444233480695
149.02058108991704
63.587804218041384
51.28665904216625
92.487950795662
56.73962380210707
101.5528075986434
70.41245261270583
59.27479338934954
70.46202818765204
21.247525678962628
96.48180273525837
46.2441269717319
30.67444240056613
51.65242716930337
56.982847091579636
68.83363287053328
63.30469934038828
52.34453728139246
60.75495777923865
225.51284581235362
60.717223228969786
56.907533425205
44.7759605372009
57.60464463967264
54.23489222981986
70.41911375329948
126.51930256859742
32.72728245146708
25.520860858987323
91.4512193325058
59.079959702332935
127.94867517236014
69.31406872864397
56.72207222590156
40.565739237183685
28.494831144844643
39.370615397133314
16.00264475148237
48.094043152391755
47.2098613243938
34.204760904839105
27.598622322316903
31.77385087528373
31.654498083035087
39.534749526857155
31.725770814712753
81.6416253068561
40.72924636082382
107.38410952606394
195.08612970214085
56.66194801967975
50.873656031457564
41.27451589667172
44.27104484539665
18.713869849833788
22.29614906749826
41.51835958486311
48.337760461425134
23.998585193524104
58.68244546651493
97.76391558217487
83.44257867257059
123.58773731410149
72.71620162139746
32.811901585960214
60.93937683865806
58.658241247761964
58.182972573868206
72.71412529166426
47.843413004053964
37.481225582281326
67.59592046676553
36.042205366943925
32.36807353511118
40.3300537191977
38.884012786970246
40.984930817535464
51.447589433142134
21.08491912508348
24.361940797593412
64.4439246545832
72.64351476651849
42.942349331040774
49.15835580468746
103.1275669050992
104.847773202138
23.480041877976756
73.88014352889974
64.28276589472125
42.21000499473917
74.66118838643932
76.24812801932367
56.278593374135596
50.37742459560009
145.0644586485891
182.57014467211616
95.5421941713898
119.72679338554613
41.78444501435909
260.461860079438
222.15138654900383
164.82444113977854
145.27142981412118
49.9758465491975
90.95063562153987
59.55172740457685
