49.002364187358076
25.06167975144948
112.940074169167
192.35980353026343
57.25765550257529
16.053573208132175
170.88881319221096
44.6508487331256
71.87264821052132
38.5873863847006
203.7336613160281
245.9060111524517
34.665771449780486
236.25795789298644
138.8520546277511
46.46639358021901
35.26964255639023
35.00410564410631
54.3078184448034
99.92925723500994
30.890046320885663
21.258033524912648
29.183255671605917
87.27898013571222
54.599830943912714
43.28998860302058
63.08161827788091
80.88062361869764
48.51807072517718
30.63074046435833
5.724938300561871
50.940899363670795
31.20511880344812
37.46481273055447
53.784397628274746
33.614595770299665
55.30104944377921
23.999977632941842
14.91066976294768
15.597744862248016
122.14376799186869
172.1365975604046
31.726558003117024
51.0478166207093
45.32847885658975
12.394305671271546
22.91567803127117
337.55757438948183
74.36041003042256
69.01970365750925
17.63522308714046
58.98286194555857
31.824053916522608
25.378204596441698
10.841158416750007
26.854594549465602
47.23043450380553
120.08924936890966
46.33206546169466
88.09679052034888
67.32455035474413
50.172411895220954
24.889310160757212
31.26334427564551
114.88262467875326
