5.137422434984307
5.279490460202666
6.040395193138365
5.082287601830452
5.202006427421451
4.936776890930893
5.09203302283647
4.939950092880649
5.2895643983730745
5.246405464762522
5.457635278579076
5.333708729962495
5.34721973992621
5.7580052200827625
5.72973614810017
5.371743455230536
5.342668476860639
4.87895712725129
5.269834033282951
5.187525370234435
5.289016890281067
5.3337876503453785
5.167821752001262
5.337685399437532
5.42590015649869
5.475100204891923
5.809050609610989
6.052255782560351
5.630831158344684
5.323731320950271
5.571368430461552
5.753499945314574
5.208127082539459
5.428824562478622
5.7984954739492265
5.609561833813794
5.546522472690333
5.184469736266519
5.917124205787936
5.455796811459447
5.450314277730223
5.962375248182357
5.419193772193363
4.537762138202157
5.399485978507932
5.296041369651696
5.431191240091582
5.604547982147991
5.696556113371898
5.821532507293127
5.442912741881929
5.787842890070935
5.511852645290188
5.536913179230295
5.55004321290278
5.6703440239659555
5.154832639040773
5.696078489449367
5.593897360056874
5.480756511800321
5.309856351576364
5.407353822913718
6.047549688960585
5.652334984272116
5.975633607143962
5.261541288463564
5.536360726261687
5.539464409902233
5.756969332219658
5.605619267180974
5.5962289292506995
5.1958376573585205
5.467960606719796
4.82300056688553
4.703641151504176
5.039791518119778
4.956622960389159
5.174005078813029
5.383457884985772
5.289201274525492
5.645847909902397
5.205764114104856
5.42949758923796
5.275536729254915
5.9196662154255435
5.714824967645188
4.755597478407482
5.6218688000303185
5.68813690984319
5.252193546036443
5.458379273462982
5.326102697242377
5.3728343728760475
5.059031958950335
5.2437084479821845
5.000094443371142
4.939115459182826
5.490581136669947
5.290702135224009
5.5711959844346355
5.7770123651957315
4.764063211231284
5.141740617793035
5.301527574870125
5.038663741112605
5.242853950928186
5.4952739391160925
5.049225859306655
6.006381519604792
5.391912964225965
5.243803476086578
5.209062931392708
5.147244735957046
4.768346765992145
5.128955135809519
5.16215960086445
5.410928205151584
5.1845817840355854
5.287302419205165
5.139945192959876
5.659063977567636
5.194105933331496
5.422263782448498
4.719587835744564
5.354341713779058
6.028467511061626
5.112968223789772
5.71311274251839
5.28341940862822
5.661349675634973
5.575979008859298
5.17982072333333
5.239737454619103
5.233075237063514
