1.3940897022550531
1.3545482623301197
1.3038247696728549
1.235524302838002
1.0942106632539335
0.8483402659003682
0.609336832224225
1.0442949542551547
1.2239034984357766
1.457761499309901
1.0401479215748881
1.1107405416182368
1.272911772585307
1.8582073938504988
1.3281749022259413
1.7711553966721203
1.8280739405895898
1.2659309345244183
0.8872428894444019
1.30415782463348
1.5955509365027445
1.3542685889960102
1.1320340570727032
0.9304809501508654
0.9292128842718119
1.2288261098285713
1.5029195609647628
1.4657355950280189
1.3876365933706576
1.332455533033928
1.2227398970118561
1.568671706807041
1.277651179746954
1.7023092191123443
1.7265945866967374
1.6533796940592167
1.0194505253268062
0.7388549923147006
1.2930272599332908
1.3707482825635091
1.4289380611857003
1.3397866183571192
1.2642446924035764
0.6646785221847743
1.3002208793637904
1.2038810384390337
1.266444939122419
1.4234335502592077
1.2122548127588781
1.1284440086786791
1.2014845687708278
1.251873297902147
1.7041490644507298
1.2484286387758767
1.0670371224751845
1.1666031616117674
0.6996032052812438
1.5087140633164187
1.316288627038445
1.6908793065621333
1.5185405189759167
1.5388655185535738
1.1294666087846204
1.2118159984619612
1.1246356014399737
0.7561823728999432
1.1405394549587229
1.1524476162225101
1.1991301456883847
1.146541519385445
1.1013109557291847
0.7376164437736209
0.6174306683959118
1.024488452593291
1.0242448813299836
1.0827420359818352
1.3676493698911867
1.5307030772181474
1.396610279622825
1.1428434501117946
1.0475911720968871
1.2955029098265802
1.050300395478798
1.0086796281396841
1.2538127985539258
1.3269452461653803
1.8231065120442478
1.1469570148065613
1.2026363444667485
1.1280852575525415
1.2291539497718367
1.238275739951046
1.083848811714471
0.7796164503142045
1.4570367150652994
1.4944751187788652
1.3991546807477322
1.3407272154359953
1.0365090559921366
1.0280836884173865
0.9899298879557575
1.057144469781358
1.1513754289430533
0.9043781440404486
1.0182647502844258
1.2344970204573587
1.281142951627032
0.7677514268550694
1.257587823150121
1.3824137887518075
1.3262738912455674
1.3370751764205515
1.3761148751904029
1.2089616854311458
0.992347997442147
1.2893887661570804
1.3986104741391598
1.141305685752852
1.3293938344780407
1.4742575948212153
1.2139409891997026
1.3031666081247053
1.423328494992937
1.9646183067130165
1.507219995131013
1.6331290408527364
1.5387935685604255
1.6447826382195756
1.4886699746586385
1.5376941661371764
1.3867874618542113
1.2104227760404802
1.2482366196852392
1.3166527475022027
