0.04744184755281898
0.10168112592182338
0.04060352954264481
0.2748719853528369
0.6644886544207828
-0.04715451665312653
0.16554798388420214
-0.08816891897065872
0.23487585125452254
1.3384945281752991
0.4522343944556765
0.8383185294575731
0.3210420069483204
0.6932353188814998
0.925036264708156
1.6306107847553528
1.2723431673851326
-0.05427843277595502
0.3248059346316197
0.7765010910955099
0.5578997011364277
0.7973161542757902
0.3141837463823223
0.8704011361496004
-0.0642569821960362
0.3286572048427275
0.445796374828756
0.2823199573168447
0.8702464609145497
0.05521451412658397
0.38664453270799853
0.44795525616189263
0.06766825450007415
0.09521437676425523
0.026403671903334505
0.15323976412166446
0.15090284202955853
0.3618720237609204
0.25468164922585995
0.8264141444670248
0.8858517769516807
0.1768331413347445
-0.3458733728249325
-0.13873384752392418
0.8208033250256874
0.5493012848625476
0.7064949353153468
0.3319633611266329
3.8096364384419217
0.3379008475825647
0.16940072860366825
0.4389210144301242
2.5661410071885533
1.385162674641368
-0.1348949356582364
1.674633868639451
1.6550445674255212
1.8304824918422609
0.8999094720548989
0.6859248317098227
1.0039589419453794
0.5247527390753091
0.9281387469800021
1.1198719817571368
1.7392104211796866
-0.214267782770464
0.8710243922876498
0.21442421893150707
0.11512692776815073
0.2512890679590692
0.3604594514773483
-0.07506118692448267
0.9111561575939516
0.9694073687178668
0.6075957351614176
-0.022189239415330568
0.8615737276470965
0.927746851767968
0.011039211944913255
4.6319905876878735
0.4199378761593363
0.13501046168671202
1.0695453389674672
1.0897091627191204
1.0213061019914604
1.2315228851854092
0.03499942915459602
0.24864935099840385
0.5599109466345555
0.5355236094197178
0.642766569872957
1.2465272096581532
0.6101684716104938
-0.09952439713477976
0.051312999971153864
-0.4655554381473999
-0.8012516537097963
2.6660916490479183
0.7430166505837417
1.2139427068621311
0.7568693957972393
-0.13677842238264684
0.07413772028228426
0.3618397337325457
-0.10604898110369552
0.16467668472961153
0.4103879030005469
-0.26294586163204303
0.21006703145261427
0.0025585602246068536
-0.450402610996381
0.18227793883771232
0.8710000987731933
-0.039952599104150985
0.27771556376441026
-0.013992746463086913
-0.10581831636699304
-0.7765911204035012
0.5309178935796042
0.338915941599268
0.05464069561721142
-0.1491355723746335
0.8108694421139118
-0.21705729365395496
1.595173596755183
1.6407537178265257
0.2703961027823126
1.2918445763382571
-0.32566090825315197
1.0829257500973783
0.4081025984333352
0.22793970640273545
0.3924539467971499
0.07722362108755104
