0.7196481595607598
0.7430394431554525
0.7375640049787422
0.8522361359570663
0.7429919773478055
0.7011572498298162
0.684167289021658
0.6889685876824139
0.6763486705749985
0.7807998774134232
0.7718562874251496
0.7716157344102778
0.8192163641601844
0.8005087028078398
0.7252203008016962
0.7735853646669586
0.8401169058285222
0.7214985261956832
0.7308971516288589
0.8647545115435022
0.8680315471045807
0.8970546182442093
0.7596282222450447
0.7449269953818163
0.7268821192871825
0.7983679020741244
0.8406949784286679
0.825720457886063
0.8104732395450435
0.7924700629186117
0.7770695150314412
0.8225851479620323
0.7980581062772842
0.8795038908385465
0.8711511805613145
0.8593419667780166
0.7534086137935605
0.6651526251526251
0.8235152889944903
0.8653077537969623
0.8626981375854788
0.8318573114066391
0.8688478432255884
0.8124504361617763
0.6963192581208157
0.6612050018946571
0.7281432516865125
0.7889933148115993
0.7328224227665567
0.7023063591521131
0.7671376242804815
0.7585394992718425
0.7906405546981982
0.7713253111010719
0.6773239789526434
0.6912306863841597
0.6969588550983901
0.7647893156641475
0.7287100111256417
0.8185693686916179
0.8024929412574893
0.8322938322938322
0.7193253451314584
0.7737435897435898
0.7235037426341774
0.6889604648225338
0.7749788672865596
0.7826286296484972
0.743941291499132
0.7802554395307235
0.7777777777777779
0.7094207875457876
0.6199603128282946
0.7780291603821013
0.8330716902145476
0.7394632394632394
0.6362746164726362
0.7781493868450391
0.8319350621050338
0.7276685578572372
0.7327271908898592
0.7726387536514119
0.6877712031558185
0.7180832282471628
0.7156339031339031
0.7585908956255554
0.8757674250631997
0.753932770326213
0.7491566664823315
0.641755008111065
0.6941016441272718
0.6942631200575125
0.6583381895881897
0.5862296162082029
0.7887334508494916
0.7634418033505832
0.7996703296703296
0.7576045398802511
0.7207577984648048
0.6732012292041963
0.6790662702466912
0.8161668839634942
0.7293965293965292
0.6956170523243693
0.6760003181926657
0.772884925058838
0.7668958793041516
0.6670018434724316
0.7845954894911114
0.8323782778642178
0.8189119814523476
0.8294981371904449
0.7081720547347762
0.6917971409121851
0.739279713638688
0.8003978779840849
0.7368073733529837
0.7859912445278299
0.8245744581899359
0.7430235379762193
0.7196263894038482
0.7551318063958513
0.7340792855473921
0.8796319959110657
0.8246247338077184
0.7842349802449735
0.7436819111873029
0.7078788993718956
0.6913312357600087
0.6754996971532404
0.7221920110737593
0.7545128205128204
0.7420496436470878
0.7476166217888072
