0.9281791297000422
0.9458680555555556
0.9096981753655908
0.941220238095238
0.9381720430107526
0.9298941543090479
0.9652631578947368
0.9166666666666669
0.9427190500685872
0.9458256599140578
0.9636844636844636
0.970074812967581
0.9122791940260074
0.9593676122931444
0.9315598405046718
0.9298517267267268
0.9239980449657867
0.9150052129877868
0.9833333333333332
0.9459293060987976
0.8953218884120172
0.8711270202020202
0.9209749455337692
0.9453974304673162
0.9348155929038282
0.9635508524397414
0.9394901761517614
0.8925823195697802
0.9278141534391532
0.8666240962853592
0.8621858465608466
0.9132171387073348
0.8663105154594231
0.8846111111111111
0.9085786759813704
0.9421350129198968
0.9642857142857144
0.9435483870967742
0.9270071339132728
0.9016565393518516
0.943011193011193
0.8600516224188791
0.914991967871486
0.9339640140975699
0.9270807670197916
0.9267258230452676
0.9005897435897436
0.9682539682539684
0.9062033929903056
0.945688016990834
0.8926520794537555
0.9011473587026332
0.9142313546423136
0.9227962018140587
0.9321493624772312
0.9772727272727272
0.9660834868017188
0.9510303893637228
0.9536082474226804
0.9519778841769266
0.9208135860979464
0.9161107813206694
0.9319897342995168
0.9348049740561818
0.9903846153846154
