0.05045492142266336
0.06709608158883522
0.053593108631554615
0.0748768472906404
0.06505102040816327
0.04897314375987362
0.026046511627906974
0.06327160493827161
0.05116079105760963
0.08797814207650273
0.04201421068890948
0.05322507893549842
0.05669083717864205
0.12926185282975547
0.04030827990724322
0.1235854675402025
0.13431810374441772
0.05780346820809248
0.05489994869163674
0.14915572232645402
0.17963386727688788
0.17909454061251665
0.09516500383729856
0.05245202558635394
0.043445314473351856
0.11701030927835053
0.11781206171107995
0.0963048119559862
0.09574732653568764
0.10050251256281408
0.08975240715268226
0.10209192692987626
0.08872901678657075
0.16767676767676767
0.16372364135093434
0.11660486196950967
0.0367504835589942
0.030060120240480964
0.09190332326283987
0.1336166194523135
0.15299760191846526
0.087467776219981
0.08366935483870967
0.06358381502890173
0.04584331166609648
0.029015979814970564
0.047342433923903575
0.05487966146522085
0.04004817825956037
0.04038848750444155
0.04617752693689072
0.0435545463928166
0.08717948717948718
0.0637046716759229
0.049334631613112634
0.0520816588972834
0.04430379746835443
0.05151338766006985
0.0452316076294278
0.08178942611839132
0.05040650406504065
0.1031055900621118
0.056598999044030825
0.07569644572526417
0.05378544285296697
0.04770642201834863
0.06583389601620526
0.07648440120764842
0.07331713591539231
0.0766304347826087
0.07789979409746052
0.035945363048166784
0.029946761313220938
0.05647058823529413
0.09328358208955224
0.07206208425720621
0.04821150855365474
0.12166666666666667
0.08621700879765395
0.0838126540673788
0.049966239027684003
0.05830388692579505
0.05291508238276299
0.05592105263157895
0.06369215458616688
0.08707256046705587
0.2397003745318352
0.055413637256828456
0.06648834543370273
0.03770661157024793
0.037410394265232974
0.042122316727420006
0.030822913637685374
0.035443037974683546
0.08243929983060418
0.13432835820895522
0.1284246575342466
0.07323324789454412
0.05172413793103448
0.0506434205064342
0.033584513446797463
0.07590759075907591
0.06842539159109645
0.05977108944467995
0.04176334106728538
0.05233539673607203
0.04951076320939335
0.04615384615384616
0.05452018672273099
0.10151691948658108
0.08838643371017471
0.07809110629067245
0.04199475065616798
0.05278592375366569
0.07194244604316546
0.055358410220014184
0.0809620596205962
0.04813863928112965
0.06583629893238434
0.10061349693251534
0.033943592281048984
0.06714944042132982
0.06558966074313409
0.2642857142857143
0.07152376721457131
0.07266159695817491
0.0855457227138643
0.04824355971896956
0.05980392156862745
0.04044117647058824
0.03498709492400344
0.04275092936802974
0.05101449275362319
0.058858501783590964
