-1.8825286647017556
-1.8739070459948184
-2.076592001849751
-1.8682100409063396
-1.8533644550941433
-1.887091513906428
-1.9638691020391958
-1.9167566653104977
-1.9625364071660862
-1.9447953823679587
-1.9601257314363474
-1.9004905352519477
-1.961222915085168
-1.9228303670106874
-2.0098853788719664
-1.8639478073137055
-1.9009636193700292
-1.885184271478584
-1.8078819481605688
-1.9215428166213775
-1.9768384229254292
-1.9618082628412015
-1.9753299927892816
-1.96812241699773
-1.9259856749148838
-1.8528936815475974
-1.92734335346789
-2.0945690899733935
-1.9801397611236862
-2.064404092624172
-1.6791799276550674
-1.9240842976989836
-1.9474217594354712
-1.931176714423349
-1.911572454416667
-1.8992063215147152
-1.7744503567381655
-1.84724258143573
-1.9451139653949399
-1.813770850783522
-1.8876738217980327
-1.8335163715441571
-1.9757417347356387
-1.9927367150084907
-1.986597676935637
-1.870142015810863
-1.9504157501176977
-1.875191886027438
-1.977285299560055
-1.8909553870923985
-1.7995912654485946
-2.086520258094745
-1.8674617667900222
-1.7912818433555984
-1.7685329030142107
-1.7900246293045738
-1.8561639040854476
-1.9998847635873815
-1.8416197636345604
-1.948948516107646
-1.7962789027322552
-1.9523234411997559
-1.7956053317687763
-1.91222322615901
-1.8784910248204525
