-19.01801952207612
-23.764367775311328
7.077705165789963
-67.52951738217446
-1.3149302663561169
-12.04785360257932
-57.23820787221125
-6.988019793583133
8.77858342365012
-63.59085370482176
-58.65119537229725
4.392345120594226
54.129718892457284
2.9012658904035478
-38.66633887113576
25.71931527089491
-6.189103873747895
23.20888717771292
-28.82931961177801
-36.365886238528034
69.46560024760892
26.443680075814772
-1.2709740249560009
-24.673118269467203
-31.9315373399573
1.3570742591869678
15.623622087391656
-88.98901062815338
9.723434889223675
29.24897356299057
39.445643759291045
8.502767905489764
-36.81547341221256
-4.790582881036254
-46.4833648933224
14.851382086373947
-32.61917406110581
-8.095262152416867
17.580872288466605
-1.4941202262240492
7.546533736658644
-24.02405089657959
-27.97695209712512
-28.860619407730866
-30.92445616575131
-10.257617460761015
-68.10772949184033
30.32831274184297
-20.222518097276144
68.41268293762688
-4.644462832280558
-24.11864894813227
30.86426547062168
35.70552837541762
-15.84837647938835
-15.604878154252999
-33.88452859434845
29.94648367505693
-4.373389916630641
-54.26181971698447
-8.470993967380695
-22.049058189020826
5.93635424274148
-54.957830215259825
29.31064251448113
