4.1984761499335015
4.043308099380622
5.296676723458229
4.040384968419428
3.932974940260349
3.5405427068500734
4.12720340562365
3.6107461323281465
4.408074286569994
4.391144224719022
4.381705036105802
4.288947607398832
4.438136331015314
4.799456791552862
5.048425973418829
4.497698151663946
4.548305255542377
3.754227048039871
4.330829156392441
4.170434093893054
4.336526907460383
4.299302946809443
4.114628861661564
4.27634736096242
4.607145670561435
4.645537326477737
4.861830459340686
5.288635895438104
4.382351460167662
4.193515167987482
4.0962042446219
4.781740760425097
4.035807661881284
4.476312079890961
4.966110063606147
4.74972556488881
4.861596603063553
4.056002521890351
5.114553321178991
4.4587189839908685
4.24436104250661
5.196115453233424
4.303999055606917
3.495575534716949
4.470598414068872
4.549992854993414
4.531167485693091
4.807243653848068
4.6465836281357324
4.744533286188167
4.1718679266082574
4.604831165477852
4.349846329793061
4.408699584903479
4.393038578866753
4.636671030504583
3.64382581025513
4.722510807213472
4.5185940305605135
4.3198598139715525
3.881673858000094
4.482849829383878
5.2960487819299935
4.72050359287519
5.11170897614999
3.508854140677022
4.403583840029239
4.556533931442055
4.6763539663241005
4.473473051947937
4.492026757979471
3.4275573394986547
4.214930321249898
3.281444269123188
3.882396322517292
3.634154341292934
4.272370684033346
4.482207055151833
4.630231547370948
3.9904455389102167
4.259332369562105
4.259332369562105
4.313004957433588
3.742472403812475
5.098331369857756
4.719887004332573
3.5321461130472076
4.691300669666103
4.755765913053594
4.275951771671864
4.631323232490991
4.437831569373389
4.428325291706583
3.820123408754622
4.209463763733556
3.941122061438312
3.7677278040534756
4.677452331100728
4.318372496638597
4.63964660045009
4.963221684550934
3.746921090411848
4.424321617480395
4.406679240446963
3.901597592515015
4.245204103820659
4.673021515953263
3.9963383766143616
5.286389137112539
4.290501499909673
4.015098612116572
3.908787044748366
3.9315147127194687
3.6824941428696936
3.9045037235841784
3.9035852056297413
4.465741130450687
3.904096251979194
4.251617784631925
4.04246530788495
4.718680769212032
3.8702648720844857
4.610959665649814
3.647413630087629
4.4945481848356215
5.247876561633793
4.2554955322305705
4.786156485206513
4.014492397924336
4.578723323610076
4.431566189039775
3.93998785304619
4.0362992158093
4.064691236689269
