3.587952186359747
3.258808249649613
2.6222940252948246
2.6540050436941756
2.167120004601336
2.424524807052618
2.7682173736693065
3.3850843431891287
3.2884297301857863
3.172044319342762
2.819219295169952
2.895251802692438
2.8027550206327065
3.1806014884694886
2.9722584723307084
3.7300095191519875
3.460568942815489
2.8890970208187206
2.824260136050539
2.9664400746520503
2.978856421282601
3.0863997667370024
2.5427731815122945
2.555219679013113
2.6898450276571255
2.813860927097292
3.5186526321854465
3.319085095196045
3.3368514568660603
2.9881992369968096
2.532848938654272
3.1285679794944006
2.9855122579965117
3.006889523156509
3.0416935636930345
2.876451307649931
2.838796364377202
2.4509081434914264
2.9303852377538737
2.7499215944897344
2.3832676180279218
2.848348060606
2.7101260061755212
3.3237790128639793
3.20059512416463
2.9683208173417173
3.008320346342981
3.5696921226044473
2.9058645671251884
2.98398888340328
2.4577375153915346
2.782526450832175
2.753916004184555
2.5834711419149
2.4313283759409923
2.440068222865066
2.508772343915034
2.936634341903803
2.91233178615852
3.3958684826760885
2.8846744258660455
2.7632414331751
2.9177651776944824
2.6591956558909198
2.725787531503406
1.684495197935587
2.862244843132098
2.864662971874645
2.721468775827855
2.5900071093631216
2.7801711994653044
2.4818012007601555
2.674524543794622
2.6299400096958228
3.026994751167753
2.5619028061937286
3.1682343571254385
3.1681401407318672
2.775759046347372
2.587880114314575
2.96145617638126
2.96145617638126
1.915120844003955
2.286904284298559
2.6320624131339714
2.4627216026252334
2.4807836498630427
2.6938431355562957
2.8658716600315324
2.9494043926501767
3.1860272533323104
2.92754235855094
2.750374083597009
2.8686980755891383
2.9995610193969107
3.04674134141585
3.215496214354037
2.793475417393821
2.6525073068889196
3.5274300644738794
2.863027467894321
2.6070674305658517
2.84875234743762
2.8465667414234814
2.714296432145393
2.8688419927099376
2.4700697014851007
2.9348847516292995
2.6728166187620155
2.8377182955500593
2.5898256686087953
2.7094858648463815
3.229321080579674
2.9378468767559682
2.469428542814272
3.116851164360968
3.01968917874347
3.02962463665541
3.271733140865146
2.827740783060983
3.036902359074184
2.8311800366941555
3.545464587301592
3.4250220034384506
3.0937075918973824
3.256970161863976
2.6725305625336735
3.786543191167111
3.3042791808649286
3.4088368560418636
3.2568416497565975
2.718448188289279
3.024044734498208
2.924218380846623
