32.666568176007814
29.761314387651858
14.766999937146222
15.227479720657678
15.227479720657678
1.9034632961531182
5.616162116423817
28.874624531796762
27.99174622755445
24.750977506690898
33.80135609880961
36.039606039727495
35.30165435447057
22.238999316714956
19.497362945276368
28.065118401311103
17.55830117968098
18.54039516645004
17.74671120261412
20.723765714638464
13.50436939703397
11.992101633178212
8.673853917351002
13.790740708860246
10.507571340689836
15.29558879048413
33.59739231432199
23.866214498689075
31.989444868323005
27.097153954603964
27.097153954603964
23.309260367421956
24.85929255318014
12.697640946196572
14.52657525020735
3.187724602915903
3.8462021619247677
12.00562868798899
29.14462864778055
29.14462864778055
27.04070753171796
30.6729740970992
15.51260384225587
24.09031216909692
23.521382030974856
15.191498875010085
21.595304777673235
33.37019936166946
24.611682695737628
21.185140717264108
27.030195557683605
22.930624029594583
20.285005024571998
21.297559291785575
22.136639914996753
20.44160105553161
25.34649915137662
29.198856275760512
25.59966889034456
30.91537621561311
30.06336863611293
29.198856275760512
18.750135549085762
18.750135549085762
14.850786448710362
14.011210780794531
24.6986371837642
26.836872076258054
25.4214518097037
26.836872076258054
27.530509771980594
19.058322746723487
14.162720810668592
20.55318379047439
19.812772780356237
19.058322746723487
31.577632481638023
29.734424758717932
32.670219435782286
29.693838512864943
22.487475664135584
20.909329304707594
14.741770851021194
-1.1931065694986849
34.09589446975436
21.61644116180384
23.052333728785165
17.061873581327184
18.715700703866606
28.15019063541933
21.52437900298372
25.053081480181035
18.695064442570605
17.531897691344593
23.63990510865652
34.115072643614816
36.224593658389956
15.881077898515596
11.79566887497238
16.331628757781377
13.263115271979785
7.142497340004738
16.331628757781377
13.309600995726896
23.848885269603795
21.04723011070206
16.232459784595434
19.219969327267407
19.4902896443817
14.779257395813477
20.21975052512796
17.214446034548544
31.409166973130915
29.201588104287833
21.148334515491747
28.254908024650693
25.82504148950459
27.457145960628452
27.457145960628452
23.280733204857103
23.968602909298635
26.32731491417491
38.69246087743091
45.37045694757656
43.20440059739588
30.528123033665302
20.523184516359855
37.92683385141494
34.0612103184639
35.37376388629364
39.17053449679947
23.020840161641274
21.898175265954116
25.26928623679654
