37.7502055511661
22.24558513100713
113.89733221883296
104.55507125008111
69.67160796524739
14.351688868040338
112.15265573990898
20.830346274626493
20.633358124750085
121.04066549223222
206.69369850915658
265.91176495565884
46.10602602731079
101.04546282524728
102.20723763923868
53.47869331054483
17.77937361628626
26.875051478454505
29.321308746312535
77.84318532264595
21.807441839331922
28.9883121235252
29.542676214292896
68.79530241443818
71.16447059161557
82.73091797416268
46.64323129287899
77.7932643470906
84.17100556301764
47.8920663138465
12.81800010186832
33.61672543896374
22.05876336629467
30.924455972155343
37.77548579038716
47.55609515930075
36.06829571851363
17.640423231967393
11.522296938112106
14.549532541660204
175.45289830686974
10.694384353759666
29.89129426580844
60.381226398319065
52.083159985991706
14.997138012797521
12.963186297092685
221.91713867115
43.841191287315375
99.36561594116846
12.966341548624015
55.936809707291566
36.24958864951737
19.370385374425368
9.114185552817403
25.89430439266369
67.49268678041038
115.8968665912408
44.11184181419436
48.25128646597929
56.593984993224886
49.493849934785594
26.26526089075664
25.59000768128325
198.98070263981938
