233.46655802623158
195.8342896261721
72.16952798011275
54.77426031712528
100.79387191626938
201.07012645273974
217.81997020063906
196.46911486245682
190.47605761735144
208.3826771630793
133.2892691700977
112.5521672272851
117.37788008524393
92.23763818497173
125.22660336582253
73.9721514111544
193.30600662807063
184.26932513654484
161.3251706935704
166.94635103348568
276.55765247533316
106.31377566211269
161.9669246666936
263.98726745845926
299.27430367114056
221.7388431493987
194.13333862927382
263.93175776994633
134.43687089443816
182.52292009250957
36.36663897731884
256.2728214942085
175.59468186753026
205.581247038508
159.351959066584
154.66847444288308
99.0573596897517
301.08736990941037
190.86737711877885
146.43151479771058
148.7658144043449
51.26171727401066
213.85683687374603
104.22042992487071
147.55603703624442
189.79203915432862
227.67135269942366
106.55242504118824
123.92920960430092
97.0927449861113
185.90141366103583
192.7300149078706
104.40694818096584
159.33222657833485
116.55943023799959
170.52725241082263
137.19923394873868
151.7763400862441
210.7722865374193
143.60785012695743
114.612307542161
287.22237422772963
199.65122565605117
286.91830773963346
166.46827757250043
