0.9445836553981112
0.9511572979111864
0.8886288780206216
0.9379259676842686
0.9044518516241632
0.9503605794404196
0.9550558258127234
0.9534728782491212
0.9469035616062912
0.9394237375202149
0.9530364568448192
0.9547208004731801
0.9363749697247212
0.9281732410454336
0.9458255355537588
0.934173179254678
0.9215881634121718
0.9300263206950464
0.9555280801557924
0.9510251943996072
0.9375017387904816
0.9084453194741589
0.9378205744386584
0.9423925432775636
0.9592574706995272
0.9527537062259152
0.949395428361374
0.8916189483541479
0.8993197114496833
0.8983114758503569
0.942249187541436
0.9354801027964962
0.9349978891129336
0.9217589422038236
0.9278325630223844
0.93749509404837
0.938005163825191
0.955108758996772
0.9275672105217142
0.9262958161278132
0.9559039989081484
0.9529514929948092
0.9307623742506947
0.9123321992607234
0.9177088430866014
0.949453879232779
0.9599096371607292
0.9483085015816404
0.9336350463529914
0.9333333951063808
0.9445828390003044
0.9266087154584084
0.9238279721267244
0.9164859120089908
0.934343953525428
0.9368427507169091
0.954290120184955
0.9423003194900909
0.9716626189926532
0.9546682412443886
0.9497068828799116
0.9400476443942746
0.9452159402454064
0.942502658575028
0.951614706690072
