1.730072620116131
1.718053322117541
1.935540903373644
1.728074556784078
1.733133766073253
1.7578276415134713
1.7439102717509996
1.785707499922432
1.7745588194299553
1.7785769953219983
1.7756395110846006
1.7566967064423162
1.804687491610908
1.7133560665222136
1.8435801355521726
1.728074556784078
1.8080238034538836
1.7694359082708424
1.6374790426261836
1.7901269228616832
1.8775923514514037
1.8499270030826012
1.8522001710651754
1.8582205297554042
1.7785769953219983
1.7393223469282886
1.8281905835973777
1.9266586908359338
1.8627874549859709
1.9089002863184348
1.6773934508738566
1.8281905835973777
1.8741586860146298
1.8311828301777378
1.8238749910500607
1.7393223469282886
1.6374790426261836
1.7692991345525297
1.8643635200115398
1.753737169378596
1.7462926330672173
1.6828464147658386
1.8697218128962814
1.8435801355521726
1.8541385312351155
1.7551237109749693
1.7955342474927825
1.7059738929972323
1.8212049158845705
1.7633105105537938
1.6981100002513179
1.915307716435337
1.8261524772145996
1.753737169378596
1.7182550595911077
1.6735263151293536
1.7417967563027
1.8535910081290896
1.6267606315089405
1.762723360606508
1.753352731946534
1.8697218128962814
1.76384349483471
1.7694359082708424
1.733133766073253
