8.606242137945467
8.005915243759272
13.251864823293284
8.353818144881583
8.881906109116752
9.694750311819273
9.463103250592763
9.38476279857427
10.027675672042763
10.196315739638068
10.126861330305749
9.10974955949176
10.493707949392485
7.875152702325907
11.575985872929625
8.788496116898662
8.976955806102595
9.053536823125658
5.4396867224901815
10.223721814099038
10.94385888576396
10.709270321885752
10.981073710240292
10.241566823950263
9.398329076218824
7.8310180702083265
9.959836286287613
12.924047796742938
10.856265038944015
12.1245411912757
6.553681588047084
9.405912009906633
10.540312303472954
9.89594175508606
9.99688740233101
9.374689497567383
7.064726653519941
9.160165717944214
10.235674655398471
8.104337695499108
9.304659820613793
7.238195529206179
10.922966084967923
10.946564186298527
11.056231039579627
9.42735742079275
10.394839398182132
8.25190089100303
10.950932313560033
9.614659580542282
8.0347602631805
12.96743209152417
9.139833473808103
8.091065595388446
8.020052482965053
7.644866667091857
9.081892833680092
11.186831588425848
6.9452184007749285
10.130984149406311
9.289952976812076
11.235113329614844
7.882437901959126
9.800715280410774
8.359071064603112
