-2.540619466551323
-2.7586947866693916
-2.7756489941218585
-2.5765511102124825
-2.173634016389134
-2.9686514854854997
-3.315138468399423
-3.2834743722789703
-3.1369067447154646
-2.400731242590599
-2.7091463511046627
-3.1913321034566233
-2.7223534572343486
-3.1110539484343267
-3.053992011642706
-2.728353575403361
-3.5129078143556396
-3.6159104104521287
-3.167797303980556
-2.6362402543728876
-3.621513166477118
-2.9720978254144392
-3.296070981855694
-3.385291199261747
-3.8059088175898204
-3.528580537287763
-3.5492662297512365
-2.754100335611539
-2.8069862305985263
-2.85713446948132
-3.1361260788226897
-3.5616793100915296
-3.6013645453087473
-3.2627763301897965
-3.382616555026465
-2.5232508211841496
-2.3453120104253324
-3.0077526798266088
-3.290577762218565
-3.184377781110449
-3.1262558974261254
-2.2290640533690196
-3.267616784837503
-2.8543236142167205
-2.936991867082493
-2.4515171063110306
-2.7485494401489454
-2.367556990598326
-2.7059066103841984
-2.409148837954277
-2.369888779492208
-3.393019414100412
-3.1097796025211393
-2.807626316956295
-2.7982727787451043
-2.3251964967348213
-2.73029122941923
-2.481717033601428
-3.229830725692842
-2.7392352447200206
-2.247551261982234
-2.975618895306004
-2.9519945351050945
-2.937412989308674
-2.88825994781368
