0.00575803752995112
0.0037665687666052204
0.00019069359305784456
0.006297742209392416
0.004112623952278357
0.010188023432078345
0.005809744521246265
0.01032423335545781
0.0026799019478433955
0.0034705101871039287
0.002327732577423243
0.0027388763531254303
0.0019834193459865807
0.0005433066297227012
0.0004942739600039001
0.002032429770695114
0.0022866334810700928
0.013310812073672131
0.0038759474946957603
0.006975774375458578
0.0039971067014544425
0.005061261717134837
0.004792628768246138
0.003678752150977729
0.0019058000959654433
0.0017799908678648433
0.000781349648759868
0.00024282917981883115
0.001542351031392759
0.004269210936611968
0.0021275605831757504
0.0009559699516841185
0.0070263770577019755
0.0021919045917623927
0.0005832975705905005
0.0008577944731696381
0.0012796797518808318
0.0038458385032431796
0.000464221815746824
0.003218509081648192
0.0033185247535690125
0.00034285113403139446
0.0045399392886813815
0.03152459764915641
0.0021053965342394962
0.003180323347933189
0.0017692607512635598
0.0009795496957800676
0.001061076496811313
0.0008788367170697432
0.0033561510833603845
0.0007480956141603404
0.001975386404625214
0.0019673400255494594
0.002116868815029432
0.0010419056979410204
0.008621017756633787
0.0008467562101728192
0.0016683767897108554
0.00275149226074854
0.005378131687371941
0.004214465963005499
0.00020227495792960801
0.001258532388536484
0.0003158760098106288
0.0053336972018145435
0.001982336451033192
0.002074331543476176
0.0008396830703661337
0.0016842154000260086
0.002231608981411646
0.005768817488820306
0.0015502013070601984
0.018090070344815138
0.02689936835629661
0.006736430862944529
0.010259263772572287
0.007313764717058252
0.0034590653273627045
0.0051947120956649575
0.0009314907289124576
0.0037967707129947866
0.0018196279354905376
0.0037940214335512963
0.0003890100696040461
0.001089727614287126
0.01874750004263334
0.0012370274158372218
0.0012418824217481548
0.0030675538505480857
0.0014718388473327732
0.0029172889921862386
0.0020261549138604843
0.008254930812996658
0.004398172876797253
0.011474717418452584
0.011050942306718116
0.0011626035259959336
0.0025425150709696433
0.0009460715903094966
0.0005000890142848106
0.018430969715893742
0.005064760241372686
0.0027338434363319273
0.007550144381632581
0.0038511033368356725
0.001424171580972911
0.007033539316712771
0.00027279328730377947
0.004256657426522097
0.005491399127908093
0.0064907823922479785
0.005886237488679528
0.015885823435058687
0.005982343880937226
0.0053411857076170344
0.0019038492962437136
0.004295169273870226
0.00314825996156709
0.007046554934030501
0.0009002404416387813
0.005061518679332572
0.0020236761398700533
0.0173965351759544
0.0035751346679703923
0.00024858799478270915
0.005190026541665332
0.0006781522167379505
0.004087363591670914
0.0009092153886666119
0.0013870730481590375
0.004887028540413402
0.0048185882400218144
0.0036650513474264634
