3.8238126427406884
4.22438749736249
6.648073241987056
3.973782123693412
4.4323944021886375
3.945971105516778
4.608564335769371
3.731523848266097
4.715871292860927
4.271025824048849
4.976592189037606
4.820645040323442
4.830556168675595
5.318563757469652
5.988057660371487
4.485684973847114
4.227351271279729
3.265358310786315
4.697937573059396
3.8475590749747273
3.9849153136928552
4.111248438913004
4.265313355956641
4.702481369526462
5.1703487840981515
5.033991541463853
5.382470563796493
6.257864582373187
5.001256810531125
4.204109295828637
4.9130824900380095
5.188852449914942
3.8739428207618656
4.281323626587729
5.367366729983378
5.099187686154252
5.441528533958522
4.778285536744383
5.999129258363906
4.357184387003906
4.256833084809286
6.224165881638666
4.19599738989931
3.0595162412670973
4.852123963044792
4.528735246362075
5.022269235829475
5.27502486285162
5.434027183708897
5.630048779802223
4.543643500575827
5.672447073244831
4.5098156931707765
5.009386683953011
5.0717460122390365
5.554507061908942
4.360621897673743
5.2884742551928925
4.933530565956257
4.140289695200928
3.850944314353094
3.980945813266532
6.795671430041993
5.317955584779202
6.463911457366284
4.554571723834608
5.025308514503092
4.974458965271454
5.641303075804519
5.188385155381927
5.010629974734433
4.469802199119876
5.751681416346162
3.4191233398254077
2.9359849331098187
4.051950170983093
3.410511903022856
3.4637755070701846
4.329250618602071
4.3283602441720745
5.689684299559736
4.247630974540209
5.186900861710296
4.605626231548401
6.159896892533879
5.312024168188993
2.317977691535332
5.352884417205791
5.333431124482701
4.679620531563978
5.19875617006146
4.671266813166716
5.063784230874812
4.1677359687028
4.050025300232488
3.235536519657095
3.2321600726785915
5.386194119948367
4.934394713319754
5.732127629928144
6.222324182632972
3.1847689218317803
4.2332025541835145
5.017959306151618
4.019142618501707
4.36964920152697
5.166124345265915
4.384207600497937
6.39721207687281
4.074580387698756
3.9027814819761226
3.784598302699869
3.856493552966892
3.0791528777832653
4.256884277608833
4.022495293442442
4.742958520617159
4.327426706661852
4.373105543771657
3.6942041681067286
5.538810442489223
4.087519922766532
4.676686788818901
2.1208360431211526
4.167054700895419
6.183635773375673
3.720375948509962
5.447043520358257
4.155986580037257
5.242589986421412
5.0695574167482285
4.219256309551842
4.185989074025136
4.264372355790026
