3.210444953457774
3.4376462344177594
2.6740937949781776
2.9120309624467082
2.6551787212327085
3.4750137396140217
3.626143900926866
3.6747000476290057
3.4752001959761345
3.3299247030527432
3.5788579018653683
3.654760279909845
3.2796935664344127
2.828359082728308
3.4569454849196313
3.1403859677871844
3.023295341493544
2.8558328771835804
3.3948313109827306
3.5139115702446766
3.5658768852603435
2.8024410314539994
3.321240460270645
3.4817190689046384
3.854013587714352
3.6941874208179097
3.5574958635442733
2.9378166466889164
2.802455743351608
2.9451051411179017
2.606017440371853
3.2805489859104564
3.2113307289752315
2.9614858902607204
3.1460101378047596
3.238849583119336
3.147507153541322
3.627078483703349
3.0114722459347982
3.0541763991298616
3.687850343300771
2.7214146598165407
3.2446722824274064
2.959926955610813
3.0661472869133077
3.4670562363906514
3.7819076030353145
3.4494047158178978
3.303896595899092
3.1563940445258667
3.376493763518152
3.2513887754318893
2.8591477238064176
2.65455699348996
3.1388583705431685
3.0962175574781314
3.631055367680689
3.383830751658468
4.204493755383068
3.75784856422536
3.1884723868421183
3.3865605754387142
3.132369045044222
3.3021324008795823
3.445785460978865
