5801.868888888889
2271.7090069284063
199052.54980804204
7121.0820668693
29701.79936305733
5911.080041580041
5349.506607929516
11527.47356051704
29569.497863247867
10499.203519510329
5400.0016025641025
7785.1218836565085
29888.180171591997
2958.6962025316457
10055.852841677945
8023.132352941177
9546.403141361256
12163.98944591029
1001.0
15015.899445764055
13616.506097560976
219972.8199513382
20015.312860892387
14534.175141242937
5097.678986272439
4586.290960451977
7401.257199602781
758808.9143383917
71694.00224215246
903340.6902095894
2818.843283582089
10075.092424242424
7580.8820153061215
41604.86468200271
22021.825675675675
18874.889534883718
3808.0420168067226
6249.9984848484855
12973.431570109153
20343.211822660094
15001.810626702998
6324.086206896552
38286.795060080105
105695.10643776825
80082.67733333334
10070.947899159664
5582.338643371018
11216.092592592593
46908.09900990099
22789.71492537313
4266.6
64594.72484941688
23366.79523809524
18159.121827411167
4618.746212121212
5527.766233766234
23244.362573099414
13902.875169606514
3872.928030303031
7397.095010252905
8413.56567164179
34152.843843843846
5976.953020134229
12571.27608695652
7990.842377260981
