262.0
231.0
100.0
117.0
148.0
166.0
167.0
273.0
217.0
169.0
274.0
250.0
198.0
97.0
165.0
217.0
126.0
172.0
159.0
205.0
154.0
124.0
167.0
236.0
184.0
152.0
256.0
200.0
220.0
181.1
244.0
167.0
154.0
153.3
157.0
155.0
169.0
203.0
217.0
243.0
277.0
260.0
293.0
306.0
120.0
122.60000000000002
122.0
153.0
222.0
202.0
203.0
174.0
187.0
194.0
234.0
183.0
233.0
146.0
137.0
190.0
177.0
114.0
145.0
126.0
150.0
152.1
205.0
199.0
209.0
185.0
201.0
225.8
187.0
207.0
167.0
159.0
268.0
165.0
150.0
190.0
147.0
139.0
126.20000000000003
115.0
107.0
133.0
130.0
133.0
156.0
160.0
139.0
151.0
144.0
176.0
73.0
63.0
105.0
160.0
115.0
161.0
147.0
118.0
133.0
137.0
206.0
108.0
107.0
168.0
153.0
152.0
153.60000000000005
193.6
187.0
225.0
237.0
166.0
134.0
153.0
117.0
137.3
99.0
157.0
173.0
149.5
108.0
184.0
83.0
140.0
159.0
139.0
171.0
148.0
178.0
142.0
