16.278945937412
15.161276230401414
21.567604650338307
12.699741984458814
13.541576315908697
18.229916491768964
22.350173213998872
21.984366056527225
16.316019906976354
17.108454505727213
16.48919066224373
19.41349185185189
19.020971673768297
18.88255175438267
18.44839982445811
17.437262672436034
24.202270923855874
21.394984917815755
18.3014538179605
18.195213518896775
23.194562129177342
20.93557434219963
22.9349364331566
23.248898111749213
25.56373687430755
23.393808914502845
22.503480172051322
23.141781526638596
18.30361703323672
25.230679361310834
15.314122259702845
23.88398311289671
23.15136424284014
23.845630673071835
22.607740455651523
19.186253321219027
15.677440237942575
17.35578761899218
20.470942689373402
24.161235567928664
18.941258306497843
11.84922354394164
21.881542150327594
19.714771928455644
20.089300541151886
15.84980647772124
16.635478408462284
16.43259950294605
19.14138102767187
16.405883516173176
16.326998760691797
25.001738383415166
19.908505503376396
16.209004812766942
15.93086407484051
11.418878149301863
18.294577531289196
17.41107453857226
20.074687953390164
16.508372511008037
13.982422277556612
26.25665304044094
14.924740090411472
18.465614053766657
17.492635969864438
