0.3627264737067684
0.4116545052241181
0.1463391720638044
0.3309298339062789
0.273895365190432
0.3663079710114425
0.2353751661139255
0.4819083530851645
0.20637101755143591
0.26699571552856016
0.35343062768859845
0.3323076485920517
0.2850077465684268
0.20244289888245592
0.16418367130181682
0.20172301782676755
0.2653252392364004
0.219878645446518
0.15940715072417236
0.42404839515534376
0.6210735008310271
0.4739472880639296
0.33626998400972063
0.15825596173830025
0.2043756278159844
0.25534161177221026
0.1617760604225994
0.1358652748219797
0.2771827710093964
0.3491898062099072
0.2670993788042562
0.2571745489182832
0.4305428217354625
0.33053946827711805
0.32790689959470354
0.2730978728318655
0.22727051588311264
0.2420662612302163
0.17603057985655274
0.25706709857864457
0.24890893221955074
0.2148218352491472
0.31390111942557714
0.8211435934431393
0.16084665853430027
0.15774009825782914
0.17116821602033258
0.21599825671198974
0.15572020735134695
0.12659164323474487
0.2034623563426945
0.21858741846549035
0.16603677315578225
0.2829331434225094
0.12084845732177525
0.14036441355633736
0.2138972513664808
0.1297072400803597
0.12818207748915372
0.2784089051610892
0.2267181286380916
0.18051610670074333
0.04237045058012525
0.12799256048097132
0.06826654605686043
0.23766790744906105
0.3509818861144528
0.2751531462332845
0.12981938570157014
0.16136835227437232
0.17799136898889073
0.32367979257319696
0.17673737455001445
0.2816858103069991
0.3082988079413995
0.40088617736082655
0.2972294515838968
0.2840601576591217
0.2041732940164825
0.3307932048733371
0.15451869135974916
0.30350183958899873
0.1698111437962932
0.18897144341221847
0.12199895443936308
0.1629805854809473
0.237052231155608
0.14729146102165036
0.1232167329820209
0.19341008307060897
0.2102360651238903
0.17078399479065764
0.11535410663824675
0.22423358347879133
0.20565959234323505
0.20364997573493396
0.18140684563565107
0.16597225329544033
0.204471280124494
0.12863171999746284
0.05187007604499669
0.2703205953820512
0.1822537747883157
0.20335161491945386
0.18442963426744666
0.20393501854773008
0.19300183662571088
0.2616309103606593
0.12857309738423664
0.3115648897451361
0.34632284117237955
0.2949851125503749
0.2870533776186485
0.402628191236699
0.2894408359739548
0.4908692723609755
0.28151543651532857
0.2535573666993675
0.3098862950611468
0.4112958811902325
0.13456485381503552
0.2582457669822961
0.15028562365246742
0.41060441716377793
0.20624517780679386
0.10948071578123376
0.1874127164765151
0.2131046713082791
0.34378015517346944
0.21467531873016854
0.14418440312753825
0.342330475089388
0.2377657512074668
0.3603688341011905
