12998.7073586145
16329.234026741758
42669.638709524384
24199.53698687935
7717.83122408016
860.2438037475289
829.7850057954637
2786.565835295612
7479.214830050002
170074.23032169288
7221.452880314913
13777.289543176505
21824.783396611416
4963775.2134420825
63492.78171491332
1165805.6379789659
2460273.441876259
14897.393080122703
5421.5548088722135
24639.343497127596
42804.225366183484
99089.48039030687
3185.57908454462
10394.752431922241
5779.971244387119
6314.546568719227
93468.0750953442
114479.67386662068
83083.75878080982
13675.267267643134
10781.494915443409
57134.404316528846
2391.696125305931
130513.01292845304
133443.09988106685
88640.46729448762
4897.711484971169
1133.4970837155015
38019.16227444726
45795.413985810286
82478.59969004283
46805.5914479747
31468.499719844014
2011.4555175664807
27606.62217654136
33916.57358027029
20564.47360530752
68225.56258952619
194998.3543565945
17854.323243152387
8997.38300131826
19999.90116207873
656963.1025119077
12137.064633757042
2924.0670627785207
20016.66865044257
4045.6142888108648
249576.45248818843
42287.381356554
137661.93594538973
67020.89289636155
94077.06759293404
20905.280355766146
14932.633168602802
82281.79930033184
580.5945394974867
6187.572053419843
5849.850110601021
4819.948630300642
7739.271957633366
5208.019166383221
1919.8975656407006
1385.5668327651138
6830.451185420906
14472.55204204623
1856.491643555036
7619.512788704976
134707.0034451567
20964.53358960836
122858.11552324324
6544.234013294657
4567.952228010844
7793.913145241195
2648.4368207560765
40895.15005130049
58623.97205620352
22372.585268355953
6155.517264511964
12597.828939074108
4220.9246490449095
15479.494180876743
75701.46610946378
9771.739789229452
210.6321763302739
44710.898637932245
33333.47576998629
37856.69633567984
459377.0624216582
7268.046308673729
10567.789443273012
22172.942829140302
2613.1971218833355
3108.129770672246
2702.649953592011
2916.167645250634
15575.404998019358
26094.48274782392
506.3209985571196
41431.121579781844
45603.844433316335
7634.740320308043
18536.306600608623
44575.40057928464
1150.2624647321315
3422.6440527511436
34492.326234547116
19356.64482506796
17898.1985393979
40882.72095910115
6064.651354899791
37453.32463901608
19626.105848984826
48632.442010671315
71027.54572079191
1141511.2062465316
478592.8400001725
24945.48492716065
110577.84352555963
16609.9281463299
52474.96730620956
28804.336461856787
13019.580084565212
11755.146698486027
12536.116071225562
