17189.385527348382
17940.585270222364
23794.837144712015
10565.116713726651
4858.469342880386
1967.2233543314385
381.7040779705552
4396.185454999044
6560.796032273447
90579.92563903381
7759.693915735144
8952.02622024529
12396.023025118933
7697178.384179849
64639.965134886654
4325613.466890562
1277450.5046777593
13448.072111580745
4149.146855042241
34783.50165521155
83503.51761656199
42062.50392129598
8160.294348095791
4709.264507600585
3729.7677759104668
25458.982907466303
43955.13011063708
88885.44212020768
46171.765107447216
19183.670793454497
13095.374173514369
70685.03821868819
5040.607400896442
112404.20461209859
135104.1644212825
89247.7794441569
8591.289392104607
1356.507575773365
28412.49674930203
17619.17457938893
25558.507825722125
37164.35337230267
30956.69703247648
617.4668717527409
54471.69328955688
33670.041169615804
33479.57884580582
43826.71149169827
152095.16349278725
22747.139591644303
7673.867612946002
14840.148046759969
444799.80540189706
28747.952124092808
9338.993029411762
45434.51567846156
610.4666224456516
178495.55864580986
38075.19701608321
124156.81133635914
76186.1761260993
59751.16884120232
20691.047056016054
6654.559217622257
83635.34802069809
369.820309258063
4503.740112860443
6464.542236177806
6284.9574547636
6951.92006048424
14699.096197830933
2013.8916760123388
1296.1214980221948
5290.767803999293
3785.5558419124845
2592.130868291065
9409.17584335613
368754.5830582474
16569.591426364066
126907.27689210053
7754.100493909391
18351.179480178296
3513.065502366672
5201.867565768779
44069.42562958509
62475.35236641872
31509.50116341371
7152.643985532759
9071.942354340666
3220.2581073359834
14810.737795959869
50420.17798264024
7552.553148056309
517.1171949746405
50227.04269507271
42820.13021080806
22939.52703859295
519977.3757645863
5541.542062048847
25200.58124104048
12599.914060130915
1594.2762416378234
5882.745406914593
3373.4005760828827
2683.3303429768052
27688.81172959966
28666.80431510797
708.1030287631551
34375.733849131866
32910.189424191325
7588.751397220047
21695.77005974325
53441.756267495846
4310.0633374443605
3598.2732271259324
30705.428297314058
12530.782468232694
7493.050316572184
48774.55863991602
14717.798440102672
41189.13325522737
24084.790604140137
51567.12463100577
169239.68460734413
56809.11481641246
148278.37855329545
16622.956421486582
210101.65808286465
54224.14891745745
77035.75280448211
22109.907894894503
15484.122347388746
39222.359769747345
12651.01185874665
