5.771440531439015
5.497488900318039
6.584962982135912
6.529953126657068
6.274689698495874
5.1109554452045725
6.499795773913782
5.3613736967176795
5.4622760993338675
6.487705426144674
6.851827619917852
7.042856737426464
5.9513523691046535
6.45398066885519
6.528866464139053
6.130462347647546
5.252394272552824
5.5726221487843395
5.599119151195851
6.325623059107446
5.500789457767502
5.67790985169267
5.654789033986717
6.24038362880807
6.215920514433572
6.2274338306523775
6.012957691727761
6.422536876419769
6.4657636550060875
5.998797171636564
5.016289967180524
5.852912670686421
5.574948120704001
5.768605511489178
5.863159655321324
6.025614057839132
5.874934869572481
5.312032465541596
4.998640037112128
5.173573783339109
6.864692164601405
4.707648941246969
5.695600870975133
6.199450378491532
6.060507412694487
5.155575857023233
5.153983286571385
6.9945836890404545
5.872286665342311
6.501787356501488
5.080853536669842
6.139833008460725
5.829253178166559
5.309307785083273
4.813810822907869
5.537478499180465
6.186420562955431
6.634850619626404
5.8999355994858576
6.058409532209126
6.144619712484734
6.0187673691691455
5.530424095718186
5.581941167539583
6.915264029609061
