0.3060103257920399
0.36531307690118975
0.08118618202006564
0.3029593541734128
0.2769201512366441
0.23401256743848084
0.26354584137516723
0.2897515734953116
0.2100987593504788
0.21457984349330367
0.21151096173777548
0.3051148025740195
0.19686831276344385
0.2578564401725058
0.16733870194273395
0.29426141899059616
0.2307150812586199
0.21248883951226427
0.5577205582609511
0.24569317208448374
0.15441698427264844
0.1436315722367049
0.1425951420953493
0.19631305576327898
0.24113221400526405
0.2796638902910579
0.18328903400885288
0.08307122789825427
0.15609567888860115
0.09967412363568852
0.31676761759787536
0.21183130541165232
0.17410296792722094
0.19648628614352576
0.18276272563188214
0.2589459454591859
0.3880738648866007
0.26199306272349543
0.17882252249600633
0.24520271480437386
0.2603276790642131
0.4062023897003774
0.15379960375349747
0.1388907467267315
0.14675418643128588
0.2504653534175317
0.21430792138626456
0.31507153331135196
0.1926023069684492
0.24190810540964455
0.3355776812224658
0.08794443370272766
0.21425366635565996
0.2501802083655877
0.33332083232211945
0.3800456377274053
0.2594711487593829
0.19944872437719105
0.3820266302885207
0.24025380654368675
0.29205299104232124
0.14796737911108968
0.2806355374151451
0.19424118796152734
0.3118731939467096
