2.876623367110096
2.8321269588939093
3.4296551311773813
3.0850047290222187
2.871428016026892
2.5459531353478013
2.032579981830316
2.4335195697050427
2.7288526179294066
3.5588216769744565
2.8576867129660384
2.5853055603757342
2.9763505112069755
5.1536517297580255
3.4969073510174478
4.371978036894664
4.497940396009676
3.142266042521118
3.2605826796992683
3.8377762499983863
4.278909483047602
3.879452350140319
3.1253088843911625
3.316563959078377
3.2176232721468447
3.6005342640821785
3.6972589719799536
4.065862113953958
3.478903837905013
3.1584234911760087
3.0221662536725353
3.7566411264016657
2.8904114796557363
4.232637864785056
4.256271436748701
4.089129366908758
3.1229633285756333
2.4277676428918085
3.888014277299556
3.710137589574832
3.8779910503104897
3.8934482301904856
4.0325682868859705
2.3070833363066514
3.310015059121877
3.381345398558321
3.1462555639609757
3.37813890839924
3.1613642626822203
3.177076625294381
2.8603310012803487
3.1726361340575786
3.700604610665136
3.0707510306045043
3.0124831090557684
3.148918200892041
2.075237955267597
3.4761930925103424
3.1022810645458025
3.725457106320041
3.4255945985950897
3.4793747599919245
3.456404700601685
3.2517442684300515
3.503712996101055
2.2224582660301646
2.802203528303119
3.0197543646796063
3.0133967585603068
2.9523655322554294
2.9391360860977485
2.7766828941812145
2.5372769392174184
2.981766520854134
3.011263222663346
2.8189710779414217
2.7129876254374308
3.633194448762562
3.274019120100262
2.827318597935025
3.084565025825308
3.364175251559632
2.5612539574638027
2.517072527280502
3.6133189930880016
3.5467553435584813
3.3727549487538413
3.1544580399485564
3.2191394212037863
2.1898567530131783
2.556345674339838
2.852384273925782
2.617573622074504
1.7666099201524317
3.619393202449116
3.5671384077008046
3.2892347709243186
3.724178731763757
2.8466253526073326
2.8689955428857568
3.1209770762622706
2.517361787947263
2.9182849965734703
2.741127091452875
2.4981084105481863
3.1836877567477564
3.347772670776916
2.167530174528091
3.7932614345995517
3.8511123094772097
3.260450145564456
3.598522314100629
2.9646975670289204
2.1611357253376777
2.999736763513221
3.384747929967835
3.0885400605991546
2.8361593240529923
3.4906467287361003
3.110984895871629
3.648674439565267
3.4381995415330397
3.315686475672491
3.6961297852000174
3.4377748079005146
3.582783774298837
2.9164541033407905
2.7022146314218976
2.3831190007555696
2.5826426950750143
2.3528029187850623
3.2697814679241763
3.486418493401332
3.1417458379417766
