6.593307516641022
6.549873797007191
7.004199721088117
6.236066997504051
6.486838753978233
5.9099782597118065
6.18609694077668
6.125582080507956
6.500647313670263
6.831539758053206
6.566916486814772
6.369824060405249
6.6785787930321465
7.968902226098135
7.0164703475753925
7.216608121515644
7.320349689056373
6.494112292708517
6.453339158230213
6.540169741368367
6.719962670676887
6.635911727011782
6.408669113237108
6.615031699330838
6.798418680420146
6.4713075743863016
7.107503517569133
7.320543547369392
6.878538410046443
6.334376766344973
6.5535408599831735
6.8898155661715865
6.019322015643139
7.1665888861882365
7.261843000437287
7.210887557258067
6.627051286611108
6.211381086550614
6.96689675557376
6.700961635581791
6.988496875556383
7.109743207338712
6.609699468834744
5.705648781740839
6.7718323839049885
7.131021218053026
6.681091508904028
6.943576626456487
6.552773395424563
6.9533178563561115
6.512601885340409
6.792992523208784
6.866082819598825
6.187788730791657
6.478419240841411
6.547932465920063
6.022980334191692
6.9452919778333335
6.8389101645515895
7.011248891400197
6.55889119987185
6.734130966238613
6.948841326320778
6.58966041779493
6.970303230217636
5.926187525622938
6.379524444079458
6.383174304905125
6.542982720878233
6.4370351427164785
6.2870826541165625
6.302748020099988
6.216954667022726
5.8670303136545074
6.0204292593642865
5.985859670506708
6.119287392699299
6.906073897863089
6.471985617766732
6.239600001644997
6.610519372608891
6.420324008364749
6.436284892083883
6.038197692512362
6.881093619036381
6.807201337051794
6.157253486996766
6.481757602412436
6.614185993181796
6.079582025855656
6.514836013807375
7.0024151998803745
6.524458246269801
5.820601528226052
6.834363617435549
6.678751035074532
6.5084499080070985
6.853008374401155
6.267981748642576
6.679568208586353
7.0306455232029625
5.65800903471334
6.07730552596938
6.2054825304602765
6.253072715740278
6.479261437370979
6.759127438469357
5.817570213007589
7.130982238492413
6.866541912838487
6.270048933732033
6.413947412046403
6.591554956541165
5.83414377712051
6.132212036030344
6.688272094339043
6.743646418987157
6.306103784783804
6.62209391326625
6.411417197580527
7.181590562922246
6.666896099388581
6.778829394106707
6.110286104873621
7.073777259603868
7.191719306677557
6.646137408824563
6.6601546909155225
6.2613704941953365
6.529600550148177
6.435187181583205
6.62890186639953
6.5390849269135405
6.562320100384697
