1.5951174412848177
1.5171538266879017
1.7193471599244794
1.7193471599244794
1.5951174412848177
1.307901681978319
1.307901681978319
1.307901681978319
1.4236208599650273
1.7701909785737389
1.6616133209047463
1.5171538266879017
1.8154898362994079
2.380293824885705
1.6616133209047463
1.8154898362994079
2.1034298245911076
1.5951174412848177
1.4236208599650273
1.8931995980387897
2.1227661908223228
2.0611873814014166
1.7193471599244794
1.7193471599244794
1.8154898362994079
1.6616133209047463
1.9866273929897258
2.0611873814014166
1.7701909785737389
1.5171538266879017
1.6616133209047463
1.856240267468475
1.5171538266879017
2.1410653617098827
2.1034298245911076
2.082946150761424
1.7193471599244794
1.307901681978319
1.856240267468475
1.9269558262661965
2.013220519751276
1.9269558262661965
2.013220519751276
1.7193471599244794
1.5171538266879017
1.7193471599244794
1.6616133209047463
1.7701909785737389
1.5171538266879017
1.6616133209047463
1.6616133209047463
1.7193471599244794
1.7701909785737389
1.5171538266879017
1.4236208599650273
1.4236208599650273
1.307901681978319
1.7193471599244794
1.5171538266879017
1.9269558262661965
1.6616133209047463
1.8154898362994079
1.6616133209047463
1.6616133209047463
1.7193471599244794
1.307901681978319
1.6616133209047463
1.5951174412848177
1.5951174412848177
1.5951174412848177
1.5171538266879017
1.5171538266879017
1.1583763986749875
1.4236208599650273
1.7193471599244794
1.4954334752975886
1.1583763986749875
1.7701909785737389
1.7193471599244794
1.307901681978319
1.5951174412848177
1.6458991128196057
1.307901681978319
1.307901681978319
1.5951174412848177
1.6616133209047463
1.856240267468475
1.5951174412848177
1.6616133209047463
1.1583763986749875
1.4236208599650273
1.5951174412848177
1.4236208599650273
0.9519598086014457
1.7701909785737389
1.5951174412848177
1.7819916707498882
1.5951174412848177
1.4236208599650273
1.4236208599650273
1.5951174412848177
1.4236208599650273
1.4236208599650273
1.4236208599650273
1.307901681978319
1.5171538266879017
1.7193471599244794
1.1583763986749875
1.8931995980387897
1.9579739137366765
1.7193471599244794
1.6616133209047463
1.4236208599650273
0.9519598086014457
1.4236208599650273
1.7701909785737389
1.5951174412848177
1.5951174412848177
1.7701909785737389
1.6616133209047463
1.7701909785737389
1.7193471599244794
1.5951174412848177
1.8931995980387897
1.856240267468475
1.8154898362994079
1.6616133209047463
1.5171538266879017
1.307901681978319
1.1583763986749875
1.4236208599650273
1.7193471599244794
1.6616133209047463
1.6616133209047463
