0.3220030399044109
0.2869820145943037
0.4212306184147482
0.3535244959708201
0.3986347604162659
0.2941715947780828
0.2796940946070611
0.3016488809169686
0.33449803491743485
0.289488351207592
0.28639733345916
0.29993225101987997
0.35487195359440044
0.3899080732292111
0.3136386242804236
0.3603488686649836
0.3879220777724522
0.4401402719838941
0.3153678207617284
0.3199354917395858
0.35330878834921003
0.4303906120215998
0.3261093643925384
0.3386737292125229
0.2813716151021041
0.2996123902112851
0.3270894784882811
0.3980121126905716
0.3822243453852806
0.418238495864365
0.3895128882360661
0.34544903737740423
0.3438591720690358
0.3903992792705587
0.3830895787927184
0.3629239689174467
0.4022864484831314
0.3011265227783099
0.3571946664384435
0.4303900347070715
0.3012911840566125
0.4029378077060054
0.3782334110546556
0.3995749046173678
0.38014806494363146
0.3467014549745906
0.2534633675126297
0.3126703631725383
0.3593316340328049
0.3460580461727095
0.3549576144513495
0.3576139375608126
0.38203694347473866
0.4145165527062752
0.3518025138596198
0.3637133246328039
0.33956962408007274
0.3135347585776713
0.21204257526143008
0.279944454214882
0.3492667617588679
0.3204439336485979
0.3456944096724581
0.3466045459644004
0.29789376072172585
