3.319068282034102
3.1201292984068942
2.784748602853877
2.85575730412032
2.634325866421538
2.688437809537032
2.8860555128900987
3.127715855270811
3.086378224425113
3.1043768834999885
2.717531874438045
2.7304980162631005
2.7259720226843447
3.0510576242608756
2.893694460545731
3.3131390060426904
3.149152783540497
2.8297829651634467
3.07012483905679
3.180790640505728
3.2022997206757564
3.2976352207893376
2.8807816042053322
2.8317796051300688
2.9221579704423304
3.0070886057207975
3.3583311504135094
3.184519712838443
3.2264758917263205
3.0827205518042784
2.7779050087667083
3.100081487817759
3.060249777065778
3.059780463599553
3.102131677321082
2.9881442950748296
2.9096248070157333
2.644613174399382
3.130463016922093
3.0550858741399023
2.840798332545471
3.0242163761091594
3.004089489983109
3.3744505168381944
3.0156290583868626
2.8386149930792746
2.8959218668727167
3.218316407445693
2.7301893574660325
2.8046885627876597
2.4745431456321176
2.7014858821604477
2.6776673509491906
2.7253204460112315
2.6727305025366364
2.596214010773202
2.704873769200285
2.7864502492347256
2.781999326496419
3.089147064375893
2.745349992741941
2.733973333271291
2.970686654637625
2.917263309233273
2.8042069179732065
2.18123363899019
3.0420395037915866
3.0241842686449387
2.963888280470364
2.8136542243005476
2.927663975375826
2.841909798339941
2.7764449058232095
2.777697919838749
3.0219945931137207
2.754707268024409
3.020322717677857
3.0132207256036443
2.886407219613124
2.7936163191450265
2.960796381068028
2.960796381068028
2.527097117565615
2.709888634377091
2.7767594059935115
2.721426422476077
2.573790633954816
2.7944910885295777
2.905677779151722
2.772740214972998
2.997177914233914
2.8466227150267853
2.689476431900893
2.7426832545510753
2.8497342121286615
2.8519637683687318
2.9770980030378307
2.8749038424372784
2.7689738716753896
3.1639985588615582
2.7824814896854986
2.6874840346900966
2.7844503590517453
3.200195542625851
2.7499525203969766
2.7710636978624184
2.738799957354885
3.0458910029981836
2.8279112021779134
2.939420086919348
2.7586598975848746
2.8948378189988526
2.9976135801704538
2.8403711573917962
2.8321324935755663
3.0154772426842698
2.991980158985982
2.9942290125597624
3.155922359290973
2.886525839336523
2.935066493812824
2.803416182824973
3.0946232755029888
3.061409013661858
2.791589362685559
3.0345877824058882
2.628975437289265
3.107010374407925
2.795898594902058
2.839486855413296
2.7350776819304072
2.8731693875688458
3.009611571996496
2.9888639790135407
