0.024746480192467557
0.031014365720118568
0.038174427325280064
0.014922354242898131
0.032998422449924944
0.03727174962270225
0.018007434801256637
0.02225481802748738
0.019703794943391785
0.031562973844958236
0.022868857183190597
0.014099531408714791
0.040987041508318514
0.017457605742905905
0.027346500536261677
0.035290944246258414
0.030398034155508406
0.030235734732507367
0.02257392366614824
0.02617308913110125
0.046645382583323285
0.054259264929397096
0.03402235871922168
0.01941009574370321
0.01992277281909649
0.023367260805310798
0.02774959359211452
0.043384846090845516
0.035068570305978417
0.05726526047110346
0.058942453782255086
0.029286019970093082
0.05759748229932213
0.047396938777452685
0.035943003992352944
0.037263710952710534
0.024380848001882824
0.03205183571000488
0.041245847751879415
0.04068329495289913
0.020755312796021576
0.018835579841699063
0.038116770858971284
0.028120854315905768
0.03404273409167943
0.03696118300198623
0.030893419132855083
0.019543527961470426
0.028691594105088668
0.027434793378261824
0.047806093371663534
0.04582936859882121
0.04085007354099535
0.04878477837162146
0.03687535361548231
0.021637438494965012
0.02197974262311205
0.019852233791228743
0.011843517372300614
0.019268284287545283
0.04006429341004311
0.04004985667768855
0.04077534568526945
0.038964685513324736
0.015869655524086253
