65622.55040049808
44715.276561405
79212.47791883911
79559.21437449608
54513.399609607506
28288.25661539012
186784.76166455468
43522.99509834555
50017.64574789944
198035.0261379766
343366.91358024685
320682.8633553589
39549.824792553736
144356.9660362112
73445.19872006516
40840.14625780785
28721.423595364067
44660.58135908657
69495.82419659739
93331.00408994373
23435.385669244493
26126.406134156325
50059.752876355546
115810.5683266436
111742.15680072467
113637.87783136795
83259.76685832535
50395.91029311063
53738.541977303474
27145.497658593293
6939.532583621684
45449.17975674271
30727.606894082357
40328.12034560146
46116.66207252784
62243.510131341456
50160.45421487604
49984.041975
23292.83138543825
29485.86289690121
253252.10493745012
11640.48327548916
48427.968693045295
102681.85519769801
83930.23101222605
34591.25970236989
34516.7450431961
223087.38764579163
73743.89667119697
92916.00371747212
17836.708556767753
52398.24566593146
33544.90419988103
16250.4662770879
21321.387805117152
59611.37633217992
150144.71171052632
154256.82547366965
114987.97737769815
144358.19661043555
93102.23253213069
78331.89636273764
39260.639762046405
42180.53367574192
279160.01175025373
