25.79128611225527
22.09298224199743
98.55226758698174
23.505107924650808
24.520930763551732
31.928298697607627
29.609530792615484
30.031311739854303
32.226287390090164
32.347676763518955
33.17070563504714
27.05089857278606
35.39378904281279
24.910647650280083
44.40789745792848
25.631567147724212
36.393390920377655
33.50548891256075
12.685698404623395
37.033157539135715
52.147440948203624
51.14405084928694
49.82419677678385
51.97149338996852
39.07987292595463
27.1546055743352
42.659875804295936
82.7772352125974
46.531021684211524
83.90006997292153
21.026277400822178
41.667077102810296
48.98826413261068
43.93035360495457
39.64242071455107
29.749077376454014
18.028325045564298
23.473785244943947
44.28975508280816
28.267627755170786
27.021504245385
20.47484669742529
57.72217091628317
48.57787700624989
56.423037196525726
30.07247054238542
39.3230599867516
21.368024924986962
40.967385677063646
31.311090551141053
22.19647064103525
95.39622206996174
30.17990664723048
27.77717485838509
20.15738637290474
22.1274682900732
26.620902434020433
38.414375648720416
18.48397329286444
31.061006724109877
29.54500927180581
52.458237231240865
26.40131595514404
32.889537661896185
20.341952819814264
