6.8980588260683655
6.184100343492951
7.634845227195719
6.206858002505037
6.363901102734932
6.880683431707662
7.066244440849192
6.837941092582023
6.663603633360566
7.6374975458446555
6.992378307437002
6.8053947170401035
6.616117141200548
6.323510956773813
7.120666525232197
6.757155742600903
6.394484184443831
6.671750909077975
5.707310410153573
6.607401831629278
7.468988224191888
6.671323118180772
7.072709843978983
6.894154161634043
7.237564378886184
6.686551418926596
7.0409733209144525
7.61551713874392
6.7086232508297785
7.2588520918701205
5.887339239591673
6.466144190853043
7.022494284614584
6.565158070137574
6.8987252801113685
6.654003394304622
5.718001877750419
6.937248610877143
6.757330387027202
6.733841338174669
7.187602008531827
5.96566515426256
7.1716757215249975
6.812386194122327
6.842614908791227
6.6620032020561775
6.98155051940986
6.73617241305462
7.157250241402504
6.514092257882763
6.35540498101469
7.5368451233783444
6.634902016534643
6.465288734785722
6.255888577721293
6.239791893898512
6.695582705407636
6.996409614181374
6.428988749495143
7.23830885481155
6.56883052309186
7.548402625843447
6.063299512921123
7.06184603124985
6.646113074233996
