0.01119327668314977
0.004435564406641021
0.002297134756313182
0.008065413338207695
0.01332210242160248
0.022786272014540882
0.03180480451467647
0.019888007509163315
0.005048291694026527
0.004440438014072581
0.012526302050856591
0.00704810628062654
0.003916335471805836
0.0015388085971766538
0.0024773366035297896
0.005120568415864826
0.003852840938847995
0.005109481386735304
0.009386548379304322
0.0025010430047942072
0.006706915781624079
0.004218528896069422
0.010088542035812772
0.00779175585146664
0.0058200441303402845
0.004936216981121483
0.0015215205918212653
0.0018726076866138208
0.00475791355648049
0.0031908633683151327
0.0020999889086801646
0.001306642542763452
0.013336069887715414
0.004927249169896032
0.003135904676464808
0.010214636339796
0.009185863794808295
0.014543949176648344
0.0023448543831529355
0.002053120918409299
0.0041396971669694785
0.0016817318208974508
0.007573136355737692
0.029891338379391667
0.008670581010882977
0.003718778250623777
0.009185409064883106
0.0009278519511637873
0.004037899304231015
0.0043313020460564395
0.005113256741709887
0.003423434873304541
0.006337216250027026
0.0064181723306091926
0.00799695607936178
0.0042898901785533945
0.019581521278385115
0.0031334619678151016
0.011608606293016608
0.0031988998114480497
0.004393167253199547
0.003431674394862959
0.0013003583620927676
0.0065572843170400045
0.0032126653004842234
0.010679128093031088
0.0067550457858053465
0.008298391010997523
0.005342790496675174
0.002897689317286469
0.00575825620639699
0.010289903435977443
0.01143377696512764
0.01902111650640853
0.015814283759123537
0.010482072977772072
0.017192862972993432
0.0047140939648888614
0.0036133221848581813
0.017770745654555626
0.00429848521288745
0.010394312596354616
0.013905721334287002
0.009822328083033151
0.0011926162907407911
0.002090155485685654
0.01277525736633197
0.0066978016808743384
0.006253960471198318
0.006904601712854413
0.005973171888164058
0.01152315774415275
0.010708525875933073
0.02574521480806841
0.004310873545211973
0.006461171399606106
0.005035230894318557
0.005879813607603275
0.006424306471132093
0.006211719307811735
0.0038090356003009297
0.011965365885163786
0.011362421146810379
0.005982996986184389
0.011470740931702866
0.006696350439102924
0.0022139429655735087
0.01209053678925307
0.0033889079765532684
0.0028454650763072038
0.005076902843893713
0.0053092150960503005
0.007546809893723074
0.030968673769934587
0.010939787626440791
0.005371784199759431
0.003276631081256193
0.004125699419916516
0.004295703827061779
0.030705866798568543
0.0028032850783605142
0.005951996492863601
0.004879088638262865
0.007608473664738499
0.0014804689863991563
0.0014071111800891484
0.007310334380070531
0.002455334119696505
0.0037136701666958954
0.0017615901987297871
0.005883437037034336
0.00660992467225363
0.012904759047404329
0.004487531831576847
