-11.405330137780028
-10.442681687891685
-14.697685767832413
-9.822613692227577
-9.750553202829343
-12.131520639623023
-12.54170667996254
-11.339863408940793
-10.506527233163661
-13.317918914921728
-12.71621102000161
-12.207029390969256
-11.086340016599259
-10.427152316409721
-12.73599719571592
-10.708607103505047
-11.936183411862068
-11.928397772361764
-7.676805531763145
-11.197899798569885
-14.548297465744078
-12.464048380643714
-14.386945768577931
-13.422369068408935
-13.35590548792377
-10.7990051587837
-13.558987640591123
-14.987246375980986
-12.976538870128708
-13.666873056520814
-8.718895479128243
-12.861741437496711
-14.853260001449044
-12.862868881624097
-13.552503125023602
-10.749814278578116
-8.217732904569804
-11.88492604504986
-13.688542437384694
-11.030664337662847
-11.61060841422787
-8.554585065204403
-14.319151762011522
-12.80986378214123
-13.194096753584532
-10.46575283385754
-12.866034865783586
-10.221300549469115
-11.953694582990916
-10.36246950887402
-9.523644387493967
-16.84906933320084
-12.251646806833968
-10.792343247777392
-10.340586035447071
-9.0968768074876
-10.605484507582377
-12.231575740272797
-9.614516209670187
-12.702529818907848
-9.785705833840664
-14.400599609743828
-10.006103331918315
-12.325223533849357
-11.00220684100424
