4.175018627710898
4.121431204027
27.172536100661127
1.9705474138180048
6.316146796672896
3.3903459087010765
11.258005287942721
2.1014044421286853
7.0090355955853045
2.204894398418936
5.7335180671297135
2.422660703320658
3.95702090083912
7.3832344555699825
19.658874570948573
2.5352594323760917
3.745314551197101
1.995691156973303
3.4090529744456437
1.5667355063533417
2.478303945293145
1.3410083183406856
1.5849126847143138
2.9359709200076622
8.43001300668182
2.185663575988395
6.048903959077758
14.157083761665435
4.061937167957287
1.7057965963346933
4.354201243610663
3.668022540725856
2.0818819706814384
3.3181176607449734
9.918788320405866
10.013386307860936
12.478376233392195
9.666534875899908
6.18831470776636
1.8173604640180083
2.1251029114638182
5.208306420360488
2.3600814530213934
0.9061636683958236
4.815468416722004
6.2188186550777536
12.595667586614793
9.302625399527704
6.1418127206310045
10.17635801281094
4.221247331854387
9.343546979252693
2.401532496591176
3.656753745111865
7.029247101203286
7.360794371715491
3.2228215207698323
7.906104135715153
6.9632226765577565
4.2413675357429215
2.382873629359537
3.2054119676316235
17.61877581966467
8.019293376552078
10.609538446635932
4.019356930398328
7.492205192694988
4.125010163442249
8.866590511829244
3.048287514681462
4.222989915507491
5.177361063234497
12.010227387159649
1.8929062058727175
1.021235955822385
2.4493687923073244
4.107846525109818
1.2253898693908352
2.392343290038041
1.9309233188443369
15.986035188911266
2.3036132139647165
7.633400469592569
3.4151641645035182
11.496540382668574
3.451409792407831
1.3457943801669712
12.9164927692495
7.518805107068516
5.822870614004162
9.592538160563606
5.3655541493452645
8.920730592521798
7.419191654322045
3.606441155349412
0.7042467842857855
1.104346909144016
4.433910167707891
4.39470531304734
12.29461734429996
19.19934384385016
2.1572323157752
3.8022057218654433
3.550793552253438
4.887308386200001
3.0980935129563285
7.417727816935941
5.3643349642307045
13.131986099637507
2.2857930485388804
1.6096708818696168
1.197609335674506
5.058902684514225
3.435166431718415
1.669203547624457
2.318544319009098
5.205288072002869
5.006414128888983
3.3834040554699807
3.3139589953983086
9.22432057243206
2.376642976998831
9.010004282906085
0.5219580516125838
9.588839688429694
13.60741550341674
5.900953316428512
9.69679491888518
4.0246776004098415
16.591213571052812
14.266549165368962
4.770781156042098
3.1709565529554924
5.235331195308406
