0.9181962864924268
0.9504582849971942
0.4573478584290997
0.9081147490261684
0.8431658478847468
0.9684038119271541
0.8617665501424471
0.988934602543866
0.8224791116890862
0.8399617499623392
0.794465506818124
0.8777772299029986
0.7651983547033924
0.668980349970208
0.4954024492492214
0.8553654093551676
0.7960665018134236
0.8379785067279575
0.8187620536158928
0.9495511006187076
0.9417770050303564
0.944608123622362
0.8808014203361874
0.7809608609582578
0.6194002745618261
0.7437199591762129
0.8328899021996209
0.6200942188129432
0.9025564460611301
0.8776246620408386
0.9057542709031547
0.7102713104713614
0.9122944809021032
0.9494124588315104
0.6727660004643092
0.7567004430602952
0.6230264310076771
0.8157634334230479
0.6962571010554045
0.8130934813476143
0.8281896308714379
0.559820171851947
0.9056374413183621
0.9974965091088118
0.7648806981525786
0.6928429826326788
0.7099578347874036
0.7993937903584285
0.6031928169490285
0.6308768568307213
0.7449903615684494
0.6699918445086636
0.7085190224247586
0.8087509829050483
0.68428871805249
0.6347873743970192
0.8838740132232284
0.5998257166014851
0.6856678270649491
0.8956611935079651
0.8949574294717202
0.6323461269154896
0.5798668733313159
0.5114813987979256
0.536260394225084
0.9241016699944566
0.8138693330149883
0.7471175490246389
0.6457037362300168
0.5901849349533497
0.7323077593752613
0.9789592660998262
0.8283196247298619
0.968062556540816
0.9297550717241732
0.954065135215682
0.8932096173233208
0.8405227096409521
0.6865747887377011
0.8827686407810437
0.5851288897402117
0.8498148812417878
0.5511679719136653
0.9022523648120008
0.5721573614614568
0.5406815195745761
0.911168494459558
0.5553596700574276
0.6033645032130607
0.7719708802039467
0.6784216219945172
0.7177418639818357
0.6385000196166264
0.8870825145826502
0.782150208663122
0.8403869754530484
0.8935687649283656
0.696294131286945
0.6672204816003461
0.9217927893380464
0.6935466553469128
0.936603168516249
0.7111231715240021
0.710640283570881
0.8187044777675789
0.7211867712547674
0.5707383042709403
0.8767958619481246
0.432777898793438
0.8715037719269529
0.8995441752270623
0.9443690700754276
0.9277470490587234
0.9494072576328882
0.9149639141270832
0.9532043794040698
0.7532224574967873
0.9288616628064488
0.8972517945789836
0.9937558671772144
0.6766417598313498
0.891295680363473
0.7811874437668661
0.9816195498348391
0.6517006800757212
0.6036437618285466
0.7420884786592018
0.7476543696724736
0.9047750203988112
0.6679318128841375
0.6858594029857584
0.924052931974998
0.8896801347929759
0.8702181273494806
