0.005009025469494949
0.0059172819712288395
0.0013259328973183747
0.004384486630741925
0.0038635758619435493
0.007885445764235279
0.002593040929581277
0.004138057923234919
0.0026756755391410163
0.005777377890388806
0.002580151796405244
0.0026373383016266576
0.0036905954058262212
0.004535960034159855
0.0014409653133047795
0.004509368611079609
0.006517579566604309
0.005646803837428392
0.01880529758897684
0.002039153216174169
0.004678488047125404
0.006093896551092335
0.004514820969898829
0.0024093095804783053
0.003380626787827645
0.0071860391616677686
0.0035490492214359
0.0030243240695039834
0.003156642099841793
0.005098929443675373
0.04339389149024952
0.003486720242626366
0.006195029332565299
0.0043287850944405395
0.0036717979748709354
0.004338321661151233
0.011647723089194845
0.0067694928720208455
0.00946854987165952
0.010809700448597135
0.00273973387261592
0.0138650216782416
0.005334715154313567
0.0029207628486146307
0.0036865299912043647
0.010520664256364231
0.006519302132595628
0.0030973918642514986
0.0028946208811894032
0.0029970499467681768
0.010122975016374543
0.0027616430994460784
0.005126863888937268
0.007970076603207886
0.013211250007102195
0.0078276163637984
0.00459744272030768
0.001352264733030016
0.008641389540677792
0.002807379691015448
0.004802701752254131
0.003614487965494183
0.00979774660438377
0.00557994920254935
0.003211550747405382
