-0.027549194641559322
-0.02239149260967707
-0.00871623733417418
-0.01833724368591904
-0.018798344318160645
-0.021244423817011627
-0.017562816386493412
-0.017691667295007384
-0.014893241137205958
-0.008355752174460903
-0.009580112484599897
-0.02092258096152744
-0.016668173560038472
-0.02338582753801021
-0.011393471305305025
-0.020488163754660553
-0.02201769541393005
-0.01561341153044281
-0.0319702252695697
-0.015681803677947963
-0.013189041979560244
-0.013413909122018867
-0.012387239330188928
-0.015097744980981955
-0.025237685651988855
-0.02073765825635994
-0.01231290040023118
-0.006536760022969098
-0.01206555342808607
-0.006440003131838155
-0.03449437678492124
-0.011615410381465128
-0.007979986444141449
-0.012604127505896363
-0.016575472341055872
-0.015741592671390674
-0.014931050582977567
-0.023111311424610606
-0.019798401761642236
-0.02104802939971483
-0.014637107372952757
-0.023594019097763604
-0.010850757207577616
-0.017552617169953776
-0.014153784815929276
-0.024953619519924832
-0.0039003917729201316
-0.026406170625454153
-0.010233439998723589
-0.01724738699578269
-0.024553620640471608
-0.002913871524662773
-0.014077842544113971
-0.02682245900370056
-0.027163803292882087
-0.025175208629922778
-0.020865806470936683
-0.012449101249273696
-0.03171535776111372
-0.011333115863310763
-0.021865221990448096
-0.012217849812166736
-0.02293142370463521
-0.018973089800289628
-0.024664473942005688
