1113.5815477779056
1446.0781368703506
31982.913843128128
743.4644547106827
1238.7011087939338
491.47066302055566
694.8722497159464
488.6161993395691
2012.9344843105853
1627.4502775673084
2527.093786384137
1833.55698567624
3020.2820072211357
16939.51660110251
11010.539439462273
2609.923171784309
2796.006382677805
634.8748715596353
1341.9446561073864
1277.6218432209987
1178.8681289824135
1166.8394115209253
1114.9414968571623
1211.5637255567378
3541.471546705769
2311.4477335248503
6560.917128124601
22604.290094160326
3253.4172297752643
1228.680058075249
2120.197710282625
5979.309208610894
837.3165128734436
3046.612288554555
11131.109843218615
7098.129759063638
5201.900084137418
1034.420961765081
14810.559722903681
2099.775089891633
2035.0461693338489
17048.609724429654
1163.695453848154
158.965267353098
2156.4469319311497
3745.808499600277
2605.9401192149994
6051.3668321775185
4950.386438718332
6389.298944135642
1632.8566274944799
6912.638541191469
2873.3495329795546
1478.48198584931
2174.6878617963607
3975.65879510424
619.3225345285366
6110.983158469011
3109.561688668964
2105.065500248183
945.280202726089
1362.7549052599707
27552.660698283653
4662.077067189774
17476.75410390614
851.5535572013887
2503.290368787833
2375.3537319970333
5246.7559250227005
2880.4673485010712
2232.4144523422133
931.6019236150611
2109.0031130791967
234.1167461714524
248.7412667987533
604.4637440555315
566.2311939141863
1067.836834424788
1203.6849869283812
866.1970683827702
6423.730704979966
1351.7147131760319
2300.516913933414
1113.3405965068973
16157.872123457424
4860.581756067225
376.6425966228814
4714.9143482454965
4317.310709293766
1597.9634049020615
3200.3339062093964
2039.3198224056116
2371.0163666258795
630.2286067445766
1697.9947017354818
698.1567756418688
580.900082088256
4827.537703736211
1799.8663522273553
6799.002860746171
9614.549818443824
245.98878344917892
1148.695792115868
2085.5618358091347
716.5300289510058
1014.3758049006959
4765.14008475944
637.9544977716955
21285.49131225037
1693.7188262780123
758.7113156801895
871.4009548086646
1144.8979714476234
341.6854705572187
769.5824684236135
1268.1765794903406
2786.2292883146447
1031.2271507155583
1421.6392785486494
732.1369894756648
7424.720105517732
1134.372663458892
2446.1758690202482
276.58116419113327
2616.721596366786
22814.099827121318
1143.7900656122442
4797.639764442112
1131.3615611805094
3609.1383555848975
2578.7537940416905
1185.361359481733
1215.3506196557844
1657.941207929552
