53.62792417593606
38.14932909925704
57.79776565443522
30.06963443368696
28.584740940418435
41.12432262029329
56.09308316116884
42.97262589461072
36.08639171765006
56.79860890323314
43.897994640470536
56.011573223911974
36.18412733764986
42.413085093689645
38.04448768484714
28.350894403311766
54.80297819226609
55.6167082349812
30.738611362756163
48.59052015594067
54.926962370841494
65.11218928794031
89.89604236172224
68.23332201766598
78.37600736971545
66.17570138226196
64.49714129381721
83.74334301223855
57.05707746935472
84.96341683210777
44.10844593360589
68.60783281429934
74.01558974369375
73.50014205224434
65.68602314758786
40.40481003761607
17.73085800265984
42.154767118670385
65.10862494360164
67.10917428976157
51.328824511146976
28.738828708302826
68.49365499076224
59.856960620812394
69.77230685723586
28.81685405370564
52.17619748203265
41.349012406049106
44.840269675098746
41.24298742041975
25.251968666350514
98.83130254947636
73.49419587962262
53.21869631226844
34.62845440816143
23.62626935126142
50.81881631328231
47.837761878361846
54.89535461065714
49.054692921651295
26.575708161869134
99.01948095780706
35.449103443548715
57.59631002876453
53.10390427390876
