3442.7077023050538
1760.7465053683734
2688.7593067599696
6049.699508891008
1799.6732950512162
1135.487466771622
11739.407745208428
3713.437967379663
5962.224984620454
2872.602511530379
15203.549840585169
13531.659533364707
1110.411016448373
14144.102984477417
3371.6872756682715
1131.7180234812633
2149.3106069313335
2198.3879105455194
5156.606208729224
4429.7652261727835
1286.3897286055314
686.1974794450127
1778.1802653132404
5322.033669804983
3404.771929341966
2601.080156467633
3842.1961887449797
2493.253575380814
1520.985838079684
949.3539904497193
181.05646039258664
1855.735802260493
1109.9605994788767
1356.7326408799565
1948.521864388885
1423.939627377777
2324.771712856796
2422.190539835869
1045.6297214678016
1119.4977330130912
6216.381043166742
4962.388514649767
2480.0945432875424
2506.946329499896
2218.3808273221357
1049.155135569824
1936.41260580828
12904.902775137161
5032.45309775732
2500.739958272241
878.4277351013417
1676.4253116775005
932.0241128199381
724.7170044084463
888.2954936751213
2421.0216189738485
4197.332891540126
5360.048970959584
4652.372620290073
8659.9030108399
2508.788083112338
2619.5640872175986
1267.9308535418993
1623.4432791269471
6545.890640914507
