0.34201533296973996
0.3499963250885635
0.4208113155194616
0.3519842511378169
0.3513782402237977
0.4337097590057643
0.26850845846712124
0.3324380511644536
0.3002848174592755
0.4722542599065066
0.5019813669592023
0.2493014273684344
0.3371466095954717
0.8265901782689391
0.5481354304821761
0.6925761176435401
0.6747250516870947
0.4134081563062323
0.5113189048674198
0.4561965125117314
0.4412346988661255
0.41937167814466014
0.232692137247354
0.5290934246907956
0.5137204830895045
0.3927792882488659
0.3012011335565
0.5307901030819985
0.3912761834855985
0.28766911033297016
0.2453762308006617
0.31469124165970863
0.1457990377834598
0.369435413096456
0.3465720480866988
0.34984973094222743
0.5404365811278478
0.4361340568283242
0.456590937532737
0.2798044733861821
0.30733194327767577
0.37382487176913415
0.5994349921455767
0.2261300854620335
0.5761943231947636
0.6465591145427362
0.5350609238216818
0.4466308089277588
0.4697296451318105
0.44627032619849055
0.26495652225692123
0.4062825106876282
0.19165864272475128
0.25452000945738457
0.4520648825795349
0.4295896158295591
0.14173803263898488
0.442439890965491
0.41162678839529854
0.4116456993286732
0.3929813441836769
0.4174327989352537
0.4628236365544742
0.28400203944291325
0.5006342178410705
0.13255479091847774
0.2128852103003851
0.3245553918202733
0.2616831681972948
0.28116192357615505
0.27141469227955345
0.5318313741490759
0.4307107438368693
0.4471058849247293
0.42016666253107215
0.20991781025078265
0.2278988054105608
0.6410861013542579
0.2613816167073309
0.2811134201644141
0.4793445738615206
0.4006844839565637
0.2545652863604185
0.2711428760625
0.5339717765135407
0.4048876993990707
-0.061079489447652666
0.37035161215214
0.3532211072818675
0.11456614043748005
0.3465010510140438
0.4431674424125796
0.40678067222993897
0.20336680849026334
0.4571796711341377
0.4172653056911271
0.31974637198432576
0.6614447252182778
0.3533229142275384
0.457920616209466
0.5838970242736953
0.19541449999948607
0.3374199182226335
0.2718922035170567
0.2857147433267321
0.5041347251079149
0.5048254166366075
0.22637688377611065
0.5405742363501367
0.477279452294801
0.20661570380085129
0.4288260396794658
0.4863846890119377
0.1856296866845297
0.3366069312321386
0.5288983991092915
0.21733450774995933
0.3933113238446197
0.5485779114488264
0.1659041846041447
0.6511630623221419
0.4834481465807895
0.4644187059961201
0.12362392907771755
0.4724155001275264
0.3393861254675633
0.11335928253974198
0.20750731582156293
0.2402936231439554
0.2756533871648811
0.28457913076511976
0.510790823434374
0.5928497750793769
0.3370930820919391
