274.1085214857975
395.0046403712297
7276.114002995555
223.25348837209305
262.84662576687117
97.50442477876106
121.86990291262137
112.66237942122187
440.0700538876058
398.199203187251
522.3293413173652
379.28358825961135
721.4826110219369
4655.393696075009
2559.522538041918
663.0284629981023
868.4518841482403
147.86526576019781
276.1064301552106
342.870249017038
314.5744382022472
359.2453531598513
233.1789052069426
241.0618556701031
707.8462929475587
530.5756545392724
1708.7135953198526
5578.422987840186
795.1866399799851
296.3970976253298
472.144456886898
1575.5563930764936
207.42857142857144
910.2400113346556
3222.898968119513
1958.2061867935752
1085.3757540936513
182.42095238095243
3469.4082225690145
567.1742605915267
547.7857435477264
4184.166161711797
335.792093704246
40.69072164948454
424.53674229597016
759.1379310344827
560.4473219540906
1733.3275959367945
1057.8684047175666
1255.1123050259966
365.2448979591837
1543.1514567509353
695.6312517660356
327.44634276561663
405.7563517915309
739.9179680488243
114.64186046511627
1552.3655450874833
720.5052017254504
612.8655256723716
265.43688451208595
434.93050193050186
5269.849682797672
1023.2183333333335
3370.4462939958594
162.56978653530373
550.1824175824175
531.3298013245034
1058.9031705227078
630.3656030286643
494.6186470382053
168.25892857142858
360.5034901365706
52.941176470588225
65.9047619047619
122.65110565110564
134.83309759547384
316.07407407407413
344.0198300283286
172.25385934819897
1309.4475131655938
290.00230149597235
447.06858974358977
217.46426229508202
3265.2972222222224
1065.5577663671374
119.55399061032864
1061.7703262129492
956.2217828900074
366.3457577243747
810.3562275756022
431.8448598130841
488.4400252525252
113.73447537473234
445.75767918088735
160.15621436716077
151.01142857142858
990.2310096905284
389.5893842887474
1300.6702341845923
1839.017758543501
63.58305084745763
252.19057239057238
395.9403794037941
144.0010341261634
247.31078904991952
1105.322881921281
114.45751633986929
4862.5637169776455
446.416872224963
191.80301399354144
219.02849002849004
290.367824238129
70.787610619469
148.59734093067428
346.3859416445623
649.4375178724622
269.6520325203252
416.19347037484886
164.35436382754997
1592.692544354425
267.7106741573033
630.9541005737427
112.51495016611295
868.2180958811614
6103.713351458594
289.4787922358016
1201.860266484455
268.4485190409027
815.5883639545058
661.5385604113111
269.6293333333333
274.69840255591055
374.9110690633869
