176.8716614802797
145.51143781356345
143.32607800500875
97.19067225789392
107.15014043979822
180.084468123998
273.0026666501195
223.84068810468213
193.87540187915573
229.58494163459358
202.3217298154856
175.18267986082367
153.64636864513608
112.38130955262581
205.01780781867248
131.93887954782312
157.23825795254882
118.2299161807958
145.06557094589294
222.0279063751512
285.8106151321644
117.37482752023584
191.55819658312697
304.6207411829425
295.2588744326393
223.2445148149225
233.08647729601043
324.58083208698207
184.54075898382672
255.40441043361614
69.5982291024718
228.64755942870534
161.89175363140959
216.3316487334823
151.3607575296972
179.63590305148205
111.62230946851557
243.17861634768383
163.5011857198282
132.7378964206271
202.9832827035656
80.39161453489052
225.75239704123595
149.3695394051604
184.86785586873245
180.97894249323213
232.5368970407226
196.1842071704865
196.3937931764911
171.25262245198485
167.19107394731043
232.77856082694493
118.90417411298573
150.4912389788719
114.713375670276
109.44200657143783
176.09804349560574
194.74835910948346
235.55527341097687
199.57432533394376
165.47384557815369
278.82896958412863
107.3354702979252
232.00273041732842
190.20464221442631
