-5.509286833485206
-6.877445139171923
-7.246917285861001
-6.223497836641093
-5.547515912137078
-6.033779908257105
-6.730234634137051
-7.192685045234492
-6.286233127053752
-5.367795416560255
-7.490106819716683
-8.542241220985984
-7.540590172924875
-2.645758534014478
-6.32801214768622
-3.789385242471366
-2.7192127399721144
-4.703858777460417
-6.3275819721404485
-4.209219955791407
-3.095192388855988
-4.612995690130712
-6.671701665678028
-6.399049808743042
-5.784512798701104
-6.5888875661502695
-5.368305476398145
-6.159930761181917
-6.284190293627979
-6.290103511669823
-7.400725074960754
-6.191033373393705
-5.269826460610326
-3.239962317568373
-3.3319610410749103
-3.428728842559681
-6.726716613410552
-6.672234510705738
-6.305532475208397
-5.187626805483034
-3.9609301702164896
-7.73535674089201
-3.67105860873603
-5.693457779236806
-6.576694521932867
-5.393639325918933
-5.567504213053453
-6.5205386186699545
-9.528649463426786
-8.50704218464469
-6.524592616985507
-7.982522223296344
-5.518696622350816
-7.51328765693672
-6.57928977055185
-7.516343010625368
-8.38276546235542
-6.865520207433934
-7.337046596115209
-4.63203162286226
-5.337192185564414
-4.7342991346030034
-8.727760781623113
-5.871967947297013
-8.595947466102947
-7.362737355993116
-7.029224275579894
-7.424424478018328
-6.847601521346978
-8.69361560849391
-7.683053349252287
-6.121321769924444
-8.62874889839675
-5.6480456928006815
-5.31378750543819
-6.12361686476018
-5.216934289639717
-5.270326463477365
-5.955327458476761
-7.511078946928434
-6.375491518416261
-5.326640829909332
-8.224327628116619
-8.923311928531765
-7.133622531646749
-7.668212905449495
-2.278338051136794
-5.641703127631502
-6.8836070346841245
-8.541269533580405
-9.42250127746205
-7.532243171749648
-8.100362341068841
-6.636914036515428
-4.114822747695265
-4.682422850187664
-4.499883045428689
-5.302246494251716
-7.433137190657543
-8.152904299991675
-8.968309488764541
-5.059118891831981
-6.1909886049329526
-8.331384110014705
-5.605737684160621
-6.615152146366354
-6.208344564392116
-6.950127974682622
-7.954786657622654
-4.23077872266076
-4.925088438901246
-5.003482141016747
-5.852660806949433
-5.28784552049602
-6.501197119232273
-5.405184763113937
-5.605401186546765
-5.321941609718231
-5.778765100909756
-4.40107641820285
-6.227275375020172
-5.107371278838143
-5.012406393589508
-2.8201267747929104
-3.9645177448416615
-7.536296679321151
-4.368548145750552
-9.56132398025503
-6.537675353190332
-7.273185116760277
-8.08080338355715
-5.043973348638925
-5.35988450214654
-4.7028363596202665
