0.8662053056516724
0.890072964669739
0.823046652211052
0.8834244080145719
0.8811637080867849
0.8548143350604491
0.9336016096579476
0.8442028985507247
0.8846297607806106
0.8931514634839444
0.928059746989788
0.9424460431654677
0.8327445806378391
0.9201563372417644
0.8638412045991833
0.8629742547425474
0.8572898295120517
0.8348726030995535
0.9673913043478259
0.8939881910896403
0.7971830962059621
0.7511399604352126
0.8490825151940159
0.8932026143790849
0.8775422821665596
0.9262981574539364
0.8839800529842606
0.7915614591941501
0.8586279139016506
0.7481840368949034
0.7532679738562091
0.8382763808295723
0.7448212851405622
0.7850143223277551
0.8302968589461324
0.8828032456763799
0.9318181818181818
0.895
0.8557161874334399
0.8094170403587444
0.8862493715434892
0.7349665090622537
0.8338637435172088
0.871034759132709
0.8634429922549895
0.8569675444675445
0.8135562978188878
0.9366128242780224
0.8214017000162681
0.89215458488228
0.7994791666666666
0.8081004164418434
0.8406504065040651
0.8402464964964965
0.8652365236523653
0.9558823529411764
0.9314327485380116
0.9027823889626678
0.912621359223301
0.905486288718386
0.8535891968727789
0.8388621634262043
0.8603319783197831
0.8693430656934307
0.981012658227848
