0.4521112592740101
0.6130206518743133
0.5745751674931516
0.6707608771938531
0.6630032655947242
0.5343453155586421
0.7192516738511678
0.6715908914639696
0.6397973157337181
0.598465930349941
0.5828737627640023
0.5799037275551464
0.6453873779519241
0.5894227769487127
0.5763882316026527
0.5738074989509204
0.5622731751164209
0.4751222418747633
0.5915777438904161
0.492278828153059
0.5115865337711201
0.5035865489011155
0.5564340497889317
0.5701323907362456
0.6234959226702381
0.6402250340391843
0.5991997451128056
0.6062418711715399
0.5738925059158133
0.5781156692434384
0.6132225398217073
0.5665384387276333
0.6314226932861924
0.5570355655927471
0.538222195985975
0.508373950020551
0.6330951907200101
0.6262515717164233
0.5895573221514657
0.5427395725356015
0.5953862175410204
0.6041381568619271
0.4824529139658599
0.4774630548262635
0.6168879122746215
0.6292203264212851
0.6220517526441128
0.5909327136452887
0.5479450219179476
0.6054761396611853
0.4988838032735222
0.6253950065298177
0.6170749051994592
0.6072584762634985
0.6040432850123236
0.5426782895072032
0.5306792156445833
0.5828153588826496
0.5056905416281637
0.4574465382010421
0.4949640156673961
0.5835726984872258
0.6291735571748671
0.6353143993814118
0.6012344833698311
0.5577075119816806
0.5915275199393526
0.6289786367976727
0.6032808915936105
0.6224942012317475
0.5906579055041049
0.5472209184444303
0.5783248399948823
0.5396001559820142
0.6259913546711569
0.5836230905272972
0.36511187721814026
0.5876507927632008
0.5518020980790438
0.5942483856183158
0.5930986807890433
0.5591840436968788
0.5884767656217313
0.6486244742479509
0.6268173123205687
0.6240132694611592
0.4385383001140804
0.5834449935745263
0.6263484677224218
0.5972101610189472
0.5885119162849942
0.4889238591248733
0.5703502605324381
0.3596509592465617
0.4691130585103932
0.5721075305085088
0.5794030282411151
0.5690627218078717
0.5929031093316092
0.5980322842961988
0.591569339187765
0.4374699389892692
0.6154585802332921
0.5938579017826299
0.5424623922174617
0.5750165496000396
0.6435248442430475
0.6241190117269807
0.6232498423352839
0.6383488164507621
0.5846518452070026
0.5898204388777629
0.4019600711559163
0.4767229242317775
0.5419750052912677
0.4955393514066654
0.5884008822603797
0.490899177717301
0.5774731506468878
0.4095496465936612
0.6282505457479365
0.6051809496101317
0.5229252362228145
0.5290758160912643
0.597193707963239
0.6126064626062813
0.4653083282878381
0.5818783047095811
0.5292722834791564
0.5545828414679056
0.5761467246781586
0.5465317231667868
0.5712816778204065
0.4758484261280162
