33.898916366226
35.70185523630606
19.48405763976522
19.802659965100958
17.342693304859235
0.46290962080661324
7.2319168231386355
31.294368389642003
29.995679920287206
30.630983774082924
37.30041955398749
37.96079958148748
38.87847916607601
43.741418260886405
24.366261909418338
33.54495016393205
31.088487995998104
22.721580740864987
21.06295157802264
22.281000578698443
23.719203539552723
21.137391846995275
11.901943570973758
15.542988254974784
14.76374890743574
19.869761647471208
41.367293376647
32.75536212870986
39.38242043933651
32.007008413550125
32.8561206214184
32.08198327571315
27.910094888340428
22.11311941920201
25.154066478813757
18.538842603008778
8.00590990392116
12.736551859235398
33.268278140490416
33.793583719221395
34.36194463458622
35.77739115594921
26.30186735322781
25.273349218036984
27.02832340076705
20.58852510507786
27.159276904425056
42.804297034742014
32.14562077952576
29.13255612770217
33.89895887694884
30.139773912241047
31.66868814713872
22.675261247833593
22.765141829045096
21.25241578956109
23.637504832590494
34.49257308737075
28.046360015251487
39.52838409817481
34.83766745815681
37.323716761440224
20.88438398576674
20.932156861710435
19.16434034034147
11.32685436902951
27.439577154293158
30.233618872477646
29.283691027662517
30.54684963401008
30.269934058076423
18.509060549561447
9.59956722566189
21.380656796115844
16.389587612459376
17.337132391701616
38.76057036538104
39.461813267732126
37.96751011421967
34.29854298192125
23.689569852682844
23.55591311900006
16.287733848690344
1.0120926931936627
37.00564283475177
26.49704368917106
28.156661900745945
19.178054192720847
20.824065413833384
31.39791685775206
26.34588650446572
30.544044768048163
20.73137715229083
16.74852966718569
31.623694265961245
38.950534374411596
42.12369933660925
19.260421580410235
13.78675684261415
19.34326843061765
18.772812705235776
16.182975568175053
18.92169701745304
14.047368063666388
26.578445025088495
21.729010407440377
21.522405450358725
20.02016986376449
24.897632512450215
24.760058827063304
24.431556579383685
24.830528595236924
36.92301835985324
33.0925686117268
21.97691875695363
36.7415125536279
33.68722309137232
32.97631998970295
33.613648606333776
25.697696436539438
30.515437617815863
34.29380519609033
45.88659588702625
58.135590609455406
56.760056151348586
40.517748213542184
26.51827167723399
45.3996429125516
38.66403201184041
41.59351247583883
45.640174067809866
28.245411105569964
26.332089293832194
30.0600894781266
