32.93370189730667
31.451066834093375
35.46402006491119
42.127890732481276
31.802998760576546
29.662590734293527
51.89053588031404
37.668134977603515
47.861696227497184
35.11958629546118
51.381151237751205
43.79593220719956
30.647509721823674
43.02328392274276
46.5012453174606
30.38984140077594
34.98730746888804
30.506038446764368
38.50294721739296
36.110035430488935
28.591060501093438
27.494916103528798
32.863430517253065
46.2242860069628
37.48194574676805
34.58516804924164
39.18577748467437
43.60797695353881
34.55389165194893
27.915591381715203
15.995707537820529
31.22062972898697
37.54130298205677
29.578263405882076
37.56812508448844
29.167216466730906
37.6237732032117
37.23616952933369
28.92991792959112
26.24476745475374
40.64642840708276
45.4688443534263
44.05403700943619
37.868837763680574
40.55438795141991
26.326529897515968
40.54069085180215
44.509451721808716
36.73194865050095
35.63772497884943
24.867885245288196
39.82065465947295
25.552984153676707
23.06314177014177
27.59142932488712
33.09748683670182
36.439167808690804
43.54356848698284
36.714927950790255
48.305293463477476
30.160069648907882
33.593648731162205
25.22065739052347
34.27843302116015
43.66913029499897
