3.683865690589565
2.3946326074705904
0.05876930768870889
1.0063368609397585
0.5844780908437583
1.1691693275556672
0.8523733859889924
4.977112252196571
2.164107573080202
1.3735207589352227
0.7441668703373242
0.9400311479605884
0.5198498314778174
0.5203521299026899
0.971866988459638
2.628834298863163
1.0130274642563133
1.7699761944284218
1.0665190900935062
1.3103478262586508
0.8339414531327067
1.0340633700197746
0.6801709120218083
0.7243293313583191
0.3572332770155122
0.3732351371480449
2.893874056191416
0.2602720331610888
1.4499458073981943
1.3737211623546597
0.7237442372547656
0.5064018831525858
1.6808056222876138
0.9998343092035699
1.1109205949705816
0.34397689962235833
0.22281333438958248
0.4780498241167797
0.4334296664890088
0.6676453154127829
0.7953014056160226
0.08376306970990471
0.9539103607924571
8.47953454562839
3.41931744119814
0.5007350691293726
0.6560156553994659
1.0427726635927246
0.5554239971131592
0.4393179246571596
0.5208024758112251
0.3958659010845327
0.5767498211786728
0.5510709996670271
1.5950303713267326
0.2990649460684069
3.6432516115095472
0.4384265403376403
0.6400256518824069
2.510759557873809
1.7703142572123924
0.4572456777744704
0.6777558775928274
1.2844293708135341
0.199646096463012
0.42133779262619786
1.8722398385631651
0.8987301597849909
0.7290895404262729
0.6004792547677161
1.011638308454796
3.669807380980376
0.6336655851669876
2.3573559063608585
1.9819404189244731
1.7479822648204644
1.4962168942588931
1.326842702228275
0.4170455164646695
1.7091866871290238
0.8496296566981791
0.8496296566981791
0.2525139899707769
0.7083232676649024
0.238107792772324
0.17025673950790698
1.9013249732615185
0.4374879233262858
0.4246670619678907
1.067494648066299
0.8349160029720626
1.2767637638292948
1.0220128380009428
1.5916503245155793
1.0541121785079453
1.6136806601836398
3.188858261695338
0.32611642420130554
0.6716394061665438
2.032055626316024
1.0204758601332848
1.597263606967577
0.6861399439877576
5.288106445149804
1.7085115330902152
0.7331148436999929
0.1732154733937872
3.864087642765706
0.12103674468527753
0.9563606494029
0.7758788090773251
1.4087869838725458
3.6353811711000072
3.2328527484902585
0.8540592214228369
2.159844054661195
1.169838672906612
2.0163867400338216
2.101056128161233
1.5398251821088045
0.6155977577575288
2.9926018607974534
2.799907091953868
6.275291029043863
0.7456699015388034
0.35065411164665816
0.786298629562675
2.20199622386144
2.255051393851077
1.4359389383542742
1.9632243191929453
1.3235308736003546
1.4435777022608305
1.7283239193025357
