40.52538568311997
38.00750417398065
145.54706559468198
30.36950583670444
35.1934187198602
38.00750417398065
38.6259228247365
41.21021104217528
46.41451157521347
42.735014848957576
44.62318429538793
30.84199372057773
48.28240353092063
39.6650527070115
64.61076791500321
30.35340345929102
43.691995588615825
41.463581329404676
23.180360255235467
51.22994141098207
87.38399117723165
66.18847563315403
69.25636014410631
68.15655805753399
44.950754982927215
39.6650527070115
54.765213198344775
138.07363673995718
79.330105414023
112.64034648495183
21.692780393287677
54.765213198344775
79.330105414023
69.41384223727012
69.2187010616362
41.43151425587962
23.180360255235467
35.1934187198602
74.94335792431944
46.360720510470934
36.514605382641065
35.38307383569862
76.0150083479613
67.72398862481379
73.02921076528213
34.38824407506737
45.63202268298684
34.70692111863506
58.19397421773071
40.06233241482109
31.6002645747058
120.83514952949909
58.694041252205714
47.9085438795645
33.06040650862637
26.330902116144824
32.47385610866696
70.23525096784111
21.692780393287677
38.91707382697094
41.31027275695365
77.73227698173794
39.6650527070115
44.950754982927215
35.1934187198602
