3.2419703678301497
3.286539398731442
3.378116198760307
3.361620000295583
3.3291194010714893
3.294759609608716
3.291113836100039
3.2542468773958
3.2902243427067464
4.271644861774273
3.389426312789151
3.319631120337443
3.2670694410550585
7.167602097924366
3.9789353033061747
7.065361367234842
5.888637761777018
3.401810679027203
3.4032601043039197
4.582388843577947
4.999372101716938
4.515189509995472
3.671790989571857
3.368399062930679
3.41551372834648
3.4971948480699173
3.7451771250874897
3.809667146997076
3.826602424683302
3.4427002126510726
3.4958536983741277
3.804401670754397
3.354181642889794
3.756365741455502
3.326522371205076
3.6966210774765025
3.330457780429729
3.299382091482897
4.083284664425446
3.683471910147912
3.8141929716393106
3.7074948447850407
1.1465660649718008
3.2368412839987823
3.818303289826002
3.476187439024334
3.683677626679937
3.413700416998561
4.309378052498757
3.494814887274109
3.2646137226772347
3.364297869141403
5.01458152810203
3.655749904935244
3.23490152994526
3.9200976036391455
3.283272119563122
4.088719316805204
3.582437962060797
3.8476021354845815
3.8082272797310424
3.5005664446209557
3.7064310194870767
3.3968961678820766
4.475545006154542
3.2756689742590246
3.373341032797285
3.2852432866596457
3.3679712771117005
3.285403521492795
3.555549962533228
3.2302780013993857
3.251271640042675
3.4918257973254274
3.341685808130276
3.291890324974475
3.335686916575503
4.4873803577716105
3.238734272514568
4.361667515381705
3.4267974423031125
3.0365176701325347
3.3503419099869243
3.3008288474468137
4.094212231439004
4.097064152284038
3.159029727622437
3.3958436370484475
3.3902215802357696
3.311849875373433
3.375229733208661
3.660177958578469
3.349338985307489
3.2844814614146363
3.0581877817138197
3.0544534633667495
3.253819016452637
6.1506318371278805
3.4571697863525235
3.6592683282119096
3.3705434812756367
3.2817762915977835
3.3535662247949856
3.2996980738699273
3.2719525842694335
3.4431083386608523
3.5509545563882146
3.2956002596142726
3.322366545635548
3.4286724019948362
3.129276377862887
2.5496841102259413
3.4804534870367463
3.264402549579885
3.236506237911834
3.12241225949852
3.2384264103612295
3.1230368941405806
3.491541789309455
3.5188927988027268
3.4289988935589215
3.196711805093168
3.691988088104637
2.6285452469332116
3.6277553688797
3.79348963331366
3.3432836885825923
3.537982718141285
3.1277283339217616
3.4219537050027764
3.311736213144632
3.287623909710715
3.6898706353295716
3.2405510685217003
