-2.2313855310184367
-2.8326500707027638
-3.090777142453889
-2.748656742453316
-2.3686341684665697
-2.338311837354691
-2.158820223628855
-2.0970070243513135
-2.906729971442511
-2.996726001367359
-2.519814777106481
-2.928925996886492
-3.206578559514697
-3.297234238314464
-3.051138376845377
-2.3170316083096454
-2.582720731540229
-2.597380558296947
-2.7406736685717976
-3.5880334404139895
-2.729852535671069
-3.4031685690977773
-2.473965400662241
-2.8185831843245572
-3.0575304240764924
-3.0782542963708934
-3.746090881552863
-3.613069525804487
-2.8721756747978886
-3.4406084650495465
-3.523459011199088
-3.5779054615399253
-2.281886494531615
-3.063219680478291
-3.3269211664747256
-2.821378250312037
-2.6847086059585052
-2.8421972027573807
-3.6140362850154717
-3.7919829900863284
-3.4031890409517063
-3.90259831293713
-2.856465381923908
-2.318794672090149
-2.4228249212289943
-2.743457657366183
-2.4224138470542704
-3.5869354106179205
-2.8870317613195637
-2.9764790266628856
-2.989296798215584
-2.9976796994309147
-2.5231274375101846
-2.790751481550402
-2.442785762985551
-3.090406575391239
-2.6193188513082397
-2.7805461906840185
-2.7071615179558384
-3.026396112567863
-2.372913917457783
-2.816764125286496
-3.6967854463700927
-2.6221567609529943
-2.9422126014211827
-2.4538422300198404
-2.8150793920602477
-2.7154405807003146
-2.6549353974018755
-3.2998928669341474
-2.776009509980326
-2.517756504567248
-2.3488601411655545
-2.3678271624621035
-2.39169269187006
-2.802650791277572
-2.1767846149243577
-2.7373755985875894
-2.9522414999190736
-2.5750040084411943
-3.0816652358917613
-2.718099555501014
-2.2076251923696772
-2.20564692670982
-3.466192408409396
-3.3055160739694647
-2.419654700829205
-2.4732815970495126
-2.6249882913111655
-1.89619249121623
-2.4802665517066043
-2.636075670649402
-2.3559482613120117
-1.3918255062879539
-2.601514008448503
-2.8225168353609242
-3.2618072274105923
-3.0392204284232363
-2.981670664514513
-2.480452553938235
-2.786858092967626
-1.9928003587476897
-2.3912891059279744
-3.13404544957304
-2.271779844541447
-2.606136191571088
-3.09845143583488
-2.018434801597762
-3.1301972021984636
-3.498757840868976
-3.1833222699589743
-3.0638903790656853
-2.48788993096776
-1.5577035274102962
-3.0273762083615257
-2.5923396450054166
-2.858431377667614
-3.039902935042332
-2.765050608882195
-2.301898370752931
-3.282204051669078
-2.60971455528628
-2.4724604250205737
-2.7993539835335146
-3.3389709920986244
-3.1837144778552595
-2.334726058413967
-2.686698080859233
-2.7035124555941477
-2.8846609197505693
-2.2010495563054655
-2.8480274518403
-2.2489207163110057
-2.9773760147943857
