12.409836065573769
22.328000000000003
201.5577130528587
14.76315789473684
17.215686274509803
7.709677419354839
9.785714285714286
10.268292682926827
22.26050420168067
19.75776397515528
21.38235294117647
19.661016949152547
24.627906976744185
134.76287744227352
68.59729272419628
34.32530120481928
35.941176470588225
5.7333333333333325
14.794392523364484
14.459119496855346
26.80891719745223
24.37546468401487
16.032258064516128
15.16260162601626
23.41860465116279
42.78854625550661
83.88528138528139
242.9836289222374
42.04415584415585
20.357142857142858
31.42145593869732
61.38672438672439
10.72972972972973
37.44578313253012
137.63874345549738
74.10954063604241
31.70813397129186
13.133333333333333
126.00197238658777
25.657243816254415
25.877742946708466
147.58014477766287
17.987951807228914
3.0
17.402985074626866
10.014492753623188
35.50306748466258
51.91566265060241
36.41353383458647
40.190615835777116
16.466666666666665
59.0
26.04313725490196
31.93333333333333
23.671052631578952
40.51234567901235
7.071428571428571
38.57627118644068
21.012048192771086
18.480662983425415
8.35483870967742
22.192771084337355
206.9811227024342
49.147208121827404
128.22826086956522
15.538461538461537
30.24102564102564
31.359649122807017
71.43274853801171
42.113475177304956
28.665198237885466
10.2
31.044444444444448
6.166666666666668
4.92
11.215384615384616
7.129032258064517
17.06849315068493
16.9047619047619
15.098039215686276
66.32432432432432
10.818181818181818
32.86826347305389
24.670588235294122
116.72048611111113
50.134099616858244
7.96875
37.86524822695036
44.37356321839081
14.917808219178085
30.317365269461078
16.826923076923073
29.58490566037736
11.785714285714285
20.068493150684933
11.955555555555556
8.706666666666667
34.9
22.67479674796748
48.05464480874317
69.95938104448743
6.565217391304348
14.349397590361447
24.205673758865252
8.777777777777779
14.741935483870966
35.276679841897234
15.047619047619047
145.6
19.85057471264368
11.581395348837207
8.61111111111111
9.958333333333334
5.888888888888888
10.725
12.0
33.79497907949791
14.573333333333334
18.932432432432428
13.414634146341465
41.408163265306115
13.745098039215687
27.63054187192118
8.08108108108108
19.546583850931675
189.1276818419676
16.54022988505747
47.148867313915865
14.081967213114755
32.13368983957219
27.245901639344265
15.318840579710145
15.840909090909092
15.74747474747475
