26.239618551881925
10.462462859073753
3.2716680698020966
6.340569643845653
5.649155530206151
9.597986694888784
22.69959505461954
9.08573815004818
6.438947117703305
45.710060040483
9.612060250969495
21.92496102999953
2.7627061644548387
35.239805880380494
4.237560933830255
7.9332401959135215
16.905960739409746
33.49399587498165
48.419648462412674
4.805883906003398
21.395417336162733
5.761965626338504
16.624169213202993
15.69733777435096
61.8871340122904
55.87288923272043
30.48478112133183
17.806214422544826
39.090621360278405
10.659685973871575
34.679797031887134
32.377681060058954
21.414174258242102
23.53486717612936
19.8746928278994
8.644270293021467
4.9041856443802025
16.139227147806
17.547082624942018
56.369705238113355
15.003739092575396
8.10169236166234
32.6306124857474
9.025198033194236
12.543098667673767
5.388089210050511
6.467616433441188
18.8664226261865
6.482302719348817
12.21954447293384
7.031176905263518
5.133805301278712
25.681561414135274
48.63556650062297
10.615743344665919
11.050202327689572
14.612242470023244
3.910067908672688
48.779444915698264
11.149397262598612
3.869799287946685
15.633447655656953
10.265991670586438
38.68338205488553
25.312643089656788
