1.8877822936915603
1.6657550464834514
3.074534271488137
2.2809418330096283
2.6977970207670214
1.9144626467919972
1.7020421874752536
2.0957707299420707
2.5656762833269156
1.9607992787781132
1.8995903145181092
1.9241450113291332
2.575557008550492
2.2251933965288857
2.317779859380791
2.3075923261010676
2.5310782523396367
2.5803304615176916
1.6454521749786442
2.1493226271651964
2.6385194080378738
2.966403660755039
2.2097061098509916
2.2520130120184167
1.752235535985805
1.7962813551674717
2.1437508573180524
3.078080665122977
2.853392669406833
3.090708061861899
2.0641546381430538
2.342622604629914
2.2344329941780927
2.696925437012953
2.614159508073578
2.448274280629338
2.4070499901239075
1.9668152033805328
2.51632518298622
2.5027675756226837
2.0291241630743855
2.387606132108606
2.740675527453646
2.9122527196459704
2.8371097124058626
2.3245830816943234
1.6079591744267507
1.9597381984551971
2.610084330756259
2.3991718413048853
2.1313795663548025
2.698274155308915
2.500934270986973
2.5828307665809467
2.1339520547069877
2.3668411816919246
2.244516925710829
2.138288110268142
1.1337550281465267
1.7589963563819213
2.2941377134350103
2.1886453064244153
2.2401753387675276
2.2548926648972207
1.8711241332934108
