828.9764889868708
773.1182886644797
1005.2426612476413
777.0715174983015
776.8338654933226
783.2944019887211
794.9742481504651
740.3169651157883
801.5541931677426
1206.9094913949418
784.7988077136865
617.5647017260532
783.1683834613162
857.0438905593796
864.1737508578962
790.5728393924616
836.9176089571663
945.34886940678
810.3854484917532
770.6712954889599
1096.7236413132218
700.4237817963988
569.28079249603
429.574291940028
1237.393621935741
612.6179615733182
889.5300077644262
1545.0900594234272
1241.4799996603306
816.6037754658395
761.1851343051874
870.1725619907456
1027.4269249502931
852.738984094852
889.8245283749043
791.9336356815235
779.8724737969388
823.5860882938572
1065.537588034167
626.8135699198089
471.4115293585301
778.2561660972029
1441.3063814822333
904.5145847571775
986.9079985852945
788.9454562401385
786.5802800384012
695.4810265324755
734.2184898924653
783.2617118211145
781.7804208717376
-1.3148983470826323
683.3106577130377
840.1770020878646
768.1063578235859
787.4169944651102
702.6128846984922
778.1669322816622
500.7788578133704
639.1466437091776
781.617737712736
740.6725112780292
766.0446124638677
1019.3375165894506
690.2476495252047
