1725.418
3435.8640441683915
2938.341665759983
1067.2562574493443
1295.7567567567567
945.0555555555555
1414.0164907651715
997.1350482315112
2075.295948616601
2393.849345963013
1455.1537030145146
2256.549575070821
2501.502821822091
2758.680620155039
3288.4626918703807
6020.350751143043
3169.6272557560674
1927.1594561186648
1502.2684915550378
1579.7435897435898
1404.2155405405404
1326.750704225352
1258.2431865828094
2992.6806569343066
1754.5540945790078
2057.873103448276
7641.096438124737
5957.994053240984
3466.442234848485
1241.4336890243906
1166.950980392157
2503.2997952617725
937.420892494929
3208.444556451613
2478.9278041468897
2306.2426246185146
3595.181215336388
1395.2148936170213
3133.7198022860675
1715.3786114704615
1560.8151147098513
3225.4843398842827
2316.1939010356728
1102.2974137931037
2346.170831906881
2567.5046668113737
2115.3634252539914
4912.328390179601
1993.3803440640438
2452.01817665436
1991.2050561797753
1840.950417827298
2411.790483499616
1583.3669724770639
8792.737776168055
2324.3492904045747
912.0471014492754
3012.0579657965795
2078.311811960726
2397.0953038674033
1316.8449144008055
1591.224225927186
4939.561288958207
1646.5638567293774
4670.91000944287
520.3105590062112
1279.0966162065895
1396.5261075949368
2404.341307214165
1750.1915184678526
1880.0725860904795
466.73895582329317
2121.1358595194088
964.5364963503647
2430.4032567049812
901.6633416458853
2192.7314211212515
4159.758963282939
1965.5880217785846
1260.629424778761
1784.4786895674301
1428.692528735632
1705.991512345679
622.9521988527724
3086.2511746680284
2331.836168164313
602.1578947368421
2165.049684280492
3431.370527691554
2097.680802292264
2252.1106817554514
1865.3371164354767
1674.1146230007614
1769.1743462017434
1458.6859012492566
1415.0278481012658
1599.0861423220974
3410.214170692432
1892.7842418689881
3286.0580511402904
3182.8957872758533
1053.0183486238534
1911.8701603441527
1926.9366450683945
1381.201793721973
1678.6952430737063
1490.3665983988085
1466.2536640360768
3939.524768774881
2213.9017971758667
1419.8974641675854
1862.0872865275146
1826.101830663616
1450.8553571428574
1212.093943139679
961.1821974965227
1552.8081081081082
1253.4981992797118
1446.9577762139338
679.304347826087
2589.828880407125
1175.3199079401609
2547.4166666666665
1622.8729838709678
1951.3965790307252
4188.948204129929
986.9355867346941
3158.439178259463
1937.6883273164865
2334.759366636931
2142.1324185248714
779.0290620871863
2258.266192733017
1043.3885666942833
