37.211125333341855
22.543660798730077
9.10788769549178
9.646728700553288
5.4405311639921345
7.055811397896942
9.935036299506788
29.646301366049514
23.53221619241539
20.51880245488345
13.163218621832314
13.28768697170662
13.518459370749614
19.544673135773056
15.431893024924696
40.809093302643035
30.93484077052773
14.546805231543946
11.990798649849882
13.008888205158124
13.650301931861227
16.109605682844588
9.101844740595752
7.6830664138488
9.689839948738507
11.963135259778564
32.29841982575274
23.216932180957535
23.30873431106739
17.141603034794155
8.698021395501943
18.038861898492858
17.011568139876598
15.905482275226946
16.46712312746277
13.037369720359086
11.845544620887573
6.3595560240828055
13.880826924350115
11.49091084795132
7.506600945338082
11.412359030531325
9.96478778012993
28.23486745355636
18.610472730226817
14.085430557782486
15.632362000263715
33.46649773928669
13.687407984779039
14.894179453267775
7.849142154336362
12.565452478875706
11.535082068078385
9.31595199518835
7.311623086246782
6.868617279216035
7.654308241055659
14.711895208854818
14.064104114961474
26.414117900674466
12.672807402426253
12.770838679681
12.444044865663907
10.639350387831056
9.706413460539824
3.1549801295390734
14.242196877637735
13.539946447960164
10.085503701494293
8.728247508497669
11.192236850042644
7.25565225869687
8.940265741975557
9.090061243999829
15.171066059410322
8.522769153759159
20.18727387207189
21.128107453465084
12.876826707722767
8.991443925111454
14.936866709328886
14.936866709328886
3.795671340121392
5.958983489399865
8.632599376188498
7.852994545167383
6.703653437213071
11.049375495149384
13.850939559617608
14.968280885936382
23.41733706939237
13.756823547801973
10.634279809619585
13.508695906420375
16.199134212751513
15.477228162648766
19.890884683880643
10.279433261725561
9.668706501303758
28.00553886760339
11.020614593065794
11.122708572411987
12.28963893322136
12.098946428757428
10.375638094022015
12.716646440417028
7.5262534604893725
11.574987695287518
9.846171132205852
13.044995872669597
9.204443523980462
11.113939254981496
21.550593956331703
16.007279026610053
7.128339091801716
18.342250363049086
15.996714752655457
14.597598254971526
22.700532435048512
13.442005183621593
15.908902794080007
11.206218177769733
32.71445809823192
32.14358446426579
18.13411728706028
23.009834091492078
10.61028321287139
53.20895512814536
31.32075529005009
30.55535896759221
24.22224870715301
10.899547954813027
16.00408391316303
15.20827187562156
