0.12528944257039165
0.11720863462069142
0.033050559350531306
0.3768582395277097
0.2935124634851311
0.12255475828329435
0.06409998897869247
0.12108737035067345
0.12140768118253932
0.4406443981204588
0.11011226626511328
0.2750713460097179
0.2619461308558039
0.15610087909720022
0.0566044570164406
0.49813253998744605
0.4387194368658223
0.22689541251245696
0.1663446598111257
0.6016551333491731
0.501233796495191
0.7708048476756961
0.10149840819974697
0.3871152421700833
0.0583207343576823
0.12487510653886008
0.20542051703834127
0.10015554568632014
0.29440382967060635
0.349316899050078
0.25668411297793936
0.09904220044633012
0.12817285336163947
0.33452390260859016
0.11448704269146458
0.13327136952225258
0.038169972273741484
0.16210855085351694
0.138471947394167
0.8654978831136361
1.0436812934221258
0.15190745589502136
0.35657687101882685
0.5801977507034943
0.09384031834354882
0.0717935858676859
0.07466617713953863
0.1796705433439024
0.8059984095192672
0.13601629387649336
0.2103365629546034
0.10200351677110253
1.1418622890898116
0.2446913907609335
0.05409691366219725
0.14732163888792088
0.576074522949986
0.3739811313907382
0.2350287858349001
0.39186773132693203
0.21805307773592136
0.2914541896217627
0.07090101559803026
0.2735155380702258
0.0861819403759969
0.06785583309957975
0.34099297335775325
0.13613315053330616
0.029619251906191562
0.26845142202079025
0.09701154078868424
0.18983956966558024
0.16678400515469638
0.5080887876019593
0.952110952883192
0.2604309131495604
0.2473778978149676
0.5670279905064946
0.2402835044928245
2.8261157929217404
0.06736716513480924
0.1069248686334592
0.13798624542471544
0.22825241674665145
0.1410627654158565
0.4846025577629568
0.534011017242689
0.06343310076266177
0.14532303793508738
0.04420187638913062
0.06493571902520326
0.3904150037148809
0.061869704005444726
0.037000119249499315
0.13007428647737512
0.3174550881285301
0.680545659311401
0.6520111120062427
0.15969345571072582
0.07459694382697052
0.11434554904613944
0.2356530890090761
0.1077574200486865
0.17242125048000875
0.08673426538158223
0.1483308731179252
0.08842096735887756
0.05683178444304934
0.16223782159366906
0.597120167195047
0.3426694460173082
0.6903833547440981
0.27043713654708856
0.061357953293059125
0.41032738528407053
0.20992213119353406
0.07583206814651422
0.2361267498858589
0.19742623479448795
0.18026561707081248
0.09825259177065387
0.2031351682341171
0.11644577469306462
0.6438951303230257
0.7659361733589247
0.2306223669203433
0.13495728611705834
0.18057446897114696
0.12157173508468777
0.09811659491952987
0.06499879024502211
0.2430128827950161
0.15661043078214593
0.13552311844889975
