-1.4668106955421798
-2.2587473503595583
-2.4965273878936745
-2.6506284150202184
-1.7629174127450293
-1.4853041299683507
-1.1138718492896487
-1.1913056775438122
-2.0228031149528105
-2.5145038022750086
-1.9770074069768868
-2.5168112255745845
-3.0174451501282618
-2.8534441587981387
-2.342018736475407
-1.531564924615912
-2.2134128722863116
-1.7848706853036072
-1.9830743760855956
-3.730935992233432
-2.566061278223248
-3.6057826883318707
-1.7749049599148907
-2.0937107507067387
-2.3701844956684903
-2.7804521492818153
-3.8178999446319946
-3.580417304651518
-2.5805782835756714
-3.2481513330629257
-3.2465180196090646
-3.5238097844015703
-1.8227383876177135
-3.114865190169681
-3.4564178443406
-2.778812471315099
-2.0874105303354904
-1.880208185083337
-3.593832616970383
-4.024943415023735
-3.46874914376906
-4.0582361891985155
-2.7433111389049802
-1.9276641496540508
-1.478074554761224
-1.6680755524344184
-1.6332110006429048
-3.413287158411533
-2.18792894253862
-2.126006597244624
-2.446716446039093
-2.4350185581782795
-2.001545819514717
-2.253204798587725
-1.458654708033758
-2.228880542099936
-1.6784129811661255
-2.2036153444464426
-1.9195560900525366
-2.6498932323783864
-1.7659157250482187
-2.607016886358963
-3.197358999812035
-2.1230405948334683
-2.125845174055408
-1.4912145891178312
-2.2898506207686053
-2.228742371415913
-1.953625488747013
-2.9749739457881987
-2.22556289661134
-1.7883423741711888
-1.00975015661341
-1.824188871647234
-1.992315795871489
-2.231899158934367
-0.7087583279517757
-2.1399949870001693
-2.7504115083399054
-1.7781778362288616
-2.4949793127121467
-2.1651986127001823
-1.1454387745493966
-1.1853179892009997
-2.9014201219581417
-2.815196637536592
-2.246837432866906
-1.748150201203067
-1.9260794677782602
-0.6229183140043257
-1.4641120532681853
-1.7080543644559605
-1.2856696206078266
0.2284614352390399
-2.2000540224408507
-2.476449405290083
-3.187092292664292
-2.4655873391034295
-2.3168561564754304
-1.3756674187783464
-1.7663057630983816
-1.455864496021775
-1.6315627493548817
-2.443420086574437
-1.1512748321187525
-1.9573857974319386
-2.692401668260735
-0.9068114317204604
-2.767199593488149
-3.4624621726824754
-2.891266726537797
-2.828073783373454
-1.6693658838433723
-0.5353152347868628
-2.509644558993446
-2.2772687764617685
-2.326735018750629
-2.6848550599907917
-2.4482507992895917
-1.5941595523981655
-2.761840440409627
-2.0806564775090255
-1.6065745544164598
-2.7975445985086935
-3.1625549733731817
-2.7915942510955016
-1.5775393249269358
-1.7708330418000138
-1.7534916266254186
-1.8156457079000548
-1.2164854736393265
-2.3171755292306915
-1.5679067351450775
-2.4931263917002378
