0.9046953097775484
0.8952016177552742
0.849502617749973
0.8689602068259964
0.8439794697084252
0.8014040875999277
0.7494485778129559
0.8402837712899404
0.8599222050570373
0.8878650593265965
0.8297594786514281
0.8402144457630037
0.8609240431261365
0.8920110911160036
0.8458969809804485
0.8897258238985783
0.9111957371057025
0.8874635420788053
0.8098199049867401
0.8841456828948822
0.9035510182914032
0.89673602855634
0.8591441782670464
0.8216944019986567
0.8120115816994773
0.8617151721480727
0.8858700453687528
0.8761613427357163
0.8694122376401784
0.8858502041676127
0.850928222481421
0.8906073552498938
0.8952703470857669
0.9145559952251948
0.9132968802131104
0.8986905135340367
0.8054542779396999
0.7658551770969421
0.858545942805939
0.8927599075158823
0.8893029252937854
0.8586552167649797
0.8624649637125823
0.7800014203816544
0.8545741827207676
0.8416872790819034
0.8478723328713199
0.8827787618294407
0.8368978053599873
0.8232287281946074
0.8471681753345959
0.8549348108718291
0.8950887384682081
0.8445296797750645
0.8199694434899255
0.8177595952922591
0.7610757767166265
0.8761812352017485
0.8592941249294798
0.9111508976859559
0.8941176901896691
0.9094378948327392
0.8140667091250843
0.8561504422684781
0.8076583495760343
0.7907593706734736
0.8462832537235916
0.8552371380649973
0.8492250290634336
0.8522234250660953
0.8489942600005406
0.7795743943481933
0.7209641891637518
0.8380600990393017
0.8720027303888322
0.8502642612266857
0.900994817258462
0.9173651919216964
0.8924978073506634
0.8412753890090124
0.8244813628554583
0.8680900407535947
0.8281661497343181
0.8455957841926852
0.8490939267845606
0.8595396395922866
0.9425330290298344
0.8353673578656556
0.8561021441087182
0.8555257339195337
0.8577931685633406
0.8615195701180279
0.8334844406872265
0.8265807815249077
0.892046767703391
0.9076089039499408
0.8878431689597353
0.8300375053804413
0.8191993298063722
0.8040987013007951
0.7958050268240322
0.8746624697396038
0.8527645191414048
0.8041366271712067
0.8285367544470323
0.8664215929488225
0.8570374841858767
0.795144548306639
0.8433560837849186
0.8788082056673733
0.8756768719497108
0.8820669941342301
0.8780513313804329
0.8729800835806526
0.8271270402097682
0.8662555306630311
0.8801574406074019
0.8507820154801379
0.8727081931476341
0.911826294680534
0.8411523271486586
0.8718792756222913
0.8822514085662487
0.9548134549544138
0.9053904446960828
0.8954841467300045
0.9131187462015048
0.8680496085583299
0.8690539711797538
0.8606812875237981
0.8441715336538379
0.8484465476580966
0.8607069680170617
0.8729341026117561
