258.76115216667625
277.17227766350993
413.5006328344151
171.66720200037912
122.09316567408344
57.71414770149601
45.58261049019768
141.70623904668545
191.29730487883114
463.8755883952783
324.81294229234686
624.8688621033959
402.00936151369314
1449.9765769749608
280.90590656375406
829.2625749673339
680.4215589147495
194.54825666332874
142.1946965957756
164.12194713821933
219.86472957648223
256.3659557020412
178.25050578116944
156.07721057988402
134.3664182082235
412.9886677898783
525.6523569457784
539.3107652943152
299.03379224652116
369.76137847806524
193.50793220723938
698.3180251146887
269.60973940073603
444.500688105472
533.0527386018514
296.68708086450715
138.38307025609652
84.76590908620653
570.2869147556273
224.46857006846489
269.6586480583073
621.5873102946314
208.0892394414696
38.38402258515619
261.61057372966235
234.48833680509438
151.0735269855451
387.15889328694396
208.49962607579783
210.16135093977863
197.38248505853642
286.53991934018416
426.4573904474156
326.4796519678738
197.82375502370425
279.4617871899499
73.1031521828551
405.8929944984949
240.75011450930543
360.15766538191144
282.97562887919224
352.62943949769686
396.3321295691731
167.76082802708518
411.3797963412408
69.22940923371333
121.8872235159276
257.75795907168504
334.74730476906336
397.05363593123286
159.82892311937462
86.44266347206816
102.6104570793299
79.88041443065048
65.5050391307426
104.6212435504988
130.55440943451427
808.1087578064992
308.6198858722292
179.37560727289213
150.18210466941196
373.9099231864893
118.85668699440286
148.90853448326158
468.0177706983171
410.8121326905316
257.1985758341432
178.2232706605321
175.65362598702737
242.53700440428779
201.0825156980402
220.16598537453388
174.70331847826333
54.464909481091816
252.4304789304867
474.6941758018277
317.5542743661165
361.8209904963812
174.4986701079327
173.81462727177887
187.40911903031446
113.94457262826738
157.06127217289733
117.00873215154293
105.14742783607271
247.70490054999127
293.58805930020395
78.60877058447905
317.1668149146287
247.0606584193771
246.00816527983872
219.62150051467438
194.20169162885057
101.69629197414831
179.53840405599755
210.65381697098874
401.6591385971045
169.7141972137428
261.9648929996028
175.70826269160648
313.0578584913122
237.80671559249618
311.36155333963717
675.7940552871711
292.49348743062023
887.5417981102931
171.40955040841342
684.9171687188466
563.6851262311358
427.13910111165933
278.0881217750663
133.97163975857993
227.67042966858142
202.3664935324317
