2.2288373076752217
2.209898683454771
2.7076460700821783
2.414449435863444
2.2280206155903235
1.8606691975409144
1.4622232098823804
1.9091719705100183
2.059605901599238
2.7606692089523737
2.1494987917147244
1.9470817969491396
2.324307836924806
4.136640800773567
2.6689446122261
3.4351285409258314
3.5345760728452125
2.395019586371021
2.4508709066856764
3.0697873820670516
3.4709706170411687
3.1700558393863703
2.5623160814378485
2.5710761145151384
2.4642839375486982
2.8972248516173886
3.041903509403664
3.2854196319477884
2.7703647182231306
2.5391639372891404
2.4119376839695037
3.0618386991481152
2.3285647580681044
3.5119280542002347
3.56440719850313
3.3669849075015343
2.3091738311272425
1.7046833110639483
3.1148516921076848
3.0909091114775755
3.2440568869459945
3.1559481901281385
3.223698187746733
1.8392166107306498
2.4202719378534567
2.515659431155206
2.321457188014325
2.659640107007625
2.3983259439231315
2.4056492525788804
2.2500989626718466
2.46986760278492
2.896824009038484
2.3128809240855865
2.268058161101678
2.3484834352084207
1.4700180970173855
2.674913526340996
2.3593444384970885
2.9112272275893942
2.627202266047902
2.753999700758208
2.7183341206556104
2.6201840015249918
2.7242225193429577
1.6761620921417375
2.210085736318222
2.356467285131302
2.3517936915508915
2.283141123676314
2.3416737832741688
2.0684978113320884
1.8201801349184377
2.2071105723537405
2.326601631429872
2.1873196754683604
2.124755260149892
2.9683017722073872
2.587751490973724
2.157599100147035
2.3403777486205803
2.6880854632790574
1.9249559548526207
1.8737445296156785
2.804649667170171
2.813859687152335
3.1022764126358955
2.429342167410133
2.4724085693169235
1.6334141333625265
1.8527352349302173
2.1093716558970788
1.886375286046475
1.2615536245693368
2.9384575979251033
2.9742218031613503
2.792508122243302
2.8446373617369494
2.1526658401972627
2.176177449613561
2.308591131775489
1.977431927786068
2.2094984781852567
2.1240706408365946
1.91117339947082
2.3981710879455367
2.56659572770021
1.6041519629500658
2.9862255116989607
3.1274796672222283
2.653629983719473
2.827440826601931
2.162241833479607
1.7302583621349523
2.3584209866594947
2.6702503424022965
2.480246687625479
2.258342516471889
2.7542574541374916
2.536472569234576
2.846469934985796
2.749162149931231
2.540331006534505
3.2484046348436797
2.7219103878804667
2.847659281963705
2.413046810274919
2.000577510625799
1.7189502689569482
1.9118097116601407
1.7487604027876096
2.5403397045565743
2.7123016945261784
2.527038710510071
