-6.621450441815929
-5.808559583363991
-7.698620618229197
-4.990671030425788
-4.81533767724827
-6.151677901665375
-7.000985470718251
-5.839857555462313
-5.206765433156883
-7.420880329072805
-6.547311755021142
-6.7449118952626455
-5.2793768466257385
-6.42054360919256
-6.353817887631531
-5.855281969869946
-6.565110910712732
-6.739414752860115
-5.654730251988019
-5.411210624076611
-7.994837608943189
-6.1546603212262925
-7.264598332126081
-6.8854809191809485
-8.163403400106576
-7.251945177239448
-7.291236586524861
-7.513781934238703
-6.429040167947709
-6.798823388673646
-5.989382275122415
-6.937061454011675
-7.827471825503789
-6.632272028394421
-7.288585349271876
-5.410264820509374
-4.346494027969793
-6.5321047536449734
-7.120328342727642
-6.840205284531213
-6.342002887709415
-4.545164856759484
-7.463680504753583
-6.421533192248826
-6.729371047626496
-5.1726932028513035
-6.355998914060634
-5.687849364956961
-6.0866613388220925
-5.087808656447802
-5.102118623391056
-8.331243302087438
-6.6883286887106985
-6.360523928376019
-5.5907397933828005
-4.955653227632774
-5.440319070213485
-5.938988365643536
-6.349792725832604
-6.6794610900210305
-4.994715672585711
-7.4756093315880525
-5.332123249486012
-6.500077896287981
-6.2031352939653415
