0.011996432624499415
0.012541331314306462
0.0080450878844114
0.03003697347352685
0.01770261606423991
0.006701955264564999
0.003247885935033962
0.0044393774069642926
0.015964424579442145
0.005750296194885103
0.006868160756193053
0.008788975379313689
0.004830690421910997
0.013581749036293774
0.006693693127597914
0.013184288871099856
0.010725023799397214
0.0208874256143186
0.0193080691576749
0.0031202679644724176
0.007267916194900815
0.008886703374486677
0.004851621730046656
0.005038956093056239
0.004944554944915228
0.010041074351148134
0.0062739678628179465
0.004413977445342424
0.009329859309768335
0.003144398589615285
0.039358611092619934
0.0078889998313112
0.009746133198883232
0.006474815848515548
0.011701473794584263
0.005197841559662226
0.016797922928303878
0.006773834730545941
0.016950126347707418
0.011734141174650702
0.008579762532923654
0.0285939509737964
0.005935934555001418
0.005765103878126135
0.0063028474752376655
0.005339522638611706
0.0053183229116541405
0.006579679699450698
0.004917797840851146
0.0059882311126684615
0.00583685226832501
0.004427504840788871
0.015282963407921644
0.02931312578600068
0.022658354418647147
0.030025925121766793
0.01032108343965412
0.0036635351328115602
0.008522850854391929
0.007184096998491056
0.009637894879773852
0.002774311638098773
0.021861136009161824
0.008520140762225424
0.011416166579908694
