-5.371223894472919
-5.204932050865115
-4.87284980368495
-4.258965602974618
-3.9006734323277312
-5.709066034783581
-6.038958016009879
-5.844887106077683
-4.87025802689211
-5.685732547622931
-6.015571726848311
-5.3234406619885695
-5.163957902955708
-4.195779180716504
-5.726484074510024
-5.291381596566014
-4.253771267629634
-4.730724075657639
-4.388527080638287
-5.601795191653938
-5.584078133344495
-4.23114624465828
-5.515903986586107
-5.19341390833593
-6.17114284582002
-5.288581617891692
-5.721595451537656
-4.776036850601656
-3.83564006846936
-4.331430386629902
-3.658003076741097
-4.758761823169097
-5.494226731268515
-4.576502818547004
-5.042781152499476
-5.083827845140205
-4.1633492215111
-5.558583544538063
-4.845235848236427
-4.596172123872624
-6.0216614460822555
-3.802925961832102
-5.080175932376335
-3.9957647828988434
-4.224733535766079
-5.213460690521584
-5.89672692666883
-5.715246368886066
-5.64003268116373
-4.606168787975596
-4.674866409222037
-6.055799817108676
-4.321975230951463
-3.7626099124719676
-4.575062861473643
-4.480910273802064
-5.227158066275901
-6.101591999052594
-5.515916227549622
-5.951821955718895
-4.8290539457311
-5.821402566172125
-4.661198032204261
-5.06904382929292
-5.415584036202098
