4.609210732744139
4.6021464958855605
5.587600080752116
4.38421198723925
4.601092004374057
4.728452640615749
4.766671486751879
4.749770729864106
4.939707481164408
4.857283933085398
4.883641766072488
4.616843042504898
4.982998951909754
4.461230704223741
5.191314703076105
4.590914538158832
4.621337173978501
4.683659850274356
3.8313039393879817
4.907606290514068
5.148858358444218
5.015430525848252
5.072041523000131
4.9100457574524246
4.765221701290743
4.469878404434784
4.868181002597566
5.594204469315734
5.063326809647873
5.449415575891605
3.9843743936431713
4.773264856848755
5.062397364168944
4.997703981945224
4.867717039383052
4.739748991857071
4.059434644455443
4.628770633589764
4.956376190004364
4.424041299538556
4.6744291130329785
4.19262163097098
5.10790339151601
5.089762919846209
5.097819220496761
4.661687625793285
4.924437644593053
4.512613240720136
5.096397425038482
4.741978431130713
4.4884745735225
5.572539127820418
4.636339150332488
4.4222410881907726
4.373843154191339
4.311858527911191
4.593710057880145
5.095134787789862
4.176485870258622
4.880241049374032
4.621617642818494
5.101263494727079
4.3914396869901795
4.856749339789425
4.5512390229951025
