12.825982998964198
12.019139058397998
200.47115994576137
7.631696760983758
10.955867942004325
38.91055696909639
16.108920979311225
29.81055029749012
39.35489333420853
32.26490271794629
24.55391549003441
10.321992178006669
38.50281927156568
6.335060884787771
58.71108319886506
11.840777418939732
24.70604621184947
22.671242863528448
2.864791730009121
24.346215772022607
90.1887093458424
70.20112145751035
68.07207271436725
28.626391946517067
18.314301214491685
8.910129037029328
29.32819431320389
285.71970586093516
36.668601371453
199.35846081442642
7.963385955462451
23.03901911819564
61.654614296024825
31.25266773008518
34.1228982670195
17.373857859579758
6.050073652219504
23.24094047806167
71.88631950748676
16.34613169927802
12.390520691406502
17.300303622008293
65.92203015754582
42.28757741149821
52.505480258124315
31.409597937240065
68.77042678554632
5.184205490002548
61.57953935353143
15.212867560944025
15.011837852294397
300.30288754911936
18.87818686897581
14.486041250038472
16.42538253302815
9.666105920501654
13.358183624525935
36.59285184815164
5.360451140670809
30.925066199211297
16.145666339111493
60.12793673651867
11.340492130560053
37.283196938987494
5.274877304736481
