0.6195092092780995
0.6330469757569843
0.5711135818290198
0.5890148414625396
0.6285856026658387
0.6976359789544782
0.7418588547238707
0.70210138484763
0.6379120953674031
0.5355689255726611
0.6721594079033131
0.6627321818450864
0.6032104346518923
0.4684370281282074
0.5877312466774287
0.496482500140573
0.4535244898004975
0.5943339115342032
0.6145840578302353
0.5107976645774891
0.42400980735139976
0.488481311172801
0.5619102954857831
0.6114799518388755
0.6100928010138611
0.5279376551391307
0.4962291447703957
0.5065853961990717
0.5493468864925795
0.5590275716892628
0.6007206339694839
0.5042302891757505
0.5631477536316433
0.4307930975954409
0.42477294888988265
0.44899219322320505
0.6491648301808272
0.7122986846644236
0.5088966884962044
0.4763704565455006
0.4710731170376361
0.5030898139354814
0.5166980229785922
0.68883284646119
0.6219549291660762
0.635736491099986
0.6198909816437954
0.5792753380715803
0.6317327574001523
0.6557285439153162
0.6221314345046369
0.5999725061066171
0.515367991267455
0.6059627899125304
0.6390599519180652
0.631788330610454
0.7187412550564698
0.5652388396651304
0.6244254353196234
0.5080025668570151
0.5651765721470231
0.539633355757384
0.5821795866061426
0.5431931457999384
0.5962714839265912
0.6841879330769959
0.6055979281598948
0.5953995142084926
0.590031776603272
0.6057006835663278
0.6172239200648649
0.6949622331215118
0.7067140487041705
0.615742495831624
0.6131707302547426
0.6065740424234459
0.6145139648413053
0.5689413298574215
0.5360973005910776
0.6369887721095282
0.6272962079113109
0.5601883669205148
0.6579731525003019
0.6555530296364505
0.5654540675676742
0.5501332503179344
0.3906742156553727
0.5918848528280514
0.5780352503384597
0.6988846136839364
0.6821942280487062
0.6619204117226118
0.6863178468386381
0.7800852849614885
0.5352018990236638
0.5034994425873054
0.5538531078028208
0.5637347242937243
0.6238500462916292
0.6600121829894684
0.6673815114620664
0.6309962464549564
0.6113231149405924
0.6261868872252366
0.6809857806239878
0.6206064401702387
0.5898388933113947
0.7079216309953862
0.5469336677052311
0.5069162197169628
0.5217932028686195
0.5291082520814723
0.6543031258172725
0.6910930618501202
0.6008715024110572
0.5944244668382864
0.5630980578430997
0.6284066694329877
0.5758538188263749
0.5178862124579134
0.5993858868394639
0.5728878570456585
0.5860250938868058
0.4194327557662483
0.5566335864844842
0.5364299542630753
0.5526406080100194
0.6535873615431691
0.6857221802691783
0.6661185507877982
0.7078832533803008
0.6003343554683689
0.596782585878006
0.5752511238341073
