4.042836665648891
3.9875179525691906
3.2465775122287117
4.272909377648439
4.069383721943951
3.5626679721287275
4.375841995715565
3.834294195081693
3.775606093779288
4.558850406091983
4.775850657167755
4.689888007908597
3.5628779024215413
4.64548104905094
3.7570309112458222
3.9184404591564825
3.6008052782751547
3.9091930105213626
4.26147562648424
4.094289518088749
3.2339132054180157
3.4879139265825145
3.598112965143934
4.145752999825986
4.218870712421382
4.377696457737291
4.120402176544117
3.236765636581761
3.596013815872996
3.057872697862988
3.1167826846397233
3.9469712458684882
3.6957386689864364
3.8563249100814776
3.7859175062009323
4.068171200676779
4.221977060885604
3.942882421065879
3.2864444819789607
3.913170238642107
4.782439699256809
3.711891064403589
3.7142429401586914
3.8627752451591233
3.830791612526896
3.685092962631846
3.6382850226505616
4.640786965287812
3.986113258189937
4.142781783352085
3.602759639525406
3.3732855185886264
3.7632094643253784
3.567214573576595
3.6683639986638843
4.200199208402656
4.512079530841301
4.151964736434103
4.342103127076252
4.304199792968965
4.237521219642164
3.802127402106984
4.058730580984007
3.7242333822149902
4.715943216291954
