0.8893772697082969
0.8900205477990538
0.9317175121395084
0.8701837715948982
0.8859657327533375
0.8927419350042176
0.9239999298811712
0.91131860536728
0.9190814746689272
0.9300836717263804
0.9308637739098784
0.8956770619053174
0.8943476988713048
0.8739712977097569
0.9267155356223312
0.8751672296125387
0.8882262070630008
0.9024873729796004
0.8735249538795885
0.9080592093315688
0.9436559479548312
0.9047920829666664
0.9031701382291556
0.9240515737161646
0.8686801455167731
0.8894865329874156
0.9545804554110978
0.9748424372904904
0.908805677159798
0.9412043102881852
0.8124681295719062
0.8866666618884584
0.9378906258705852
0.9039990209015414
0.9107808129977278
0.8796228154285726
0.873099644482902
0.9003059724492863
0.8980424398951385
0.8629428256902771
0.895944208447077
0.90352277023287
0.9362895135080046
0.8927952548286915
0.9201288082148332
0.890701677028184
0.9407773469944976
0.892076269967069
0.9321971845210298
0.8899023478285379
0.8894093700532886
0.9576248081980432
0.8899528898349037
0.8656544881165795
0.8630985719387818
0.8562738158541381
0.8636761118476005
0.9147480460997264
0.8343909902191923
0.9405069349488244
0.8917100472873385
0.9109696540789648
0.8608753880095228
0.8956567313329925
0.8725343394494218
