521.4673591574708
483.602277570056
404.8810500282296
266.23138466150886
385.3057364666269
538.5967709886197
469.4128377759089
536.3197884530347
451.63162023682816
334.263684307219
225.45691144260158
383.1128626665262
447.2267932644578
579.4252503038292
332.17818797330426
362.1005923871048
1160.3642768806392
1257.9868651219424
574.8231512147139
327.3516912332448
733.5965623958368
680.1033100871091
627.7096775133584
594.8404952733284
874.6638567694781
771.1899046820993
577.8946736454944
580.7536926408927
482.57751733662894
608.8442305489231
484.8170590494332
1011.7821268080536
888.802222040391
787.9703219196609
848.3798198351835
442.24774653589964
388.07669820638944
559.3178799873407
831.3958237899685
895.3052218464309
367.4896964698388
263.14590024994806
635.0780293299497
500.52553404992113
546.8860221191874
358.42544312702233
354.69760361226065
215.67308829025987
345.7656911905935
275.9607711769637
406.18277160188416
692.5081576956056
640.6072831859314
661.1678777086662
472.7061913989464
406.00848699995726
325.05571005226034
319.97992020134814
410.2393995210051
244.29813360002598
229.43029348001656
793.8584141120014
720.6115149477774
675.9225297393648
390.0031433421347
