0.012202110151435505
0.004563734613698942
0.008629049487645691
0.014772513682403681
0.015446938586173409
0.0182600071837332
0.01773761785873473
0.05417346370097596
0.013222265505588466
0.006458680824420113
0.005622714441912505
0.00776940046300835
0.0031276494173615066
0.012121618640800452
0.008489308119000224
0.009778252378289323
0.006263972322412752
0.015386409133983757
0.02514190441476661
0.006502776341313541
0.0058572127903005295
0.0046743345873954106
0.009462536951264656
0.007388427766474814
0.010650889708971337
0.00611986246685056
0.0016078060664701745
0.0021849535256152305
0.003352041467885993
0.009555190795638494
0.014205084604266425
0.005223590335233861
0.013847311047519635
0.0028830661952349893
0.0034103498091364115
0.0036081489700802096
0.0026783408259897523
0.01440593445672038
0.002522350951571265
0.005753695110087362
0.00910479407402306
0.003486394228985202
0.00393872109972004
0.011811401988842715
0.0163614705609582
0.020425013767265524
0.016682514919404156
0.0036652119703751845
0.008979278140191982
0.010177712681441685
0.010845354932167798
0.010612062178370423
0.008189528080588766
0.007667275371069072
0.003081657882116149
0.014058037275051123
0.03627295395596314
0.0090180072331178
0.020547551616888097
0.012600168666518786
0.024952584001650468
0.01915869750758183
0.009346254919127434
0.013713589187563168
0.008028721881706809
0.07630807985219851
0.0083333467507403
0.010338952604227509
0.010625629068745505
0.015129528903033462
0.015345337136303096
0.06270938875262112
0.020134301149538958
0.05010017217646378
0.007469262008919717
0.026747880800959245
0.009501293812250613
0.003141224523874589
0.0095387261193633
0.04231354594920401
0.010485822781269478
0.021840060387307743
0.022593001053529224
0.0172292340705538
0.012878375980215356
0.0106046170002789
0.04458658072796655
0.013029929098342724
0.006113040565811918
0.020161557115534412
0.009916321937376463
0.020689775676206387
0.044423547596526516
0.02300902854363456
0.0386241505360978
0.04772237551671343
0.02828686482015228
0.006644521245313864
0.017181058636959838
0.02222397094176897
0.020715053053723544
0.020768125656992816
0.014449940856293225
0.00788457552957663
0.04664090318428445
0.022918331224312385
0.012840293922765143
0.016687861848340108
0.0050631909702763545
0.005549348227922987
0.010907104103366223
0.008758540415491577
0.012364239559058562
0.02738845008688921
0.013040423353970558
0.021498898619290475
0.014296280844342691
0.035465256514401404
0.019055226248154877
0.015778966331211924
0.017112781157017917
0.03700841750674557
0.012614854624426394
0.018086959778583274
0.0154372447684098
0.006035800030902832
0.027613970569287632
0.011208273456689968
0.0121800726046089
0.017572947308334752
0.017996306055259675
0.017847363095993926
0.007009250085275493
0.010124708747223049
