0.7665858249564673
0.7571659914046641
0.7411476093301536
0.7789022902308075
0.7945188368317311
0.7520984024230385
0.7967040901979651
0.7762260615295733
0.7790030173645563
0.7783890323151216
0.6704068996436514
0.6899297783529224
0.7392547501799239
0.7347886023928937
0.7158876315166439
0.7826341224103974
0.7512482829267121
0.8128667985380609
0.7365376361111279
0.6194761698520574
0.7694114228871687
0.5554060008168745
0.7587583722054345
0.7566164069105112
0.7847098838897586
0.7513782838477738
0.6347455543017363
0.6658933709349271
0.6618423711182511
0.8012421610736771
0.6993314668872681
0.6486569203298121
0.7680444575756817
0.5450061722651418
0.5552421131488319
0.5903462489367067
0.6548978938658757
0.8097726048714295
0.5566065942226516
0.75821465026011
0.7276963443553385
0.6916142590950111
0.7495205188181328
0.7705688052337752
0.7202710750130624
0.7752261060191231
0.6963232889905758
0.6661493209424111
0.669539683686794
0.642670691429694
0.6396741040009267
0.7093119091746892
0.7583235528727532
0.6936105845245842
0.7306981364621962
0.7736408524766962
0.725989268524496
0.749619047185404
0.6856323690460464
0.6993733607936065
0.7636886788902293
0.6937222716485076
0.6668380555645438
0.7037167374841109
0.6489759292375427
0.8102306124684298
0.6732243989954376
0.7202198482533023
0.6470936288510514
0.6764886545359815
0.6254888598240889
0.6784595106504919
0.7122709030993427
0.8440010952118346
0.7986853401974578
0.7916104079639686
0.7998602187304737
0.7306069837609219
0.7589118279223737
0.8151184032923391
0.6343960329884503
0.6468295025520165
0.6955236185637791
0.6089369694802683
0.6862300109145453
0.733570957411172
0.7137013417969192
0.7869104718759048
0.7578568774762582
0.7808696759254073
0.6551810340497393
0.7379666674210529
0.7273676522131708
0.7463805761460601
0.7220968072688881
0.8184738590445053
0.7737524381530474
0.6857011499214493
0.8147676896883012
0.7343949109841421
0.6458482097005851
0.7504009167655397
0.7538491399263959
0.7375310027586793
0.8224313187764745
0.7363514592142272
0.7157471431567166
0.7700514706192993
0.7029671355023727
0.7505914820813475
0.7545514863207732
0.7776583765459066
0.7479377162451432
0.7798655533273416
0.7535313516363378
0.6904606578911435
0.7284059756728878
0.5660115753021779
0.6819929877904892
0.7782571388851128
0.6831218715570873
0.794386833697478
0.6517541955806363
0.7792220450752807
0.6433921616625874
0.697376579633217
0.6826258778773047
0.6776466095083131
0.7599975902634615
0.616842387096165
0.5592913789529022
0.8025147877602355
0.7847707251313726
0.8105957973374436
