2.4171396508426266
2.5223294040032247
3.8726018991234503
1.5485114278388883
2.2585271308357435
2.875076242849199
2.4283742214095274
2.6176503248538663
2.823502928402703
3.019928321341522
2.7421524924985343
1.911934354771662
3.072755105501899
1.754134002916516
3.123148943608281
2.2943865139554105
2.5299260846110436
2.5817726010232325
1.1738865870316992
2.6235198943550286
3.383601619102155
3.2583204578421556
3.255395203028155
2.734794481932308
2.5088197752943495
2.2677940745040837
2.7726553598799897
4.112501588703563
3.143110610135439
3.9805025832334824
1.9627939321644823
2.562153245177182
3.2527299050337084
3.0432558311892297
2.7640770164153303
2.640114529658604
1.4431711565315377
2.5290159452239735
3.2661649088613056
2.3893545107583187
2.157824955821838
1.3098226017597925
3.339523775451086
3.14540241591223
3.2299594659024007
2.8890961335214453
3.1519711015987637
1.6186766681482592
3.188888408060733
2.440914430112687
2.4702986173616246
4.04886730770177
2.43653672012537
2.197522581345348
2.3751129799841184
1.9728323424853302
2.240305764005811
2.9239889315720777
1.5934240851772294
2.709372221452263
2.2757620199149766
3.1773267445897324
2.1955994622252932
2.9076614057759556
1.9127432974639467
