0.7167652328230966
0.5561907538127522
0.5895284132855972
0.2191267133649814
0.5267972000372916
0.7625257555126906
1.0088881155519007
0.8360762053404136
0.8345291297350607
0.4159269856960621
0.4436411601994252
0.4728683957770334
0.3010029895094158
0.4246852319213451
0.6194818024264619
0.4888872684568377
0.2605134612292097
0.6347571059710214
0.5707205570082498
0.2168065137907201
0.19686423319933746
0.14364481660397033
0.4930582410162204
0.5570853767682533
0.6140929057005531
0.3467459685809177
0.2761807686401053
0.2971551602316589
0.3413983647380409
0.39686788468253786
0.4779017653113297
0.32159836240192136
0.37319693801640175
0.1754286022174192
0.19117156928502707
0.2159515123701392
0.5071119086999286
0.9387551597891785
0.3190751114829719
0.20967217035964766
0.20570724584107572
0.2743522871813218
0.2151527501467822
0.3145125560394456
0.7554946357305058
0.9833227110356378
0.5820013188226055
0.4241984032984118
0.6798488824642462
0.8339533935206062
0.5551036636460902
0.5212244164660003
0.42287846930228107
0.515819033643457
0.999301549410812
0.9051696256483758
0.9050379736050841
0.5043008352183819
0.6967975788705121
0.3834205712759991
0.4752865080056794
0.2919827576572193
0.7102889419472265
0.42843622357982025
0.6908994165508453
0.8198937900314875
0.5031606494820451
0.4269061721720411
0.6125220310248761
0.4239555091235469
0.4756484132601129
0.6459155896512061
1.3817761652283855
0.3808779002913963
0.3897577760719454
0.5160662732399541
1.0698747521839531
0.42316487955766535
0.2895521615874259
0.5590181410682441
0.6172449196099881
0.4980412266457531
0.8417202826402702
0.8317175577410881
0.7047495322752868
0.5288946302704489
0.2442127806122483
0.5424695419692971
0.5419995297378392
1.1422061042177891
0.8608740004179498
0.7763947723016107
1.0037675197970892
1.6360294059997362
0.4115355143810818
0.5049914080250765
0.3685968466282007
0.5131417776474831
0.5971610731378717
0.9209001980533732
0.8629253332938576
0.3622589902579071
0.5762947497852331
0.757884913998269
1.0027247890003124
0.5034367933080797
0.44344428615941306
0.9444515660495496
0.41796752476531296
0.2637088078466334
0.3511896169180622
0.3470621946204189
0.6596439274648189
0.8195388111141096
0.5835405731274395
0.4062457157051219
0.5974568392519866
0.618043229425819
0.37983738326991023
0.5548951954402378
0.6205975860037187
0.4950381905854812
0.6228065395396918
0.19517688553687856
0.32706711819099576
0.4338091726157813
0.5496210960109142
0.8927656636327004
0.8980758932516856
1.2233340386062672
1.015648398580012
0.4971774636496803
0.5515265595932836
0.4879664052364535
