0.016125482908699692
0.0228724425464791
0.010528549926443188
0.033451032193601925
0.036443137579639184
0.019672152194746183
0.013814621870308135
0.02255554870705132
0.030162716700025825
0.011708959793796766
0.016630199880315142
0.015325583410638409
0.029146758824554364
0.01753839156935927
0.01804059042680231
0.022401336173293856
0.01650729944792921
0.015360160144428325
0.024510851317114862
0.027406197499709455
0.009424877324904254
0.019646808794231863
0.012443832656359021
0.014472658924704637
0.008859455976336653
0.012505746233384485
0.01231469949775472
0.011297044249140782
0.01747566829612014
0.014991439070194191
0.02111312616410156
0.01417420438937704
0.010030182541203756
0.01605337615029267
0.012327478687535979
0.02741822813938199
0.04619376510677699
0.01673608240143137
0.013172458996430587
0.014740937355681091
0.01813132315016861
0.041717027186263786
0.011516963263405074
0.01753107223219614
0.015423579333329487
0.03065423908625595
0.01802390163358656
0.024146378395382712
0.020234625597153118
0.031921687398593836
0.03170362428127062
0.008336852039773008
0.01568605917159763
0.017989336811016072
0.025234159779614327
0.03402406674099419
0.02703905013215184
0.021586406331055952
0.018071439452496882
0.015743480652298945
0.03338560241085775
0.011464134170412834
0.028434712283109495
0.01696176565035154
0.01924039025117422
