0.7064977768961497
0.17842124603613513
0.8364464096372937
0.3813089990062885
0.500191109587936
0.5725465119708708
0.6939678677638761
0.5736266606477357
0.38596579041598655
0.8183826231974559
0.6476779246437514
0.5834587237626997
0.43606963367955104
0.4829287231220186
0.6571463838114189
0.7141354091809975
0.2996137002287308
0.6191204096266727
0.4318251918559776
0.4224329232051586
0.7484849618272782
0.5039477092449088
0.6196498853691839
0.6248949688201316
0.5917978787247163
0.4741943162537835
0.6174688907003424
0.7585150433107392
0.4445042631061718
0.6546900131041843
0.4385787570396526
0.32024683183509883
0.5204346405644619
0.4164936782424051
0.5407931538289461
0.5696312564187233
0.1610201625723885
0.6460967955320007
0.5240816925712881
0.7113518711256271
0.6512064233801595
0.1417118634146479
0.6166707822959526
0.4219510769192655
0.5549788242036152
0.5436390181463489
0.43123166145297853
0.7374835207125078
0.7232897243689875
0.4831731394092441
0.5220532117427118
0.7604064712565506
0.5609305814454688
0.5557262671537386
0.4097474276064064
0.3407384959229949
0.6474668577807864
0.578884454508573
0.4557977016422203
0.6944399973511799
0.5270639349385929
0.6746898044490018
0.3376063537996626
0.6072080363208119
0.6209457084283281
