-12.191486901619484
-12.073424169365214
-2.0499287096275918
-6.2849187114236225
16.642608044891986
-18.242955825585586
-57.07576674621375
-2.4928554717816374
-18.132922295402125
-56.4685769360682
-65.25505024515391
12.32605041038648
66.59383022816043
11.790704281740904
-46.46615206658014
22.79323334055969
-3.0435299862834384
27.028947805873926
-26.874171099039717
3.5929719279880685
40.24609675440377
24.80764288135145
-13.044074487114788
-24.581900487090483
-39.92340538815707
-29.780261651914696
-1.759827080545152
-83.27787241260911
8.921256868200377
12.10053718822829
6.978363339294432
36.31095659603754
-48.53243606984597
13.905711154173158
-40.62470238448207
29.58364315800366
-34.01505645632636
-30.017856783170647
4.508082337234455
-6.604751195154322
21.504379199926852
-55.1916291946185
-49.47799835979156
-20.7801252871396
-43.558623228286535
-19.164422996470133
-56.42913806938946
14.758861353650095
1.4288491550769586
41.562287845307544
-7.6317547380173885
-14.814234969722536
33.442297659380785
33.25740672976736
-17.253808141048072
-11.631301776167204
-29.901570971794317
42.12985054442399
-3.3501676990880482
-9.848720399776116
3.1316006400459875
-8.805209363012185
21.103256154222013
-53.874648183913486
10.120591729040015
