246.3576110706482
410.15893271461715
596.2778009674172
387.37558139534883
190.05521472392638
100.08259587020649
90.80097087378641
141.91318327974275
348.4607390300231
405.5019920318725
165.86916167664668
299.99503927242665
383.3675762439808
1563.493990324672
413.5866350846971
477.09993674889313
830.8047337278108
249.2051915945612
151.52439024390245
506.4148099606815
269.0063202247191
493.2230483271375
144.78638184245662
181.7022437841116
219.80751456700824
267.6807208432506
919.072618593412
728.8134047481183
454.38603952964723
649.0488126649078
739.8921239268384
834.2134282523731
165.15949119373778
585.7021819212241
700.1466194363161
459.708506841166
170.30494110887673
152.5993650793651
570.2586234730668
750.2294164668266
552.0520278574355
748.1423499337246
327.07906295754026
94.62886597938144
213.6891296986116
372.3475862068966
215.967333725721
1410.5593961625284
326.58209186840475
294.801733102253
305.04567541302237
365.875751048634
382.14947725346144
213.90016017084892
183.01824104234527
269.36546401005205
126.67558139534883
468.75410497981164
270.46434914996195
626.7563162184189
327.96060877350044
643.7528957528957
629.8879830126357
237.752
294.8037267080745
132.49589490968802
212.0021978021978
223.36721854304642
226.38089117395032
444.2244456462953
221.81808622502632
152.55431547619048
111.71107738998482
136.9607843137255
238.28571428571428
180.74815724815724
101.81895332390378
516.9838969404187
505.0672804532578
150.0763293310463
266.71889994148626
177.95051783659378
121.9878205128205
149.39409836065573
807.0080092592592
572.8971437740693
281.47652582159617
192.0188772975658
200.68853342918763
193.0823933300637
249.5538185545874
282.9831775700934
170.9318181818182
62.35117773019272
473.6406630911751
557.6795895096922
834.0271428571427
295.21272272585185
232.27855626326962
200.96746847515098
283.55044023280107
140.02033898305083
161.42491582491581
230.34112466124665
158.13753877973113
288.9082125603865
569.5877251501
106.69389978213509
391.5555514502125
608.1346817957573
360.9052744886975
346.74453941120606
270.34018426647765
106.59734513274336
221.0550807217474
465.0444297082228
455.97683728910494
556.5845528455285
469.77750906892396
127.66246056782336
553.5280484052918
361.05758426966287
334.5605804927438
717.8637873754152
1263.873396353815
830.1616577265045
366.41049604601005
612.1481038606081
678.8201692524683
796.1397637795276
393.8544344473008
305.00333333333333
192.95015974440892
396.1646168401135
