0.18765973615953088
0.2269587403696557
0.2930634792104013
0.2682717513930474
0.3209776349399256
0.31744680235999684
0.3152753619882803
0.17590712288229285
0.22018932094698115
0.20941391143244809
0.23813720859487905
0.25892121918566524
0.2281129171466129
0.23324151609294305
0.23725269516741734
0.24930481164875698
0.1918469483784388
0.23071682286917744
0.2679015232528913
0.2989453986440179
0.2754063721924819
0.26046148036581
0.26342115545098577
0.3228746840630914
0.2886163116553126
0.25938016340190484
0.2450900257580688
0.23679834165795585
0.24774759194285914
0.20728735408517496
0.2834326426243379
0.24065328137826905
0.2187631070921851
0.2379884977201328
0.2423857459624105
0.25865084470922106
0.2735258728120344
0.3633599553413235
0.26115434595203235
0.2577491838837905
0.2919327249231761
0.29925756684655314
0.2963070524975755
0.1620021866371012
0.2574345727082475
0.26191621014247457
0.24047241473793415
0.2221635238083072
0.2526759394209784
0.257053032423588
0.2900762569041539
0.2457397779798554
0.2589529874076271
0.2761158129533237
0.32056402801413364
0.32856738071032016
0.325505008926021
0.2374906152419641
0.2452209833390728
0.2539478114796809
0.27134250669122906
0.22932162601247705
0.3024201454647769
0.2591572406781316
0.3108180816832555
0.3895997796451436
0.235978130635124
0.2426159892227606
0.30002058433626794
0.29767241436666103
0.2831213758117708
0.323233742620399
0.3204067013447455
0.2859737507575962
0.2649903382702006
0.2871067782709333
0.21973309389149648
0.2054246277775766
0.23771330750846906
0.28933116648219426
0.2557710885936872
0.2557710885936872
0.3804336055947176
0.32496446129737194
0.31436229538277816
0.2907508661298469
0.34654577622741084
0.2577746483701728
0.2492654583138858
0.24456671575060776
0.18980373872456865
0.2587281739855855
0.27954482269650993
0.2518499086630968
0.2312767354979616
0.2578760084003935
0.2437946770037659
0.3149514719234159
0.2791476204389963
0.3041813553639073
0.3311308520337835
0.22585662751650296
0.2667867280344526
0.2933914585912345
0.2787040270639786
0.2574932466723564
0.3043241981207215
0.3465968489689831
0.28522932392338
0.24746380308488616
0.2742412093612393
0.2522329381807771
0.22102713186990314
0.2144407109907499
0.3294627523513881
0.2274677135811188
0.24079151262331516
0.2776374067560326
0.22359666606020284
0.24328380850480966
0.2546421122253925
0.2916815768169652
0.22238071910011453
0.17038965080031054
0.22366797101849725
0.21365494790811207
0.2552793217671905
0.1700726615895235
0.15206573125515085
0.18457448643079213
0.1964586519561724
0.2532836173662231
0.2379923424194733
0.22737310115328896
