189.82852462524613
176.73237836796744
791.0075442550998
1029.8954758099671
375.4333790632106
129.91012799515045
1089.7008680752642
268.411868783738
655.0937931885318
246.1318379286016
1016.176920900813
696.8809024078885
335.62877147180865
599.5539897132666
2066.299894629764
427.89139917223685
272.80469609846887
163.73887503877398
258.83731866568286
458.4448567170917
195.932019795002
255.57672131007328
225.19322819236683
761.2094837203338
336.12948392104414
245.29143725369698
438.61229476628165
1337.0907608037232
545.7558143930631
260.30453620938044
35.77170079434875
296.1135589269682
642.9391121736969
279.64670787992316
633.7722558279072
236.67848169102012
484.83082517339136
233.1281556963251
138.45860535757126
93.11078616493242
567.8573286748817
1540.7111080705795
514.0633184157946
486.1139913621289
621.1256218927767
69.50962997316593
358.390474046307
1105.4072650169387
295.66001141734444
496.7127524131769
103.96147015600565
1016.4761865464404
198.18944890140443
134.9979113594141
92.285990414766
154.11325052053678
209.26385717108752
859.2084822589236
193.02621412064732
574.6574750754411
272.055394614288
292.68238203223615
105.378920213028
309.67464374714734
666.7656904627232
