0.89052477225406
0.6976743069196604
0.9080308327786132
0.6596572296752158
0.769702044022256
0.8238030172354736
0.9062189068052792
0.8525996592558163
0.6350060189884027
0.911183488417762
0.8042752830188337
0.8233329911410707
0.6967452033109308
0.7805771911753637
0.7643889776733624
0.8464841127400867
0.708960740002027
0.7343464484852001
0.9710135825330479
0.7309509000629991
0.64596706352647
0.6365175199015083
0.8022318211048053
0.8100637377544536
0.9136801841164996
0.902138225857534
0.8334987489680159
0.9060087413419874
0.5976417315873523
0.7753481364245137
0.9045931527839871
0.7289547983836975
0.7358336732219729
0.6777108365064627
0.7538544528034549
0.7282291969323522
0.7997439397074383
0.7960193552546221
0.7277658488101463
0.8989572935559821
0.8940863805371589
0.7603630956198058
0.6944336646133493
0.6383615051243994
0.6815361264145162
0.7557293993883278
0.7045681634315747
0.9331546218153488
0.8226808109827601
0.6642117412067912
0.7421721380370216
0.8423467872218902
0.7615943855860551
0.7784391653712386
0.7932687053350415
0.6485775642666477
0.8465925679800399
0.7975242839504555
0.9827488022986071
0.8516904480608835
0.7997839715108847
0.9057319627238354
0.7135884624132636
0.7917968465585113
0.8496703582804641
