556.8000000000002
748.2
835.0
571.1
717.1
702.0
796.5999999999998
791.5
937.0
574.1
725.5999999999998
713.8
935.6
783.8
906.7
762.1
770.8
774.5999999999998
652.5
726.0
1087.9
861.6999999999998
910.5
1082.0
601.4000000000002
909.8
1135.8000000000004
858.3000000000002
958.0
833.0
654.3000000000002
813.0
727.0
797.6
696.0
895.0
662.6
1027.7
1087.0
836.6
802.0999999999998
495.0
944.0
720.0
733.0
825.0
857.4
932.6
807.0
1096.0
698.0
981.0
795.0
768.2
639.1
752.0
650.9
1211.0
1036.0
1288.0
793.8
688.2
826.4000000000002
639.8
954.2
