3.3255245018022483
3.3988864695125898
3.811738839631756
3.3968439442203335
3.390230743348772
3.2270331765712603
3.037678766905942
3.3287785019392517
3.318784005739277
3.646815188357469
3.4826926313995545
3.292175830338127
3.4814819039218188
4.980873031583059
3.8595274400608552
4.345367198866133
4.2821787586001525
3.3400597263119725
3.571353645715898
3.8256191263576316
4.070004779739518
3.827410514782613
3.4965764171685136
3.676208346701259
3.633242014991398
3.798626837118666
3.8612027219743847
4.163388131860613
3.72199348211641
3.4071982144200126
3.4710177187607134
3.8855274794900363
3.128745045072822
4.128508050944384
4.197313056591909
4.0803112134248885
3.6154221184567135
3.2069325915408884
4.005514130669922
3.781304540241125
3.97244472157058
4.064990206475826
4.022992038107847
2.995890532320499
3.6004901704424594
3.7304262946451465
3.514074291048656
3.756192767952688
3.699698958251995
3.760459524445493
3.4146016528614926
3.634311029471055
3.7789547353803945
3.4409645213017797
3.5691285723461945
3.6747815685786267
2.849861555491788
3.7489598688665984
3.6039961046430418
3.7249517099074514
3.584304806349609
3.5766103321133484
3.9044058595442217
3.5522400739677704
3.940548227706636
3.0032648980911265
3.302710673696124
3.3953105743104035
3.434484248164442
3.3697776496605782
3.3765314576798637
3.457449199725372
3.4474508288668324
3.2504364671466184
3.198358431672581
3.250318751846038
3.1154636725893514
3.8588717623492346
3.4151844436503893
3.3596387179480067
3.555489417369468
3.666189776941533
3.2421023681286565
3.029935389818317
3.8771173719532697
3.796240772236525
3.4791496303730947
3.5354656380260034
3.4775252460289687
3.14238586610394
3.3723003707176136
3.5092792311024112
3.4003809215106644
2.886834670103797
3.780840460878951
3.6308743906025915
3.6279048750632703
4.015262316959062
3.3689247895327012
3.6480129226886406
3.788693354074324
2.813038045225948
3.295813442075556
3.3432572585387867
3.189469330927
3.5278376285511968
3.6739260235524887
2.990856817039215
3.9943469683699866
3.90878898272417
3.4452265325901115
3.6408809197553023
3.3960591192849416
2.8821673686096654
3.413743256934689
3.7171381288823935
3.4608866185223404
3.454608002590022
3.762873417509568
3.2133905895505084
4.027602635778937
3.7189185847567887
3.5762870227022816
3.6964543801830505
3.6199147012478186
3.843494397888288
3.224510804171536
3.4625765601714247
2.9974267947643187
3.3316864246001354
3.313396316179685
3.615765640730268
3.7714418842616064
3.4942786040710634
