0.1807612392901804
0.3583567417300205
5.843826144394784
0.4398198938789759
0.54642012834729
0.3152636219001891
0.16109560260619196
0.28695468659134704
0.4839149247148065
0.12162723706875432
0.3371936863940161
0.2274917856209902
1.0013364636482436
0.3918663222000818
1.2750436390191635
0.5208925609130781
0.9753900749475196
0.6520294314917983
0.0969247015405574
0.4598646542427274
0.8213203683840278
1.6195339557101216
0.4689064807066649
0.586663454711221
0.18135749684817912
0.16812208316034036
0.36561983903439815
1.894358673551625
0.7190518043528867
1.7035698546111229
0.23397252216216485
0.4166527851695013
1.0330560562200632
0.5699448814620246
0.8471051597480292
0.4011276799502549
0.6229401055648941
0.2875048180434591
1.1788865334606868
0.20173503288805894
0.217920021839392
0.36212324301467896
0.6808192943396795
1.238391295364415
1.005844885925928
0.4995386897254803
0.4253834149617888
0.11201418708784026
0.5813472157116671
0.25153459630819003
0.4227583101656037
2.436448621107603
0.3686832768241871
0.22969774027825304
0.4029269458605841
0.2994993340701628
0.16225018805816216
0.6142805758560601
0.04964907809380175
0.2464504153793929
0.5328628771807896
0.3294281465589576
0.4651280215332158
0.2519549260491561
0.11268240558902552
