2.1376235683566662
2.1119869465948113
2.559812604676387
2.0279353316863316
2.1198065760767535
2.183251197707735
2.196016634330385
2.1220159599959687
2.266377653565314
2.2605603144697013
2.2427699489110338
2.15745924314098
2.3081808562275192
2.1718765570672773
2.3187949405916903
2.1667110081443783
2.169062627307716
2.212151586019443
1.7746733823508536
2.2498810343536224
2.3930819317963996
2.399075770942563
2.434499320741039
2.26426097344658
2.1681703106275223
2.1602698962068687
2.338401501712076
2.585265704288975
2.3634169407365127
2.540203528375752
1.8431617438182841
2.2311553946004934
2.3859845368617223
2.4141961804634717
2.245110588081048
2.165838730216973
1.8962235700426613
2.1475070283933757
2.342393781286589
2.1748631477177716
2.1810429110564065
2.005778118303575
2.410161405109995
2.437795614894947
2.3567821928378163
2.1673388781026066
2.2538369514633794
2.1068694616592714
2.323861893307115
2.208235148578204
2.1145941241859747
2.610457362531246
2.189451147861446
2.1479342002841286
2.0408785856145504
2.0006391458191013
2.155187330847525
2.320528825854523
1.9952237809373345
2.132735350760753
2.1667933037460263
2.3566170412116394
2.178642728200017
2.2179649641522814
2.098056567330464
