-1.3969304266329061
-1.0802449852248424
-1.144918444085639
-0.7493341763089737
-0.717144758067258
-1.4463276588884721
-0.651271601320947
-1.080143502088487
-1.2196511859086638
-0.9817420286721837
-0.9422658245172377
-0.5182937489329823
-1.2620995226652343
-0.8075059644174525
-0.8163137623183567
-0.9681157307967772
-0.9600573272662855
-1.225880815434958
-0.4885097237718384
-1.0495906235328882
-1.3188357645874318
-1.4584410579660532
-1.309670380068301
-0.8615264391425382
-0.9635123502658718
-0.9231737995908686
-1.1181998837238774
-1.023311826256891
-0.7994187794727933
-1.2300368648564022
-1.184280420327248
-1.146610074339103
-1.30093656982683
-1.582214355447127
-1.3428988667917032
-1.0217130553916574
-0.9933393634625325
-1.4263604896467876
-1.196677085019038
-1.1065741880357562
-0.9454440803038554
-1.3471626041104146
-1.2353713246354618
-1.1594877118300835
-1.1040167739332831
-1.780827124055021
-1.2113859026464107
-0.5902973969321872
-1.335619730722434
-0.7105657863431049
-1.6144234127646413
-1.200519934825819
-1.1587894551047222
-1.237116781796104
-1.2950219088313515
-0.8852576061078721
-1.0773245199160792
-0.8422398154387961
-1.0039102168731924
-1.0287749659559813
-1.0663729789995158
-1.4965333373418144
-1.0766023642534954
-1.2947103833434435
-0.5559558571267036
