0.2256421686540733
0.09911494971554408
0.07721556558162714
0.06563561954517125
0.16615780432501556
0.22138276531088272
0.3241677699251364
0.2994645908339227
0.1268243281042398
0.07576785743828766
0.13302152661368305
0.07558396908707786
0.044487506997227234
0.052956032435139015
0.09082947623388726
0.21107005959560834
0.1039325292527582
0.16241834318138595
0.13218378588795113
0.02069617557848886
0.07176168902507994
0.023689565292005714
0.16410554321803011
0.1177830189679554
0.08818369372655722
0.05721532858331864
0.01883783770965576
0.024346024787962738
0.07067163363133802
0.034780075304701806
0.03484089000102966
0.02587598440307334
0.15616095382105907
0.040101319466783185
0.02782058325716291
0.05731476470312031
0.11856008359243653
0.14711322670451227
0.023996644651152328
0.015046752017358275
0.027454366103481613
0.014511402168199062
0.059509703030723886
0.14003098751986626
0.2230384156751185
0.18330603092491454
0.19003619479945594
0.02913953268710617
0.10674062209125412
0.11387737436404645
0.08137012933014355
0.08237713162860108
0.12966491352272602
0.0996919892700703
0.22754607557330075
0.10226357683390633
0.18135581051662306
0.10500345400730196
0.1412168913475558
0.06568660057325723
0.16564214868561378
0.06872793828827058
0.03672084235963495
0.11423070437469934
0.11389657658374913
0.22003815992337966
0.09593697479848023
0.1022783684697453
0.1362990963092215
0.04654376942207135
0.10261932173391748
0.1618345870479087
0.3605559178768631
0.15592602915517964
0.13091763635562187
0.1019409464344382
0.4897595121737658
0.11222536837402797
0.059064218936263235
0.1635495589894096
0.07734149809773729
0.10930793486473936
0.3138650020436595
0.30130708614734103
0.05032740393239698
0.055147598772925695
0.10035896500159312
0.16872054032930914
0.14026199689610175
0.5342776254141595
0.2262703962436965
0.1758758252857207
0.2718444805432856
1.2560098974277127
0.105395400056953
0.07886457735813482
0.037125832111887566
0.07977101689487988
0.09325883665521427
0.2478357432653919
0.1655751845527486
0.22820102055054745
0.19036029325812928
0.08165266634528802
0.3119957023319598
0.13576670418276818
0.06280168636376167
0.4004551212278397
0.058023875730163314
0.02764048347974994
0.05087282499945234
0.05439999892530748
0.18306148388589571
0.5837935996109103
0.07615654610790654
0.09721031276675947
0.09229756753538476
0.06330462422953184
0.08123894407221073
0.19786229126764626
0.05835401127088721
0.1193987034353403
0.19534063044620947
0.056188793650357664
0.038111567883982185
0.056544093755221174
0.2012880864933886
0.16479985191114832
0.16778913678838686
0.1573147091505234
0.2918365164926469
0.09322760697847654
0.20330011092954334
0.07749249379364179
