216.94454182496887
172.3366265575434
88.52601067649971
61.24918324808299
97.21520253590894
265.70819259553167
207.51733420130853
189.9395095024754
179.46995020664258
322.79241063313776
141.46403748962646
139.03489898161985
100.60615519046335
115.02479481338388
117.60706955470656
64.92820486731247
164.3934857228339
173.83935947091615
157.14222939510495
138.42214476726102
200.9249634326437
96.55029256812729
171.4377315470984
133.74014309457849
259.88207368570284
170.95442913104048
172.40433637921433
275.3023362863113
217.2156857979438
155.3407754951175
59.58198574074349
228.18109598658515
195.7956851724646
163.2262663423547
165.80237856620522
172.1785533770467
107.36126095526032
244.33525992199506
174.53455954060345
144.18459536849554
156.65210128439054
46.73618151920781
219.4705844763049
124.4330698025825
139.92844014414234
178.39096529617188
216.5867195936988
85.89995985252102
115.38799379784778
139.4130670856062
165.45960223317843
185.8346413098708
137.06632398365804
149.30697733645246
107.6214799454245
197.14430633026814
130.8181751257097
170.28632526692374
196.93486882612262
185.79886806252517
64.35115212147839
295.51368380323294
198.3965848124213
347.76022439955557
145.1191964362423
