0.39514487333845516
0.7102151075908254
1.3913966051988307
0.9526734307573302
1.3569753299648617
1.842640603297561
2.052882877505411
1.436472191609266
1.205594406105115
0.9247362031425225
1.6033133595923428
1.4530515741231285
1.2626609209979902
1.1107908539217126
1.4469644362886465
1.036405011656068
0.6505806103134186
0.767670158571995
1.6339453250661777
0.7838871700486445
0.5413880548474114
0.8405380632063584
1.103678121447492
1.3952840678956233
1.4409512582348327
1.096965768291342
0.9200524762030349
0.9896254181997652
1.2029236759400794
0.7674000560561106
1.5291724606712085
0.9150694107852766
0.5460801041332612
0.513859204671451
0.4424640693760485
0.6600112225944315
1.7255738970743766
2.1250785125395537
1.2290041918657466
0.5914538308198731
0.7267556228425276
1.07919394101123
0.9873441086765766
1.835528554527556
1.449668967562117
1.5247589088911662
1.6406085654395026
0.8860789546069737
1.3641625696867756
1.5894548973242322
1.268162851475516
1.1658391984709617
0.6350807790904401
1.353524427227821
1.8212857684301742
1.7833009433587965
2.8174309263239694
1.145159145897668
1.3113975756764946
0.5709461991787278
0.7092017470603063
0.6273931249632194
1.7089201002182042
1.1416463796607539
1.700590067175102
1.716112274359834
1.4651780165600372
1.2176964371121535
1.439538259233263
1.267797935221181
1.445978536077149
1.7425273274092032
2.3088409672961667
1.305704937655583
0.6360335520636848
1.1890222107834343
0.4416134312093584
0.4503021585614147
0.6998088162844927
1.4085118659226417
1.5644448674946607
1.1104079557101685
1.7321032453284773
1.3570824461096809
1.2645842459223704
1.3071872597572247
-0.10428716322557159
1.4218866919596564
1.1759124742635267
1.0061678899746462
1.1453120720675294
0.9756421450451084
1.4371846844674019
1.1664313139704285
0.8454538808079745
0.6891440055151951
0.9832752926348565
1.6199112049500737
1.6903182320199746
1.843178803947977
1.9429734584823772
1.0182141613613747
1.322559408989801
1.6786830615717483
1.5208294248187475
1.0240365071026971
1.3162247165860874
1.9073491037181605
1.2689022887392911
0.8450334011730148
1.0272113042725104
0.9199394253362775
0.7621964429589649
1.212562915442341
1.4679000325903797
1.3618176395943864
1.1436092559884126
1.4648059157228208
1.1903633646231608
0.5150655078770352
1.3810392888557188
1.146723699299316
1.1157708789312097
-0.23330227837947495
0.590203470471139
0.8587076966600884
0.4936988730460069
1.0425330528096481
1.1660172414463355
1.2457609800766312
1.3643793432867624
1.1420510326832778
1.195643117400686
1.0854685240682829
