0.972461580964086
0.9747053905895074
0.990739083035786
0.9625847406068098
0.9736323617296
0.9763198154090538
0.9823712323983268
0.9831133798423785
0.9849542897735084
0.9878714617511104
0.9852840829502
0.973251275102956
0.976888884436048
0.9588555494473392
0.9883216031935704
0.9669588789701582
0.9694629502926372
0.9775293204529012
0.9633435060223482
0.982898743350386
0.9935077683322421
0.9817492585247304
0.9808744116867868
0.9868809591110016
0.96323520264379
0.9680885856595544
0.9954705719044524
0.9981556227683234
0.9824540593568314
0.9925054001801168
0.9261982921998152
0.9727525192774548
0.9921711619070692
0.982088257225472
0.982770938312072
0.9715112075321706
0.9640457583634372
0.9804704186888724
0.9792315352966242
0.9617769448556084
0.9759288262707394
0.9792564686901336
0.9914541955083538
0.9754395410019262
0.9863713727947584
0.9744380272189652
0.9923738104396131
0.973819087954882
0.9899746250976952
0.9744247558536931
0.974249829120792
0.9959841106924336
0.975141615430128
0.962920907523066
0.9615106955536288
0.9597582481437532
0.9593686533624642
0.9849282618847092
0.9422792935106136
0.9919530822323308
0.9759296135842904
0.983490596860368
0.9572513622824886
0.9757013446571142
0.9653647368101496
