2.461400843641342
2.6235136647366133
2.359008096066027
2.020101811201046
2.4394227548820395
3.3039415812786865
4.150519860389236
3.158858779391299
2.625626247010594
1.8549326470722087
3.070107856805002
2.9191392996603938
2.3957625279314767
1.9354266365909956
2.46980898105291
1.8929750043039832
1.6495181260182004
2.1569288835089213
2.3600504966648432
1.6839639909573343
1.562580868847329
1.577784096275635
1.9670913564982628
2.4017893782728805
2.468343880842541
1.8437628860777755
1.8600721921583692
1.89349465129588
2.0146022847463074
1.8758696116377165
2.3487969924959398
1.8320742943636232
1.7639154054093296
1.5541845849853846
1.5592395070084362
1.7272763083660505
2.8835495614162925
3.6118443243050806
1.9335667961212957
1.604896246610784
1.676879464513328
1.8991313515127384
1.8565280457778717
2.6588004747331366
2.5077596246242497
2.6424343736050613
2.545770666271684
2.296910681344845
3.1043406304864516
3.3637567242034767
2.8220043679341367
2.5100308393379835
1.9509621442784693
2.364591327744464
2.9931627004201014
2.917232281707749
3.2235990660120324
2.3002810079060003
2.6903382001682843
2.0021654920613416
2.2064577109417782
1.8441244908970755
2.489861924478105
1.9266250348559557
2.6345417601139807
3.0052104701240063
2.389488551832377
2.1817714541218587
2.357971213115675
2.294675484222564
2.263887614122418
3.154397804955084
3.9220319374407695
2.2848882228423024
1.9807894197866631
2.2622223087244917
2.4887406852277154
1.9138057614205315
1.7745332254946304
2.5020946636214854
2.5720942706039085
2.1517033790442257
2.9541117031967223
2.6958931551771808
2.2466274011401497
2.1010852665766784
1.4527966404243895
2.3324464426524822
2.1619011280620857
3.552261261100119
3.47047104097632
3.0580719405956267
3.4263571050836914
4.677611329535296
1.9045793813845855
1.6499226891580323
1.918066903314796
2.3404396214159284
2.522798784920118
3.2394605861171
3.447227861613728
2.0686035927480653
2.246980624931107
2.5071052346148304
3.066948079349328
2.418445067035256
2.268193603371362
3.0956677007830535
2.159709659180284
1.7474495564908648
1.858413215171988
1.9625043234613804
2.8457860366582377
2.8719660183773517
2.2108891311534924
2.2854406463574786
2.151246559410697
2.736899057056237
2.140100739665452
1.7858279514508222
2.4844995445688265
2.088002487232514
2.2633343238184964
1.4197672480906276
2.02528017338377
2.112685700412149
1.9264199422167934
3.5510734476553236
3.2137156272982152
3.660230028781448
4.210987196954264
2.268743276568713
2.3306587356515327
2.0779160925561277
