40.14423515023438
39.43124950111519
45.31454810832377
51.96544528104788
39.54293738039775
36.60736456768237
65.69558264996758
46.80079357330896
60.61909810966126
44.210000564455456
65.6633583633937
54.51927695220552
38.88192277223094
53.558911790321346
59.43245524972152
38.072613330675246
43.45155380152772
37.32656200245787
47.6246312728329
45.680320692251094
36.21856988488713
35.66506517019349
41.40654882664886
58.306773143965714
46.485912609818776
42.48269641314349
49.55438280901352
57.43524612665152
43.898635134027664
35.86265445551714
18.76579756141756
38.59238981715774
49.02402008711894
37.826333388003654
47.49798380601225
37.17633396877318
46.18817620886172
47.03950052711401
36.57279913208772
32.660845349865944
50.79802580998179
56.442082845930976
56.98599149433809
48.119273044135994
52.31018222897863
32.5463769268808
51.33624244497529
55.780054563995506
45.8104564090019
44.76438194156303
31.002902015059057
52.185291589541436
31.524658511021265
27.884176741648197
34.20267207795789
40.14203903556268
44.95341276956072
54.99693202762496
44.616779164244015
61.53077091402641
37.43640503493821
42.994591083555775
31.412957225611045
43.624795834830245
54.92129109560459
