9.810847584861518
8.252417001131269
14.446492564151002
7.252399647481771
7.730149308398564
10.95982227086634
13.714130042702331
13.404313465835507
11.418893013452752
10.317017579416355
9.707071988586542
11.53008333361717
9.24202710361611
11.371898721437695
11.91902134164927
10.556180289829515
13.921602006955274
13.881179361074818
11.941253761149138
8.520175437162408
15.782301554110928
10.59874073583551
13.912332662505277
14.371562023221937
17.650965907555733
14.245907756919134
14.944317086744851
15.228054289679188
11.114972994252689
13.00477069100514
9.294943787481749
14.459315267331858
14.57065635044901
12.6149129949114
14.618341025072937
8.470727766190633
6.879067926564939
10.161983470889538
13.715127396668
13.90525603854054
12.899325562976896
5.6355901509672615
13.300256757994878
11.270619984140309
12.0629167520072
7.694409121184203
8.953803076469544
9.873605108302785
10.966752781181357
7.226381077760327
7.066944341288311
16.17259709753623
11.480654102753178
10.559526592395086
9.687165112076832
6.2148625259317205
10.29006079844657
9.126278283096518
12.82371323447362
11.194052871563338
7.187874158802717
14.0691344216047
8.819727524281157
11.596551774461737
10.425800399528617
