0.010298281300977829
0.020260772017941468
0.007706951975850294
0.013424973882923392
0.03012615421788933
0.03858505526325998
0.009748378897700465
0.01292132242715563
0.0029579504025177283
0.005502759991768711
0.00858886069605266
0.009652406051895749
0.0073948404319225175
0.007693374207378206
0.003867641732044421
0.006180883345665689
0.005264795826624125
0.017057046225967282
0.014454607825125252
0.010206472960694686
0.011518572973864823
0.014183436673617747
0.012608700249176671
0.013192298478520936
0.010030299835597244
0.009496894362967587
0.0014701809963037554
0.0033279088114007453
0.007897576696677311
0.008996430925717978
0.02116656769010492
0.006041749512823371
0.005848908415847283
0.004948886139547635
0.004985512372084357
0.00741841005326078
0.007231565729601359
0.02486559292862657
0.006511258172554552
0.016289611601242298
0.00835890885749624
0.00825216035235869
0.0097767213510636
0.01664429961317502
0.00862370139571632
0.009952690669244469
0.009213192950420016
0.0055822038854293895
0.00751983952185203
0.007368475187693983
0.010690054419068184
0.008087839047888191
0.007331414417786319
0.010524819129966077
0.003501959151102998
0.008836634651106179
0.021628167761232817
0.0062626201525272426
0.009295213949650842
0.010153841572482274
0.0210762711227927
0.013537222471012677
0.006375376136034315
0.011883728507929396
0.006431886955779158
0.05181379209941084
0.011665416886842963
0.005013566077958178
0.008328150827503052
0.011845096774477195
0.009744186768085259
0.028820523917806463
0.017097671709852474
0.02448165814863789
0.014653358386480032
0.020062933927307187
0.009097885896112556
0.00303968193915193
0.007923625259370706
0.009480117941397245
0.01693093789446701
0.01693093789446701
0.019136327371021868
0.03369977353976597
0.006614023117924145
0.012974248131867542
0.02080983263083559
0.00533652958674612
0.00691207421238368
0.007138959691160333
0.004577370531924113
0.009924659148920588
0.007392064499229103
0.015413522672207212
0.007377445124207381
0.016736325901299122
0.01629715057082598
0.00881767977848393
0.016636488287408924
0.0073691063067878185
0.004908757426433911
0.013309257152786596
0.00873050990751689
0.022174715156152776
0.01615668474111889
0.009424230825024969
0.016713232214387398
0.021069738542841526
0.004601148316523404
0.010545842207825616
0.01373188470267466
0.01509868991359606
0.008259566895760363
0.011154626891640136
0.03950702737102645
0.014631579651305512
0.007382059350846845
0.02065892634715648
0.008978132178157752
0.013377641472871672
0.005641793336834303
0.018165574780761348
0.004534488949057953
0.011252545752249751
0.0063199496161643635
0.0028558862058588623
0.013264329580586558
0.0021265912580876625
0.017673423306894233
0.0061076063174018815
0.004894245917377517
0.017150685298232632
0.023150381793879345
0.01102832671736754
