0.9762078442617016
0.9802104811538224
0.9758425663377585
0.97785155974186
0.9679254529830921
0.9822160461832976
0.986133740226386
0.9857143190887826
0.9825399896989584
0.9700033627478212
0.9774551732652004
0.9846587574051392
0.9771877805605892
0.985336284130504
0.9819707292568997
0.9795410169930712
0.9873808700113392
0.9895247030269498
0.9876653676953336
0.9777337848254318
0.9874146697138771
0.9807254417857264
0.9846573158212
0.9857429124908164
0.9902516054444958
0.989069210551054
0.9884078826061876
0.9755580742336752
0.9790172153833948
0.977667905044108
0.9865120995034512
0.9875470434711178
0.9884225594682632
0.985583689574436
0.9860697556809324
0.9732409308105584
0.9731193238368862
0.9837159143528706
0.9861392532198447
0.9837941010163131
0.9827570670784064
0.98162819828926
0.9847436810600809
0.9788212892593388
0.9810591097182736
0.973358040873968
0.9776152820723202
0.9718163107237938
0.9762890521732236
0.9726387069716383
0.9716102944077364
0.9845750121109156
0.9848459935189126
0.9817775374419344
0.9805929222806335
0.9724810146342744
0.9794655137848142
0.972152676507568
0.9860312196480544
0.979329064703233
0.9731468219041146
0.9813260264270456
0.9847070461698214
0.9820230407655008
0.9805166188189685
