38057838.93734675
33368239.71289856
11725604371.682405
161078171.73819804
154724482.24734733
25197502.975329723
232870393.23031908
103498933.82314534
374783332.6859961
27460934.05762893
273987571.3895663
237180293.7731996
895003352.3572459
273236781.13308936
2294850945.4684486
177467952.51310682
149910755.7794635
213958531.49990305
6209948.793960262
334160993.91768354
1387892733.039465
802754536.6952777
355331178.61120343
740328495.7003827
115973970.1972961
44377770.87248758
509762280.5401887
7074205556.804694
1391643197.726782
2947763852.3589315
5743930.493631233
537684294.1120839
592263467.699715
650802981.7299564
362345922.072718
185075144.62196335
20258952.9232283
26063567.629621174
223927845.75997436
23040386.61386055
280099163.2096119
88231956.01410924
474092880.426272
789104442.9082311
725951642.8291807
9053582.661732573
49461965.13993687
309322867.42320055
386566533.2792589
418986499.4958493
15862478.13147157
12300091373.734665
245896223.7428181
110574591.79866073
6054852.432477977
13855318.108601153
26633080.034655146
1831010990.2598538
17397131.474901985
330321875.1325085
90510597.8154081
623948616.6254028
65061517.91021717
79063232.97582841
209294109.51656672
