1.021924769299362
1.0193707451342808
1.032063185171097
1.020077129840741
1.0192928294512795
1.0268622681085648
1.010273420242629
1.0253659968844164
1.020551176720348
1.0181301871978612
1.0117830093858111
1.0089133228186178
1.0283813477783674
1.0128798564259045
1.0241322048627666
1.0227486918348427
1.0234309155035215
1.0291420714098325
1.0051282051282049
1.0176741319733231
1.0370145143260532
1.049268451764094
1.025562789486365
1.017788089598832
1.0198471222906735
1.0128560103179394
1.0189151925927076
1.038531915508915
1.0246716512848721
1.0474867244906447
1.0424007569516764
1.0267275660577584
1.0511581903610572
1.038934098227236
1.0281138750433991
1.0208697431702447
1.0105857445306987
1.0162672999935112
1.0260951368243536
1.0336636747932093
1.020057508971966
1.0527915896774915
1.0296135899179302
1.0221171410743646
1.0222113433469475
1.0242449033084828
1.0316963540890671
1.0102750516147871
1.0309573972130268
1.0185190274882636
1.0375984087440362
1.0350670087087597
1.0261606546777526
1.0306768026906874
1.0242834759680182
1.0068437479680086
1.0116238536202289
1.0163949229892624
1.013619461493661
1.0157634123888593
1.0237087662466489
1.0276951375669248
1.025158384515416
1.0232937034776233
1.0029335071707952
