136.1531574642105
126.81236920403666
124.89921192432031
148.53319079335736
125.04392433237305
125.4284776732021
212.44660501118312
131.91578828099793
141.88539558380103
145.82568326071225
237.8949974067035
210.9473127973156
123.94422603323683
212.93643947877118
129.78695859736942
122.7825468908942
127.92009117111924
130.674932694464
139.37695521965998
130.821976496486
125.64568072339108
123.74545024906098
123.73643959878325
143.69379858866978
126.88625746273495
135.3188102218804
140.08566360030312
135.0172113228102
123.65978835075444
126.53258094049401
124.19747544292267
125.78813325283915
123.21525923792771
123.71522531887372
123.48155643823752
123.77223792940495
120.2706907548543
124.00840244718349
124.55490207811674
124.65011112627973
143.9798217579603
134.7312584989453
127.82094877928637
122.62605033509692
121.57517336513494
126.39894862349874
127.06393365668495
170.41117193637618
161.40203038328525
123.8184543294131
124.44990294098662
128.29131042838705
124.51333210846144
124.6639219532085
123.82519553777595
125.61725684953556
119.19699579561657
122.36504777844576
124.52678912956412
166.40154678912663
127.07161666079406
122.18406428387247
126.55527431195884
122.36316836758515
121.69346394630313
