0.12523402951907173
0.15818538617583794
0.03294150590866095
0.33553902879333075
0.10244741090931862
0.1400295759409459
0.052771717055298734
0.28006681614097845
0.06759247059137502
0.3128668299716035
0.1172207554713786
0.21082639645603746
0.17572792946181345
0.2639252338305221
0.05877316502078753
1.0718036402755835
0.4048511712207649
0.2876191779837666
0.19085188787572832
0.7138981043805995
0.470614178422518
0.6289207873157853
0.6351635610427383
0.20301810878242424
0.07135694482277143
0.3828357449385151
0.12079389855462455
0.09767089713998113
0.24661515746408294
0.33824532253650513
0.3097657198599936
0.2392926761096416
0.23462475007661696
0.23721422826668725
0.06715932032869612
0.090573546423836
0.05862400611504129
0.057840229752164324
0.11561410916939265
0.5088824607692835
0.291215127347303
0.223008438413813
0.25441348081565274
0.4543913741044148
0.1884760770883125
0.10787970398802264
0.07595088236212308
0.09646135225181253
0.5985657704597346
0.18191915369391076
0.1390841802064425
0.10685184632828168
0.6765192457674436
0.27751040741287913
0.10635933320947888
0.1253285428427756
0.20222059456699334
0.21152174889906675
0.2236306143306377
0.3567965804159679
0.3641711930158996
0.19202715628898767
0.0816921371780704
0.09325159140129304
0.14457982019579904
0.11657245474409472
0.1503530835443595
0.19154844610256264
0.06064811033926858
0.2497190192273465
0.3321595879144608
0.09958863753998194
0.06186728392553545
0.485852515977214
0.6241078743522306
0.2409046133916385
0.19075221683370003
0.8382914147348267
0.2755221753672297
2.0088366769429853
0.04020185606919905
0.22700095424659825
0.107601597033126
0.4161004953067147
0.09583659671937884
0.4842819999039358
0.6458012994922161
0.05114798975311372
0.1107659467054717
0.09462727249100157
0.12530613169546534
0.24309792720318446
0.07274092696309327
0.051974509533027034
0.18994069289417592
0.7342685770298899
0.5002972710866871
0.4940083510691806
0.15225430074662472
0.13900535283034834
0.08613687497948884
0.2386718560480364
0.18749659087327006
0.3824979241321328
0.09581198125988293
0.2163021751141035
0.08822270947570288
0.08994492852420748
0.1761689703764019
0.3243551310207754
0.3515266312923761
0.5829699940805512
0.17030474273358698
0.142675322692591
0.3073479724402767
0.26397067620342723
0.09705446178090246
0.0991722993432915
0.2786950729051785
0.2299887695960845
0.07639080272356588
0.23243646341777585
0.08812871647681537
1.1350110483073574
0.09869648026939784
0.09563145157956003
0.1435474107506673
0.2534261607374555
0.12009498409504665
0.05606710411584915
0.06482380210478553
0.1433299822471603
0.2338095328717381
0.10931999802517686
