0.5908762932077456
0.15916962603054335
0.1912351009462472
0.1893788003593962
0.3552310998726527
0.1921752796137162
0.27596422430671025
0.8809269553347071
0.3667233536529381
0.27727526822530035
0.17217060059037334
0.1914247917978868
0.5834494555685383
0.6042073222678787
-0.042824507805468565
-0.8886204057230734
-0.31631674285930744
-0.0018834003920630694
0.8623898215856245
0.010633731906346512
0.16581210937217328
0.14970786129680594
-0.053605296271058776
-0.36915668894012704
0.22681005758026135
0.0872379325942503
1.0545851193501283
0.3411564448599892
0.3676566302899529
0.12070016666384405
0.6621109260103053
0.008900911924420397
0.12256938733418067
0.18409463589786887
-0.03170077150866424
-0.02672563073618519
0.07361536192726938
0.4284944552872992
0.960127182640346
0.4165965193197386
0.10966446827644127
-0.021348566545069555
-0.15191069156098524
0.2358964478205935
0.3483880280250252
0.000419575299224759
0.33273448123929444
0.9383155290026216
0.6072910633891856
0.7479166858907657
0.07799208628014892
0.08127630012560699
-0.04748491243148822
0.02824684039708117
-0.5809763628716317
0.13731316933430102
0.6833756694298849
0.16692323479925414
1.0107772062288625
1.320549468925982
0.6189690707569971
0.2255321810610161
1.167496856566732
0.4129271591371968
-0.05310238121023274
0.16668517178667114
0.3284899791501304
0.12399318599682504
0.5915079921110354
0.21834825553413004
0.6069649500571814
0.4435840047976747
0.6503172080765964
0.05513217915237289
-0.2474884513124999
0.18035928918794836
0.6580190618078522
-0.046058201444961686
0.1598077527620257
0.0031602863707208798
0.7741844562437739
0.2667975511631213
-0.08706085127678334
0.0890925666724102
0.17181215259197952
0.1543700538512039
0.6906007539758598
0.5362156847667304
0.4677978985731686
0.3589632826933813
0.3241999157730939
0.4536465675380495
0.4789332132920501
0.34062118346840337
0.5635078766363962
0.8721616467505675
0.5772923076274321
0.08298198499080964
0.19387642578013306
1.6985618904065316
2.1261795621550035
0.010209275191531277
0.32207383949647755
0.19384438086804232
0.7083869558178011
-0.039424867179649666
0.2399662989657538
0.5878683473800218
0.2430647223314455
0.08842604435859708
0.06344715661323146
-0.3924753985146904
0.1868649521244882
0.3903877235145485
0.3202978513345649
0.34749448112391196
0.3886505463722056
0.922403915698776
0.4759621803509694
0.5825490111731833
0.5035450224949704
0.950297539754534
1.2718224384802783
0.6291134505832043
0.2479972307930185
0.6292656100434376
0.24647070552933034
0.6823367201041307
0.08966934277696184
0.5121573088342839
0.7087938117553116
0.5893672383565063
1.0809196895222934
0.16641002635152075
