-1.6606719725628025
-1.7801734467232833
-2.220324530025964
-2.0257089081548085
-2.251393957449499
-2.6517607264750436
-2.9200830299255287
-2.3139730631368702
-2.1004933854502896
-1.820452476532986
-2.4173218545201722
-2.305414404913511
-2.122050900741975
-1.789121087951792
-2.250409384933351
-1.8186576851092964
-1.5708086180274083
-1.8331697141969996
-2.527039484737413
-1.8622327452953529
-1.6629924862070082
-1.7395941674788697
-2.0675224921975777
-2.4157571603951484
-2.4575377793506084
-2.110405912962955
-1.891960378508778
-1.9679142754800596
-2.0464725830545314
-1.8394391467639999
-2.260252797812289
-1.8130827439983415
-1.7633278938866046
-1.5585878002820794
-1.5693300341073892
-1.734391139110255
-2.567126258447117
-2.8923373193855206
-2.1243643001862322
-1.777047310303805
-1.800946638130739
-2.1127515944331337
-2.062474594705149
-2.713469482847316
-2.150086894107437
-2.270006594878186
-2.2290367794371644
-1.8976593432508848
-2.2897105960825725
-2.4482006370290037
-2.2379847678750506
-2.143162707611708
-1.7553027548480664
-2.243355924441793
-2.491957011198623
-2.503421858791443
-3.007667245409628
-1.9591365221248989
-2.1053908241198527
-1.5876503980647296
-1.7529534958798805
-1.5878933147718193
-2.529834705744507
-2.160359721554953
-2.5630427448888984
-2.6102431533082364
-2.2585225841213403
-2.1954654145392634
-2.248908179016227
-2.179609300983326
-2.262606067518063
-2.6821405683659116
-3.1429837098083295
-2.3249920570618645
-1.9597074894636846
-2.150552178467606
-1.697719087582619
-1.5061274669839169
-1.7777174880614972
-2.3062023979232906
-2.4329927589547795
-2.0479187925091593
-2.4134778311341094
-2.265602343294121
-2.223998129455369
-2.142051509086112
-1.1936716952798971
-2.3228070170612702
-2.1452524354090796
-2.110322883216229
-2.120225043396866
-2.0784854014617666
-2.3284310686865917
-2.241060172294109
-1.783566583021264
-1.6197809916203036
-1.8223270035934735
-2.409617352409672
-2.4859984128907833
-2.6060324311560628
-2.660110561797224
-1.9922017446991331
-2.2062074658518753
-2.5921944930367666
-2.3848027609953206
-2.0357550206439012
-2.1392968509796435
-2.652437700742451
-2.2502965523110094
-1.9318820637165532
-1.9452695870659178
-1.9127140436241044
-1.9082235596931103
-1.9047094378729708
-2.386683648016301
-2.0245962509746134
-1.9374884034522928
-2.1773321305687263
-1.9743994923109138
-1.623555761590844
-2.2516994987877412
-1.9862899186591234
-1.8851630764153209
-0.9689034493075159
-1.6377938426298349
-1.7518487811033725
-1.5578956397104078
-2.0432218949519223
-2.0192935759191832
-2.1431255821473503
-2.239635212950523
-2.1983508389543056
-2.0930803493972463
-1.9801068971473945
