398.7000000000001
327.0
190.0
197.0
197.70000000000005
224.0
258.79999999999995
396.6
351.59999999999985
293.0
274.0
279.0
223.0
204.0
270.0
387.0
268.0
296.0
338.0
369.0
328.0
313.0
234.0
316.0
264.0
250.0
391.0
305.0
380.0
319.7999999999999
331.0
286.0
294.0
247.0
246.8999999999996
218.0
231.0
215.80000000000015
340.0
362.0
375.0
364.0
384.0
466.0
216.0
204.0
243.0
311.0
274.0
246.0
245.0
217.0
205.0
246.0
284.0
219.0
274.3
230.0
222.0
296.0
267.0
188.0
258.0
234.0
240.0
231.7
312.0
317.0
301.0
255.0
282.0
284.2000000000001
266.0
247.0
264.20000000000005
240.0
372.0
277.9000000000001
233.0
252.5
238.0
238.0
184.0
197.0
219.0
233.0
192.1
231.0
248.0
254.0
268.70000000000033
250.0
230.0
311.0
177.0
175.0
218.80000000000007
233.0
201.0
279.0
226.0
198.2
213.0
264.0
292.0
227.0
177.0
257.0
239.0
253.0
250.0
288.0
299.0
301.8
326.0
292.80000000000007
246.0
271.0
236.0
230.1
201.0
240.0
297.0
257.0
220.0
306.0
150.0
279.0
254.0
236.90000000000006
247.0
246.80000000000007
268.0
251.0
