-1.0895866567682002
-1.6801325268351621
2.0689965760825273
-0.3059212195810885
-0.07852760738591548
-1.0933561500417295
0.06939410218384855
-2.372886886178818
-0.6671106698433101
-0.7654516303743562
0.2582242740068337
-0.6232500637834727
-0.030714885331367067
0.5216937938496313
1.088130525584991
-0.7502371529572732
-0.5805670995716437
-0.826754483231065
-0.4774100113020723
-0.5097799521462293
-0.17805721129490423
-0.25149694533214634
-0.35964330423417595
-0.28741427508776574
0.7467717504471149
0.08720999021489448
-1.0825107841548105
0.9366391345326015
-1.2089227083883591
-0.4544398648715786
-0.7892224010041291
0.49305742810347936
-0.3246519078802955
-1.1444620305136548
0.8395268400337161
0.3403364306495041
0.7205070216570072
0.0641498948112016
0.5373872295030724
0.014387591130803061
-0.13870943475874975
1.5567713700957129
-0.4813723832388374
-2.2197727235194766
-0.30827089350909165
0.33644004260421495
0.009324258741903691
-0.6078449404719781
0.4784516321588385
0.3511307023439812
-0.1740691425029135
0.36752056396261845
-0.07634252885160893
-0.22853505852746117
-0.8875196115969332
0.6419310720724692
-0.8598654884752911
0.15990541582776735
-0.21916948778076423
-1.1677857069696673
-1.0441002267352633
0.20928145297333642
1.3385517515888357
0.757000457543179
1.3449121289070038
-0.5321283884636877
0.18118250585962345
0.3045661765462624
0.4819578984847738
0.8725131948915243
0.31426239543616646
-1.369646502205202
-0.2483235876491668
-1.4779598411693062
-1.3187927445344003
-1.0783133437687211
-1.1774197551844021
-1.2642569517161508
0.32461824976001646
-0.6384253347935354
0.732854200603632
-0.09013601393636918
0.9306139375077406
-0.3116805660637112
1.5325712198302714
0.7412299797547008
-0.7845846824745006
0.49874935710444834
-0.012202712532021017
-0.7062683838663433
-0.27483491718210107
-0.4613443821942891
0.19913363095975845
-1.187172321434337
-0.3374808991966362
-0.69199569574763
-1.5865720221205326
0.5548276597752183
0.34170264391527805
-0.33875113497335496
0.8738343799181488
-1.353571114460762
0.18355523682025898
0.301358056103993
-0.7385139594268526
-0.09516186190911745
1.0323837471829072
-0.3331817464929377
1.6965875918731004
-0.6627257942761255
-0.3795386303791812
-1.2138095870358385
-1.5125247103295814
-1.5607281444911167
-0.48686583610528344
-0.9515199514684296
0.023526963257217464
-0.9710628994959539
-0.6545890391448618
-1.8180148389068727
0.3421802342137364
-0.9227799041866175
-0.858353120512946
-2.5832033921042377
0.038712032450313974
0.9018420519385757
0.025511815770975027
-0.5532742850725662
-1.7250429831956398
-0.12206024819030678
-0.753450485695456
-0.7236668365423444
-1.4571149262958278
-0.4092551409023179
