12.266927494332984
10.698369225976073
9.963843220245613
9.469427963123078
9.396280580417233
12.572409859645532
14.968652701176929
13.382824422773828
12.481952989125013
16.69034986240406
13.37404803769555
12.993665133948376
10.221010439871534
7.948493889599673
12.448392376675443
9.401224326503062
7.719070344412889
8.705504300871928
9.667518950033802
13.319206148384374
11.426030845253354
9.336924853128055
13.914204964793894
11.346084655162393
14.22402070833688
12.231030468684185
11.928959231783079
13.389220425749036
11.662526011614363
13.044527629626025
7.387525758284038
10.310751578630049
10.590891976831944
9.891078870798856
9.618101900179015
10.423912515785883
5.976974064758987
12.530595453470998
9.681492973220656
9.400387375442692
13.601805807112779
8.176138156816876
11.46857505470271
11.078540814739139
11.141038650892407
10.064261111706344
14.60655281950525
12.559853855865926
12.69596659303954
12.794823297297585
8.611889297861298
12.62517836233344
9.972860724352063
9.084608474210803
8.81493930402666
9.579252681964116
13.22568099168968
13.530664052468902
16.547844374711275
14.374082183903546
11.141133576311965
16.030916669591367
8.469564523296967
12.651559962443413
12.981566896203796
