168.79316866599098
198.2570649715929
125.94011008180776
87.75426498496412
91.32151152906836
91.32151152906836
91.32151152906836
173.17581437957585
164.5708049694106
167.58595941172211
123.07531544508619
158.87904357456574
177.1538631406543
161.4285004833756
151.9979695273021
147.56007260679692
169.19482009425963
104.84531474693466
150.6500202770864
116.92868679800644
119.39405067627766
139.46915654220044
90.5550021733531
98.75179116318249
121.78086499175072
137.39379640094953
369.1893880918585
263.6475787158228
208.62714615850803
121.2645287046328
127.34948713425594
161.25139838501352
105.1828528549145
171.8987341571173
141.19061077370998
136.18385152641522
143.93404425220166
91.28358625970984
340.71753086785213
125.29392167184541
101.39589846468144
138.26713427002016
119.14871570428896
107.76650983745961
148.70732120961975
130.05031412058997
142.12249517819745
268.92772855184404
199.03631526889
216.04403735884134
111.69936399616691
117.67505013587952
123.19106811099888
117.1695503028268
172.1491085218455
116.71889818627744
87.8771627271201
161.55134002211102
179.3776947831716
252.35433458626312
135.92595505308657
137.04010222565282
245.74798518855133
152.50318229785984
158.1675862117804
56.2083157612112
155.62387482147753
107.95897075311922
166.21607572555715
98.1815545339688
125.47684147909708
80.69756770449757
130.35760936880376
78.48060155876959
177.80068488738198
90.89561197484615
193.2581839828571
245.0700295546687
133.60186970754998
103.19592694652135
190.83942697443857
113.47209171453105
69.245684586235
65.37480780812247
135.93719690624505
132.01121288007192
92.41008345717677
156.57518636552902
206.69991599409775
140.11010382929146
184.28896539708612
172.79697045155706
119.35460845623017
180.516422739771
131.66187196467473
131.66187196467473
143.29710716155296
131.63923200934894
99.20633329395115
335.45478113077684
235.2975679074449
85.78057974629864
112.13774112085966
114.60389636782119
121.16116710994262
122.89204092579895
116.04447220460659
86.94241020972092
157.42659181636157
126.02729891309818
95.91838790996893
94.6280060098348
151.05926786778784
134.95368416129574
100.97534871901856
134.39260606450412
139.80769275574792
129.46979998155524
137.83857032256833
121.85150648248073
164.63763256563578
131.7101060525086
361.35969681424734
202.8235598460074
147.62474292589147
266.7532823918944
108.32355400296446
287.5009765941266
175.51855200912152
211.25762368518696
238.2604778404364
119.39292682839806
198.0837195107514
133.4125508120357
