130.60664130737115
108.4825542997367
-6.381310186106143
3.9406909762723683
44.25425105713225
110.47010723652306
67.3254222143061
94.80307937947259
51.10404927512682
85.89566507467944
31.580714593904148
35.99274147362554
34.98808727808347
44.762541355651855
-5.447465926003042
8.956911136956275
106.00081164378021
103.9398937351077
94.39188102967688
56.936547590250825
56.52933493188619
49.78447755442553
68.0110145106976
62.211385518002245
96.52585705811651
93.8676937697978
43.84589370780023
24.435353017709502
16.227456753048873
19.59479881034554
15.596080117305744
103.05564511384672
84.65484351491456
62.757889612185366
69.93420223576888
90.36648306418219
59.93397381736786
135.60549616168115
84.0683201814357
82.70646281473854
78.24294077851202
10.335227766680076
48.002716362267066
15.53505045773135
27.587005167833453
86.43822346879222
95.869273912626
34.18693864110271
9.915486580627508
14.7149809426638
112.5958573849062
54.87908004346678
54.87908004346678
57.21063306304666
59.83016727145586
86.60075432267075
65.81856654524245
65.78848801764362
125.47886392637241
75.36686049018391
-2.7434914689377736
172.88797969774618
152.60402864270318
134.9324046174764
71.16129086954356
