5.143107951010989
5.574865010727976
5.987552604773883
5.05966501763854
4.585599088127717
6.014199696615403
6.512321633685327
6.904589951953699
6.457122618162255
5.046932002274482
5.471406958606258
6.640061399451363
5.631499257269202
6.3356428276563355
6.158513132567776
5.631488485906749
7.451651306017626
7.0851126505177815
6.519448916742508
5.405217638970041
8.203837037232205
6.316860516308756
6.889737239625314
7.237577524081255
7.955999710676606
7.811441117750899
7.348320932768374
6.503658629976863
6.227239488567386
6.505726925439444
6.014804581555354
7.545415082399984
7.371621819203472
6.904845194934985
7.297466477354588
5.445944253612646
5.205799200990152
6.170097346743755
6.775770795628592
6.943096521595601
6.424104276054332
4.365990400949733
6.90735135103353
6.237561675810188
6.4354041237538295
5.118365662145648
5.6836286399807845
4.939228632021449
5.734784863325216
4.950490910283791
5.03679173996084
7.186866833751835
6.336268378993295
6.01947298447813
5.865236610403643
4.7804668711904705
5.85535609129743
5.117837823510309
6.767000706320446
5.864175499135791
4.574378227583624
6.386095827656034
5.885342854758878
6.202883533402171
5.80482972226194
