0.00585559364716299
0.006114629152093298
0.00019265207602394655
0.008008879421097561
0.006019052799488432
0.01773581358908743
0.0053808791653787574
0.02684119746385133
0.004010211183644969
0.003277317694995262
0.002458662804588634
0.0034105745808918585
0.0017511947871501168
0.0010528114103283497
0.000491903624533882
0.002747460687711469
0.0022714108995712484
0.007983897473205845
0.004594452920143157
0.005593364134443439
0.004185290656855728
0.004922359817702057
0.006829331589140648
0.004042485270482461
0.0015410169022112244
0.0023374288206894885
0.0012106665674723508
0.000260112454558298
0.003592050543883165
0.004902066206058978
0.0068151267882063035
0.0010539587497608405
0.0061978637420156794
0.003977530426626847
0.0008155406952290178
0.0016674058437527227
0.0008033845909832136
0.00498473593723185
0.0004545094828254841
0.0028962623912671035
0.004415346923178254
0.0003364977882504892
0.004150183625750228
0.030896851839502405
0.002631775764496493
0.0017234703347104045
0.0022364388305483834
0.0013451543360036328
0.001087227058929714
0.0009819188863994556
0.003741506361898017
0.0018988148943445762
0.002615602082393285
0.00342124328631814
0.002376674485008734
0.0015100108530171257
0.01291836380578683
0.001254217515688131
0.0021574718765229022
0.0038832269564324385
0.00766466046981721
0.002217935223564532
0.00019537710137450704
0.001154515040449276
0.0003302979537374036
0.019428008405048845
0.002459945060713509
0.0025766482890146178
0.0012982212296034814
0.0015446209378231716
0.00248776080166917
0.02729144919991955
0.0035645000243216783
0.02347733320595606
0.0072738816042626905
0.015595487342213537
0.004971643204943197
0.0030544308397475804
0.0017845160511495296
0.007107711376627014
0.0010370844804014137
0.0044094107667216435
0.002412533700797725
0.011460988218200609
0.0003717849227362552
0.001074324573867175
0.01575799781357862
0.0010963860040706923
0.0011125224421287756
0.00417261780955909
0.0017800059697780312
0.003197245144047932
0.0026294485263738754
0.009106376486898445
0.004435868929568164
0.006735216722357219
0.009857240456638784
0.0011979658560264212
0.0029027565905119144
0.0015547166308184355
0.00047325344868614084
0.01912006624875656
0.0028047724725151816
0.002421913246630645
0.007145484737457361
0.003537540545453624
0.0012158704876041382
0.008290357205731812
0.00020034297154061567
0.004390369795883689
0.007123475906478133
0.012050849893189304
0.008708825093323486
0.01215127771819905
0.009437519818643977
0.008979714609430341
0.002613500455598092
0.009855308747140823
0.005564387138774261
0.017839396397077257
0.001293154096572965
0.008081896408919596
0.0018017946340435195
0.0157537095413954
0.0020881746099057344
0.00028211799955055465
0.004287606595020696
0.0012920185979626436
0.007753926728592361
0.001424274947025398
0.002353369871262785
0.008950411958192767
0.0059345935847851744
0.004916603094590261
