510.0
479.0
376.0
260.0
378.0
529.0
448.0
534.0
423.0
328.0
222.0
394.5
450.0
565.0
304.0
360.0
1144.0
1244.0
577.5
323.0
730.0
683.0
630.0
592.0
846.0
765.0
556.0
538.0
460.0
585.0
486.0
997.0
878.0
777.0
831.0
436.5
389.0
552.0
806.0
907.0
351.0
264.0
611.0
472.0
514.0
351.0
347.0
216.0
342.0
274.0
406.0
684.0
635.0
648.0
469.0
403.0
331.0
314.0
429.0
226.0
230.0
790.0
718.0
660.0
395.0
