0.1456926781675911
0.0971526125061484
0.28422667458074224
0.0214743782632389
0.04481529631375542
0.2717401986518043
0.05080828720161359
0.1663897614688847
0.20498792851102726
0.06131584239856719
0.040356769743081805
0.06011920089129327
0.177503773307047
0.03745385499572868
0.0687357228224727
0.05762316925568665
0.13684947740967435
0.17354319896494633
0.04946491363465177
0.07832171419382
0.3462839295444444
0.17491276429627542
0.2560978509098473
0.06909118590285786
0.1092682270979244
0.07361265962215419
0.10191717604408224
0.13714584425464196
0.06588979339272194
0.3181167207977044
0.19142865911655485
0.08687381923485886
0.11056182043219737
0.11027506193145577
0.08538201080786689
0.08658592896585257
0.04063662253188939
0.24824202792908065
0.4496660320299975
0.12528566828848794
0.062483775500262226
0.24146097612054065
0.12066202408458022
0.14318499160479248
0.14475680049480294
0.4281803668595426
0.16333744165701827
0.02979398259197805
0.16339138169231146
0.057852271802612064
0.2343497218129017
0.23297575586576205
0.1340361918602691
0.14851848859739306
0.23132568451359706
0.09921935607970896
0.10206063501245116
0.0796120057701176
0.1021395073484828
0.06191704484861756
0.07974975860631707
0.2544483760356601
0.1187417095268865
0.15223247121931144
0.025870634676978442
