-1.162774721581133
-0.9766179863741553
-0.5546436338343287
-1.0458176932658203
-1.5698239769733675
-0.7386973196668051
-0.47910286931685137
-0.28546051809324247
-0.6535597772621776
-1.3679195871079148
-1.0936788611823474
-0.31529375382792085
-1.1333718529696575
-0.598794052231212
-0.8176159184411919
-0.6123298608905338
-0.19973447678741496
-0.2240070913903105
0.08493974795846214
-1.7336661968873266
-0.010633570617500088
-0.9560506039363794
-0.6014334418186483
-0.729354296278923
-0.030155461908759073
0.026493299950357607
-0.35525283041621236
-1.4372380413425574
-1.4076189145948141
-1.656138028561902
-0.5362779292805824
-0.4287559366080659
-0.3573654568955353
-1.042751302031212
-0.2560948552159009
-1.3791784237704179
-1.0789753435591884
-0.876131574930883
-0.4451908286232128
-0.16052542307139803
-0.19265073481865552
-1.5992417053100807
-0.9773220357735464
-1.0377320396300558
-1.0163906376441918
-1.3472695766240272
-1.0959468502455385
-0.9342360926453348
-0.9795191382323566
-1.8294801127581588
-1.4418673640277933
-0.5489293777173633
-0.5016378198588106
-0.8425415367929354
-0.6197349123817945
-1.1657671925714157
-0.6339574211060772
-1.285493983898244
0.03982278229992453
-0.5329787985903804
-1.6983919769355826
-0.9554662625679193
-0.5695505503465752
-1.2083126216593583
-0.9126276883729342
