0.7421259914623651
0.6800656213895705
0.7148792952226289
0.7914639646486114
0.7993088397624741
0.7474039741737606
0.7653597939766814
0.7707933362694064
0.7631917221520825
0.7193249917118788
0.7015883742756979
0.6477965412739477
0.798230013819578
0.6792859335034928
0.7303712109183872
0.7520377281528211
0.7841297686164207
0.8234180608162321
0.7306178169961689
0.6814870430253978
0.6547706064415502
0.6565131999998501
0.698453989869474
0.6742634041048926
0.7600873890991308
0.6487102099439528
0.5897624632056787
0.6293701280614651
0.6865102348637905
0.8038831086869171
0.7431187055080859
0.683676268618194
0.7910696815051177
0.7291502087264721
0.5771193721586038
0.6919551054140685
0.6978635973664151
0.7310213369136129
0.7014164957696168
0.7210884197348063
0.7105662975240186
0.6630189520540427
0.7378848715868777
0.7608987269400391
0.6676601784555191
0.7919781457356999
0.6475651495363313
0.6588223270027478
0.7480714601249082
0.6504890561184821
0.7184292858937612
0.6161579405609084
0.7646918620558596
0.7287864853472102
0.6886971138725508
0.7449139955622449
0.7258234107860622
0.7354672773313017
0.6380285150004091
0.6104229321960625
0.7318278093894316
0.7223394842618102
0.6863769469288248
0.6938605032809021
0.6960077033515611
0.8097928455028783
0.6967931164171636
0.6935349397116136
0.6313640032594866
0.6673746053010485
0.7090381684324231
0.6838915410779849
0.7435391524339195
0.7868480581165138
0.7569096814710908
0.8129585666144171
0.7699959750207303
0.6847994758914989
0.6756721164646793
0.7893925240553564
0.7521181527604859
0.7521181527604859
0.6640346515195944
0.7182510184103191
0.6920548406490111
0.6848075500171218
0.7910914012578055
0.7762888585939263
0.7036407717773658
0.7634275280145442
0.700435273296439
0.7095958914524015
0.6324455936834262
0.6357877925425954
0.7756368655874725
0.7740323076720462
0.7105386659242077
0.6972558661405862
0.7591189001490641
0.7176095782284261
0.6729410450599788
0.7102781461984939
0.6397125403623676
0.7307104192700935
0.7560341919130968
0.7197605081819376
0.7448206521053881
0.7845728559630919
0.6708230369743182
0.7472166391588688
0.7813469902462269
0.7860037777513211
0.7089916635795429
0.7950458304381626
0.7601469707200459
0.7043677921238773
0.7097314299437795
0.7952573656683805
0.7933010080396199
0.7775753512370884
0.6522880943773379
0.7515235867979703
0.6554867437686785
0.8324651830010079
0.6723771904754077
0.6665862430624337
0.6590188243962838
0.6746187242768206
0.7227187568084007
0.6770585971841313
0.6914346580760398
0.8117897150032274
0.7772925191260763
0.7164084624699644
