-1.535601347598195e-05
-4.430666934310558e-05
-0.0014517253733971353
-4.5566702063670436e-06
-3.127338047767675e-05
-0.00012816489180066074
-7.425436986007087e-06
-1.7210179593870408e-05
-1.92364064128382e-05
-9.619274301076075e-05
-7.787872197697872e-06
-2.518948737685353e-06
-0.0006375729697864628
-4.380694191258984e-06
-0.00032024158104318505
-0.0001055651331947346
-4.7840685641809946e-05
-3.524006391339372e-05
-3.47230501818376e-05
-1.8237441671321324e-05
-0.0009333921996264291
-0.0012214938422147944
-0.00036875448877122174
-1.622448632388776e-05
-1.3653363896274309e-05
-1.8759761496309292e-05
-3.62935200657958e-05
-0.00145505210514149
-0.0005738857259040219
-0.0014550530973443411
-0.0003207937832915718
-6.390622740888016e-05
-0.0009219174961756038
-0.00037407064492491756
-0.00011534518349048194
-0.00010828681931695212
-1.927428764521696e-05
-1.9744838060080194e-05
-0.0006189560884829584
-4.445867804039712e-05
-6.495213026073133e-06
-2.323069745174527e-05
-0.000258144726977238
-0.00025834250503343494
-0.0003521782926414974
-0.00014529446380369073
-0.0002252409642794545
-2.133732143208843e-06
-8.321151082611719e-05
-3.4763975012482236e-05
-0.00013303528565118854
-0.0014550529552473965
-0.00011397986603048334
-9.639566084385734e-05
-5.927564052829431e-05
-1.0166618791448776e-05
-7.592360172337313e-06
-5.321416226200025e-05
-8.463451754623327e-06
-8.133604688655935e-06
-1.5822423757040138e-05
-0.00021401687281441802
-4.6190262632122596e-05
-0.0001490164807984129
-3.858587970910895e-06
