0.008804522257080484
0.01135
0.0049425630290653635
0.008769132653061224
0.00903225806451613
0.009693627496829277
0.005713019390581718
0.008883928790910565
0.007554107605547935
0.0059636457983578035
0.005174399113793053
0.0053668820467534396
0.007944745283436878
0.008035310095065641
0.0060381175715905795
0.008879656683710737
0.010517625407418235
0.00907790611590682
0.02617283950617284
0.005366410046762729
0.01006240265574569
0.01043305785123967
0.007050211457131872
0.00540711595188006
0.0061965962855730534
0.009994121105232215
0.0064693634741225465
0.007206134604731762
0.006731859410430839
0.00916503696660678
0.02352607709750567
0.008899710937388753
0.008833592108957745
0.00800512
0.00811251748001004
0.00748512709572742
0.014784580498866213
0.007919990750375767
0.01068459957025198
0.013346354166666666
0.0056203176596296995
0.02404260317957553
0.007115369106949887
0.004859239522743804
0.0053867319564145045
0.009152091906721536
0.009199957984664402
0.0071566607912676
0.006332766542047655
0.006489642077819028
0.014013295465185231
0.0068903070600421
0.010471007693751172
0.01457725947521866
0.012929618680760849
0.01105601469237833
0.005708006471108941
0.0042339347894903455
0.0124349027526836
0.005275459848304798
0.00642393477235462
0.0055028913653025115
0.011224007561436673
0.008383444706346058
0.0065015706041347075
