36.0
44.0
80.0
50.0
38.0
25.0
19.0
34.0
35.0
67.0
51.0
62.0
60.0
134.0
64.0
118.0
83.0
35.0
53.0
68.0
81.0
79.0
69.0
53.0
46.0
95.0
87.0
116.0
77.0
62.0
64.0
104.0
47.0
80.0
89.0
76.0
43.0
27.0
120.0
92.0
75.0
164.0
61.0
25.0
55.0
43.0
40.0
64.0
93.0
80.0
43.0
78.0
100.0
71.0
49.0
65.0
30.0
83.0
63.0
79.0
52.0
51.0
107.0
58.0
110.0
27.0
49.0
62.0
60.0
74.0
66.0
33.0
38.0
35.0
32.0
44.0
29.0
78.0
63.0
104.0
44.0
57.0
43.0
59.0
106.0
110.0
46.0
47.0
58.0
35.0
48.0
55.0
36.0
16.0
51.0
57.0
47.0
101.0
48.0
62.0
69.0
27.0
40.0
79.0
27.0
49.0
52.0
23.0
146.0
62.0
58.0
63.0
35.0
20.0
49.0
50.0
54.0
36.0
60.0
43.0
66.0
51.0
48.0
59.0
44.0
116.0
37.0
84.0
31.0
41.0
35.0
40.0
53.0
42.0
