91.59226251427731
83.83363998524798
34.157907553455125
32.30173479053697
28.816703209821966
137.3357234921307
301.4514340343089
224.13061312280655
84.00660908941829
167.3108396388921
172.5757269361137
154.22788366331898
109.41328977473343
47.41495824603506
125.02534544325508
65.69238063732939
49.621879000816826
33.01246468685608
113.40074534267731
209.02059867227538
95.593616338359
37.12196999115039
123.25492877747948
156.45948083111608
297.20445862461014
177.84909629452653
147.47510893688374
80.3099268226793
39.875887220064286
98.01978401599655
19.37160138589597
92.26094691583513
66.58652184650303
67.31074443153761
60.185136339045286
126.56679678786007
64.99610487316289
155.37294523389053
47.53157072741054
78.6924520174918
190.458590741682
33.43856221519838
94.9367431944968
62.75708719560411
66.33838404663356
139.67238686839482
203.3741775597671
187.6985604722198
122.87496756011019
90.556754438777
139.7251814183238
103.64232792279164
37.660414556191824
29.20606102788188
43.478946239840525
32.46445529725509
181.96412621018382
149.04052364829198
456.7645161290323
199.82705636726192
105.69591590928226
296.91896667552516
42.62560113214961
101.45556760033158
133.10260959603693
