3.907807439187976
3.685739716378674
3.658512886946699
3.6677176103396008
3.343659321686455
3.385525155103352
3.647181953127968
3.7941466979502376
3.9530592410079857
3.9298145293003044
3.514764125174388
3.512366725583874
3.6087047063426745
3.7119199396914753
3.8132881526510305
3.8506273864401335
3.9035825387071372
3.558085985645407
3.7909515326287697
3.872503585821398
3.9178399813032154
3.9201901296142534
3.6999038636821258
3.6321491589448534
3.739848713311352
3.816713773259866
4.19043409526208
3.9770382510738016
3.8724844213186307
3.8102929246458452
3.5167364984358636
3.8837913441625482
3.946342258466804
3.915637923323874
3.919624605167247
3.820492000598183
3.7348925077044606
3.3198738417924423
3.905920661110765
3.7635420385764826
3.8022207200455007
3.826764499756222
3.8432682420544135
3.9725571041594487
3.6805526287428636
3.5501566499334953
3.6297674229683743
3.8039161889049726
3.533745676210654
3.5825814471343826
3.423588861984094
3.5765939816671195
3.6278799597135776
3.579367942070717
3.8557833673518673
3.5152281719813527
3.328545937808688
3.6644647253527105
3.5436090344637323
3.6488768719912317
3.4479683760738657
3.4704084228361185
3.738229770004852
3.671156074048139
3.675737954152833
2.985977933020001
3.733617433040976
3.9091888755993613
3.702655064249489
3.591157940916295
3.6612173599187017
3.42281944516192
3.516226430872824
3.5005833084261724
3.6929056337774018
3.568507596941046
3.7247050245588245
3.9446910378717837
3.7401171220386544
3.6727149665381416
3.5842201888609977
3.5842201888609977
3.4195999956090217
3.48954154950211
3.6713359833799113
3.553576896116875
3.287891829943456
3.743558395972059
3.7231252763611216
3.5957118797552767
3.8269419590494107
3.588311169948469
3.572053944382367
3.473785770590189
3.6603767756949828
3.4767555357510442
3.6082251462202257
3.695550878084429
3.548931698255921
3.658777550740255
3.604438407865507
3.548515886750029
3.605848044147759
3.678517983414066
3.446897153165736
3.5774580332906623
3.5221076701589697
3.5807861932140677
3.8015635610546905
3.689062715130817
3.527497576125412
3.6536837088904397
3.7371345449803295
3.572284485751375
3.453080426095596
3.6750074959694534
3.7221798924237963
3.5424354997359746
3.7759621500037515
3.617686902188892
3.6947933484764484
3.404966336105892
3.7546315261534517
3.7661110934258564
3.6150921679879846
3.902519280485268
3.4302796036496765
3.8244136936473123
3.5132244592489688
3.534715818472965
3.538647925991062
3.6019362586905386
3.6461652777553932
3.7502585634395214
