0.28888592225161674
0.3428252784128757
0.12903039815233955
0.2845177935540967
0.1810242588913052
0.3278190771898717
0.3608981403918256
0.3714755958953371
0.3352127049220059
0.28264667228976004
0.350293364358235
0.3637889461527854
0.2586704909866861
0.236087622625038
0.3163423999655026
0.2394642637850956
0.22060790113475112
0.22512169281363828
0.3690079853780592
0.3382318990408613
0.2580292508214221
0.17249959956517727
0.2682177666701976
0.2891724155776893
0.3825735016996362
0.34173419863077825
0.3322908597045613
0.16679100827342885
0.17799614756729226
0.16889048115285632
0.2592188314249095
0.2698560270920754
0.2503839756913047
0.21497389589625435
0.23843111754738944
0.2683993522145286
0.27555985005990946
0.37986910011602304
0.23846412120805285
0.2304290694887292
0.3748499998551996
0.3406588428870592
0.2570296395821374
0.2040210157966169
0.21349533956472375
0.33817958925584457
0.4014523288563235
0.3209203753934767
0.2460151623180972
0.2520022350440943
0.2982865342616037
0.22253367281985087
0.22197280419794854
0.209499377232974
0.23197628110439344
0.2680767068837357
0.3735726995270702
0.2889995756262994
0.4949613575268816
0.3803127287557835
0.34950316583785823
0.2890381997588508
0.3023965917873144
0.30240620132164003
0.3239248257228115
