0.901103767941578
0.7733910415274032
0.896781838856855
0.6860153882759915
0.6959331748856558
0.7885208443909332
0.8922409388069485
0.814641833437303
0.641732249563296
0.9421142782067942
0.8236823047131584
0.8424054480630593
0.6022862522004687
0.7896961223888114
0.7692643819712697
0.8602488645218715
0.6332094927386991
0.7810268760465497
0.9606712499768932
0.6534814625447967
0.8720190745337267
0.6320529498389664
0.7706003427951995
0.7757647252557345
0.8894516624264285
0.9082320507564297
0.8159816660911835
0.8596186880112698
0.6296271635114709
0.7704000527735005
0.8843793688755732
0.6795021258158054
0.7061053170221163
0.6539001061040259
0.7146802864312801
0.7617383527532069
0.6293760246883008
0.8600368730989268
0.6788320135531987
0.8967091423242987
0.9076771365053756
0.7122703339407507
0.7615686608757967
0.6148251070160197
0.6890535877391698
0.7666097922160133
0.7148869952945264
0.9239238546840708
0.8359409212763531
0.7267200599602847
0.8059342892030433
0.841751768092438
0.7726361892879073
0.810129974376774
0.7265427052020104
0.7474407177758227
0.8396861362282338
0.7267287631475929
0.9874106632260458
0.8631829580262294
0.7344554657615513
0.8488223538175658
0.7292254337512828
0.8432494839477526
0.8922268569726808
