0.7454728498307427
0.4162164171093127
1.5391588120782447
0.8571077340240207
1.1379463992881356
0.6147520318842297
0.42206570939247934
0.7177519957076608
1.0300394879733994
0.6731405042242119
0.54579662947345
0.6146638013186019
1.014188093373868
0.9667565173836373
0.8057706741702354
1.0211769487296705
1.1809364301066632
1.3761619044008553
0.4557923664771567
0.8039818513345621
1.2435123443432257
1.4429952827400452
0.8674367191441078
0.8886870700803944
0.6885568675169466
0.6703155992907676
0.8746567048262595
1.5345547925445167
1.2502439932549618
1.5762407699199459
0.8741246311508514
0.817628134881614
0.9346027934046207
1.1348666761557393
1.2287885979219881
0.9568821191582517
1.0543256677086112
0.6172673861100677
1.006328207313734
1.2255795760749262
0.9193955163238979
1.167756793890252
1.3686781596715927
1.4550291441807064
1.288835676433594
0.8950080185787582
0.36935904931158475
0.688205335230461
1.1319809516797865
0.9566339239556825
0.7369133788986554
1.1922216187827017
1.1284080221853536
1.1317139440490283
0.7871962134617979
0.9920616974021045
0.8092280287585536
0.8296569209423206
-0.1396506891555628
0.5745704276672268
0.8836310143985497
0.9875179818643891
0.8288090595681807
1.045334359270125
0.46667189919835045
