-0.18299852246710724
-0.1823692387454626
-0.18142244252918266
-0.1827495036293645
-0.18184532017543598
-0.18319934240727384
-0.18128047603143024
-0.1830524164173659
-0.18118222859123895
-0.18321640152573146
-0.1824957316908633
-0.18181955302133682
-0.18142980979350629
-0.18439875560335747
-0.18207386898622113
-0.18448554943135959
-0.18422487792243597
-0.18427320117269375
-0.18275997818875214
-0.18390865160675623
-0.18397917351665102
-0.18390572527436827
-0.18202149721088237
-0.1830223737732911
-0.1821090282896983
-0.18190787585653884
-0.18192105818000628
-0.18219094953101875
-0.18224894317694096
-0.18294236048694418
-0.18201383395195672
-0.1820771000454356
-0.18280396610382355
-0.18326267811031122
-0.18197709622652566
-0.1824180536599794
-0.18257239673332018
-0.18215892262160424
-0.18196310411998898
-0.18242594206263368
-0.1826638056241289
-0.18156342008499274
-0.1836957760000468
-0.1838884137309788
-0.18335341129972
-0.18365302968286806
-0.18248603384608894
-0.18176915573112992
-0.18276523987603718
-0.18303193590154926
-0.1824797571043183
-0.18135210757063225
-0.1833499174898027
-0.18203814058363935
-0.18251792290219246
-0.18241750046254013
-0.18210197580430929
-0.18233501297401203
-0.1824754442292039
-0.18373532300154938
-0.18418662813582307
-0.18359370654354976
-0.18172027349764072
-0.18047048307371233
-0.18256951594825263
-0.18082357121399956
-0.18107838730137996
-0.18126737899128453
-0.18083423704552284
-0.1811317678422956
-0.18199990178336586
-0.1828911950512831
-0.1818175763005041
-0.18426819379458093
-0.18465439935719696
-0.18214198491814726
-0.18400028379542904
-0.1846528563660013
-0.18235306640440307
-0.18278449925628346
-0.1816651490455717
-0.18291261174205342
-0.18073812782575102
-0.18180208933656036
-0.18215944372850654
-0.1822833865056374
-0.18527987617919645
-0.18127791567734144
-0.18138298801298777
-0.18078373836107084
-0.18089609425156758
-0.18292750950618805
-0.18154074405925083
-0.18113014680936687
-0.18352321345204267
-0.18460556309276346
-0.184359877669779
-0.18340341528653922
-0.18136759664033938
-0.1816708921570714
-0.18271639170089016
-0.18425544680851944
-0.18209843546698282
-0.18092397682748965
-0.18254954659725078
-0.1832607720632468
-0.1820820185073657
-0.18126853780741337
-0.18229434126475066
-0.18330824409119834
-0.18288898941985754
-0.184072896928236
-0.18390901227939752
-0.18402341642362505
-0.18238334278377286
-0.18364471546669378
-0.18156945675209848
-0.18263406241499672
-0.18329367268172483
-0.18435782749146878
-0.1830381504720464
-0.18322086865780243
-0.18280825570801537
-0.18528090746649784
-0.183000104926999
-0.181195247181371
-0.18344897679887828
-0.18143789413592995
-0.18319161225845051
-0.18162387089840273
-0.18141849218328107
-0.18318373717554357
-0.1837932700397592
-0.18240257451094738
