0.9816548075160052
0.9870870124141564
0.9761325181599996
0.9770682693775292
0.9692384308744229
0.9794565917319924
0.9839543286538238
0.9780462028966684
0.9728341155705832
0.9807302713800394
0.9819655446096076
0.9856570795829198
0.9728618812586112
0.9839068893963993
0.9777013016977344
0.9733970608868928
0.9850701931412916
0.9849557131562332
0.986907715504753
0.9777720103291092
0.9825352286665322
0.9789681709494992
0.985494332908745
0.9845322481434464
0.9893514004953584
0.9888703356737611
0.9863845412768668
0.9796599183208318
0.9843137846265534
0.9785849972238068
0.9874655895506984
0.9888081416351036
0.988533682103212
0.9859825011765978
0.9856618839561798
0.974459760971464
0.9675575838828879
0.9805181492283436
0.987876490115898
0.9827963669016776
0.9780737921205668
0.9741835923570642
0.9849848440289174
0.9806092535997324
0.98332119220729
0.9712134232729256
0.981843925911382
0.9779994648659028
0.9733591118661522
0.9748271219475028
0.9740497809761536
0.9846498522148394
0.9850159589628558
0.9836685000385532
0.9796433820642628
0.9744173066943488
0.9735187450170708
0.9759358115934582
0.9889462994880072
0.9805490324607274
0.9710695738761358
0.982408405679808
0.9832478715037172
0.9808484455016836
0.9837985167607204
