2.2325896669990275
2.275750621323991
2.6529079545349923
2.1956804487419856
2.285250307517999
2.2116685266039986
2.2521964312698195
2.1460543966951255
2.3085974782584064
2.3195876315520874
2.377259831480948
2.3217698071694364
2.3779430022493315
2.518827245041653
2.5091235545706563
2.321494569259763
2.3342960489862628
2.198051085627918
2.355396250957989
2.2829552014581815
2.2521964312698195
2.3377867344213854
2.205877020759482
2.312909661078487
2.377259831480948
2.3693701894340498
2.6640164834030466
2.665098355483605
2.502315517155219
2.331079468563385
2.4820161913335164
2.573104082478492
2.3217698071694364
2.437708158245576
2.5081025188791517
2.437708158245576
2.5042408392073128
2.256553912604129
2.6195140200477813
2.407767646291396
2.4317745937717605
2.6246519809044075
2.395706049826258
2.0119171937885287
2.3550465852913516
2.3537463030679135
2.4040104660845176
2.4356091960565376
2.4916895132881853
2.59854336724031
2.4820161913335164
2.543180541040943
2.437708158245576
2.3838189404723984
2.499541119717347
2.477260802455604
2.3356568952052847
2.5008301095137107
2.4738185556168903
2.4922648363639874
2.3402566380674474
2.3554391733150473
2.701462122401405
2.5716570136438026
2.6526153358258644
2.361655633641788
2.4317745937717605
2.4073357078963826
2.5393312734284836
2.472248089942645
2.5146171927243306
2.331079468563385
2.367558834360219
2.049898462193477
2.036296910909167
2.186815696565546
2.179531361206678
2.2254934352191955
2.3217698071694364
2.3138009202890384
2.4777906864925567
2.3217698071694364
2.417146816725823
2.212057102231543
2.6604833525270926
2.499541119717347
2.132160844401152
2.481178301962645
2.477260802455604
2.3136027063240276
2.392527755472059
2.3245436801400907
2.320927749971368
2.198051085627918
2.256553912604129
2.2116685266039986
2.1975671691050014
2.414581272244653
2.301464238953309
2.4896781895040423
2.526756545614202
2.0223288966024824
2.301464238953309
2.3365015189955227
2.2060827169656836
2.2483998517121875
2.4082904888404504
2.2641003798725476
2.6417208431520063
2.456651389106157
2.3377867344213854
2.3217698071694364
2.247667029544796
2.088656877577621
2.2757055772561765
2.2521964312698195
2.3501226323465785
2.285250307517999
2.285250307517999
2.198051085627918
2.520217001334354
2.2555940107632644
2.385355460939574
2.0849497610636765
2.4278719578039816
2.6529079545349923
2.2835456421306835
2.547009383849963
2.3138009202890384
2.569170735518601
2.552402186031178
2.2254934352191955
2.2980964600686384
2.301464238953309
