4.5486616565762885
4.492250795376856
5.874715750204602
6.5253244997295825
4.901066656629908
2.9996345315477586
3.1544028654915635
3.162632727122342
3.5031429992041008
7.5259817304487235
5.626749076696906
4.963447189561896
7.292956723151323
22.260569337029036
5.821731639564434
10.425310284485953
15.303287195671293
4.739938974546244
4.172765251891583
9.139082465744485
12.393356070887515
12.822089246970053
5.3603246696529965
6.120924492157807
6.222793223350216
5.949638596812919
10.253962163217684
10.980423288633572
7.293210338076298
5.247565110240113
5.293234635276572
7.527037640276573
4.118286158524209
13.628309531171949
13.22541762030733
12.407624084273227
5.397131438107689
3.4282328042328047
8.700793476891755
9.296491823327909
11.672450411438756
9.823359733623636
10.273361215376996
5.2061855670103085
5.019429924213973
5.529809973549467
5.173782937094527
6.406169107868066
4.712618352411899
5.097071574486519
4.955999059348853
5.76452735707979
7.146996679553656
4.193017987650968
3.669145773429957
4.04208803564862
3.0813466738777717
6.251521223659494
4.990410637594702
8.697896221195341
6.44530007077084
7.172852389068606
5.6796196960383085
5.561922000000001
5.986050558749019
2.9384937486687104
4.800390369890257
4.836515722994605
4.687715698154874
4.852452511860153
4.349480423445402
4.011774110685941
2.86495425772714
4.607714981417405
6.68744504604563
3.783113692204602
2.86244045701802
6.320717973451992
6.035104807838921
4.013377896901636
4.784389065426865
5.025572030335253
3.716073307034845
2.9826390755173335
5.300475582990399
5.886334620600784
7.891655094888581
4.736405668722657
5.035681974757103
2.473004946938332
3.4141195318097077
5.351881911083939
3.433556484988777
1.8084910288918743
6.662581975328775
5.796686901677092
6.7247346938775525
7.740849237721894
4.0892549168097885
4.210248969959891
5.076749409248534
3.9027865555874754
3.6674080876101076
3.7697943519069335
3.095632608233013
4.702702772786089
5.758649083823283
2.421689663519729
8.209624333233936
9.228676800051792
5.9012097918870605
6.66393400486468
4.345398938481235
2.5058931787923875
3.980490778844688
6.2906496914774594
5.086838843605396
5.080465331482583
6.342867461388536
4.9448795390540266
6.572029610525338
5.6855836147582375
5.187628860342924
7.7482588492400755
8.841554126292936
7.538472633450736
4.830050013411677
3.8861831382919934
2.8613285562812205
3.1643313286626578
3.4009685949075137
5.483393777777778
5.043679531280303
5.177899465562287
