39840.752854455015
9458.58215350057
24903.12935703532
1935.0236121353266
3829.729364814106
36281.52192848821
145507.7246578825
65098.388244561844
21936.595863825958
106124.66935190052
48373.73867290701
40811.43911136447
14945.897535230824
4828.163864085551
49025.83107889435
17706.835757286295
6431.003967854829
4930.594168603785
23984.74703560997
31713.616983718915
45277.41986118167
4177.342101442147
45492.85668829975
73862.2062624532
251144.7589364822
51694.19178958573
82958.06997665823
77533.23412760241
9988.20926155513
21313.938605700463
1472.0319669769362
28110.50159337153
16940.840662015133
9008.911669887337
13374.820270684722
10565.108353485699
3839.658723281531
31807.38806717345
13422.169202084255
20326.633703273288
112943.71272770336
819.1962985058841
28225.72809475096
8176.709164780395
14699.238251358627
19117.57272198156
44934.259360152064
105892.40393425463
48736.50982429246
8411.82156484616
9678.653277473832
59823.68140851253
4133.74378177939
7069.996394407468
7540.420392389779
1765.7557261752652
51763.96569569624
37714.392468334816
360387.6512760585
99855.20906316844
12563.933959860666
153188.40894515868
3384.5023963388508
58724.70149855573
35985.595504564626
