0.11748822639068389
-0.06362339015893656
0.4791839497856366
0.02090045180597114
0.724928944611916
-0.30733487794440933
-0.8555792402038426
-0.7685610060466216
-0.24399486862987377
0.6241297957553668
0.18977060673943952
-0.7546642469281208
0.24620043599881847
-0.7700062039556919
-0.1527981619543709
-0.08626250143470154
-0.777927213543544
-1.1984766622357563
-1.0336263155884282
0.37820422063496417
-1.0138654574690227
-0.047237616809237964
-0.6462616062844044
-0.80154953874232
-1.4040244807667905
-1.232072626210217
-1.1204043172317952
0.7300397029727221
0.15024752502705596
0.4369830495945937
-0.8113697654793421
-0.8989858412217998
-1.1362073396796166
-0.6902317199353545
-0.8066600456734275
0.7129950513371258
0.3948238240731835
-0.5178577824126654
-0.7307190356844459
-0.5852118351400184
-0.5264186274460463
-0.43503377651454783
-0.5324912953323406
0.32982688014337375
-0.03228406890341449
0.6035390184480262
0.2348638267849192
0.6802852294418371
0.2967808335583165
0.7308320810838206
0.6684927285686457
-0.4973301089897367
-0.48256151232599936
-0.3906772973510158
0.03576519667841053
0.6174968465080053
-0.2061649592156994
0.6577633781466624
-0.6846070650269254
0.150528581588138
0.7511023065931274
-0.21786100151099355
-0.7048185375380893
-0.301150049149044
-0.25980262104177093
