20.570696083162463
19.61528269217537
67.58240667112804
17.256405912305894
20.027006192173452
13.06780873446214
22.12503049178164
12.18838353179015
27.565604663298146
25.78356820142661
25.825913892455247
23.375484236347198
29.678886973513052
38.38364430636445
49.739570344667776
30.506366262908088
28.862457788759155
16.74448251477929
25.107174837308317
18.592423437125564
25.20492017945325
21.211249786961673
19.51465491669262
21.032530354686642
30.75497016334109
33.2548857589089
44.0155329880231
71.7564373505558
29.54186182565355
27.641466701235323
21.57549863912924
43.079397702311226
23.261113554558797
25.542978600377392
37.207409802159745
35.00789231449902
36.24818484602412
23.36872943298791
64.5278134264274
33.018052901064685
24.32517041229772
64.01597597850967
27.51673899419136
9.463495228448847
21.05143669811353
33.31233836841805
25.90569680441057
39.9565827080361
47.948786118173345
42.10114504269689
29.172782753416485
44.78408268587528
31.451552194763288
33.477296190272654
29.57372417866303
44.11558431984459
16.805514902203686
49.48434205455646
29.61820222548748
25.056381960943888
22.80484041635345
34.80266924042973
73.50459097795265
41.025289881902935
63.48353620533668
14.901654519483236
27.301110762367717
32.16293745810634
38.708376210777494
38.745919912714356
31.41131453609076
11.684819557909956
24.193102431971717
12.665579940253307
15.715276315166495
16.01954366969411
21.988917072969986
25.48564003361095
36.59546009821893
25.17194875103895
25.243942071961406
25.243942071961406
25.03204559860707
14.436418173903945
59.74341480412902
43.494141695924256
12.380630789723986
46.81484114723864
45.14540257275653
25.563758305894808
28.5966106243591
31.163569684986452
32.20855017850331
16.403897540338836
24.135565183583445
20.46013886359429
17.106268075923293
36.138059069458855
26.151733372553
37.29407171529948
51.500377997726964
15.628572995199404
20.110916808046472
26.848662358521608
21.58295222096236
24.21684887756185
32.71431680834721
20.8924840633562
80.28068503752911
25.912498985653663
24.373669646942897
21.827162331185583
17.085957239916414
16.193752511964732
18.70362732857732
17.8133513968094
28.282093889236908
18.59897856788365
23.77406366561894
20.904305843870002
35.79459394480557
19.720280207032552
28.076210676065678
14.61070978613683
23.212256830424643
64.15732787075228
26.326669073407693
38.62753139109871
25.41016447137132
37.13756257970265
28.85700942530636
19.375277199066183
18.846579908266076
21.460723285969838
