4.812524107560523
4.549550957950369
5.723710556360572
5.540224523137509
5.062161469893902
4.376299101644421
5.407116336318816
4.874423741310895
5.272464886234924
4.731061262449987
5.455915047804968
5.643741086578621
4.8953591057144115
5.393484591933103
5.7247929581162245
4.898695051763794
4.729273019159648
4.662315513318801
4.488517984716767
5.449460408158454
4.826746614690522
4.628824312172461
4.806671658931863
5.3003836242023725
5.004614686205644
4.5808515692647696
5.066412640277017
5.37197388133745
5.082739745659153
4.919894264719117
3.3893024066092985
5.011254754379535
4.897666032774126
4.960471904542883
5.0862078577229815
4.790962089367584
4.707013205276534
4.60071366294585
4.3884591585580015
4.221854938558661
5.450634539929752
5.280443532236446
4.9306737775339995
5.128668630126013
5.065360499069594
4.196441615206319
4.577683643202262
5.929559632121283
5.23751313702292
5.2341850489861645
4.352483136599479
5.284411757879533
4.681337098893108
4.477550463025303
4.008524660944152
4.4566941653297
4.8505030390341295
5.623533086642724
4.67157326918232
5.299457837657211
5.0675104720866315
5.167454776900414
4.466773856405228
4.761817911974768
5.400933851150133
