11.198257304003098
10.938869264361955
12.442607308234956
9.708674624858261
9.472024689215333
11.23923427261608
11.990781316958548
10.926754787507488
10.776219273069
12.69461516280481
11.41340023874588
12.093526115577802
10.230920711519309
11.631584479507238
11.489904231326289
9.585200994059937
12.348764662382049
12.373823741680846
10.469756147393332
10.71266898741709
13.225257838921204
11.86935640897534
13.362581076088961
12.578575714174203
14.132085753685015
12.918101851657852
13.272454586375021
15.044810470601416
14.06005075138115
13.861712696533907
10.768107103390388
13.593685227950166
14.055096416743357
13.105701671525441
13.184150832646015
10.333265341127838
8.26831923560864
11.341157019536006
13.152109115920993
11.90585632219817
11.809750410872576
9.224187201891672
14.206953192362153
12.634561426456305
13.011331484803298
9.875529056464297
11.943929232335796
10.077890305443287
11.155298679522717
10.975909008020851
9.162307136234682
14.026197719123662
12.4233478088376
12.02534683707684
10.206664561857714
9.525847507431054
10.614392298451753
10.98131694377307
12.049688978771666
11.41042065719502
9.242533557387397
13.336768770324996
10.36381942333827
13.003279451568254
11.10489971577478
