158.7316691940079
159.20853995241166
182.3742539599532
84.97437589657281
52.15188826897818
20.860079682165814
11.308765436392012
65.10371312625274
90.49006608489547
256.9346857341804
129.04503161438882
267.5785875581992
189.7807135078359
828.0996797765804
116.55521973268364
442.1113414299022
423.40877645199714
105.83215646118934
47.31674874041926
85.35081003672578
133.25441172168186
147.73155952819187
78.79401953481289
55.473436449397
43.271786102792724
186.78018346320908
279.1425096914601
268.92764087446733
148.5038450375875
197.0799770133918
85.06458448675987
394.8799859253688
150.77493286323323
283.9538717179882
338.7231699043854
171.8188838806123
46.3852657781829
23.60283331242416
259.06497437245264
125.77662311658564
147.09623553228462
282.71639404114035
100.66940491739088
14.790663882444436
123.10952600818999
104.31170539818399
70.82277596980425
205.7341542530497
77.86194089453225
76.8497519839634
84.69855928544273
126.24709345273581
237.479419679723
137.94600053458652
71.14375325526095
99.8556721926627
22.99181339530344
207.96490796721702
110.94790231247957
225.89399928546112
161.23705096049258
225.17550454316762
133.99901169710932
71.08585383056419
129.66131444888435
21.907783214876837
50.892089408011685
115.86624338087013
146.8817768059911
181.17844275065426
69.56120875899863
27.21507604908618
20.64033651619833
30.933760928751674
33.02080120232173
46.85474722769777
75.2897839986176
509.9275427442891
173.9887771493739
68.75655671958683
56.09797451568814
189.02379604282748
47.00879473622364
61.32680872660366
199.0910770932969
185.3385583895709
191.90767790262169
68.87733565011557
78.99093512066945
104.30935162288534
88.10506472509655
97.78669764400816
70.88777438870149
20.39163425317229
144.80093086797189
310.4368402206654
180.1108638847472
134.09183763975352
62.99945660273493
53.14314684498827
57.94857291889132
55.572981335548526
70.12566796190869
37.386432783256176
44.27187800630585
120.16741051079805
136.43797040576806
26.064721630667357
129.73879862113822
122.47164024085586
128.1701180428677
113.41543556218537
97.0172906070824
60.352458849891654
67.89018618536775
113.33452107223928
219.43721399385362
82.54881202402522
137.68496041260963
109.06410035752545
136.21513169494818
130.49343266683672
165.9898970269587
557.6246468253969
177.35260385731164
508.6923547858325
110.133666062705
321.00514603007616
293.0092459719999
189.59693727059596
117.5947438181373
59.240163294361075
112.26194608316635
105.17167758317369
