17.87953393631552
16.635135845587584
23.9770365632844
14.210389380240366
15.103821640826967
20.363956808182984
25.122873298274797
24.769951813509266
18.690389084588634
18.984581293344842
18.416571772276807
21.763381647578445
20.92756219632947
21.390751728997976
20.755934693642228
19.356442318648163
26.94932080385014
23.877107591354523
20.72714180607819
19.857310369421377
26.628106006004344
23.00096851102402
25.817274755252786
26.322460895485893
29.17678070179054
26.74673341807596
25.551946893058997
25.803143360463544
20.5003174307275
28.233380885568955
17.037961488980407
27.004494571170635
25.73649008541335
26.565110478686442
25.41710609003244
20.90064447215026
16.965089505699755
19.331639928280772
23.04577848861778
27.165988712752522
21.42427849444646
12.985704256240908
24.63647229471355
22.108640686220202
22.586697053872754
17.016009694721863
18.075875876907045
18.179701733045313
21.245691777940724
18.006204472053273
17.834338296306008
27.964869174221402
22.19229193585663
18.23658069949787
17.899091565186566
12.652376926291135
20.018457185250735
19.15067736091457
22.63009481187115
18.447429117177165
15.443653823419208
29.0172300190791
16.618342681877355
20.39167970680624
19.691015992795702
