-5.085858126528705
-4.936654955694986
-7.311163684977238
-5.017923187250611
-5.287730738859353
-5.6029144050995905
-5.62998319917329
-5.264444802846767
-5.848778615723467
-5.427768234663312
-5.928512601344323
-5.445513703720187
-5.9400733587877195
-4.834772023421919
-6.722669603978128
-5.216086228336881
-5.380524276038654
-5.246220390938364
-3.592003165523167
-5.999479638270237
-5.967931790987086
-6.151255082234165
-6.159308430065811
-5.954847207788589
-5.4952008826723375
-4.812030270531392
-5.783078532637828
-7.257349924054597
-6.340288622785198
-6.901172502417798
-4.120059789665198
-5.566226950325045
-6.267303583558469
-5.872115016473066
-5.913251119093837
-5.540400258309292
-4.358282488703758
-5.318794491566125
-5.847602551288311
-4.6550123296496295
-5.43653169628532
-3.839156990132817
-6.425025539953343
-6.094069677415673
-6.421130712573587
-5.24106507596457
-6.157710617394693
-4.908958689440961
-6.185381912353856
-5.513361974416751
-4.7392114221421355
-7.560127110096016
-5.210885512044809
-4.794882763310413
-4.126188130995735
-4.49123446131945
-5.355362411361061
-6.455255504640304
-4.22508161706878
-5.99718930129612
-5.4684754619954505
-6.126814780146636
-4.479661700846508
-5.715957972552137
-4.9104607387822705
