0.5760321167009892
0.6556757546212547
0.5379159493991793
0.37849034953700816
0.5504215522202929
0.9260511784253852
1.2260295633954374
0.8623320944986103
0.624182727878526
0.3111733841323178
0.8744091261948657
0.7885085961967091
0.5423361480611532
0.3865061606360704
0.5738364553999836
0.3431651948246645
0.2389805250893103
0.4357243162155122
0.5253314026731071
0.24701621383000974
0.2083258107631956
0.2144447104879362
0.37255536821694135
0.5434012853970089
0.5753795598001955
0.3213708022693248
0.33295433040937905
0.3412153509297522
0.3912313696775478
0.3282159236824102
0.5388174836070225
0.3128634522920925
0.2742197165610116
0.20867062119815025
0.2073605825944677
0.2769878674594388
0.7304808854950058
1.0417288217482379
0.3629708666762119
0.21681898108148526
0.2565501793038902
0.33997185352952525
0.31013331655400805
0.5968213604119906
0.5724374897952219
0.6072890050931559
0.6030651959797201
0.5042264832094677
0.8632999551935171
0.9856839979763612
0.7223180939950512
0.594643018614727
0.35403052405752705
0.52088683635267
0.8374384276378136
0.7805057724185368
0.8587751056389575
0.5044067917547504
0.6503145547363862
0.39661875579536093
0.4559294784285878
0.3162337579725616
0.6003946212514781
0.3439848703996554
0.6555419915039978
0.7585625660162438
0.5634042924119727
0.4542433386046913
0.5413775357576495
0.5095727914291839
0.4863605915492501
0.8231096990866694
1.2087774418592256
0.47304947908407
0.3488079365660288
0.490244561194596
0.5545137738871706
0.3434479668617192
0.2744828071565316
0.5759155323784882
0.6121026768411223
0.4431469205878105
0.8224664807039849
0.6983857314711192
0.4911236659814471
0.4284466739163311
0.16966094792833072
0.5127091148475871
0.4412945843243304
1.0899385321586568
1.0474031999452205
0.8230640734852911
0.9728930309289284
1.5938834487634563
0.3454030456190517
0.24073569582005244
0.3648807820948537
0.5353770217319472
0.5998858049342728
0.9259686694610222
1.0068310366589404
0.40547263076421625
0.4773439633202726
0.5790593689536541
0.8111483310352708
0.5311162171075254
0.4801807883852688
0.8019937795338652
0.4451113574485156
0.2673258208686558
0.31292127693717914
0.3547269054008589
0.7332061458377417
0.7445318800181797
0.4610705712057012
0.4975423217169838
0.4524731878390374
0.7217129445500258
0.44272166841982497
0.2959195532586803
0.5752121034257717
0.3970229268278779
0.4826624110039882
0.15279264551236707
0.3880472806124649
0.4320838031792053
0.33889736428964423
1.1395422511664208
0.9406845900773676
1.207455816500545
1.4137953997848245
0.462556630313214
0.5016686307620548
0.3985504337069651
