-8.453779399714916
-7.174396714403898
-6.300331354441362
-7.032118062244322
-6.456179862698436
-8.396121753093961
-9.115795716143467
-8.357467954901347
-8.275818590431337
-9.106269488618333
-8.44732884117093
-7.76784268862557
-8.109865951505773
-4.918301620278786
-7.847787679403228
-5.971753589336287
-5.701575285425897
-6.077693699967644
-4.795443196253481
-9.463861580220108
-6.640104416946965
-7.630301458975788
-9.556970169420442
-6.7719699772620245
-8.16818322530239
-6.4286948525892145
-7.516842405921702
-8.713133794652316
-7.4980007258388595
-8.505498452861726
-5.383033337267815
-7.350846720124085
-7.124066742780345
-7.584267278794932
-6.8367773830209755
-7.864185632808492
-4.370654628240573
-7.796509813531189
-6.606632707495166
-5.768282178782817
-6.494280626580067
-6.022847593056105
-7.459228127442385
-7.87705779186062
-7.904148887386535
-7.309787248252816
-9.249303812960287
-7.630590915509716
-8.304538104209884
-8.85275543457901
-6.002639515120223
-9.046265875603405
-7.567647548365908
-6.315969364910455
-5.941223622858191
-6.15152743865808
-9.027469630298354
-9.799783063479218
-7.309167129673047
-8.033962791973686
-7.548185870937154
-11.274062775635656
-6.2862640565069015
-7.636156100556769
-8.476824613741021
