6.1138944788043235
28.825170870534805
80.9174388690788
34.24267710855085
61.55151812241945
18.185639276613696
37.840684147353116
26.570757193097364
42.501595860510136
2.359328823139289
19.763008762150086
41.83590046873621
90.36803429519928
34.628710108154046
100.35609924158123
72.2287107553648
38.19560772224485
38.67097949243869
-14.170016651127705
22.105097199667455
98.52678677009884
78.85719914630424
32.33050046515767
53.79289478565858
-6.351867374299072
32.242898855686235
60.525704199320096
97.21954319067022
118.84950103260977
91.73069731904462
52.96165553013192
46.721151416752065
33.72992223901072
44.39481502911001
29.047037302848143
57.063661245209786
23.11856201851965
14.888656193999653
42.273040513004815
12.970107226633408
30.389823488607426
-9.693455938533166
49.143676549846155
21.96136075852255
23.63822812441416
1.803383756050724
5.261582335030374
72.10601697886827
20.898669064089056
106.8842946640708
17.260698608848493
91.89875852037056
59.73894065279749
55.105160443921385
-5.671016922515367
2.991760443763185
-7.69074047816543
95.05663093109463
13.008996057114686
37.75679981634533
24.04381944720973
4.6666457157448615
22.572127188289073
-1.6041596624833605
56.22444497143834
