31.15471570062141
30.675446853420674
30.171291314433557
20.944615011283947
16.02713550343607
9.203541899078838
4.68536419686317
15.587941529492454
18.28873647111534
42.22075427752397
18.648417485917626
15.080206279072465
23.46434889316379
505.5725339638356
38.77353396809712
222.19898078814742
207.49962880229825
23.7468081867828
11.75739384052181
33.86313884029301
56.144003738826726
35.65855778624505
16.23228761303539
14.567907219916256
13.041915552575045
25.819155529280483
42.778582044158114
58.0263085294631
35.56702405630821
25.391919086768066
21.399540044160304
52.026722431939056
17.714393952463926
75.99329558208345
79.57262936638432
62.26111018397933
17.448242004065982
7.1239214121853145
30.953603796971546
28.91596491603513
36.25983334195953
32.37588426851754
38.01097489594172
5.463664004811387
35.82992110538371
33.7087425666026
29.2461508105659
43.27285035262757
30.395913774370772
24.19259427142173
18.458639378023648
25.295975474047502
72.32831616626491
21.63520087737939
17.786531158451336
23.435504721977487
4.730521951610318
52.426289244979884
31.63148000207887
72.80812166696036
49.23389582920218
49.84770996489333
22.961069352585355
18.838662521535397
27.219707122852824
4.891174143590606
14.284331329863164
16.798438866033013
16.70768282264093
15.83092834357278
18.92683229000273
9.632678185376772
5.854191729737687
13.423391003460207
13.66800790822009
11.510621875015365
23.901119606045732
93.89028888888888
25.788593493348014
26.276589725533032
16.60780717811614
27.497033161718697
11.874347511971484
11.244702216066482
32.25712965342936
34.276324126096185
55.018417988750016
17.31121822481426
18.505538213225922
12.045558865087768
20.555851782399376
27.2691990647578
15.575416212152124
5.8935362922608565
49.83247317580658
50.54605480062375
39.013695698067174
64.83624314376843
12.844446853374887
19.61634235683037
19.15259435800287
10.994543018658302
15.837144863049312
9.783324746746606
12.470028692782662
26.754837416383733
30.020760490347385
6.276296341021617
33.15650737475014
40.13146862477858
21.410418398506856
29.751695126599248
37.66032811077969
17.999140014275767
12.27613412866829
36.42793841274863
26.41893971107732
19.83553517313432
40.34690681950583
26.769784335127397
39.46609199153568
34.59117840684661
40.94146074365607
114.62570153061226
54.96417742960777
63.99755479333227
34.22217194613885
60.36853234171927
35.45916570549789
44.24866781258605
31.472094680154548
27.11539365127624
36.26725007351397
27.08582621334377
