430.7840909090909
248.15489749430526
227.9415126747216
185.99588477366254
161.4105488239487
413.61241970021416
649.611848825332
480.76063303659737
322.74147727272725
808.5492244381134
464.49879766403296
464.0369487485102
257.35766607729227
107.18411097099623
344.75279817065837
198.45901639344262
110.721635883905
128.82977495672242
148.82872928176795
499.39733897792564
294.9850221610882
213.73059866962302
588.9510964148973
351.67759078830824
534.0485945688423
375.27608142493636
337.6686431810254
378.41511500547637
213.98103448275864
381.12078027087125
113.48267326732672
223.8249758919961
248.22589035614246
214.8140243902439
185.64234293193718
276.65758547008545
62.47563805104409
367.6013555144794
195.73958056809133
203.2462203023758
623.5588732394366
118.5816513761468
256.8213215859031
228.3066010970305
277.0347233759761
220.89868766404203
680.7851681957187
504.3499458288191
403.26927292656194
396.18
160.6347087378641
475.60070913162485
240.7606153846154
154.5083426028921
166.19030303030303
140.54907539118065
560.6173969914977
540.5782392026578
912.5676959619952
645.7724247226623
249.28723972237046
1033.8155208646053
151.69059405940598
376.12790697674416
506.71838469713066
