21.552531615409002
18.128396778555256
23.55404313219264
16.054447130301035
15.672377618745065
19.180942566700384
22.96661477362128
19.595770528706772
17.87051228356613
23.676061718139167
20.22598065974962
23.010790340519502
17.341235340649057
19.98034012236248
18.986666113788708
16.282388317362074
21.975305113189208
22.357515079923527
17.436744932911168
20.154139208161034
23.683933785769927
23.40748403578767
28.160692708730686
24.822759367257174
27.661711034715513
25.13392611176214
24.501796283123475
27.590453171463423
23.272898094773335
27.437896243650833
19.819197839016976
24.743180318059814
26.028724601553407
25.194787644745947
24.197116474170155
18.24743942540645
11.47756104415424
19.602431667311947
23.951862069290637
23.994040907689858
21.406032367773378
15.29073276716795
25.40463774116831
23.417420331705692
24.96196192807665
15.34783658827657
21.078054207884506
18.882629113604988
20.305883539043325
18.92665250685693
14.45509859190358
29.629899035778806
25.166311604742763
21.93449495291574
17.268169701134994
14.6035412667953
20.55317125297398
20.304099345513748
22.69953886898483
20.812362404506246
15.29503293382475
28.558527060178097
17.18379091995012
22.688228322926335
21.597146891553503
