36.514605382641065
36.51014213222985
119.89136986045577
29.296875
38.817491195087094
38.817491195087094
40.351757055738624
44.94398640599763
47.539056722472935
41.43151425587962
45.50408732741464
34.27275832933464
47.27090685880593
42.41016344581776
76.88325359418356
36.514605382641065
50.46071085957967
56.60887593473947
21.845997794307912
45.58598787620396
105.72240793257832
62.743449807724275
65.06403846644089
68.15655805753399
72.15978577592605
40.547832546797906
56.234392365932294
137.62428354185957
80.77811898928006
108.21979289773708
33.381235518860365
54.765213198344775
75.92473137650687
65.35373635150893
73.97797303099358
42.17579427444922
25.683415517442413
38.817491195087094
60.5151410033011
40.240674757106476
36.75080901831927
23.769528361236468
71.0090370337051
67.09147207358025
74.61583997268342
35.979873965404686
45.017092701038635
35.65429254185471
49.66167027135339
39.44157492597883
33.06040650862637
134.29207311259628
63.2005291494116
43.385560786575354
31.6002645747058
28.645599549235417
34.585065046102834
69.78984140618874
25.03592663914528
68.44299394686175
35.59210056572475
91.00817465482928
38.00750417398065
82.66230815759626
38.00750417398065
