-4.283124878809715
-3.88330885568571
-5.523930209254998
-4.992001573860504
-4.917550327253529
-3.4301027659541696
-4.912017098166322
-3.7105972918187797
-3.7811651071016987
-4.3653726488643505
-4.799435323461025
-5.503548340576161
-4.503147382262615
-4.962866178838166
-5.1769419507999626
-4.668507175589385
-3.550860331505214
-3.8855868350232425
-3.697225803523483
-5.099398103237573
-3.802749637048114
-3.865125144638975
-4.078744896489317
-4.811057290506953
-4.730173794218793
-4.266643036863929
-4.4139889895705355
-4.85525709158932
-5.193396072413359
-4.38410469466236
-3.27197525989257
-4.212650662446197
-3.9423584060141645
-4.292669558787286
-4.202797386608121
-4.606452145624304
-3.8646997072646547
-3.731559575819692
-3.21392532374292
-3.2526289286559797
-5.1562829285445595
-2.348953747525947
-4.118548730030957
-4.898209569380664
-4.706550128502561
-3.547140672585251
-3.317308068976616
-5.680506160071975
-4.16041029272271
-5.181979842181406
-3.3553187008814485
-4.552903991853561
-4.199971656558982
-3.5306922454585012
-3.0954008738859384
-3.8425065625113044
-4.749640454307561
-5.498770802665157
-3.9784686373086218
-4.467067560815042
-4.768501928069733
-4.620074398070539
-3.8486595624484936
-3.866306492147436
-5.735431016661673
