1038.9197096864025
1574.7214794445258
26966.580095310732
820.2076186746592
1211.5695126468238
451.1288360959625
691.7113266697028
497.2888324759919
1847.735554999107
1527.8998095945678
2431.592281247339
1699.3696406755043
2412.778972178354
14635.3311308416
11348.079953498758
2809.8119150239745
2527.922291860816
433.4279652717455
1411.6765478049772
885.2609759147971
1501.3334898435098
1273.688904228609
1034.0325153124465
1737.3024619861985
2880.2576232444308
3092.2589137547966
6530.2602159430335
24906.197454153837
3250.5035342018123
1160.7883607229608
2272.312463736604
5696.617956008918
705.5702151082364
2594.9951115348395
10174.341654634238
6196.905782896743
4082.29259740488
992.5125415086363
13123.345372048283
1785.1885433022512
1746.2880717858566
17545.614749488617
1587.6116177056033
118.76179067762821
2301.022471589714
1826.8844718920604
2673.677851158638
6254.271896474174
5070.323378287735
6277.418546744165
1517.8006010085862
7635.308701240239
2476.744405796901
2368.650704779159
2271.202787540059
4569.3741808313425
411.67197330147536
5618.84874316582
2912.51766995896
1923.9539167715507
1038.9313075270359
1395.1522377269832
25939.66530069617
4108.879576484142
17271.821411978097
763.8907085907417
2294.979220309908
2349.246445145985
5450.001457569982
2887.213319283533
2271.193258541778
952.2108481049002
2713.4898717346564
323.8252097985708
218.1464896573624
705.0128036849406
550.036723846431
1052.9084530419161
1435.4725931096414
935.9106306458814
5510.953067263704
1369.610339844008
2361.8659247732035
1179.1850582234508
14096.68279970215
4762.849284275986
244.6580577178861
3867.4144579661133
4136.165100853891
1527.383296351515
3534.182235905565
1968.3549295132932
2604.480815947959
592.7158857257996
1488.2300106396838
578.99333234327
488.16669774749846
4106.6046243724595
1749.7547970232763
5168.799179746538
10826.98491542495
247.4955974276867
951.2383337395137
1688.6587264598736
648.3351942759218
1430.0610770450528
4036.960181951283
640.3810558669641
21656.826154989034
1409.5475728817014
797.0090718426405
763.0819280653187
938.6958277287836
278.19293441181253
833.8520137166755
1132.3789347890354
2428.9394244597474
1217.1686942608753
1827.431175449199
709.5182333627757
7757.250325932445
1232.9173184850138
2558.3228669774626
261.13155657339536
1937.9117542822821
22244.329234885045
886.5103690571977
5169.792040870946
824.5722813314065
3679.8234820239372
2695.235694248613
1257.051938139369
1373.0731193208364
1368.6614301125614
