8.322060391484502
8.088467299817607
7.751706320600387
6.981877236590738
6.914460129669024
8.653533361378436
9.168673419467089
8.933255725888223
8.11737908200901
8.827740664938265
8.895465783429653
8.63611972720722
8.147838842643466
7.053459851397403
8.742506139795136
8.024866203029715
7.264981265321492
7.292400514311604
7.288003586151878
8.49845333037082
8.663819360513411
7.030954794042065
8.618459436637734
8.612979346563758
9.426057953727916
8.447078319481202
8.896589068767648
8.183301616938255
6.791558896089952
7.6850811858850525
6.123707197019969
7.804616167475428
8.207632039786175
7.39464610678558
7.975339684262946
7.907098828292849
6.934207506583992
8.56241637074131
7.660887976086483
7.712592284228769
9.118257135467372
6.310013826433115
8.110014418252133
7.296332525715475
7.544527695168678
8.279407254761539
9.030386005844672
8.754943186062688
8.617124827403972
7.555497168579486
7.797880919977508
8.740686895198008
7.265409454031332
6.529931311977942
7.593054913263257
7.063677134864439
8.505365657639853
8.714894089414132
8.704454963164805
9.224353033219725
7.8903724630113885
9.029403202776873
7.349966134161294
8.138990613144616
8.440578050234109
