34.27275832933464
32.53917058993152
141.36477313840481
32.47385610866696
27.642842188225945
28.907401001155424
35.1934187198602
23.769528361236468
40.06233241482109
36.69173395267797
48.45889286276928
44.142838889447596
43.807657493896414
53.64519684151638
74.4515593068912
44.950754982927215
43.773584777159435
23.769528361236468
39.01644961364503
44.94398640599763
39.01644961364503
38.00750417398065
36.75080901831927
36.75080901831927
51.11741854315049
51.366831034884825
75.92473137650687
125.9295588789164
56.251793726825746
42.56714594687434
39.55078125
83.86629426122481
30.84199372057773
45.4153204388828
75.92473137650687
54.19921875
66.91116877955646
34.628180072053155
96.56480706184124
55.48533106597613
53.416443219761454
120.83514952949909
43.385560786575354
22.475377491463608
49.965056759425934
47.27090685880593
47.35275430694715
54.361663796490404
65.02741602274172
85.71046225784869
49.58131588376437
63.13700574259621
47.539056722472935
59.49757906051725
67.20543410718479
71.30858508370942
38.00750417398065
68.84765625
73.78101268376305
44.301632687898504
35.82789182524701
59.49757906051725
132.4580159015018
76.81529942153274
111.73182076346096
27.18083189824521
59.49757906051725
72.39858640270782
82.00344404105675
60.70680691858204
57.81480200231085
15.784251435649047
35.59210056572475
20.731790664702338
31.6002645747058
23.180360255235467
42.17579427444922
48.73009299704831
77.93301811883299
38.00750417398065
38.46074071907815
38.46074071907815
40.351757055738624
28.1180007024144
100.03516723246649
81.05077136623994
22.33377761778477
66.91116877955646
73.50161803663853
37.47167896215972
49.306296302830724
43.807657493896414
42.668375000926936
30.94845947967425
35.65429254185471
29.748789530258627
26.626875117362623
55.682943754975156
39.44157492597883
48.997351905734796
72.55014524333569
26.01096640909669
50.963375329740465
40.18147994494984
28.907401001155424
33.545736036790125
55.682943754975156
28.645599549235417
115.99884986307262
59.636988300342225
38.00750417398065
36.75080901831927
29.748789530258627
23.95427193978225
32.305383957501604
26.09870865356731
41.788533046047746
27.615840722554086
36.75080901831927
31.568502871298094
71.92577011231788
28.907401001155424
58.59375
21.692780393287677
38.6259228247365
117.35186448568511
39.01644961364503
81.90842739618205
41.36557572550562
66.77300846010667
42.41016344581776
27.615840722554086
34.07827902876699
30.84199372057773
