0.02261422718684173
0.028540097406114358
0.03991491972051067
0.038993320268052384
0.047978891533677306
0.044403757983001335
0.037259611278037286
0.028585739864571105
0.02983378970285868
0.02824815489463545
0.043452848614527716
0.04339725815767364
0.043385227223430176
0.03194282612706165
0.03694108881633409
0.025584443943041886
0.027425122760261676
0.04003305203405743
0.030201249576410474
0.025888518365032625
0.024582882112893948
0.02213717406528998
0.03613489658323928
0.03961146494010697
0.034620309622184195
0.03150451261501454
0.02409435997094534
0.025903092591722656
0.024947989457600957
0.029040021801701094
0.0423460062167451
0.028517005412224343
0.031102128805917593
0.030450751299560506
0.03062090142208257
0.03310647120999435
0.034477577536335124
0.04583822633915029
0.027789384006377205
0.030306702406657636
0.039023966896151126
0.031064581692457
0.03215790977401148
0.024586042944550617
0.03305987122431205
0.03831808399019074
0.035692522385284656
0.02630833763170931
0.04292679755812322
0.039185097834887925
0.05485883944993431
0.04382546956527435
0.04538966396363572
0.04380192444227792
0.051307245165899365
0.049835796357518385
0.053807258773668036
0.04096335298886389
0.04121218684285631
0.032087575029596575
0.04302167762526174
0.042563128194597837
0.03708329890507892
0.038727485412237916
0.03969771149976576
0.07031892924717413
0.03238603880292363
0.03148969762146387
0.03755646331590325
0.041293748536506684
0.03633022455070286
0.04923260534711642
0.04054091018871113
0.04339186157230472
0.03196788007535624
0.04352454428106094
0.03189738820459249
0.031837133887183434
0.036571182320196384
0.043297323806399605
0.034692788869154605
0.034692788869154605
0.052792827126123335
0.04366900808257861
0.0411985890385481
0.04262116926154855
0.051026481854903015
0.04191491618149615
0.036846671587352865
0.04134479067542856
0.032875456080631346
0.041907361302470574
0.04689784326131559
0.043106537295620084
0.037676189847231215
0.03792738870738814
0.03281461955528185
0.03798654839859834
0.04179836476265846
0.032473561340182214
0.04611054505298657
0.04595652530359872
0.04064112602793998
0.03656990048136157
0.044569488704398634
0.04029485706986344
0.04251041237900554
0.036446912810659766
0.03879733477132807
0.03408256027295038
0.04084045618520783
0.03828841577601761
0.03335275912566178
0.03969772517178075
0.040410561474563116
0.031740425706160286
0.033439553432043585
0.03601274994014387
0.026999653705371215
0.0372195273987221
0.035754893998019024
0.04323646019939306
0.0318385973251344
0.033651787463684885
0.039483771032702425
0.03173668158722506
0.048331125275562235
0.03084835819597748
0.039932224040661705
0.03876161622133
0.04435783402058625
0.03680556166800415
0.03221624185810017
0.033501285887056934
