1.9427842658637746
1.9820776522030241
2.280356122093764
1.930116538032998
1.952076305960185
1.9412652024109094
1.9324325847444384
1.8818902979383907
1.9941995162544095
2.0065284886703516
2.0730993470181125
2.05294981138141
2.029615511595014
2.16903790418199
2.142441301143889
2.005966978736788
2.0372385033873153
1.8882034081892436
1.989215891179416
2.034011849249866
1.9254509437371017
2.051170095495085
2.0004454632200703
1.9932604648513519
2.0560031479737066
2.024464967917496
2.2009496419402743
2.236483576214301
2.154820310448665
1.9936510650046066
2.1291364773245047
2.1828666182209315
1.9990139725732698
2.0515836619309007
2.173037681145204
2.139352889982915
2.132289723979961
1.9452991182441595
2.2509753416509515
2.0720797493104346
2.079471376791195
2.23323850861131
2.0790227079643047
1.8054093799031565
2.0337542501848533
2.074355389023223
2.057087512222053
2.1031073526471458
2.1306826099972027
2.200623397258716
2.13076707207804
2.1592548142311605
2.07610162856358
2.028623004722099
2.1479338119667966
2.1245960180937336
2.030045463476213
2.141813007416621
2.158497256381865
2.1375896087832147
1.993593216364023
2.0566752210635744
2.3032758939926024
2.2038520442884018
2.235276717870375
2.0151020685402283
2.1054706938186354
2.0954449206538377
2.1548739027512105
2.1099133499687914
2.1406204314267003
2.0469542534797665
2.05807853612321
1.7620916996070113
1.8301674238058379
1.8775879968727949
1.8950751211232357
1.9476626272685604
2.0166573601179225
1.9916892500552
2.1113827068375337
1.9989778900401385
2.0679594334182703
2.027483912469669
2.2501614037673425
2.140486670012824
1.9223850090800867
2.1260797578015134
2.143492820109166
1.9796826182012317
2.108251183567136
1.997908871000545
2.0123804916414225
1.9008110886310827
1.9918122723435339
1.8959925783264024
1.8971118992419562
2.086976477854597
2.0052168926724576
2.1180067855437925
2.1576945075973972
1.8703311504809228
1.9903844364469299
2.024816242720562
1.9278073144004384
1.9577132983953232
2.086191746837411
1.9636145517477535
2.2347204667347533
2.1073551190948447
2.014781812079996
1.984531976839489
1.9334649867430045
1.8318579005148041
1.9868620936608044
1.9643073697875255
2.0293922085671103
1.9866022450904177
1.9731792401508996
1.8954114365598442
2.1509579668504055
1.9262805219274184
2.081648055066496
1.8078511529110686
2.078850133142957
2.245758048518854
1.9829461322378987
2.162243882927835
2.0100015645265406
2.180351843292549
2.195935812476391
1.9417403596241816
1.9952520136907494
1.991075330395715
