1.0791866562802126
1.0938215604883994
1.147086738018587
1.1054345864395736
1.1353751116716864
1.1239184453261866
1.14041278023285
1.0699026033244543
1.1150569419046341
1.090291859600172
1.1412958489439171
1.1431428760008366
1.1362954572982729
1.1203474774194997
1.1314277553262242
1.1299467311041522
1.0929989034478953
1.1017003161896202
1.1033632569070375
1.095270281263112
1.0878580194293652
1.0778325639787565
1.0894002771503362
1.1262967100604255
1.120533983497936
1.1000856793316252
1.1121543666400826
1.116094309860525
1.1048989371146214
1.0805328567050032
1.1012092292616842
1.1055781497109884
1.07915821661403
1.1021067931141375
1.1090888841982902
1.1192739035293522
1.1321246391377953
1.1708367627194478
1.1067678199755688
1.094471107541034
1.1061389033890436
1.1260225207790884
1.1059919340635995
1.0337439035382638
1.1263670945463733
1.1495121836416045
1.123006007461983
1.120096687208642
1.1473565355829862
1.1512599056907131
1.1532555229812036
1.1220564072664925
1.1340001931181782
1.1197187671463749
1.1569691277532324
1.1741296367083591
1.1535582885763425
1.1346896839017484
1.1362324936633557
1.1368179880664355
1.1388897633462505
1.1198077338804764
1.1599432567410437
1.1161192503664012
1.1614915891552793
1.1514669237827155
1.0997117039525857
1.100858859334919
1.1320352412616788
1.1305123177798997
1.1278501984853135
1.126962693118258
1.1622803690718728
1.111607617849932
1.117915191650757
1.109811443045867
1.1054189816240831
1.1064594458046708
1.1005224710576411
1.1186525206720068
1.1320951723853403
1.1320951723853403
1.155410175428385
1.1143166211008635
1.157340710709901
1.1336564404861376
1.1682929438477572
1.1357331024134465
1.1256617114473717
1.1362897073925575
1.107571246284544
1.1442003621985049
1.1485891094642964
1.1170966914692244
1.1343276026961966
1.1400940326172253
1.116629569401384
1.1496095258787162
1.1384769411873383
1.1751080795946174
1.2091858919643208
1.0852467894688351
1.1327675504524264
1.1221601342569951
1.1353908418623821
1.1327573749804078
1.142088580518387
1.1587043365657397
1.1424674526529326
1.0992721662040168
1.1043458287984529
1.0881862093337054
1.104433436031521
1.1030224589932027
1.1320546367967876
1.1028293083889842
1.113847179288055
1.1390037633274206
1.104086024891361
1.1110433230045456
1.146530929156101
1.1413571567633312
1.1350377817890602
1.1011914589267031
1.1303571496408058
1.121038945436122
1.1440291760528338
1.1283358104575003
1.089115764421642
1.1333190983198866
1.1347576358026183
1.1039457138846491
1.102396394197728
1.0855534255350394
