3.0860031536505557
4.118588938201976
4.851118512115173
4.340187654744505
3.9215867808675076
3.158703505113131
2.851228482968647
3.1625944133477404
4.056217115050859
4.988965992913518
4.195499233164846
4.604915924005264
5.342036515806753
6.233417879957375
4.997474528695422
5.110362770654857
5.537463851469344
4.061593803903288
4.169265627213689
6.172552833343333
5.079924041322259
5.972896565562509
4.174506908124116
4.824995031772618
4.624869773631548
4.714313142742951
6.456664053690373
6.320957270901487
4.823945870518122
5.289035776872782
5.4003223637294875
5.736774606239832
3.4245682347170416
5.822315294631157
5.866434955959936
5.327117614710515
4.005530472203985
3.9406401438783107
6.103379264695014
6.417000467633067
6.247340102078879
6.633897891721045
5.0792214459312355
3.2857975944254996
3.4736033649360194
3.8116207262688464
3.2949079392470684
5.654075169990496
5.044517755276163
4.602564693432648
4.6584480656053815
4.87302165898315
5.4548973884862315
4.416876859382869
3.5516897145915087
4.650554482107275
3.9549248920741054
4.786693682380518
4.216676192110771
4.94324987910968
3.974770668085144
4.62002438830326
5.984755339525023
4.687292648239261
4.962622396074813
3.3785358912255496
4.466128385585568
4.2394916902558615
3.92661588884737
4.968941081061175
4.059462454805859
3.4221332007222816
3.4144643850624976
3.2102838371520934
4.449017968907554
4.029184666992776
3.51547706634208
4.8245078284966745
4.84164564239628
4.843951786837954
4.5609167153209915
3.971914575094136
3.5225835960707035
3.6713411880657034
5.285943848917744
5.566702166629327
4.102617677334105
3.96079967930941
4.283599947745536
2.9989017154325555
3.639715359638896
4.606950622922742
3.329577507392738
1.319726260856625
4.079798786776548
4.127530748201262
4.647977327277434
5.458088616365795
4.2023165049354985
4.248114084395036
4.6987461777609445
3.1916648342394325
3.6450270589983713
4.549359644849158
3.165385515668005
4.108127872381537
4.809808021193951
2.590231338986003
5.29024037391077
5.898262950777187
5.000119649011754
5.309881217417865
3.390165769949744
1.7623414987575703
4.613372158147833
3.646969800081257
4.019661972655716
4.08545853601203
4.1542553422296224
3.4209795464469117
4.727286917877368
4.329841432423917
3.898157415513509
4.127973624065262
5.750715175031332
5.779345849524189
3.474350574439905
4.228629824743786
3.6626475281923665
4.19023809351956
3.1161523531770188
4.340268928678322
3.11649625733212
4.234408460674491
