1079.1169844974588
549.5827205775937
7035.441385495466
5573.4558615159885
2712.799287460629
388.524820124756
7293.536120958122
719.7514213117348
1071.059898974211
6959.594029941983
11945.648561974673
13868.348920066543
2121.73924373894
2391.035748647484
12318.724745392581
2119.494748273279
728.2070913693939
965.4521736432699
484.09317725814185
2999.0128466774386
1360.861590595294
1194.3452254662593
1542.284241804784
4437.208250884453
2692.7251483580185
2919.090172271912
2322.128652710438
16105.35766597647
8011.113370133569
4235.741918310151
345.8241476801153
1682.9148776324598
1007.1733590446913
960.61052074242
1738.5491828596466
1731.6342697625967
1039.4996861892744
382.8425954064792
491.1625508696195
349.21910099018487
4555.88509324336
144.99018393149478
1716.1651318298016
3103.0649561835503
2485.2872269388117
304.24785345654436
844.5758577795859
7948.197082267907
1924.6254868129354
6061.08586883896
303.01410429215474
9902.553468667084
1522.5448345828916
593.895675693026
167.6807389653927
705.5272364491324
1825.0672735899607
8082.816262015185
1141.500150866023
2878.762538851854
1804.5011379733905
1756.916282506577
645.3961991910581
1288.6048021728145
7304.370893310976
