-2.342663376720673
-2.506095566421054
-3.036837549451301
-2.5775718326449963
-2.101051297072269
-2.114446178068582
-1.5680255429507812
-2.216199150286542
-2.5548822772212287
-2.985444687478442
-2.805495459245879
-3.286052225845001
-2.909220579866588
-2.985141814425438
-2.553440019394259
-2.6044747633790886
-2.8182036580049146
-2.422961739833162
-2.6350640842324102
-2.66152814471369
-2.678612321401752
-3.007229185154027
-2.74075963462191
-2.8677300615752417
-2.6351290957089146
-3.212495361888926
-3.237848326132904
-3.0949754629300936
-2.8579291694160465
-3.0267590810141414
-2.4154235856152555
-3.281943282827991
-2.8574099671428512
-2.938228547753193
-2.9757735557107425
-2.30389928258237
-2.454937392540662
-1.980580223169525
-3.7076846026836185
-3.040609823383116
-3.1051178881963
-3.743487778230837
-2.7493112771671813
-2.0205602287847255
-2.6396626843232385
-2.4256981602656196
-2.0310015180913465
-2.704834012442032
-2.360471579367543
-2.4130000672733534
-2.5395472930487824
-2.9117821827118244
-2.8186503323516976
-2.8942829677509114
-2.3035393508006634
-2.858770203525079
-2.1162810390328235
-2.616222766583846
-2.2457758399022207
-2.431384338590237
-2.612672675655159
-2.6295767775753838
-3.186280737892768
-2.7214941520339866
-3.2354519507124193
-2.533024949915009
-2.1436961543756703
-2.767466825971704
-3.1720225224053378
-3.201816290133368
-2.4701743703022236
-2.251784998867951
-2.378993543199207
-1.7977362274882862
-2.242240438906611
-2.547030087114553
-1.6727334054046805
-2.896786330775328
-2.8870486027796507
-2.2184824779760017
-2.5584684605354138
-3.0302238314876737
-2.4134024006412833
-2.3860029762408095
-3.1948285475155065
-3.055545955710482
-2.1844688832826344
-2.466738269259296
-2.691075612244928
-2.3079720794057867
-2.3199476009317297
-2.1552312763561488
-2.5057590921419615
-1.8615155253869569
-2.2372855321387095
-3.119924846941325
-2.790619409025523
-2.836569244150019
-2.748830169579842
-2.226169268515503
-2.4041477326293896
-1.9189397161882178
-2.150732451072411
-2.6204841099077356
-2.1251520379164672
-2.688084427025051
-2.8169119068070865
-2.166776812664335
-2.9675186807659317
-2.6627526865180853
-3.0180147368626375
-2.778854526763546
-1.8912639587287048
-1.643230238049296
-2.9235448293752917
-2.576717215680834
-2.9508183118435767
-2.3799502320986528
-2.425010826145411
-2.117319014254533
-2.913015983871953
-2.7700273062121057
-2.355353770362067
-2.7399933543011588
-2.0642592414991547
-3.257515093367665
-1.6995066331146729
-2.3319213895806694
-2.332369583497944
-2.147237509090891
-1.923002875855221
-2.231694076304454
-2.5724177879338144
-2.450026851710741
