79.58557902403496
95.2958236658933
2346.675743364353
51.0
127.78159509202456
81.57522123893807
126.7747572815534
52.7588424437299
209.17474980754426
110.93824701195221
263.4592814371257
223.5944605208764
226.26966292134838
466.4061144082589
770.0258397932815
137.94307400379506
102.89598255995016
54.68603213844253
164.61751662971173
93.77588466579293
73.13483146067415
66.96877323420074
121.51134846461949
123.26682838083687
355.467349809122
221.02516150969055
339.77705710288694
1083.5395917776489
229.28171128346256
116.06068601583115
199.00597237775293
371.75237297599114
90.61252446183953
115.90563899121565
435.4976128137995
302.3306365258775
546.7767882792301
203.0495238095238
1052.6787386320832
133.4932054356515
107.90290864399836
1025.9361863283468
68.0307467057101
15.701030927835049
242.8184896715205
298.9582266009852
256.7545615067687
304.41873589164777
526.6539416511483
618.3735413056037
147.30903790087464
557.4176397233874
203.5820853348404
184.88147357180992
312.2234527687297
574.9540477472626
111.72093023255816
382.87510094212644
238.318447094646
94.66422167889161
61.825425246195174
64.46074646074646
2837.6370261626384
444.469
1708.007619047619
163.8505747126437
267.06216640502356
253.37019867549668
612.0771208226222
315.76149269875606
272.4763406940063
139.16220238095238
464.40637329286795
30.901960784313733
19.12244897959184
92.7002457002457
58.5134370579915
47.793880837359104
82.11898016997169
118.24699828473412
698.3336454066707
133.81703107019564
302.71410256410263
204.28655737704918
1597.8083333333334
413.4204107830552
21.732394366197184
460.6214605067064
400.0938173975557
190.51348700343303
263.5996924654024
160.11775700934578
281.23295454545456
148.23768736616702
100.98732325694785
53.608893956670464
38.87714285714286
500.29071584870286
218.2424628450106
827.1502596164037
942.5749888076407
25.8
143.47542087542087
342.9884823848238
98.36091003102379
87.34138486312399
385.4072715143429
138.44226579520694
1340.2619988915574
89.6571287617168
66.61248654467171
72.84045584045585
88.1637136782424
53.69026548672566
120.99240265906931
76.96419098143237
222.1158135544753
86.80813008130082
87.09915356711004
70.65930599369085
507.2303353502205
85.9887640449438
156.01721228484644
11.112956810631227
102.29642133693451
1147.7226835182598
80.17469446441409
375.0430474888965
118.69957686882934
370.01968503937013
215.2589974293059
92.46133333333331
109.6185303514377
142.81740775780509
