0.7698529044486505
0.7033915202783778
0.5492793530403712
0.7382235651838372
0.6350151231764075
0.7230768416977439
0.5002574251676852
0.7417003524604897
0.5842330445914198
0.7996680462787192
0.6959321043873292
0.6334378730821245
0.6120223667308684
0.9270309821164968
0.6759784707718473
0.922113897000278
0.9083598750024876
0.8671171081774209
0.7098870439890147
0.8381192837460287
0.8520560286877009
0.8420177488757058
0.6514516533653529
0.7264593660975281
0.6479260243958337
0.6587601288591677
0.6193499831531865
0.6750155974456769
0.6820393764829886
0.7569185603691762
0.6328397639262004
0.6533474555539874
0.7357688620847307
0.7967397892527217
0.6223779535295495
0.6459826198573231
0.6979541923227545
0.6163296262240388
0.6112776563612787
0.7029610310660523
0.7241570605171765
0.5720810649888262
0.8096596279760383
0.7478869818447369
0.7945425125935814
0.816858021735364
0.7105572311295705
0.6501158303672534
0.6906754481549833
0.7117773266555559
0.6490506331353457
0.5670117340732262
0.7977677174603113
0.6580414317063046
0.6641248493984173
0.6733987768135967
0.5997450220514133
0.6971121289847483
0.6940239070505844
0.8380594181614767
0.8726837054898492
0.8360263661907024
0.5930688255544057
0.4881872105024941
0.6724397648701973
0.4793566746094634
0.5342816311346986
0.5808560462119731
0.4869531150503513
0.5620236916678759
0.6275428259337174
0.6978773812441651
0.5811038164472095
0.8397846623556511
0.8820269762243521
0.6604277278770218
0.8399317705260907
0.9287403085701122
0.7126957609813991
0.7151308990585183
0.6108092987253927
0.7291870714696246
0.5015522874938444
0.6095105509282239
0.6593872456267671
0.6614491568456576
0.9891511817774096
0.5595001248386947
0.5732744894623282
0.530349375424914
0.5566682229777009
0.7471051251261086
0.6119001215922686
0.5216498466585178
0.8167752476740486
0.9090832824481772
0.8798474541908325
0.7910695293937829
0.5838291332180984
0.6034055008890115
0.7085090022020525
0.8321600417151205
0.6675169748520791
0.5156069271064708
0.6754838073879698
0.7841756317969192
0.6878804890956152
0.5444520069386896
0.6643222563584092
0.7871857531031906
0.7197242601805911
0.8397273406627738
0.8431625018738795
0.8198708943797609
0.6676866392929873
0.8152306660085704
0.6128853603591206
0.703464081523988
0.7939274967199312
0.8778825519379059
0.7702602434300297
0.7768225955560761
0.7492713372143991
0.994576927492352
0.7680162976316708
0.5596682006185753
0.8111780350265467
0.5851012489009312
0.7620576717321226
0.5892056734998126
0.5569594438715985
0.7685764718042811
0.8230519682627693
0.7004374883025511
