5.249888985382074
5.227483376589708
5.580325262133196
4.952085367432001
4.67506920347539
4.339554137277132
4.157481719778652
4.90964483401843
5.00302460455491
5.506060510746583
5.401703834346832
5.8831950936575375
5.509476766906213
6.235682504626722
5.128894309950092
5.692846084376639
5.70968930971317
4.8775080145538645
4.812095178044983
4.712540208943771
5.017752117033066
5.0250943424973356
4.85925080786783
4.91513920333957
4.767868785941983
5.500300319940533
5.581706956587676
5.632432668277531
5.248901108261644
5.390094495299966
4.957469603711511
5.830117866167766
5.165803588618684
5.473727593102042
5.638494377708887
5.259377352003037
4.837332778406575
4.562097789703829
5.731593159279545
5.0555249070982375
5.146073576044645
5.842516720143652
5.038657952439493
4.3591495887064
5.162416945171468
5.237500176799927
4.834673505337513
5.461152828412542
4.898476840759678
5.076610462316845
5.021461207513262
5.261356392889496
5.382506811117096
5.3488225382506736
5.02433770156902
5.214139318554272
4.432068600552528
5.452943287027943
5.07372603639375
5.334797461799076
5.21440184641971
5.340918529965694
5.46093626996072
4.748772028082007
5.452698009809113
4.424958495493388
4.629498218707939
5.222054594851785
5.431904037137105
5.5755204570686905
4.8320822040497395
4.707716175656124
4.72423953464637
4.369821551006538
4.25183686396784
4.651897356862087
4.66016227379453
5.7817264641484885
5.296085706347674
4.631263685861894
4.8761098230302915
5.54628614308116
4.62337480638725
4.751009424215085
5.618693580129239
5.41857280915886
5.042895129025519
4.901953735250129
4.892537034676701
5.167779834944419
4.969473610829066
5.055764358236402
5.036215101797671
4.226671370529738
5.20463190953446
5.661274794054969
5.271162614423772
5.210993063606159
4.938974768958973
4.705550898545307
4.951968049416516
4.478347275893051
4.821275774625578
4.66758930004012
4.693897640166189
5.189462550546994
5.300129033204493
4.442232536761144
5.373001275824749
5.012743974192971
5.165028409694443
5.073855536890607
4.953689865908575
4.728933587942673
4.964509548276255
5.214420936201688
5.564402633062328
5.110998941657736
5.265321568355767
4.845929689493904
5.489500629067998
5.315649323234337
5.177153613800598
5.771839562512064
5.139319680436133
5.958568392975295
4.8634798671822415
5.770290903185462
5.837424042787635
5.420448755841424
5.312823973511392
4.829201368808313
5.223716101974142
5.0555071564067005
