4.092782546400486
4.278521782944276
5.0574329500725055
5.405955821650911
4.341577978141076
3.3228849895024513
3.4636718661465835
3.3773254165974222
3.7535482879837114
5.369817890933902
4.906229061435687
4.766531345745483
5.616490081591014
7.0454391604125854
5.0122425423477335
5.914255365625026
6.838242956430777
4.331411809037936
4.2985559242162825
6.034130764098159
6.588402905378902
6.950547668956356
4.538227794558411
4.720670592551488
4.8461563965432735
5.11797215363538
6.364581127475481
6.521125228189709
5.665630185554991
4.797300431858886
4.7740269761838405
5.795852815754518
4.191300621434392
6.971305052978622
7.084383552122167
6.841588183340617
4.8236236779254815
3.5772495329823077
6.114558225286943
6.309358140203876
6.689842873679472
6.504469087824595
6.31079905500358
4.241374071036144
4.354249656464769
4.542884681910578
4.504368578571972
5.293378450835203
4.38216624535469
4.529466312590045
4.485394913435736
4.920159421669252
5.52032327786616
4.380535250226203
3.902068834058137
4.1763093448877004
3.4140470256089537
5.12717755071048
4.564796084796738
5.7775370997459925
5.217598914058548
5.576887471854984
4.878922104045127
4.889157519367282
4.922903439075961
3.343949398188545
4.377688447830623
4.635069217893883
4.455734794862703
4.677793549205148
4.4658050590511085
3.894560919823821
3.239723251586306
4.432374908847698
4.756899125911894
4.026973742995079
2.9899197451469166
4.851683725380076
5.255114739866229
3.983930267571469
4.51212985351164
4.55902698336731
3.8425378071717256
3.4356262446674015
4.728417925025665
4.999503782709036
5.353592524117811
4.567346686566138
4.664905291821841
2.9360791860094206
3.7670055137488574
4.512050923591501
3.795634442192172
2.3280727447341247
5.156618066252959
4.712329706355323
4.758290474267898
5.376576256675199
4.187984211099463
4.131920143157218
4.474943019832984
3.9492965236783655
3.947609011151167
3.886052877118869
3.4387837426155716
4.487432678376567
4.992774600695029
2.9008985247620034
5.770180753269321
6.056222973795315
4.978672894178743
5.25236464857375
4.241539719081336
2.8869442584419023
4.145429852311283
5.0935193286238825
4.5807580338787535
4.425760000394424
5.230616293616458
4.3325963541994925
5.014892627363507
4.717678841260364
4.511894176634722
5.265495700752002
5.7337926775524215
5.775304001869308
4.305717923268938
4.081202581329803
3.3178477351573643
3.580596864392232
3.5086246596038615
4.612981717521404
4.509730307633496
4.573010152452623
