0.007814333096177144
0.008072104814272694
0.004805345683239826
0.021059681832006263
0.011960079489190631
0.003864915220426152
0.0023900237958384358
0.003364095088588496
0.011291520904003564
0.003336059265558012
0.005071031434541211
0.006061640360020923
0.0033913630895009888
0.009814944631569318
0.0045310146625161685
0.009112663281357321
0.005114947035057601
0.013420037788244776
0.01507591414830896
0.0022832253007441174
0.00393354420616553
0.005301501305304232
0.002442402460403162
0.002512088798265822
0.003680659979010818
0.007744177325025053
0.003110247308161764
0.0027141921386945405
0.0060401205886313645
0.0016535696712037273
0.020821056384102303
0.005054170431346239
0.006488120847577424
0.004459602589553194
0.007046215796516105
0.004030150199047466
0.014663440290750797
0.0051598540802185065
0.01248800730043572
0.008875784000103373
0.005116732212141918
0.02199822038400852
0.0038252923022127493
0.0037080187306798773
0.003337942277983209
0.004196121120816503
0.003406768243708518
0.004607320849128824
0.0024597945152593195
0.004342169293998403
0.004740264270990343
0.002690148437277373
0.008909664614655248
0.02097343624596976
0.010379963033554984
0.0228021317565552
0.007655212613581731
0.0025260860621051607
0.004668892560235739
0.005373761742955185
0.007575109707340173
0.0021827415846534188
0.011172021523925263
0.00586231449539655
0.007571451518736616
