1.998688917927172
1.9947995303795467
2.3578624936027066
2.0087365039953617
1.9976397002709239
2.071635089041073
2.0780305435311166
2.1109590035906027
2.0800274669432506
2.0765566268131717
2.085134473826429
2.0218850929713015
2.098619772689513
2.046094506037875
2.180110266731049
2.0162425995286464
2.083573294703937
2.1730811904170704
1.7551495284101475
2.16595486416994
2.1962492083275977
2.1852548110660113
2.2239975659256976
2.1951960478497616
2.1790203276807114
2.057274013293209
2.1349920948710066
2.3584048263270057
2.186416455555711
2.327581539431731
1.9889260758289045
2.1290764300926077
2.2002950395860505
2.1615542912747627
2.1838709590278014
2.073552319121884
1.895201962113144
1.9976397002709239
2.1692182427688613
2.0250399257343075
2.0071155522306947
1.9944400991635565
2.209606929168908
2.1978994080004037
2.21184292739853
2.067304843854405
2.135874452713778
1.9600894419677908
2.1554157355022507
2.0568373305303456
1.9874154815181042
2.3254942456968606
2.032729064917768
2.032729064917768
1.9426968492386154
1.976325523398655
2.0207179779974713
2.143098605471273
1.889141866088559
2.18580312243023
2.0526082323073362
2.182679719723085
2.028668842478982
2.2359787183706263
1.9378432335116935
