0.3060103257920399
0.36531307690118975
0.08118618202006564
0.3029593541734128
0.30853269207599043
0.4398342789666409
0.2769201512366441
0.4568387065102676
0.23401256743848084
0.26354584137516723
0.24893782243271265
0.2897515734953116
0.2100987593504788
0.18583900477708168
0.13340240519533855
0.21457984349330367
0.21151096173777548
0.3597230944889339
0.2655711317016355
0.32698562590901664
0.3051148025740195
0.3216135611700809
0.33700159481836883
0.28852019247955274
0.19686831276344385
0.2324237028007422
0.16305544294091512
0.09788463164224563
0.2162396886326569
0.2242382319830328
0.2505061954108737
0.15325614484514394
0.2578564401725058
0.2364723597749041
0.19063474377893067
0.19096072708490366
0.16733870194273395
0.29426141899059616
0.1078372522637529
0.19746206186576296
0.2307150812586199
0.1009095934031202
0.21248883951226427
0.5577205582609511
0.2489682172804224
0.18941442939606712
0.24569317208448374
0.1901658577192806
0.1472620448399807
0.15441698427264844
0.22282721446652276
0.1929718968447878
0.1881331822775812
0.19286005638426576
0.19518389141338854
0.1436315722367049
0.320327567001708
0.1425951420953493
0.19631305576327898
0.24113221400526405
0.2796638902910579
0.18328903400885288
0.08307122789825427
0.15609567888860115
0.09967412363568852
0.31676761759787536
0.21183130541165232
0.1863664050618598
0.17410296792722094
0.19648628614352576
0.18276272563188214
0.5192263276974931
0.2589459454591859
0.498033499045284
0.3473600457702482
0.3880738648866007
0.26199306272349543
0.25034166123354057
0.17882252249600633
0.24520271480437386
0.2603276790642131
0.2603276790642131
0.2713180788794952
0.4062023897003774
0.10224788812460983
0.15379960375349747
0.3875714187166841
0.1388907467267315
0.14675418643128588
0.2504653534175317
0.21430792138626456
0.23381405946614764
0.26309980460527344
0.4358095858475153
0.2608756787015494
0.31507153331135196
0.4012326678509677
0.1926023069684492
0.24190810540964455
0.1871098770430907
0.14238349957496274
0.4386412977875639
0.26749370955834684
0.2414572964577931
0.3355776812224658
0.27323391762327004
0.18318827916775607
0.2909091627666302
0.08794443370272766
0.21425366635565996
0.2501802083655877
0.2776215541725852
0.3716502033201901
0.3876921388358595
0.33332083232211945
0.3800456377274053
0.2400600138939969
0.3150633938953826
0.2594711487593829
0.3064150980010248
0.19944872437719105
0.33934740137695
0.22196904789064145
0.3820266302885207
0.24025380654368675
0.09570422126095758
0.29205299104232124
0.14796737911108968
0.2806355374151451
0.1758626723625623
0.19424118796152734
0.3189728629515466
0.3118731939467096
0.34425138491755003
