-0.0562863997965341
-0.3210515351477225
-0.1809508012081787
-0.33945847904302967
-0.21990023816742219
-0.33734770137986775
0.6431365417652402
-0.08047293001861948
0.04478336038127587
1.6273889906957737
1.3643920935390417
0.8412290202328288
0.10772755314702087
0.21599225763844246
0.33179498026782134
-0.6435959852479956
-0.3544705513097814
0.38141877901274573
-0.15834852639954078
-0.243589302079242
0.262573693850199
-0.9838649324272996
0.09650588817197503
0.05767642895310031
0.01561218625417995
1.1805821336040017
0.23071966185382375
-1.6050793911901133
-0.4730597722230716
0.43605989349806745
-0.09718432247919596
0.09698414241848166
-1.424801084168427
-0.5674522578799697
-1.1889471413482817
-0.09410904335295649
0.6042656539442904
-0.1953200219688836
0.14724369217702005
0.09137199535594516
0.41127347093189087
0.9339005782236743
-0.5307602155232443
-0.7188525504268897
-0.23484149280702848
-0.03230041082500344
0.7944425196245721
0.05705978409971324
0.5661025341934619
0.1664404618024923
0.04132390468516054
0.5494470596700565
0.4451623996163766
0.23491230400296687
-0.3587117770505236
0.21137432379443213
0.22493684081362864
-0.15166381459130715
0.11353374506263837
0.2810371392762912
-0.2471936645420693
-0.09788417749707741
0.2700907616477705
-0.7847278956958378
-0.19880281792449628
