522.8252032520327
598.1052114060964
12975.154265581748
320.2105263157895
407.18663594470047
880.1586867305061
1138.725535610886
1106.5124317768343
1741.344399854068
862.5602443087173
1182.1494145199065
748.4838145231846
1606.8271433530026
505.51570680628265
3688.572834974137
572.4530612244897
844.5278246205734
1042.385684503127
125.72432432432433
1287.6373913043476
3916.215498938429
2008.265391512253
2749.9262661955245
1749.6610814927649
1355.8591780821919
601.7630619684082
1708.5089770354907
14048.335415314728
2265.855049712193
8194.380503587003
164.44223107569718
1262.0720620842571
3053.320388349515
2256.360849056604
1548.9188605955978
722.9555884529977
142.984375
722.1947826086957
2043.2506631299732
444.80261248185775
782.2084309133488
217.27659574468086
3125.8540222642305
2461.930344661364
2707.2012808783165
568.0433179723502
1333.3344343517756
343.72701555869867
2156.6327641672847
659.9422492401217
327.56071964017985
16655.51241162608
762.6990701606087
406.4856278366112
313.3936170212766
221.07239819004525
572.9639278557114
1881.3611331744767
263.20103092783506
1306.9580865603646
501.3970741901777
2682.3740698985343
406.1026856240126
1272.2408551068884
518.28125
