0.015925167331644632
0.010051499622738795
0.01903936989997412
0.016134093032788083
0.022416306662365527
0.044149910858418816
0.07899651809157868
0.02689545796217872
0.034196696042490315
0.02050952905048769
0.020987358128501683
0.026825103747898597
0.012897501404115854
0.010490911660783545
0.015460849776405152
0.01683436227698237
0.009531786858962143
0.02844318396741552
0.02879336493919516
0.017601498333688726
0.02097448689827635
0.01815211233845393
0.02386746359202219
0.024838885645673815
0.015995764419172897
0.015080176595572254
0.008838973050395549
0.005772188791775316
0.016933137991217182
0.0229412588769406
0.021475104543048032
0.01186245747850831
0.02310148730058747
0.005358404156912707
0.004113284473431728
0.005144959143356864
0.015302794432821103
0.0498536206307426
0.011755398800050795
0.010519514138655092
0.014290488655709303
0.009913426663890071
0.014672469681860888
0.03257383342484674
0.057039311287272576
0.019398128688726528
0.04563590484987694
0.011077914295498238
0.025482786227127942
0.027912013805172168
0.01821292311438146
0.021100939022882483
0.014960233938853216
0.04252021210689395
0.05045364565100982
0.04571146413225186
0.05484675533875713
0.0125090512490391
0.017208697414099118
0.008616587285623213
0.014909273948295084
0.009400538089018192
0.0287168562627012
0.02089752384153507
0.02271923035770635
0.04629139128069574
0.028031545491497646
0.02762026481689039
0.02688956882943137
0.028357443896158994
0.03229197678950525
0.055961044650569884
0.05605895799182256
0.03521398270716702
0.027948023725043784
0.04537848627527467
0.02523466695011926
0.008833914201593091
0.01296408796257295
0.041319059160977084
0.021049113081459483
0.02001377278139379
0.04174428236132592
0.0782608687121343
0.026493794914055367
0.02130856993996357
0.01708664841596302
0.01641068327871416
0.016237023388154512
0.022760714129547797
0.011440243076821056
0.0254371444290054
0.03497701631747002
0.07473524974539801
0.014285475561902143
0.02546423598029612
0.02720173989546451
0.022752818833605533
0.028674154563147758
0.033888822296138425
0.025799188907980226
0.030929603066479575
0.03682090421327988
0.0364868206328425
0.04048129312130693
0.02918461335480769
0.02477237502786363
0.09260918794170243
0.009761409009554498
0.00908171303244951
0.021108363388875517
0.01949114762175017
0.016057508694711942
0.05121969067260485
0.041064474138119526
0.014706334145339015
0.030348088575324186
0.0270068710322181
0.018984089716939836
0.018917582900487208
0.01812768762805252
0.01967742635299749
0.013103632562803265
0.0143399533063139
0.011086753666033546
0.00956587649567679
0.02231177424513673
0.017325486166561963
0.02704797290306293
0.029760607989990282
0.018077380144202213
0.0202385761524103
0.026752219915341068
0.02338986538206974
