0.003388073027106554
0.0033283452431358803
0.00028130541261892566
0.005131962381921056
0.0036905746216772243
0.002959136396317142
9.87516384530162e-05
0.002374852506849677
0.0011925857362149927
0.0016330670096475735
0.0013786550602519607
0.009611714595831268
0.0012716256699998151
0.005231670799230234
0.000697313766081239
0.0035171536898035032
0.00493065377913934
0.003783234066462889
0.017373700318876813
0.003039123748588462
0.0009829651159772562
0.0012941488696815292
0.0018430658605348399
0.001343542174997566
0.0021406914466692802
0.0051526330422928205
0.0016047205514647714
0.00020824932794332926
0.0009378693913467584
0.00048112061217504983
0.034741086833482315
0.0022648154031543197
0.00028336136350998675
0.0017390190678027322
0.003572809436717628
0.0025591967381437828
0.010914997314729549
0.0030143339143157703
0.0016305597004854732
0.01106650636598843
0.0026729788736721024
0.007886289715456178
0.0007655643814168558
0.0008405858417036929
0.0009206693682755957
0.0031130005513487703
0.0012411900446974318
0.00432216952058353
0.0016417854775213024
0.0022213515859636586
0.0059051551974575785
0.00019058916956807124
0.003761055210850809
0.006320958772207543
0.005801726443172465
0.006319784654296175
0.0034580506413764466
0.0007582519247365244
0.010915190880017292
0.001425945285609206
0.004423701063604109
0.001419216573769116
0.008115885429827894
0.002869582461620845
0.003361018847391391
