2.873087271491107
2.2460262329719964
-1.2595673856526266
1.5225705453492462
1.039007010535221
1.931742893290408
1.4554165652225617
3.092450971538165
2.005544748182555
1.7907692418688914
0.6635630179279323
0.9566104653403738
0.43994116692887236
0.6149061216616877
0.9333156242216685
2.459756854571913
1.3346312478493805
1.9333201700053169
1.9413605391525832
2.469457496508115
1.9648286379772577
2.3886581475618556
1.4282585429203638
1.3355830335036953
0.6742862145117184
0.7181559577350112
2.5991589633467207
0.06707388807284724
2.0432050070922076
1.7287258118900775
1.1775581591042426
0.8854203500145682
2.0504695790265575
1.5011797622283445
1.5141464603221044
0.4920222995520199
-0.013634842098847818
0.9216985375419207
0.7155473363640898
1.4223422909036536
1.5020181875197196
-0.553982533405475
1.879453829591815
4.377862297797004
2.2799627602824817
0.5818473783788033
0.7257761021816809
1.2738059070545382
0.3182244447890232
0.10789563241762742
0.31771932529507413
0.09922543731473288
0.6884649391247966
0.9078920601836032
1.6411681810236873
0.04956049887162082
2.6084605419620264
0.20898871439563588
0.7108386729009113
2.0485581390410528
1.6310758569004362
0.30553860107407826
1.0423713788247935
1.551773708269256
-0.11088098645073706
0.7250113087147296
2.091810395957808
1.3557125659188474
1.2409546819944164
0.8726233352110222
1.443356924496004
3.092714337911797
1.1280539139192767
2.5364523780992068
2.3259514662720857
2.1710191822472074
1.7396852571991568
1.3678213832551693
0.579599465799833
2.0175486685110706
1.1871772998360413
1.1871772998360413
0.17279753215987442
1.5799211279683025
-0.12302490842478955
-0.18528086900640975
1.842574681414403
0.4341858764392762
0.412900962579773
1.1053798006082172
0.8902414834284783
1.424308546000448
1.0076093344499781
1.6607367065518894
1.1385612724133363
1.7698514054630061
2.3966576992505004
0.5232625938917695
1.0351280038953772
2.048655873691637
1.0978537673140514
1.7067497324327685
0.8541226597020442
3.4712001664204775
1.8057714137907082
0.9790386844505082
-0.013611667294505357
2.9696663038447957
-0.5890569540426986
1.368289454794526
1.3401133544785155
1.8436140877763352
2.392074216047557
2.2485517046608274
1.840194581307123
2.2375290954466567
1.4610820209086004
2.331434818535238
2.071893675563183
1.7804208219162205
0.7170647354139987
2.3145232822799553
2.0289066350782865
2.9338917692548323
0.6271308310982665
-0.05435369570595573
0.82239145863129
1.2999143357095309
1.4492975902162017
0.8463178074223855
1.0959784440835647
1.8672096123525588
1.941527120715992
1.9783437727405855
