39.23649691358024
43.411712728746245
46.218218646722526
31.605477591670443
26.397135559062015
14.821259908922247
10.364152249134946
29.57756081137952
27.27346061390532
56.14394762389053
27.927870398289517
28.96314717052907
36.563385285391725
462.64274410568345
55.825182691831216
282.8831801794585
208.6783419193252
27.16332958794599
20.55131079176129
47.11461992276194
60.92784032048316
47.0083670108994
27.67391535178067
23.820832349305764
19.391473063480237
48.42278375848935
58.844409290459566
74.18872249253445
57.21166229257869
39.148874401985786
38.00483600967202
67.14109931299863
26.072710892829896
88.56146326558256
94.92899193788507
75.99787221641549
25.322869014910914
11.361553625659333
44.61835685687333
40.43162179419567
49.51185821598954
53.8009027071179
38.68631438763377
8.762656147271532
49.89485675402791
41.86752592747916
36.947867448640935
59.487403724901355
53.7377330613125
36.36048182920649
27.46393826726755
36.65908565110577
99.82675661269228
38.73081570035588
31.17757287328971
46.94567389881575
11.470933333333333
73.08714057572084
48.28298516453871
78.57476637229611
60.92815412326729
60.71005913996458
43.09921973250877
30.371848146883696
52.3998278191375
10.30830654573002
23.899895850024038
27.895420130897175
26.047213499405984
27.8608449815302
33.15802668008036
16.20851851851852
14.74529754253308
24.28458442200409
18.591706695422012
18.960599922839503
29.35188778305332
109.26790754718681
36.154351163228405
60.73045321015933
27.21281229185305
40.05704355700625
20.933030333103254
18.803815104166667
49.69013292344038
56.33646361657458
55.67072653061225
25.86726988118325
25.999699519324235
23.203815073900266
35.663172307714426
49.964224825584495
26.58075115528493
10.066447288974759
62.1140714370476
61.76589919202121
57.88844637434066
116.38455477935372
22.88390833543188
43.5684191847831
31.000900668195573
15.633085171777882
23.050859815107003
22.97902494524756
19.921968473663977
36.43967358575783
43.385199040832674
14.38838427527874
46.32675465223755
49.178282697582944
28.511265219625784
40.50331628926223
57.14098810425667
22.189750692520775
23.82772101379008
47.48085387323943
36.18363005079487
28.936179116970077
56.016459397942704
32.95127049857315
52.35397623241275
44.0121475018789
52.59735361597485
117.09057387570307
61.265902295524704
86.67734707031003
40.201220850480105
112.36551302574448
60.13495334273904
77.7666464653796
56.38471820004457
40.76490975448164
49.02566143857073
37.77958579881657
