0.4928349350513921
0.576449439076171
0.3283094483179841
0.2454931643697083
0.3225515355509885
0.3134723361292881
0.43972661398863055
0.5331861134438521
0.4546315861611844
0.3632505435353967
0.22929342644637776
0.3245881954607921
0.12398699626407282
0.44819067020667896
0.30796175496479433
0.6625517507055723
0.4329025991751061
0.2550799015863693
0.4906654254340074
0.27299908530318057
0.19188069688244755
0.27315929774451103
0.18561140943108528
0.33732211174653803
0.2159624030112064
0.2697562107033465
0.5206803131220396
0.4313599553638851
0.4745152614731195
0.147983740528659
0.2542535263177185
0.3580642259668033
0.10034094350594122
0.4566874620611714
0.2272106029381451
0.213530901430891
0.29502840871422986
0.32545416473569416
0.4276127624372004
0.2194879099490536
0.1373071613990703
0.32862779998652153
0.3472172280579908
0.31823377912362033
0.4681540795272042
0.4561116415820351
0.40655877303175453
0.5335737478220982
0.21002908536122167
0.34911334146863804
0.29746225827305645
0.18329935693675067
0.2748037168323696
0.13064665700024805
0.25642430432572705
0.3366146046474209
0.22265151239800246
0.27180714206879425
0.320404285858087
0.4114184301459015
0.3153281492631127
0.15351967253889545
0.4372172830272309
0.11860757318070975
0.3917106280917405
0.08708008105475118
0.08648155937819832
0.17881416437259234
0.3480605979920525
0.2114802732135286
0.3686321300520869
0.1959846064321752
0.444800802420932
0.15042895583718266
0.4073245720217355
0.0790489288054603
0.4418522892268624
0.31393084316869463
0.29051006101685906
0.1456702422874323
0.18811571002652333
0.4156387115939896
0.12347124942124575
0.098141059894554
0.4300706808966496
0.24425546220264144
0.10426725129854007
0.134679413009921
0.237050553843855
0.384427254610017
0.2194752018691597
0.2800050021164569
0.3360064945246993
0.3948491514250251
0.3191333575721587
0.4554084487819887
0.4444642934604819
0.43154278034930216
0.19830539705865952
0.8215159925482911
0.5657499024786695
0.12025649845134315
0.3156353553949476
0.2161956292973197
0.33902977614005064
0.293511717844764
0.2562162948424461
0.3824702555794465
0.2799199508175321
0.28562604731019753
0.08241263307379823
0.0904758589713311
0.4067468473825091
0.2174257476427128
0.376761532868716
0.25026140446855943
0.26526083531051325
0.5576349118598147
0.4685463880575857
0.017403529092447426
0.4624051864460324
0.3696502364859929
0.4964771998996695
0.4741213763573842
0.2785058547682329
0.4343354822717965
0.13942542564136415
0.4798517009234266
0.1889728339334971
0.2822258566095768
0.2690192714328012
0.20844560033774048
0.3663963548931377
0.09771149593214906
