0.7761901602796806
0.7487956892456697
1.8165352762434852
0.6742499493314864
0.8878948699321144
1.2140490517217934
0.8401598295931049
1.1058071424815337
1.201251311362089
1.1250965634465375
1.0123844946853813
0.6826492846374231
1.343767402011645
0.44483175894700416
1.518634407741523
0.881270817452779
1.0422141064830628
1.0201076590711942
0.18601779142879193
1.090104938109748
1.607235241874382
1.5611707309874427
1.4383546520540038
1.1204530425468993
0.9299870434718716
0.5906446520716002
1.123423515467226
1.8956550658117377
1.3986150268060975
1.8390530830410257
0.7814943643338407
1.1246511641336758
1.4770200476372137
1.2327968434336998
1.250885407577659
0.9739345765462073
0.4633639359599075
0.9120420593112882
1.4521917226486105
0.8986023104817997
0.779777350872544
0.9809160790241117
1.4466768630314322
1.2718712416815714
1.3554868154028505
1.084260186277379
1.403572403734297
0.4536653278928739
1.3909389284582416
0.9659181098049673
0.8841908293684705
1.86895466155389
1.0951524680203197
0.9392508731115063
0.8018937403476816
0.5706603761898671
0.6593719592753837
1.2686666328634826
0.261778204859486
1.059097002857614
0.8798911329813348
1.4085611585837736
0.7145834712900327
1.2287636650380125
0.4002678778264469
