10223.507881164549
15796.780586242676
592665.1954650879
8567.690849304201
13293.027877807617
5322.21794128418
9079.813957214355
5450.9639739990225
19778.609275817867
15517.473220825195
27503.013610839844
18805.861473083496
25843.26267242432
149129.39071655273
125491.97673797607
28582.334518432617
24790.76385498047
4351.973533630371
16508.817672729492
8955.001831054688
14776.468276977539
12610.673904418943
11021.37565612793
19895.19596099853
33754.706382751465
32995.820045471184
133432.38830566403
520832.7770233154
68432.09266662598
23562.66975402832
49351.21536254883
115714.78843688965
14003.992080688477
25237.7986907959
99607.58686065674
62207.937240600586
48529.7441482544
12694.716453552246
283163.30909729004
35929.44145202637
35299.30114746094
378567.6956176758
33659.21974182129
1423.3589172363281
24845.48091888428
20215.630531311035
29312.25299835205
64533.59127044678
113412.38021850586
143952.3696899414
33048.391342163086
165563.82179260257
49756.765365600586
52054.88204956055
52421.09298706055
106209.75494384766
10586.50016784668
117207.52716064453
62505.483627319336
37534.475326538086
20788.19274902344
27244.80628967285
609383.5830688478
88816.88117980957
409930.94444274897
18407.106399536133
50390.48194885254
50628.662109375
119292.4976348877
62605.61943054199
49223.899841308594
11765.241622924805
38456.439971923835
3554.4633865356445
2209.782600402832
7619.619369506836
5396.246910095215
10128.021240234377
28890.609741210938
20570.039749145508
63168.883323669426
14416.337013244629
26786.327362060547
12840.27099609375
309531.2118530273
102252.96020507812
2185.1062774658208
86837.0532989502
89162.34970092773
16438.36498260498
38079.85782623291
20979.88128662109
29309.391975402832
6632.566452026367
15016.07894897461
5616.903305053711
4873.7525939941415
46636.81983947754
20229.220390319824
61737.656593322754
131701.11179351807
2503.037452697754
10255.33676147461
20056.486129760746
7258.415222167969
15068.650245666504
43544.411659240715
7672.1906661987305
480652.57072448725
29090.166091918945
16332.149505615234
15528.917312622068
9650.945663452148
2831.697463989258
9373.784065246582
11935.830116271973
25076.15089416504
13230.085372924805
19110.560417175293
6810.307502746582
86411.11850738525
12865.662574768066
26327.49080657959
2307.7726364135738
19066.57218933105
450288.53416442865
8575.201034545898
109286.78512573242
17161.846160888672
78668.11752319336
59273.95820617676
13695.359230041504
14624.834060668943
14227.509498596191
