4.570283363901393
4.2700544746968925
5.414018964733066
5.4637189566241755
4.863726316046724
3.9628613561983967
5.2242371771834035
4.623707377418468
5.002858047540329
4.368217291371367
5.185937856889722
5.536338459251777
4.564123495892996
5.3041732934052535
5.4989869422008
4.697623551226663
4.420511769573287
4.382177730771962
4.379862600937832
5.2408241852287505
4.4267189223514505
4.206112069653411
4.433518860943781
5.082343645039231
4.822739021338427
4.364083416478518
4.79673540157836
4.9623361038182905
4.786301962182128
4.4137170569203965
3.1897583368652604
4.7902989448298205
4.4447788872245475
4.606108157547751
4.8171088179383466
4.499422954223272
4.581195095924702
4.264739603094044
3.9401946707348263
3.8939802659708267
5.284982936569317
5.2271384198787985
4.470969206327569
4.833083345298763
4.731729032658267
3.748401552707765
4.171625887803565
5.818772955330415
4.891609426110192
5.010559922455098
3.9927407498974974
4.876643119358981
4.444959519588577
4.241758788826959
3.672818903719608
4.2749360115782515
4.653968684008645
5.418568471875711
4.533040190749146
5.0398631536425995
4.8389670026542415
4.78543081296222
4.177258224201624
4.428141164673249
5.283896582538691
