13.664008731821788
13.236742287617648
14.112474797118745
10.195691945906557
7.314916247065883
3.9116336230766864
2.492210495005011
6.8125069580058755
9.861670563244065
21.089598779924664
7.150516133558838
10.275796416663267
11.066783246551118
95.25525652731831
16.014518858170796
89.2316152468441
67.30033485029881
10.959927453908223
5.065908308109153
15.500497727014572
25.510405870315967
17.465087291059994
9.485692429838016
5.343415491040755
4.6368622447940835
12.676156750956096
22.28137792190137
22.422340143119243
18.372833978254672
13.498630754388484
14.154815110376955
30.80362780245078
10.914827550164793
37.678673758125406
39.21723660786208
30.704167715881947
7.0174757517549
3.1168293284445863
14.193379144232269
14.815514396602767
18.748959845249754
19.05245186280237
11.911178799518321
2.9208288368132966
14.72686440748678
9.840325593962984
11.906387910228613
18.192772223262146
18.923585519974356
14.303613565587964
10.277622279662284
11.3177919875397
88.75712580885616
19.775057380710162
7.752415827650953
15.88090416649274
4.216164593272858
27.213873725940328
16.650613758995146
34.17669072674126
26.694045801850805
21.368313640282732
10.570466698364891
9.681129771740876
14.614625235132534
3.155778621851415
8.271180942918472
8.509221613030569
9.97640613438286
9.421336789097008
10.864484247635476
3.219284495083595
2.988218482739716
5.843436479689657
5.5386434074483875
7.332121721752359
12.026992787910027
23.50895985736135
15.394771127644358
20.50817589491878
6.729269749336117
11.322951087173815
7.023803529436558
6.223570629681841
13.596488104742965
18.03682864529655
27.55149518344194
8.970877694809158
10.387250739585319
8.684206705242504
11.03865793665138
15.072697892045026
7.824630603232095
3.016826728680457
18.259424928529693
15.914230344974037
15.654793245585164
28.303678426988498
6.864191832074478
7.8758657397804495
6.5107222914879515
5.877983968659273
8.146857298862622
5.1472185213614745
6.443390479261061
11.101119038637123
12.116167640722391
3.565168613592154
12.626261106998966
15.744643487992905
11.71473213222608
13.131411850104367
17.947206794373926
8.729161411425173
6.093507305443483
11.664501122496775
15.568964611058815
7.719654034989192
12.25997088922205
14.516541078212905
10.10160217441335
11.903991065558492
19.141603470338442
61.589962852372295
19.01182362060092
39.50025693205974
19.648382350073906
50.23784200231746
29.33778222903451
28.84914493804011
17.175937456174026
9.307048167479811
10.326283784125783
11.974201075846436
