0.33309934140200753
0.08960355176419353
0.1560027874240616
0.09995185797797193
0.4413264941711342
0.08123527263641385
0.11374914987490553
-0.2978172237325151
0.9674736435936078
-0.05830698150556118
-0.1241741728887317
-0.7060212066884404
-0.5885157592829662
0.4191098137501364
0.4802521427463617
-0.19227422507141886
0.4526668814780374
0.38220402811854026
-0.3443211140782962
-0.014014531891601956
0.2488102172046993
-0.4962021710227283
-0.2736146557662381
0.2937445455690556
0.3554206082875652
-0.4090580268340947
0.2947818773378293
0.9131126739968324
2.1017634838778987
0.5531372110976609
-0.2902593812832309
1.3228847744938212
0.07510707752460534
0.5909902551770654
0.12019263134345025
-0.1214948453407632
-0.6171281037541371
0.4250891587773012
0.7397443789480451
-0.6950574396174016
-0.10225896432941853
-0.16293361613968296
0.8541381780587959
0.9069572888509604
0.9753626133778606
0.4606407348452716
0.16262283157479202
-0.35804859899772984
-0.3825007012946304
-0.14842594463945785
-0.3695065999968157
-0.10528367863755253
-0.111580079176111
1.5058560137008348
-0.12556682378076253
0.18140392087517812
-0.7558122072434386
-0.0008240735925235692
-0.73629352442139
0.11215086938978017
-0.2112129430214692
-0.2527152652476151
-0.16297324070284847
1.1828117682053658
-0.3462855236185729
