106.04768130528485
114.48639257929517
93.77060598345803
73.7868623461192
79.19175768210413
73.07992424877912
85.35759578226046
85.1678307480307
98.98390853105006
97.1282474932703
86.85389488490422
94.20757115273146
87.71025915522647
105.461952730659
97.34578278205592
109.57851707228804
100.36650885416894
77.90477194149037
92.15355390631026
89.96053521292039
89.1691329328554
84.23205940437546
73.50640246544017
77.08707426441507
84.47163699436686
87.1016338337833
118.54880475888596
109.7402706006953
99.23865766008693
80.30431368719847
79.8701922109923
100.80306759026524
77.39596301240293
99.26620729578215
93.47122316953174
87.01512701381833
93.13670655835277
77.68545047957602
107.1239343896773
84.3523143064182
72.54933657591982
97.88706436956787
87.15605008131912
73.26165894038844
97.93487235149716
101.32188405472522
94.63863716396718
117.87914378367498
88.64556088962276
95.22508712561735
84.23865271663925
84.89628285886447
83.23081830913111
79.24237249644541
83.51126632577082
90.15593829261961
68.0456481231802
92.07722645680593
94.99402270812823
114.40308546782177
88.77945932334357
82.4721890193398
102.35435173284039
81.58860122057372
95.45739566737906
47.92886515920185
85.73011670071433
80.71586564568909
91.2008640688201
82.30895807220274
91.05046043216326
55.556329495216204
98.96859627643099
63.08724694807495
89.55200568688828
70.42827017416437
105.91952903501067
97.09814433433553
90.95558641418434
77.87651349127994
85.83801881694585
93.78497292241808
71.90865289671636
51.79683929745873
99.04533665464392
89.91275791276068
70.19654874845926
87.81754628854519
91.94614779683133
94.45510603798746
96.93831757789623
90.1264909580507
87.65194739747336
88.70127222902883
93.24766801486119
92.86484425901635
90.76998573875552
97.047908574728
81.5549315967541
136.1588724528958
103.97858863201174
57.288258088346396
85.05229308411346
85.53048732262442
92.72266441160328
86.36731707762529
83.97616713065584
77.90990816888899
94.14072009863965
85.92344957939348
74.52740842704804
70.33800520135026
93.44131858207865
82.40763305937561
80.63194632005349
85.48984432521853
94.75710822490541
97.84400387369863
99.11938488150018
66.40919224911522
102.92715338321017
89.45396067348392
113.86390231052876
94.16178535867338
90.410711110326
110.64394108997814
78.91009549959233
119.2477305509813
85.72626288427257
105.41318110779517
96.66398793790835
78.12508146404375
89.83185987316102
77.27159500025496
