4.56
4.007591442374051
6.088020890001088
3.9749702026221687
4.911547911547912
4.42512077294686
5.244063324538257
4.871382636655949
5.399209486166008
4.474966170500677
3.5597320431708224
3.6619452313503302
3.7352862133834988
6.2205778717406615
5.9515349630471865
7.199216198563031
4.432482887367766
5.61310259579728
6.143855562026792
3.5288461538461537
3.1554054054054053
2.791549295774648
4.069182389937107
5.546228710462287
5.257900807381777
4.2668965517241375
4.492327185696185
4.703991324728023
4.110795454545454
3.5746951219512195
3.8588235294117648
4.034805498683825
3.572008113590264
3.3195564516129035
3.5740694479140647
3.6866734486266535
4.250542560887388
5.051063829787234
3.7074451652764906
4.110823630875378
4.519568151147099
4.564194520154928
3.585730724971232
3.0517241379310347
6.198904484765492
6.9509442153245065
6.151233671988388
4.892568792222772
4.818429569068302
5.4203351320647535
5.2438202247191015
4.768802228412255
5.303914044512663
4.0275229357798175
6.114089098152842
6.716161830120738
5.9891304347826075
5.8748874887488745
6.802439750074383
5.293738489871086
5.340382678751259
5.68458659407962
8.217108567501121
5.655933429811867
7.470160528800754
4.68944099378882
3.9964381121994657
4.200158227848101
6.047278206818611
6.113543091655266
6.237677245104659
3.97991967871486
6.481515711645103
4.54014598540146
4.1915708812260535
4.760598503740648
4.6284224250325945
4.004751619870411
4.8439201451905625
4.5597345132743365
5.486323155216285
5.236781609195402
7.048611111111112
3.8871892925430216
6.9257405515832495
5.708600770218228
5.044534412955466
5.668328348288468
5.409083483090998
6.234383954154728
4.990063483301132
5.987810004203447
8.664889565879665
6.212951432129514
6.582391433670434
7.018565400843882
6.153558052434458
5.7391304347826075
5.822721026110856
7.967242570836213
8.587570621468927
4.657492354740062
6.030895580758702
5.060475161987041
7.294170403587444
5.476738107684264
5.513126047291007
5.5749718151071015
5.662995001346943
3.843388960205392
4.367144432194047
4.161290322580645
4.778032036613271
4.485714285714286
4.6118665018541405
3.895688456189152
4.955984555984557
6.421368547418967
5.023926812104152
2.613526570048309
7.250636132315521
5.835443037974684
5.404
4.508064516129032
5.743110547988597
5.649643116149473
5.732142857142858
5.201552895503074
4.268351383874848
5.917930419268511
5.9530017152658665
4.043593130779392
4.805687203791469
3.7174813587406783
