0.7161343884690652
0.7530699058582944
1.5570001011746393
0.9468649165944325
1.4083342794132228
0.6572845241629957
0.5929083382131816
0.718420303997107
0.9445872055169989
0.9342213076877366
0.6446424321792219
0.5454630780298266
0.9077017293946543
1.223057648808672
0.8595094762460131
0.8848676347332015
1.2979731715487992
0.9804038058448784
0.4332637561418284
0.6812724266094531
0.9096666020225971
1.307537309491067
0.9772013483396692
0.8958730687320305
0.4317749173531815
0.6194247739569768
0.762202863080578
1.7509548926410627
1.5580679516986382
1.618010183986691
0.5925976324060575
1.0016166701751665
1.0123673472110297
1.199621008109742
1.168309192010217
0.9765871959175301
0.8917565869137021
0.6790991839117801
1.159040155081326
1.144797442971982
0.650758363527528
0.5473678261273695
1.2074007850209851
1.435475512223038
1.405821122574681
0.7590902743186834
0.5224140353963325
0.7292927400614813
0.9642023260169148
1.0116491365446916
0.8295793229284717
1.1579878128071497
1.276273370646086
1.2970079918468185
0.871156474713615
1.0066724104962814
0.7023928035764788
0.8436129731079757
0.07702923036474454
0.7683912790802638
0.8350552230774049
0.9476025674883161
0.7458518783351569
0.9352693645576129
0.5451867128215223
