1.5434483269564594
1.5588482845738127
1.7072787334722657
1.5452145615851034
1.5191895908824673
1.5330133815212406
1.5648693865762349
1.4863600260528296
1.5641118456570877
1.5673243141877289
1.5937205472801959
1.5984540199710153
1.5786656649944126
1.6223338088479418
1.6492772545765328
1.5937414277878086
1.5833394662430023
1.48449134149361
1.556583968928681
1.5943370099484195
1.5663339298716739
1.6024038218845178
1.5458051277140177
1.5865451288345809
1.609070560134339
1.6063863691989793
1.6943274012067728
1.6940104827633105
1.617351470914665
1.5678569695567859
1.5771612773968793
1.6639058547719237
1.5653434881957307
1.5913348356070716
1.661219055726653
1.6333137791757648
1.6503361799288032
1.5459908638225495
1.6729656724059743
1.6101994966760182
1.6072549048191516
1.6981738593890408
1.6191880106282905
1.4748439396613062
1.6091060128563917
1.5920412355467555
1.6130647785013668
1.6177218053320341
1.6268422625492398
1.679432880140333
1.6100470161011613
1.628088425222024
1.6111536427010869
1.6151282587646447
1.658912141428319
1.642272771316105
1.5579913958752887
1.6373677518551033
1.646081126702476
1.6442941626575835
1.5651699444603144
1.6189025160123973
1.718669787935366
1.6604782822245236
1.6856829578844275
1.5427088137472127
1.6187121061772787
1.646592910370918
1.6620342631202485
1.6164738550221938
1.647886460482386
1.5640973056364975
1.568666801500748
1.445473022972451
1.5582028895867956
1.4633310072974408
1.5905379137882796
1.6077882021906884
1.6473242838235713
1.564426097252227
1.5663180822242075
1.5663180822242075
1.5872817147276994
1.5196536807219843
1.6921846030085714
1.6479698034943624
1.5297837811353132
1.6356841763968766
1.6449457910635752
1.5561038638895615
1.6044231470118007
1.5776203396102544
1.575154617303267
1.5582173865927427
1.552630589187966
1.5329013639462254
1.5020037843450023
1.6131020992710168
1.568156873066525
1.6158441889938415
1.6485879690963288
1.504906682668129
1.6360757333445624
1.587981820301071
1.5138565692301675
1.5780281879034093
1.6137573488885721
1.545267742117521
1.6952308600660568
1.6268457329244617
1.5690634118351605
1.5523636307897954
1.5404676334228922
1.495505883302936
1.5416006517808927
1.5150732325934342
1.5959296392738305
1.5216904156851534
1.5548757814186627
1.533829796054141
1.6404875805853707
1.516815871856251
1.6245127747799388
1.4723097010910555
1.6341320548174283
1.693347153484362
1.5582592898522767
1.6790069110706414
1.56310687731954
1.6552423910449463
1.6656546815706752
1.5071180250520273
1.55833889138132
1.5234535108858527
