5.379595011736188
5.373594010968638
6.260994531647164
5.204678761507237
5.382228300590969
5.471636710694206
5.496785981943012
5.476195806027602
5.631153947793731
5.5818131441376595
5.5958568334994
5.373285056747578
5.674902730429774
5.455206845225478
5.826838205270143
5.362873541866808
5.573524929738428
5.609768316871001
4.77095778189814
5.6139284054151934
5.9422549557637785
5.854378982087183
5.891045281496676
5.773844155473439
5.665010578849715
5.457374190577126
5.748532745107163
6.2657044351499005
5.890392135360305
6.163419832228063
5.099374029519305
5.680346598399319
5.8812714433877185
5.836647217828167
5.7491849368581605
5.486699712832669
4.956498501618034
5.387803688863407
5.807292776149892
5.433494888373513
5.430285813370367
5.044813485235739
5.916329176394239
5.909519406999307
5.914457471703265
5.43626240245852
5.630510748942049
5.3184203881732115
5.762954306923689
5.492135884734298
5.295144365878244
6.244218855918441
5.577196072083684
5.4338189160377866
5.200352781669248
5.145675711116119
5.359306519440592
5.763613864450691
5.033390691041545
5.591502567451853
5.395659795599745
5.916140469308044
5.406761866999357
5.740106282967206
5.339867041303055
