0.3330993414020073
0.08960355176419164
0.1560027874240617
0.09995185797797287
0.4413264941711328
0.0812352726364137
0.11374914987490513
-0.29781722373251485
0.9674736435936075
-0.05830698150556132
-0.1241741728887317
-0.7060212066884411
-0.5885157592829658
0.41910981375013495
0.4802521427463624
-0.19227422507141886
0.4526668814780352
0.3822040281185437
-0.34432111407829497
-0.014014531891603031
0.2488102172046986
-0.4962021710227264
-0.2736146557662369
0.2937445455690564
0.3554206082875654
-0.4090580268340967
0.29478187733783
0.9131126739968329
2.1017634838779
0.5531372110976596
-0.2902593812832308
1.3228847744938217
0.0751070775246065
0.5909902551770654
0.1201926313434494
-0.12149484534076392
-0.6171281037541373
0.42508915877730097
0.7397443789480461
-0.6950574396173984
-0.10225896432941868
-0.1629336161396833
0.8541381780587968
0.9069572888509604
0.9753626133778608
0.4606407348452718
0.16262283157479165
-0.35804859899773034
-0.3825007012946296
-0.1484259446394578
-0.36950659999681534
-0.10528367863755332
-0.11158007917611176
1.5058560137008339
-0.1255668237807616
0.18140392087517976
-0.7558122072434398
-0.0008240735925235232
-0.7362935244213893
0.11215086938978014
-0.21121294302146867
-0.2527152652476171
-0.16297324070285255
1.1828117682053632
-0.3462855236185732
