0.3918361720279686
0.37967911705016205
0.3946094502426839
0.3927778079440242
0.38733848073743216
0.3930312415725648
0.3984971724379963
0.411179344440742
0.39598792521891685
0.39498500991297353
0.3901901436441034
0.3967234081101055
0.40963206331878527
0.39847873681523016
0.39255109177138875
0.40527143094878737
0.3893921076101607
0.39293076045121444
0.41479302286396347
0.38452546520332775
0.37799640077017244
0.3834606635841562
0.3855384805036778
0.40525283989743854
0.39570149358481893
0.3932685003982466
0.41881240928602986
0.40541237755576404
0.4024411086837871
0.39063701341367196
0.4083830133767192
0.3929901071125138
0.3834244901737828
0.4043385430250848
0.3927037825335159
0.3943174570224406
0.3970333929451369
0.3972918918031022
0.4197897689242422
0.40525449148023546
0.39846741542191894
0.39521695334810436
0.3951402359245305
0.3676786021724996
0.40383681942732097
0.3908531285851693
0.401729774251392
0.410292914141258
0.4121247185406224
0.41878017664831363
0.38833687995351907
0.3919865346580667
0.3986337203853203
0.3907998268627428
0.41768133979896105
0.3992891376798039
0.40601563951982184
0.4008271249933583
0.41626770538859525
0.4144848415186297
0.4037409010190854
0.39896490868658224
0.42161791187994657
0.4133907703730016
0.4049110379740231
0.3863174802546769
0.3977272004745798
0.3920500587975037
0.414623002667763
0.39639201031645704
0.4022284761565415
0.399600711502218
0.40949866319959494
0.39896356576866315
0.4038556990226077
0.3929453814298936
0.40287327243668214
0.40206575991850924
0.3918786857703631
0.3876621323748315
0.4164474210071533
0.3878460224195662
0.3945760383653527
0.391706891496137
0.39602909388976343
0.39508725087843005
0.4029195914646104
0.4083445565508036
0.4123517386968074
0.39508622809248295
0.4007725161221264
0.40725681566430016
0.40695221676940113
0.4085692467655546
0.39908477277192417
0.4044563116710593
0.403158138073249
0.4007976055775557
0.39496743705322285
0.4195181436644276
0.422237570700742
0.4000445448620486
0.3973073339077867
0.3957045784991297
0.4056863903115968
0.3893155807141535
0.3966427562508203
0.3967677427344055
0.3979294295746373
0.3858590981762707
0.37812913762869943
0.39760265834784564
0.3882975323333283
0.3906058033205193
0.3885165866265231
0.3810326265855889
0.39311125742707237
0.4062536115394099
0.38955834628875835
0.39859416987932705
0.40573123992314897
0.4083088294270461
0.4202738955699781
0.3940983991587294
0.3923882249982996
0.4111728260628285
0.39012550353537917
0.401651031220301
0.3823530469639505
0.3988209309536956
0.40978347777879454
0.40099869076707123
0.41670286859946315
0.393658430365462
