-0.2510471011800825
-0.23880417736344836
-0.2414542706076375
-0.252320153795287
-0.21288881512183955
-0.25834820780808926
-0.273782205886972
-0.2595311416621529
-0.2429109380840528
-0.24893599612451464
-0.22326127002605492
-0.23995471354302345
-0.22107926912946876
-0.2459333134386165
-0.25185249785945607
-0.2417773910237041
-0.24962358963234405
-0.2736459698971707
-0.24396611279123367
-0.24641740560052977
-0.2588425575937786
-0.25318404171266284
-0.256616828368488
-0.24886063046997053
-0.23677445486636348
-0.23375474437053856
-0.23977869586473302
-0.2333389828288983
-0.24087990996651593
-0.22460193262195258
-0.23993538423526248
-0.24366266376412757
-0.24473320737728996
-0.2516763628763206
-0.2453218497425641
-0.2528372538657695
-0.23036793492892532
-0.24345212154773807
-0.2403321365113425
-0.24509173287115138
-0.2490109032135463
-0.23879474888419913
-0.2648615399742663
-0.27237208587592937
-0.24734243311337148
-0.2503423610205232
-0.2319577653648322
-0.24255866954918606
-0.2439853073405383
-0.23696698363844243
-0.25676183367095046
-0.2307482652963129
-0.23940902123251595
-0.23564997165293325
-0.2513746687263704
-0.2476120954190301
-0.23122173440129823
-0.23902482422818003
-0.24652124869656117
-0.25292711052803957
-0.2753749460935272
-0.24481116832994607
-0.24368777873349973
-0.22463928900832356
-0.24559828538250006
-0.25428928351079
-0.2456045753345976
-0.23853524296825035
-0.24074113226137653
-0.2458915593124083
-0.23898216768933056
-0.24366803461858108
-0.254714021889509
-0.2856935406641242
-0.2584817150931924
-0.24598445423078044
-0.25606319594965915
-0.2578349308384614
-0.25066550958758343
-0.19039471898998414
-0.23110311685077772
-0.24499066897036392
-0.22498756719552668
-0.24301932882608654
-0.2339717899417631
-0.23320473989441862
-0.2752096695821919
-0.2516986652917246
-0.24137357024152184
-0.23811959469929067
-0.2387307758274365
-0.238011666857134
-0.23196411562604355
-0.24692016932642918
-0.2595748782839116
-0.26295897919254596
-0.22639497261429078
-0.2385313653243935
-0.2576076461455091
-0.24265330835698445
-0.24476229168198355
-0.2599449671569714
-0.24202221430474738
-0.23097445574867242
-0.26199164313937506
-0.25029813925633443
-0.24580654276478847
-0.26964682054810885
-0.23669060399645628
-0.21820087769445762
-0.2523408221256172
-0.27892347696348646
-0.2606671823633487
-0.24071786678151824
-0.20973523542973144
-0.2615404298512408
-0.24193660320290328
-0.25540307027354214
-0.2573444505178717
-0.2319579734283412
-0.23361640815161083
-0.2674483135924171
-0.2594904569263009
-0.25261280308521267
-0.2661192862980153
-0.23373613063960808
-0.25785195149033346
-0.23573555865309948
-0.23021635675268415
-0.26192527076626926
-0.2540241110697881
-0.22678894990796514
-0.26058486855600504
-0.23857398336241606
