15.85380050502025
19.75061533006114
23.890002933076786
19.86630679628332
13.176444308424902
9.933676119938506
9.434930972575827
11.739318164522267
18.113319857369444
18.79128052420997
12.168268692420911
17.002249498250002
18.218559978724386
35.01087047697769
19.474750966033426
19.053288770037565
25.824110253398146
14.683800701671547
11.80331644276475
22.36014488936292
16.167171572530478
21.539193813926076
10.865922734171344
12.156057689572425
13.850133164013213
16.029231645168135
29.635185291184825
25.356350841079784
20.849049836213897
25.21985890110356
27.0905549990782
28.47958800424439
12.350208628603893
23.03627751595911
25.925494498071643
20.91952654204312
12.671707355273124
12.000998414224286
23.32267718937087
26.807551494367388
21.71132314615632
26.54294773795105
16.71976546301939
9.565093797913518
14.293449856573949
18.795598567551746
14.414416471988206
37.39393867188269
17.06287834489365
16.13084253263263
16.524652938734604
17.89105636243081
17.593213995592944
14.134043674815324
13.005014164388564
16.041722315563472
10.815377940555713
21.180950363851707
16.160298059648227
24.702292769067608
17.92877150860121
24.905849205782214
24.479732549161177
14.272364429112606
16.097738334642894
11.155524602553914
13.980222868587365
14.349857142581156
14.63525608634574
20.855381954340924
14.753579357086087
12.383815393749249
10.43614327739085
11.94462080073276
14.93316952618386
13.292761664725028
8.787566687996232
19.464732956228442
21.00875368477329
11.016695164397133
16.07573945606883
12.779504485640063
10.293740875757317
11.5486913079405
28.150505704882647
22.653349630362143
16.42933877713838
13.026864619483495
13.17646347218038
13.47169234689482
15.210695204028392
15.807213802990095
12.730360179436612
7.679602721118222
21.8848174368498
23.639883330369702
28.91349188717987
15.930503450003982
14.966390164126155
13.349243684325387
15.757386266821065
11.07581809094516
12.094429756942134
14.892543727548725
12.310053040696404
15.706132279104445
23.359416706238274
10.177483328506211
18.567674981969873
22.956974268028226
17.838472650023856
16.664062862974053
16.240717211482814
10.329202905214078
14.385182787173715
21.660307865363773
21.26880128584482
23.42695549650108
21.6867739568677
10.790173141151335
23.399863394619665
18.681758748316906
17.397294847598655
27.276747689845305
33.53462601178486
27.11299595990951
18.62101137718296
23.806960203844124
25.499968799455186
27.68209524947472
19.392534370538247
17.340032570972518
13.932067553747173
19.75306074116361
