927.8086666666667
1718.3057280883368
902.2350397127625
589.580452920143
577.2891072891073
598.3478260869565
611.0540897097625
539.1639871382637
716.8231225296444
1209.0599909788002
1084.3933755117232
1414.3862134088768
1727.6920182746576
777.4116983791404
881.8862990335417
1224.134552580013
1225.656191661481
508.96662546353525
462.59289458357597
1222.2251602564102
1300.8668918918918
1221.6767605633802
707.5985324947591
992.9975669099756
732.1866205305652
1053.9013793103447
3841.0965789103197
2598.3543918564387
1927.235321969697
743.484756097561
625.9666666666667
1285.3468850541094
615.5172413793102
2551.4440524193546
1776.4098176367725
1498.1571719226856
2026.3696648179407
605.5446808510637
2262.7221501390177
1106.2393272962483
780.6059379217274
1731.4398699373596
1592.2100115074795
1046.6594827586207
604.1797329681616
590.260256131973
593.8
1958.6851211072665
768.5416453755748
777.4419199091168
675.8719101123595
689.5097493036212
863.4098234842671
810.3707501349162
2343.564650488953
653.6786697733531
311.2971014492754
861.8851485148515
522.2011306158881
904.9677716390423
480.59113796576037
486.74685267097647
1027.2126410954559
562.2170767004342
1054.23984891407
168.2826086956522
819.9363312555655
696.4280063291139
747.1612356375964
558.18650250798
649.1769074949359
304.25301204819283
640.7125693160814
388.7956204379562
1142.778735632184
415.53615960099745
942.1544980443283
1835.1801295896328
770.9297381384496
593.4734513274336
734.8175890585243
615.7689655172413
391.22839506172835
335.61759082217975
698.43544433095
708.3465982028241
285.78542510121457
603.2337986041874
1076.280509720634
498.5438395415473
756.6262765663814
493.1109709962169
310.7757044935263
483.4881693648817
392.8572278405711
356.71729957805906
446.2284644194757
1195.3338164251206
485.41731562070544
862.46399447132
586.0299066568409
374.71865443425077
590.2006257332813
882.2699784017277
312.8502242152466
460.4615786722425
647.1867436231614
595.2750845546786
1327.1361908467775
1054.6309370988447
628.2469680264609
753.9734345351044
776.4439359267734
668.6196428571427
666.0482076637825
572.3963838664813
653.3532818532818
445.63385354141656
664.7311752287121
573.927536231884
652.7294847328244
393.90678941311853
807.9571111111111
744.828629032258
550.8438390877416
1228.6284972708881
344.02933673469386
822.1863474603688
636.3742478941035
563.8873773416592
517.5166380789022
530.4121532364596
1146.3878357030017
698.9544324772162
