1.2565337568621595
1.1960091357999396
1.2905905414586007
1.1644353364176292
1.3304643667094465
1.3944274875428095
1.5757231841217352
1.2920729916806206
1.3068557117853206
1.2431347225269838
1.338769793595598
1.3405767230144727
1.2491070747850197
1.1988136940828895
1.278858890827114
1.229531925015481
1.1542682016285857
1.290597627773729
1.3653203271519656
1.2100132781427824
1.2221338723460666
1.1620684309701643
1.3618859813140547
1.3879228001452408
1.4329275295223478
1.2817900674563183
1.2132298277901628
1.235812182866184
1.2438447886028556
1.251223485234445
1.292304708117792
1.2123926269818872
1.2296749986055693
1.1644562135226961
1.1748771688460553
1.1925691646284682
1.3599048517014525
1.552744514282221
1.273619641764256
1.2051710250091001
1.2121098194313364
1.2495067653862793
1.1956452998937157
1.24665114734425
1.407783929289071
1.3808494754770402
1.3346449109557774
1.179724411906967
1.3284302696915316
1.3955642983728378
1.2969682086184642
1.2977419644443435
1.2511254544902959
1.2948451438651056
1.4627292459435697
1.44442708370617
1.4457753870367722
1.229805453872898
1.2876477086284994
1.1787020898796454
1.2038513183433632
1.147730113637858
1.4212139251333604
1.3009600019199823
1.4215505668926731
1.4505283387088874
1.3089968471326652
1.2897035634553526
1.3682458897569876
1.305749762855951
1.3062897055039977
1.4872162257182937
1.6159942722283145
1.3259775536548242
1.210833897682957
1.372097411696752
1.2592500071641557
1.1684996007729165
1.1830657451970694
1.3654449613891146
1.3531090151157334
1.3163342808762464
1.3872308920528067
1.4330111695228764
1.3637933952073336
1.3085861762365971
1.1548772116574524
1.305003472800058
1.3085056262544086
1.2855331801720082
1.2312374978062397
1.335585818750061
1.3599065123369543
1.5235951008458388
1.2218453060588903
1.2773249163859808
1.2178195397377765
1.34970380603257
1.3170181098395377
1.4172270782962264
1.4232005976519295
1.2080237175424582
1.3101487431918222
1.4337411849257955
1.3998678666674482
1.2522684296222408
1.2694692279770157
1.4933427838637958
1.292234526934665
1.2028823844598848
1.2549705480626885
1.2445320552977184
1.2411231150793078
1.3400862761744758
1.3979733461410615
1.2020293241650253
1.2735405976371592
1.2198932418803343
1.1864698337274615
1.307258090188562
1.3311579033891774
1.2686512121427491
1.2235570810914116
1.0907622257689635
1.1406061216053731
1.2027763951004316
1.225890999180897
1.2358178572995873
1.2717433429122829
1.2904386085409365
1.233181748785409
1.2761575627538435
1.3076705801492077
1.2866372000471875
