2.5747852261468487
3.2663880359100994
5.287956585246734
3.2099522151879762
3.442138180790994
1.9078305551604393
1.9012603269918749
2.0165186993410904
3.128141964918333
3.3975366668377833
3.9731067297932863
3.64891043402832
4.3413591998200785
5.313559051703445
4.280014778755979
3.8870010529480044
4.155017963795163
1.7108062868662648
2.924534891318722
3.8567827861092225
3.430388987845974
3.949847638393436
2.90563700809961
3.1724489007183565
3.652599159454494
3.801217510403992
4.85535015540392
5.6432247043755535
4.194059615605098
3.5646996256740633
3.741900356463629
4.598022178920456
2.9998120166800066
4.464085867576125
5.309665741725571
4.850522628634315
4.225813311928187
2.7687514476824844
5.333830850609253
4.214151010321357
4.1890558118835886
5.417614511171898
3.4830900508606004
1.2756772119505297
2.8399298431457547
3.214936760696779
3.4191389099459473
4.42735299037645
4.118695738395499
4.204476070585403
3.2729294071791393
4.375959370487565
3.928663652543816
3.706746356272688
3.2406717441402795
3.817428905527906
2.7651265523443627
4.200148699893254
3.4666009225633756
3.6444760935256
2.186179429763359
3.6190841712179953
5.262132806603441
4.370142943180562
4.911905590524216
2.4922586555660518
3.8057228816033097
3.8275891567273717
4.199563489252728
3.7939503020750722
3.743859447410504
2.7574418334063653
3.096193711913632
0.6459121183957742
1.9842059735803455
2.578774492607934
1.9347350877575926
3.0157644412172844
3.4007851178807127
3.25982806405013
4.409725781848116
3.3368345292898822
3.630419433418914
2.859535563496283
4.966902487305093
4.248976879260002
2.3406870869219203
3.8450408257247055
3.9740865499026325
2.9993218542278766
3.4910322404761143
3.4439772524316465
3.3263347036502715
2.0853770235766618
3.117039973350661
2.7534052322300586
3.1148988715289296
4.325351529367121
2.909490611951239
4.275184179349414
4.336077858587118
1.9207565361233305
2.8445220516434433
3.6425375096924055
1.986399998712582
2.7857311909094675
4.123278399564975
1.97005879664705
5.209917669706663
3.874396533412332
2.8468901590571103
2.596590785270226
2.355220944591436
1.8200031995841703
3.2519983741573384
3.13949931134534
3.7779074474407417
3.0274141540664723
3.317625804141535
2.688853701836559
4.087635450478422
2.495517591844675
3.228115539857656
2.6122670858927104
3.6146633418771605
5.374515106083197
2.6349859658135473
3.963228001417677
3.024113263562936
3.4739670629093404
3.4045260756837754
3.038041180855205
2.453085405521697
3.1740895341304136
