12265.20538330078
12012.004852294922
629116.0583496094
6829.261779785156
12378.215789794922
17015.933990478516
18655.30014038086
17300.60577392578
31109.333038330078
25679.11148071289
27106.761932373047
11999.130249023438
37031.65054321288
16033.172607421875
70125.10299682617
11574.268341064453
24876.59454345703
28610.2294921875
1895.4277038574216
29078.006744384766
118414.87884521484
79204.55932617188
93432.42645263672
55778.50341796875
35588.26446533203
16159.0576171875
50122.26104736328
646768.5699462891
93154.9072265625
362391.47186279297
4900.932312011719
37854.19464111328
89375.49591064453
73216.43829345702
50259.59014892578
17977.237701416016
3194.3321228027344
12621.402740478516
64395.904541015625
14831.54296875
14662.742614746094
4149.913787841797
104930.87768554688
101683.6166381836
104026.79443359376
14978.885650634766
31030.65490722656
9942.054748535156
53260.80322265625
18339.157104492188
9192.466735839844
570530.891418457
25228.500366210938
14848.709106445312
6734.8480224609375
5660.533905029297
11432.647705078125
53409.576416015625
4009.723663330078
26654.720306396484
12973.308563232422
104839.32495117188
13489.723205566406
48385.6201171875
10694.503784179688
