-1.0502173985066436
-1.0923069350068089
-1.772147192067539
-0.9536423544089726
-1.1115577002272106
-0.8705799492234985
-1.0109953246350039
-0.8738036071648654
-1.1978808903108493
-1.1432129807155824
-1.1560696715286907
-1.105716183042307
-1.2393497473869342
-1.548181998811647
-1.471572740222256
-1.2410349759890915
-1.2192293223356219
-0.9690820330714347
-1.0835816182612132
-0.9275487793885657
-1.0606965360420768
-0.8167347502681542
-1.0626234274601998
-1.0820990270649826
-1.3319981177804212
-1.2012197275211551
-1.4279895874978272
-1.6651224320301605
-1.324484880170126
-1.2455893061090197
-1.2783462188456587
-1.4230865060874691
-1.1367873985019286
-1.0324935055900732
-1.3172126919869938
-1.2677906196732098
-1.2920515120182463
-1.1164733423113908
-1.5110716683063687
-1.3123790920139446
-1.283561119830237
-1.6405704658060583
-1.1826639005198427
-0.5632956566594141
-1.1756870275900793
-1.3289025731644923
-1.183868955374916
-1.3056672689056312
-1.4208373740552682
-1.4521896712346674
-1.169305053216126
-1.507870324756623
-1.37897151512655
-1.2003268638754825
-1.330873800531829
-1.4728256549180465
-1.062359015329016
-1.5067683499700881
-1.3420344855936737
-1.2602889931943368
-1.1523696341582825
-1.1615939830730533
-1.715411279603104
-1.4352420573429177
-1.6315419268760918
-1.2075464114328707
-1.2899825798219051
-1.3192669429752795
-1.417504516680731
-1.3215208760037367
-1.2233541555612193
-0.9619043659558375
-1.1915136317965729
-0.758389861131882
-0.7043295266900839
-0.952266330772056
-0.9261823245679714
-0.9947712324328606
-1.1976241563747752
-1.2023143223856911
-1.3135460626915036
-0.9882223248274661
-1.1652228357020307
-0.915308305592954
-1.6404499571063798
-1.4644326080787922
-0.7136972466406419
-1.4960211938709165
-1.4615861494554245
-1.148500615049538
-1.1746720812952698
-1.1702472914834148
-1.1964409315449345
-0.9433341960166729
-1.0989036716676177
-0.9930404424593527
-0.8999335006010344
-1.3025021478517989
-1.2052962451269928
-1.415131382875642
-1.4088374160307287
-0.6536461048480526
-1.056441397800419
-1.190036120567466
-1.0182091591395541
-1.000060429151628
-1.3149401129957492
-0.9609581021950215
-1.6871757960033997
-1.2650660925303787
-1.1046467066283356
-1.1511220836169798
-1.039885717976244
-0.7976235616280347
-0.9784789018979523
-1.0003353960550276
-1.2174561683461584
-0.808728916916429
-1.0132693708428049
-0.9767056256916367
-1.380971792053579
-1.0818891842780822
-1.1127328385140602
-0.6899781420612414
-1.1041189605465467
-1.6843144401085355
-0.973953012211709
-1.4099184859324314
-1.1993765178985452
-1.309407796207654
-1.1716487628739536
-1.0999797946672056
-1.094725297706855
-1.1797539384542919
