0.2938928530816212
0.2785293262339709
0.08253096228048794
0.3038324676171491
0.2682423865999261
0.3388420826336904
0.294004051338946
0.33344085936587875
0.2287094230346181
0.25903361092031
0.2649390000748493
0.2719111207618292
0.2055068316603008
0.12344649953266072
0.1338347536391518
0.19912855868709156
0.21151096173777548
0.3597230944889339
0.2595493112695516
0.3830700141207106
0.30567065789761944
0.4055811822725764
0.2953684422393165
0.25990036302588904
0.19686831276344385
0.2324237028007422
0.16326245729547548
0.09810561398512678
0.17940966030486769
0.2110539405012051
0.20720554915524694
0.15677307725458478
0.2588374116360533
0.2655385947725037
0.211162297933857
0.1847802239739205
0.19544438814637455
0.2680305457834665
0.11116356450085392
0.20171832675081772
0.20206413998343187
0.0974879285135248
0.19364501811407492
0.4996813452496734
0.2479085565573929
0.22780069162849206
0.23019818911269144
0.1753902452760119
0.1331369104161592
0.15777304701011474
0.2112303879134571
0.1226390877146534
0.17182389057134584
0.17701667837724422
0.1828674127010864
0.1308250096090451
0.2971202262093331
0.12863001687619602
0.1752511064481812
0.20774593664568408
0.23016465584796744
0.23123025693287164
0.08240700492463048
0.14782995616932626
0.09438036034601284
0.22756236044970665
0.18256042222364946
0.1834038265900917
0.15380149847668442
0.1813888556396645
0.22413484072747572
0.2981131164567995
0.195286875605836
0.3849509416339768
0.4679292025990972
0.3063915685628141
0.3510176756680555
0.32673622533895663
0.20366731377365915
0.21968984186484666
0.203673959995616
0.24984496384084104
0.2506749073541243
0.33896185062149464
0.10259862584741099
0.15655306576119996
0.5339574350239653
0.13750539270943218
0.16486998873307632
0.24840281201548794
0.19176720538614106
0.2386094564461495
0.19479031896357105
0.3697103682701675
0.2657288862154403
0.3759181560826649
0.3721632535163751
0.1721136361580079
0.22431742387115056
0.1655470074525334
0.14876510320472247
0.4754783123273635
0.29632169305936223
0.23311793651610596
0.320716826128015
0.2641882191992116
0.18691186457652129
0.31169899780148563
0.08989840123618313
0.2072025718773408
0.2443790799097988
0.2340069622929905
0.3194700203675823
0.4245414572623844
0.3134999517620799
0.26868157626322103
0.25381874171299085
0.2572611875392563
0.23523361509159035
0.4441179735742994
0.15518843258164422
0.2713561806251999
0.2497719576969976
0.4648937638586251
0.2841870488446358
0.10398301923749499
0.3286877536924036
0.14567453601079486
0.2591591680674876
0.17169226516266575
0.17495650611186114
0.24539167306440055
0.26991354347286056
0.2724891115608017
