10.362754532622837
8.730873040959258
8.592081516714508
8.10246977530641
7.7860047560592465
10.084794224193713
11.185730815480396
10.44975777661657
9.435146997164994
11.862341411278296
10.344967406793016
10.16534251270225
9.013456671867104
6.694805857081098
9.507535376340153
8.113238135666844
6.9270130165369315
7.269861117419878
7.202216597239127
10.783789490471937
9.038999684202619
8.59050567105247
11.103972359286168
9.614711945450138
10.525786333182198
9.540712335029106
9.476043765224613
9.96066969710113
8.29765371078617
9.946672005616765
6.904381658225714
8.489982857616086
8.728208604508016
8.505270362231848
8.111165024726164
9.292857308002967
5.846106067741373
9.777408367895124
8.262148368905754
8.436565145883348
11.289066428986194
7.156551545499602
8.811854601208227
8.542429604642766
9.090429241153425
8.726089356280223
11.657491158304069
10.671098988508625
10.002234442910849
10.035368004014574
7.891886169181203
10.573652165194664
8.812201714395274
7.646799453182886
7.769701097030404
7.272594347589243
11.129029044358854
10.92281484379472
12.083833979822463
11.452345830759532
8.688103726325236
13.10992363208752
7.736722601323558
9.934818268983275
10.685670698843618
