342785574.8077907
73268744.5864318
201094407.67120782
982825174.8038336
72229108.76147507
31289726.044901315
11056698005.205153
350292147.49598604
1020115735.2129047
664848082.8772426
17759086519.922634
10581349070.807585
25350947.16014196
9513611638.498608
358441001.83612233
22143261.00087905
85666090.86656404
148602639.05905324
631160541.4983307
608773174.3674157
57411772.13030258
11057587.434613027
77197606.63956842
802291790.8280222
238177473.7097081
260349630.24221534
986960829.8191288
708827739.3417674
53446967.70422851
35417623.21608509
407520.8590024729
59501804.30919094
40402675.02730385
40803819.71576365
74367338.20377758
37408757.7930785
111259383.35364498
113452737.93294558
19881319.30636888
27358732.53416606
1133771157.7695491
361489505.70326304
183522146.37983975
118515884.43089676
140104158.4151983
37286621.341714695
106823794.24172124
4803205122.601422
1625406046.4947278
127992431.14983326
16882405.663702734
139311289.8722378
15791051.009352198
10635930.141848512
12650174.414103853
126908227.28775656
344745200.57703054
606683590.7831719
431725112.4325902
2775219271.2168717
120309936.33933093
172610772.02235782
39907591.17753852
61537663.64736971
762293464.1719698
