0.9510076005053816
0.9429651742648856
0.9143095679934482
0.9361597773289948
0.9193276266282866
0.9252823137411099
0.9178776666619644
0.9557697295828002
0.9312380140283208
0.9436443527160508
0.9183008194697844
0.9167586234336872
0.9202938407896792
0.9281990776193756
0.9220221192066372
0.9239680825846576
0.9433686197625164
0.9399566174288556
0.9381359524053862
0.942141813997646
0.9461338760605612
0.9519802609935216
0.9447977525271782
0.9245148870096288
0.9287930694194392
0.9399081123618994
0.933209079665812
0.9310982628068084
0.9369223159089238
0.9510620952280396
0.9398743612199022
0.9362518774876056
0.9514562124206224
0.9374666013192272
0.9346114311646404
0.9288579586926816
0.9222702620929631
0.9038379727041148
0.9364288861729164
0.9443582820598816
0.9368861743888404
0.9255514418756909
0.9368416145164968
0.9796138689627594
0.9253679520754664
0.9128558226875908
0.9269615800704016
0.928734309049322
0.9147461587732788
0.9142064586015092
0.9125197023058342
0.9288065170549356
0.921011285162057
0.9286117204929062
0.911659023430414
0.901736540677404
0.9105921465645288
0.9202875684090928
0.9202977419312152
0.9220246952670464
0.9222905721352136
0.9291159430600924
0.9077605170059736
0.9313409355521528
0.9077481453903627
0.9161669880595874
0.9413966097601734
0.9397681612313892
0.922726464773758
0.9232775811268941
0.9252462538399993
0.9287618524396092
0.9066831202348994
0.9314869061442088
0.930300059374034
0.9342046204423052
0.9359383864498332
0.9368704721932708
0.9388708979829528
0.9303735745639374
0.9229014036220666
0.9229014036220666
0.9109494438659144
0.9331543791908828
0.9096968398809681
0.921438327805564
0.9052249605714794
0.9202233144641152
0.9260555964869291
0.9213112779391044
0.9349121052976924
0.916390838531968
0.9148161224503191
0.9305362031064272
0.9221543586030304
0.9176365201850312
0.9289676702886452
0.913022458928808
0.9193883264327368
0.9005100052472782
0.884087731363869
0.9507863637939402
0.9221100970105544
0.927036283407676
0.9214206624680792
0.9203081100769632
0.9160786076592502
0.9105896039172224
0.91650949890205
0.9395374065629708
0.93711965617747
0.9464292971715854
0.9388718573131252
0.9364893118860896
0.9224224328820196
0.9380108205514106
0.9313853564672276
0.9201397810893296
0.9370278673572792
0.9356133878283144
0.9142770218967043
0.918598447032834
0.920447487823935
0.9399196153973604
0.9220973284846768
0.9283140826503402
0.9177969527494332
0.9236768258994684
0.9464300081061872
0.9208987515635108
0.9201535530768168
0.9383851633390526
0.9366989739615004
0.9478919598450792
