28.557862785500728
25.724271536222872
32.102520721906515
29.032072430156497
26.972292441829897
25.62885645360142
36.15735762821121
26.92249064163723
29.33030297126536
35.02586632877266
38.03456496819378
37.4176854510921
27.039699087450316
29.57029204566025
33.010114729119195
26.035437080859822
25.54849147187578
26.551987441682993
23.643883792592966
30.722501637250225
25.996655673423586
25.966790840416294
29.08801667402505
33.78796804499472
32.577949055212834
30.328159517407904
31.0211353292719
33.802882376046895
30.131202167975847
27.6325214623319
18.195595070729674
26.85432919171272
25.33823558645187
25.819541194382104
27.979198569359138
28.59396475740438
24.738146753488518
27.128863144908074
25.72324727668365
23.37448169759008
32.864135342799976
18.572813733858904
28.900357044276404
32.81190368867349
31.28666181063053
25.644636546380006
26.95367135790867
32.86597129486567
30.377094202966774
31.257633455363624
21.993782279849558
33.53422794651465
25.6686558117263
21.835666722183166
22.477754582916774
26.523067355169616
32.29459008716168
36.041609475632654
28.992970762073856
34.39331791362532
30.044527917068116
30.62858933530584
24.62987205692278
28.573571601644744
34.477907844181146
