0.08117860981539332
0.03666950640911549
0.02556565086074204
0.04112727943424632
0.06806836832071418
0.07078762008534936
0.08899581515309454
0.0961846233926475
0.033105545902237674
0.029198676896817686
0.05586753332463
0.032100434813205334
0.02165604934913341
0.01898193722977261
0.027043788573684783
0.0727542284092041
0.05140192085174543
0.05040876610709608
0.041575465394874535
0.012293875362162771
0.0421900345504314
0.016237700302791525
0.059340132717210566
0.03738418342822837
0.026800322707883392
0.026024537444640915
0.009632810801205215
0.011832408956598471
0.03472699640267004
0.015357177733348952
0.013560171896149378
0.012485131431544543
0.07611053824759152
0.02658529388016221
0.018173481501054384
0.03724118401762449
0.04484350482503072
0.0361915190123499
0.011814907876203349
0.008964458082643623
0.01623720662249376
0.0075223539785929825
0.03548766124523012
0.07258943859031443
0.0634427582271163
0.04141866771008885
0.06347674935859735
0.012314481695179588
0.03402128220703807
0.030039332323747826
0.029504635002087318
0.02915960903698267
0.05562389937757014
0.03883541331188866
0.06181188918888974
0.025579124180628892
0.04895489959925616
0.03938017932572832
0.043505479394912436
0.028005158119725173
0.06769227031960627
0.03747751543942731
0.010400788717711726
0.04876962500075322
0.0315120544482624
0.06092493987687155
0.037564143312844064
0.043021289995416184
0.0466751212847807
0.018908232519220185
0.039624561205469734
0.05601939716388707
0.06983072771933445
0.06813949812770911
0.06606412496579528
0.03820882820889627
0.08699969240168329
0.0417619110333686
0.03107441356281417
0.05193177848368237
0.025898815025777296
0.04286682032469688
0.08366700427313517
0.08387726330113429
0.014780561494847962
0.018753192919837656
0.0637053256206966
0.059393368184536374
0.048585398856357716
0.12331068175113255
0.05885160191658561
0.047870066292658886
0.06919431218365865
0.2244707368282074
0.05013189135741089
0.037183074326209015
0.019989177192603118
0.027503075759336457
0.029821715026234256
0.05883723649860999
0.039042436286437984
0.10950037402103373
0.0660987408107469
0.0240358668568452
0.07710128559056884
0.04982390814679752
0.02528806214080833
0.1060787580217309
0.024168491198158296
0.014074930543445803
0.02239478779935842
0.026560047474771444
0.05826542015053567
0.18502807924776984
0.027966496187077618
0.05074829684969269
0.035391653781250566
0.027476584579445337
0.04022056111132917
0.07418267123245957
0.019403523240332638
0.04958665204378627
0.05945735510892443
0.0383815072552704
0.017854312111041756
0.022382142757821133
0.07111559463116142
0.04472346259862761
0.0437204495425284
0.03413302846700639
0.08436773875992523
0.035902398729948146
0.07938529131514314
0.030001631090962436
