-5.175259767704074
-5.212897038361098
-7.057713834389346
-4.814397701891407
-5.127434589215188
-5.299665241137978
-4.575134297230693
-5.456245166892317
-6.002689476486811
-5.783570727138542
-5.901731639604125
-4.2971007739225815
-5.990933648295698
-4.702983829398494
-6.42729968904625
-5.172377078874309
-4.894226852307526
-5.099962720476809
-3.8027140206906926
-5.270951842824981
-6.157476225193991
-6.003260574275496
-5.68529128855751
-5.908238671628028
-5.536026978219089
-4.8285249869914955
-5.790496871445672
-6.873854488246556
-6.219495348038217
-6.698630756727091
-3.1634102786435863
-5.501704765469713
-5.78226698163626
-5.215031906323754
-5.161833795233059
-5.4406539933996925
-4.1992402841711005
-5.286267655195145
-5.797703320937102
-4.233324815132186
-5.363772857869383
-4.4563205786157445
-6.384753157366848
-6.220277663308147
-6.235174376243653
-5.262351180366556
-5.987572802006809
-4.968826720866035
-5.7670204713163145
-5.523020823870068
-4.780538025098303
-7.415338762833443
-5.104051587078879
-4.5867023527760376
-4.768697553757587
-4.650930800856598
-5.15100384306415
-6.347782714768655
-4.172003628895074
-5.863942249510889
-4.968138433378304
-5.828343915029349
-4.307631121169459
-5.348261745565326
-5.17165623431314
