3128.1746392999266
2417.6833982460835
5631.099025769372
3104.8475430241506
3111.3007056411907
2911.4257484045015
4950.607535031112
3192.3784993340805
3733.1831414555245
4794.980983190324
5573.680372788243
5161.769673126011
3541.6271370722106
3283.986368193291
4794.810562900474
3028.9342556340475
2675.6412470470773
3085.730863120269
789.7604427118406
5042.95964511177
2870.927982643878
2962.770348854651
4051.495965493119
5162.9974420316275
4523.080602706465
2767.7869746955325
4395.022629470597
4345.310262233789
4213.156603760985
3294.957791080029
937.5842810518407
3219.7761739511707
3292.812194055034
3536.1874614978433
3563.208310643553
3783.737908237258
1694.1873543465697
3408.8979736354613
2723.0990931453016
2013.7820035498355
4838.622233779689
1016.420902263271
4058.2812696350475
5479.062496992871
5125.2520894851805
3037.88885850955
3168.6267810283553
3670.760958363071
4589.881664660354
4287.276080365962
1848.4438845451368
4405.540984658838
2707.4233401907186
1835.0111263637882
2003.6867330990226
2386.4457294489625
4734.040782259387
6462.911115740515
1955.452563093669
5326.697761445608
4281.476092277779
5035.125080206934
2405.213120030109
3386.6571398911265
4038.7539336265263
