2.8257236052174948
2.427415046392547
2.487804368050296
1.6180655943084217
2.371626912331204
2.881847881342662
3.4452139630162835
3.0523737435454072
3.085703218306588
2.0812177468759345
2.1511083468533507
2.201709144299063
1.8068292429282624
2.0302142207314304
2.5756798765264484
2.2224559016889462
1.6961624597821634
2.625768387757481
2.528238291326007
1.5875742541456357
1.544670491533504
1.408980808518824
2.2872679950463253
2.414819413436293
2.5764069321318224
1.9394311658778147
1.7313166771555637
1.793040114557729
1.9086693760819555
2.052988355125176
2.236666595732573
1.8495808330970187
2.000058477911359
1.4845541979129475
1.5236971430788708
1.5937514559169932
2.309267911436357
3.269368086237176
1.8346639755713985
1.5722031105562866
1.5711955445963086
1.7448654567356838
1.5927989270029492
1.89437313462054
2.9397851681206504
3.4192929768283102
2.5453188022200965
2.0849816975168776
2.6785293153057532
3.0439574353778367
2.3910033835035374
2.348117967261293
2.1039420340571686
2.286793208483415
3.3615371079519045
3.1189817140960625
3.1657711367138237
2.2961319590737665
2.742934066121812
1.9726063864771888
2.223457577859946
1.7822608998927931
2.734751318700964
2.1303729803588967
2.7179454924159097
3.061694650416096
2.2791266522665925
2.1116758520285805
2.5289253815564434
2.134750168125516
2.2368923138777315
2.7282453309442163
4.244484967791366
2.111889908249076
1.9664420428768496
2.387814213529931
3.7540362176952518
2.112340726112396
1.7783779389105583
2.5155434635359266
2.53898517110514
2.2773326747574743
3.0592131616573046
2.962540881029498
2.728100193539788
2.3556231785366166
1.6429970351151777
2.4029273194814627
2.4060426226844145
3.7017163613642383
3.0978253526147665
2.958178485884792
3.4337692082540032
4.835900537578177
2.0909952956412488
2.279339674810781
1.9633187592129575
2.3070389900525354
2.5684371991581783
3.214559720438864
3.131535458624232
1.9665110231178848
2.5015594856853505
2.8662638748721165
3.4626001641216897
2.2930077954633665
2.1674200163621027
3.3342505092389536
2.1015261778561576
1.736553764878304
1.9453603593120763
1.912876408478271
2.743545292219224
3.0828320588056557
2.468869144873255
2.045281463060144
2.4892079880791678
2.392593779512583
1.9682777503697475
2.4491815010703064
2.6010988403614403
2.30571598707906
2.5939000973310518
1.5413084788617637
1.856173790541353
2.110580675092762
2.4641610031325403
3.0721652763537155
3.2171130579819445
3.6787295168980174
3.32925930719576
2.3105357139990805
2.4579254271509376
2.3141079749986733
