-4.957360833172855
-4.377382248922686
-5.869601290784243
-5.001442762053017
-4.317912047110087
-4.175199349460844
-5.600028628293342
-4.560034148410228
-6.304667332628231
-5.613233214565505
-5.403302342356416
-5.339522485291869
-5.425071761497788
-5.501722811314377
-6.282552782667271
-5.783220053659847
-5.726651941903851
-4.53880743712583
-4.967385333394238
-5.474772040164732
-5.225100081751706
-4.873290025596511
-4.987987907382446
-5.193853648661611
-5.431829132673167
-5.313087863741693
-7.01529985675339
-6.35978103029389
-5.470897795753963
-5.154220911666352
-4.4512512133021565
-5.734410848689917
-5.464643170687065
-5.772948416283873
-5.878439163988999
-5.579920495647933
-5.834620132650337
-4.74727642775157
-5.787570884367162
-4.780636755622048
-5.498838194867742
-5.756054081969323
-5.260427955614553
-4.394264154575234
-5.441266329744533
-5.404199355648183
-5.3557396082463224
-5.804430183474251
-5.652282691956142
-5.673749224788054
-5.2951263928736765
-5.397252873561326
-5.415010767813007
-5.2057443443798554
-6.344470228008779
-5.826095877520166
-4.496098790810919
-5.762197440308091
-5.3446739709005575
-5.421597716710278
-4.54511942747699
-4.864904896345943
-5.987100286818872
-5.109769554793535
-5.984477703380889
-3.8350501845854255
-4.9930306705381104
-5.894528556302886
-5.677413955639882
-5.310572165672702
-5.512172717725997
-4.426304780522798
-5.101422070702048
-4.219574074426139
-4.954265769487499
-4.7202108349030745
-5.242888556749791
-6.141381768878461
-5.480123159886136
-5.2800764461379375
-4.846813032969934
-4.846813032969934
-5.055244604843266
-4.079451921604944
-6.093970304020131
-5.15109506875398
-5.115387051351078
-5.959764389442988
-5.646508577574431
-5.539298717546093
-5.779916792729948
-5.3927313915553725
-5.641302491811691
-5.104438002852323
-5.502278720578845
-4.797341779413235
-4.65081858984468
-5.677006766020652
-4.7351995602199874
-5.936637607090645
-6.425821811436927
-4.716131460774016
-5.3537692164483826
-4.528513195273661
-4.782957722718111
-5.375004688576622
-5.149498262167006
-4.73743216380786
-6.35921990425564
-5.127572481939377
-5.00197901069033
-4.66891375360787
-5.243043616993444
-4.79186654950482
-4.202434943148565
-5.070550377160742
-5.594623249441014
-4.7132558982262385
-5.222058787050953
-4.859571404503816
-6.05171232571579
-4.900890539024121
-6.031898907367158
-4.603112343973129
-5.620366668991733
-6.469529398991845
-4.977174280998131
-6.5110893630124025
-4.2482207808912325
-5.531361686099823
-5.691866991598447
-4.52790390902445
-4.543194016899103
-5.044235709810239
