5.102392225070959
6.271828507309246
6.490255103243445
6.391784544193958
4.794170728445068
3.4461651198799905
3.297822554770362
4.351324944439726
5.698557510773085
6.343925465834719
4.628644117215787
5.395361190868661
6.127176301882165
8.66278862580266
6.150561045851118
6.917409034016238
7.923227492314748
5.319990332544868
4.362244844823384
6.788587706526024
5.668740508538311
6.857838676724499
4.350018708713226
4.805518164536833
4.5195599761151675
5.267705996287138
7.627250925361615
7.191049042868706
6.434525802801302
6.78133529034658
6.966608285580907
7.421991902889093
4.872705899598983
7.058233642404374
7.215851202187111
6.492005312742895
4.335521323180873
3.8524424947420646
6.5328662332548255
7.281497169703419
7.0040758507498655
6.956274128253823
5.935890204661573
3.8480372106830383
4.7926150114037345
5.513493186714163
5.005028129438865
8.41749355532108
5.704995701596765
5.296995515097457
5.6143909446983535
5.912781765915149
6.3986826152694745
5.295923124218572
4.337783581018576
5.191466541133626
4.133190972718333
6.496379674614154
5.376093386994521
7.221789113751545
6.061740758060843
7.3953246869650515
6.333364792859202
5.3163697051576015
5.3465708274641495
3.7883552892404904
5.0846694016484175
5.159386301214485
4.889940511665119
6.046909438058599
5.081444177574471
4.007183078511227
3.3338736309081787
4.038905128908833
5.576657870194455
4.477160279506201
4.394604001605976
7.152241604019344
6.842925494818686
4.91375316644977
5.139910665343812
4.749565354584442
4.292044734676355
4.412545558784815
6.79028790914747
6.660216950813438
6.005508419982605
4.8462751226540455
4.942021810278307
4.832778867478496
5.511109323190473
5.666394366573511
4.563731628277923
2.6768171982614137
6.440299187509476
6.484059512256379
7.246096412179385
5.733645076883254
4.943712661120902
4.843713426290574
5.237676206037374
4.824135348862474
4.551429912837163
4.6382330349084535
4.2830398481487375
5.772544497287728
6.596607343782426
3.6051961884636605
5.8370259708369785
6.912148335483319
5.901939901802858
5.989751730493121
5.536920405333455
3.8981774012066017
4.847162422976423
6.3829391762694305
6.146685262845922
6.655543539450129
6.651612384790569
4.211437997040115
6.0816487040065486
5.833437434117755
6.050630851594818
7.727938920663338
8.688957951189224
7.638703674906349
6.107913046279301
6.924420641827143
6.777766584893769
7.137265528545859
6.083161288036144
5.583234892132764
4.695393872990587
5.846879395085268
