3.3994424322385
4.0024363336995785
2.247437776212271
2.731072825890895
2.1720872199587875
4.100414239459172
4.6420979451885165
4.726557270742028
4.000433737107518
3.6527864651386963
4.430175105052845
4.726919376368032
3.5055610714637697
2.6959789257165094
4.01048817566674
3.1998200085698727
2.921180764192784
2.653557933078364
4.054988701727708
4.20039070355442
4.907107879534045
2.5183435214811802
3.787057289157527
4.237233596373174
5.637309332020459
5.3067719774597935
4.51445406451966
2.6189955447182496
2.3744661511916068
2.6823820767905695
2.4727157151511343
3.51665066025074
3.407624731830368
2.7341928619678457
3.2706231139343647
3.465915769296714
3.191718313287081
4.602553035887525
2.890574473037097
3.0062829088465834
5.133112124196207
2.4567949042667654
3.4402793010527954
2.734449992335075
2.95459582938191
4.1720926744706714
5.265260489851191
4.135177785995294
3.590671357678473
3.1738539219125474
3.9256009616135112
3.5217708178897924
2.612245322912069
2.1814725435954907
3.2350870234427016
3.1585307286663564
4.6248996591725575
3.809915640509416
7.290572930758739
5.02168373166179
3.3502500116478235
3.81146073266294
3.3018360537395526
3.649726244840196
4.0882991115014935
