2.314777443893459
2.3064082985917658
2.316923281642994
2.32186787637142
2.3066211186805305
2.297075004486935
2.3432712259277704
2.3272606394734185
2.3348743538147376
2.3232396373817394
2.345752122991732
2.3385548752892884
2.307510291172697
2.3369955197238865
2.3215787601507336
2.2964002129526397
2.3105112346337133
2.318041038319217
2.322779580927192
2.322872207532301
2.323900767363754
2.298924842185344
2.309630813611171
2.338330054051939
2.3112531858006142
2.314510897386762
2.3444209465247776
2.3505858437454097
2.3109770218806305
2.3132921377553117
2.265363642845591
2.3124442653728625
2.2966503239178757
2.3004263511929537
2.303913384846829
2.30425717379486
2.2990580349088057
2.3123780612426548
2.3073810589874415
2.298148902989034
2.3275213265279664
2.3265032397948864
2.3195542465515078
2.3104877617928397
2.3136332750882858
2.3043141265169544
2.325751362904611
2.3338353651829333
2.3325805908502164
2.3139076529367775
2.292541931772028
2.3300176382000384
2.3009335801615016
2.2914479152205036
2.2899796402844173
2.306059462742259
2.306990220516701
2.335210998500173
2.3186200731438986
2.346998107279892
2.299748995227374
2.3107217001860287
2.3035368835030603
2.2956024565620257
2.324034054408917
