7.704333048604137
7.0807980237867225
7.468125787315573
8.1885614051551
7.1347890757895565
6.71156148362588
8.746620025605948
7.756934145293875
8.182719555880912
7.545672710723537
8.989714323072628
8.8858567357346
6.705079417041349
8.934687139696866
7.695025357671247
6.698467066696687
7.314440293709105
7.309399491684114
8.05488039463083
7.90486939472867
6.81316016869375
6.269500806855562
7.102543989613155
8.076067918266368
7.6693860079636496
7.455506325908319
7.8204881591574065
7.466171869421706
6.9752002467900605
6.581405054355345
5.014481387743147
7.131540422189993
6.718917643789919
6.879807650340293
7.192747392690097
6.888797134165997
7.329379352859391
7.378953729973208
6.645017241532274
6.69120685352842
8.218015751121222
8.009010285423184
7.430897752124241
7.397795091866653
7.310484027370606
6.649562216872917
7.186626183767413
8.839352955440368
8.04355682702064
7.415976888615401
6.520116947583332
7.0940827360233865
6.515077577984559
6.271834406681199
6.487990774547988
7.377815239529792
7.849974108800718
8.078719818461446
7.939023582202843
8.501336741216186
7.401363139337699
7.437837173657296
6.828659500920537
7.028733761790052
8.249794148825218
