-8.840337959733013
-8.03251421038246
-8.024128066933415
-6.7222152614869195
-5.490408852933482
-7.775376131052297
-9.137575296503803
-7.608556878431755
-6.735017451945411
-8.608324166837171
-7.947217187614475
-8.896652882736488
-7.555121626243798
-7.268832304729441
-7.393102860817269
-5.43771700060972
-9.137693157239005
-9.215981396174735
-3.628016368846361
-8.889677462271845
-7.292239457955044
-7.7695972162969245
-9.4492230178749
-7.367115157508239
-10.259959514474598
-6.700171697647889
-9.643295629396608
-11.409509051826085
-10.112478752606439
-10.84065838302733
-7.6356655734024965
-10.183041450972807
-10.512716289177819
-10.992858824279448
-10.18678762178046
-7.935380058925444
-4.255171316843308
-7.890712346922071
-10.452709687191314
-8.764359424326432
-5.730607408068051
-6.460585712220663
-8.884561160222967
-9.962509070904076
-10.531293843260519
-6.1399729124394655
-8.83132102794724
-7.298275955116713
-7.41790741605822
-7.926541132171368
-5.310266968408025
-12.06340744419837
-10.257268359524735
-8.318232499130525
-7.139627218787102
-5.778141601113035
-8.257281920938226
-8.887255585892051
-6.57129822729609
-7.3307143792041
-6.0443965470662295
-12.141999353131506
-7.053443563683739
-7.481619690389889
-8.805305311137568
