72.96778014819509
45.426477342704075
-20.255497557915028
-25.298484727478808
-19.99061832487445
-9.896551566742607
0.4788562284281384
89.40658869479424
69.0726987024551
28.943067327888212
57.363749880327184
60.34190269342822
27.4130184883463
-2.6987348440081886
39.674209763584315
76.78504074528355
31.13876606452455
53.235321050016296
13.17484777208472
8.809102550235332
-5.617260662601779
-14.82640933707754
-19.02496067746597
13.955554870246832
-8.451736961962219
-15.552678298074206
60.451302478881615
25.24202352249877
50.77837235136299
30.578927391244413
42.318381036282794
15.615014859415036
19.475598991938693
1.5334350141998463
1.5405929999640648
-7.836861388531912
-16.231075062347912
-17.977170646725586
29.021059660456928
39.42028915638368
49.343615277690475
41.36328077875749
49.89918258446495
63.54447348819786
-3.5404391562736213
-6.59987597199437
12.094624438971012
51.869168746599705
54.044932827948884
35.87434210635921
43.19406177469251
23.735313568587152
18.15625276761089
15.469810973060811
35.92306974772273
5.154950529989746
30.61365735526461
21.684619983321443
16.43961877890251
43.38560068961996
42.09114116601923
-1.3442114755061725
-2.9186533241469625
-12.247719935814786
-8.891950540728148
-4.533302920715459
36.88486121102887
37.13028682991077
34.385279993188874
15.839686498589554
25.84782512312757
16.939734412591633
10.547500821099511
3.2598826645755725
3.4191720447248017
0.3738799749707832
92.2859487982468
43.710814643162095
13.522283206140814
25.06211942797148
-0.5603275367159348
-0.5603275367159348
-21.827377504999703
-19.82687045625508
2.8978504451483706
9.671331475478524
-13.169039861066477
-2.471353779960348
2.84603908979984
37.68712347500203
39.37495732431661
19.119787162382085
13.469809634765381
54.37049264843815
-20.823097809591545
-21.57214819658316
-2.4740351078321705
-14.362643555940721
-26.108717975933466
12.233407408771582
2.2583650785665914
-11.245440394406412
-7.651785736027324
-6.404644931306224
43.418395792161036
9.90661192911231
-26.288026993627874
-1.3078414829083227
4.3160237002464745
8.215366822292964
9.174305686628507
21.517362116563085
57.04410780317827
64.13157269948562
23.178356906776234
39.18255456602646
17.83056890739662
29.236809394786484
5.158751258997169
-0.6507503757608888
-7.727407214514557
15.403799928861725
72.26154264462201
46.80037141725721
34.23351573083819
60.008350081445705
-23.35629521658328
80.03075167133946
75.53819706107842
60.52472229074203
75.5701295016945
10.197519590661091
15.923097518893034
9.238474770293738
