35.89819840785421
20.954357359357342
31.561661070555978
9.90821854925743
12.053557825990179
38.27713350072047
69.23756285376317
52.24283661864626
31.34393408640261
55.54559664058444
45.698809632370406
38.6799609968332
22.37668355914381
14.564604152109306
43.04804578667849
28.300776365771664
15.82960242891525
15.312276702387798
33.674296426623286
29.90538648014979
40.209900880142
11.015001513359387
38.40241005153386
43.80230780118614
91.43755009128729
42.29506730680187
49.5809460137206
42.977029065344404
14.880194505419654
24.64036309774627
7.699282380304508
25.342684407052268
25.028609219052118
15.684851592075793
25.844084412595805
21.103370552609192
11.522486464505874
34.86910337096281
23.38015125854582
24.362944485334893
73.03654918487311
7.297278838147746
28.151874771148076
17.869912601884792
22.455104189267182
27.561377166203485
43.12224908527595
64.87824086219035
38.62488469044518
15.487304788674223
20.922107976727236
45.895942835863416
14.052060880881575
11.23785861858635
18.920931955009504
11.141622619961225
49.205556118255174
37.51749835489389
114.65954795519572
72.2402381522313
22.121773954707972
64.66409084648095
13.726130323351448
33.86633978959109
37.4926486864004
