0.8940360410803978
0.8958532744526906
0.9361715508969431
0.8858516523830144
0.924783092016943
0.8932935272358654
0.8879979689606936
0.8793491230236073
0.9260937751424944
0.9206265958583488
0.9047607720873432
0.9223042900987436
0.9240744788289396
0.9219565146334898
0.9232014256770796
0.915195329130085
0.8955825713995934
0.9024644369618336
0.9120824929009604
0.9013128170672484
0.8826971914286497
0.8819117045203988
0.8949471044287892
0.9257347854977532
0.9080872191667096
0.9033620555824736
0.9218987308165444
0.932484610451514
0.9223708215565783
0.9238826173090368
0.9292880106511746
0.907580658528848
0.8733537795755542
0.9003164831027022
0.9071538376363292
0.9001682519145681
0.901490667675765
0.9268408633811472
0.9413204647372988
0.9274807759464369
0.9279114964291224
0.9352823472844236
0.8811871694417369
0.8641064066358427
0.9107145610719838
0.9244369395659872
0.9019068356621184
0.9330588620430388
0.9549684937375668
0.9417925325346204
0.9152496322700524
0.9258875368049416
0.9381648763387056
0.9093708549355172
0.9109131780654942
0.9342548949754552
0.926535883586767
0.9399923971808046
0.9310466806148144
0.9181449221880348
0.8770377395244601
0.9003219737681647
0.951680298742334
0.9369694243838927
0.9452906757358512
0.8937951708767243
0.9353848235893688
0.9202253765139312
0.9062677337093754
0.9354513099295964
0.9071063830014464
0.9238888712549814
0.9424383079669824
0.8863270059752859
0.8857111724865487
0.8997516824514733
0.9122748539966336
0.9250394115704794
0.8916087857473998
0.9565400198597644
0.9256327842732184
0.8908958687211951
0.9266434572890312
0.9317856242779868
0.9557636207837532
0.9505805131172324
0.8511133392324192
0.9124064371243968
0.9293582528336224
0.9002786308579042
0.9107175355015604
0.9344374301047222
0.9111373300965312
0.8842342818966054
0.8973330806263267
0.9017670151427952
0.9048755381558532
0.942870021337764
0.9157156594877128
0.9330071024322846
0.9483713795393628
0.8627322405442539
0.8906980470509039
0.931640448499945
0.8942196208629781
0.8905115596788037
0.9228394323933192
0.8938986809354135
0.9558282505306036
0.923384991096926
0.8887508178007545
0.9071094421204704
0.9149673321624862
0.8862907621723171
0.9234191070049864
0.8924475449280104
0.9106370362885308
0.8974298892921659
0.8809269665048138
0.8923199642509337
0.9343670645158156
0.9050119630387704
0.9053039697374896
0.8424623602011688
0.932533699941688
0.9475546509535068
0.9098847094232904
0.9339102878726969
0.9185066867797794
0.9305333863420924
0.9132532017149892
0.9071755581120308
0.8975006392066095
0.909635534318978
