0.2621589309244659
0.23282092290804293
0.8485012369002227
0.4996689103941646
0.2618261385943258
-0.2597575542241103
-0.8717925822840983
-0.15334222542860018
0.020306875384597405
1.0493041158828298
0.18252956049210525
-0.030146889381388337
0.39660512625663813
2.56635404524444
0.9105565539641948
2.1159216569365573
2.077217178278384
0.5091282408749691
0.5535747594096838
1.448049384953092
1.7872806399716552
1.472489592212212
0.7754457936882481
0.6990608504780887
0.5672074105256095
1.1685020703686648
1.2627644031218055
1.4859437508110815
0.9816752714994889
0.685927847832346
0.5638703928551216
1.273761397691169
0.4035569915647615
1.7154965832836315
1.738571581722041
1.573974991814737
0.3674803545015837
-0.4888811484863661
1.3473518734608272
1.2985675772358973
1.4547285609960157
1.3746566360604429
1.4892801438570542
-0.24343678263867358
0.6886779471443376
0.65036038296833
0.5058926653463683
0.7978464661164809
0.7226963820015698
0.5287005927322433
0.29263105298255976
0.5673569547435827
1.4024621025742305
0.5335068501808298
0.37246369095856546
0.6063234146971228
-0.8027372613921195
0.9468353961721089
0.5165166110520115
1.2035776477958333
0.9058279254079317
0.9124157253061068
0.9201674573827616
0.7605475582488059
1.0470864193688285
-0.5260999706664234
0.2662628279968839
0.4356341236191896
0.4248642024771115
0.3684614666795559
0.5555969490116526
0.040276905289284196
-0.29324338548093815
0.32226583266662884
0.39524851231853275
0.20613713675692333
0.14349415290558415
1.2749139525747413
0.7202945860821828
0.740895221695644
0.412501402935619
0.8371029086576639
-0.11636600941090425
-0.12761855297895752
1.053934881200669
1.0911163271397248
1.3702135456631381
0.5199785125101652
0.5750246017778262
-0.5752103636260009
-0.20456988756131064
0.3096287246900089
-0.19587881311516944
-1.202458945228922
1.1306119548631464
1.1550845157397334
0.9482615659451391
1.65847226259385
0.21041769835662635
0.425988750914237
0.39466947330623786
-0.08095762915939743
0.23506266974929632
0.24022725541089987
-0.1852390212950384
0.4994467104681266
0.7034799720439786
-0.6466688089224369
1.180575189945604
1.3258834999693212
0.8446775004948661
1.0934806428273804
0.23630393578271358
-0.44663585021528146
0.44513898459283874
0.8326242163890031
0.5753325367263179
0.3338318867445968
0.918375898361226
0.6896717741260695
1.0045544382822276
0.8947473314481578
0.7266186744729921
1.4896393319266714
0.957878636290548
1.0659463215282452
0.5113614034799527
0.20872794046157392
-0.24914834515205692
-0.0545511815000684
-0.3908323173569985
0.6608878715185063
0.8910703822163364
0.6299280186379282
