-0.5381261460215411
-0.5711767074166642
-0.600591773280088
-0.6009390811624528
-0.6019273476030476
-0.611763283528702
-0.6035824589672683
-0.47013507907156604
-0.5835191759187627
-0.5830545589568582
-0.5660455405457323
-0.6067812890208583
-0.5595631477435347
-0.5571809328769206
-0.5829238426023452
-0.6254935872471191
-0.5827328997040423
-0.5683943230371477
-0.6087811844201858
-0.614772450200669
-0.6319322660188611
-0.5832701539976398
-0.5765311627970231
-0.6168443342839858
-0.6091581331078987
-0.5843149347248533
-0.5459834047578684
-0.5802103790054777
-0.5555096436155728
-0.5831526164020747
-0.5839793388041364
-0.5865869378204923
-0.5587809657933492
-0.5556006567353302
-0.5603826686213359
-0.5908341610115754
-0.5895355680644944
-0.6443580123296985
-0.5834277584272196
-0.5993028956179314
-0.5910539239443584
-0.5960206965115881
-0.6281445624176611
-0.5434010189977041
-0.59378811558377
-0.5784220383754523
-0.5876727584340532
-0.5834037763747502
-0.6167526943370066
-0.6118041418802682
-0.6059170610068313
-0.5797349018669197
-0.5900549817400439
-0.585866588968338
-0.5806923125256032
-0.5931893219783857
-0.5894686274198018
-0.5945396040059037
-0.6051245729768392
-0.5970831807896129
-0.644302678606861
-0.5524641811444756
-0.5633174481526494
-0.5752157279067474
-0.5817343593805365
-0.7074717459872776
-0.5642512351661977
-0.5834230309879301
-0.6020673039805461
-0.5985431877942127
-0.618064429742004
-0.5709439229166022
-0.6196081009060204
-0.5660001652518324
-0.6680872114480753
-0.5893031701983233
-0.6116260803961934
-0.5275132909284344
-0.5848833814406139
-0.5938337015802474
-0.5822307142988002
-0.5822307142988002
-0.5764812767990102
-0.6287555410538732
-0.5981892046398395
-0.5842936801853695
-0.67770194679969
-0.5792311912303236
-0.5615659907643753
-0.5598265057895067
-0.542714176556921
-0.5512979820526742
-0.5825463030970499
-0.6599562488516603
-0.595256180231377
-0.6409373511851818
-0.5692600815109685
-0.6105844322281759
-0.6021908769391228
-0.5933050914540318
-0.5736260082510785
-0.5579944422103563
-0.5996300506089892
-0.5695429968749463
-0.5936512780044678
-0.5893363910864974
-0.6017595439228592
-0.6040087055400131
-0.5877925027601596
-0.5689263990070444
-0.6441214166823099
-0.6467760302976726
-0.5496929243360958
-0.5274270140014088
-0.558604893025155
-0.5863113358456157
-0.5799704615019713
-0.5926327247593822
-0.588956197557132
-0.5920802584660919
-0.6060587276952716
-0.5577793106859343
-0.5878705289691178
-0.5327296743888262
-0.5712529661419542
-0.5827803132869712
-0.5574710062980278
-0.5290253099583716
-0.4797619958077617
-0.5516893771311597
-0.5247946690780931
-0.5700590259568676
-0.6151955934091157
-0.571741178405803
