0.9999845625006044
0.9999550057548476
0.991191612053028
0.9999954361904028
0.99996838614618
0.9998658445384384
0.9999925555792476
0.9999826873806452
0.9999806354925104
0.9999004851125252
0.9999921912421348
0.9999974788715528
0.999161410304554
0.9999956127077412
0.9996383743884786
0.999890415540718
0.9999513563450556
0.9999643268134436
0.999964856544362
0.9999816474698268
0.9985085491684972
0.997341721274521
0.99957482750867
0.999983684513596
0.9999862822690626
0.9999811184339009
0.9999632468486824
0.9797178504452336
0.9992704842395276
0.9765698417004838
0.9996376664398916
0.9999346500265864
0.9985401615605636
0.9995676923119732
0.9998798332544004
0.9998874783107738
0.9999805971040006
0.9999801201679972
0.9991941483237188
0.9999548489707026
0.9999934902678824
0.9999765821337776
0.9997158677510058
0.9997156273654042
0.9995968538280744
0.9998469408252032
0.9997553176963224
0.9999978647041221
0.9999143180211624
0.9999648146199054
0.9998604946167244
0.977667835552447
0.9998813151898488
0.9999002678357096
0.9999394849852324
0.9999897977492876
0.9999923877914376
0.9999457898386048
0.9999915118741788
0.9999918436104752
0.9999840910465424
0.9997685341067308
0.999953061795658
0.9998428006725508
0.9999961362942252
