2.5938502506341043
2.488287047531912
41.91456307078529
2.230638414829777
3.0988515280771565
5.753339204802619
2.8670341882306687
4.594809790844594
5.595638927167834
4.774929247953528
3.84782755531107
2.2576858252017318
7.790235071646233
1.6420217491236109
12.676031175695277
3.0650969451551875
4.0659386257434775
3.902643476466319
1.2143441099962842
4.4553555023639575
17.00929585238197
14.52792663198777
10.004237849056302
4.7306478167072745
3.3264602297432284
1.9852211094718049
4.758905925703209
66.7257672336615
8.975449479286024
47.39089344965943
2.6150365134629627
4.77065589976082
11.177403014495829
5.996214928352844
6.244866849069102
3.5908390653550764
1.6806441265156864
3.226561771323093
10.40267370948222
3.1545618938322377
2.6081510324563215
3.63561844598432
10.241169548032348
6.552472175369378
8.023606851841716
4.405008619847224
9.095194817397603
1.6602695636897995
8.794487112882036
3.540399058544952
3.0799107325908404
56.410580457252635
4.499507791684322
3.3797903270629983
2.698892886034676
1.9323670296520972
2.1838664397573906
6.5041008745461415
1.321007732280499
4.19739000827424
3.0581333781352127
9.218045487859662
2.364970339046261
5.942729821816855
1.5542471902695032
