1.9712981382433363
2.0962858729681297
1.7089303569354364
1.8194529062851832
1.6614902125224624
2.0906525381399628
2.1185509076790145
2.0873711184045534
1.9704837235624493
2.143148100120281
2.095997757265132
2.1340054273843045
1.854792812361949
1.728068481067162
2.0192332733737763
1.805201399545032
1.7670468092214784
1.5287136780162127
1.9734298934946322
1.9907402052493561
1.9752073849676477
1.6060635670418288
2.0095139787796645
1.9780097694467285
2.2373588971282268
2.1587361515549954
2.0380851179133663
1.8673616785408347
1.8905286675443342
1.7588059547188064
1.7006751733072867
1.960727796418194
1.9965794407651467
1.7955421522034676
1.8285008404092877
1.8345822070517779
1.6253073981302613
2.0447690837871177
1.86365087943148
1.6293289165148699
2.3067630931374454
1.7160768599805651
1.919939435552759
1.8437946511146122
1.8218193398563631
1.9007581861731346
2.2594435939110764
2.0229333581614912
1.8803442375758597
1.92518212192258
1.81577001232182
1.9332554897131315
1.7727870226068811
1.6855368428798088
1.8504396922862354
1.836982376592134
1.9245285980188982
2.024356774022185
2.4411113742780435
2.198996334368335
1.8408798305128944
2.1269267577105646
1.868924219356129
2.0234151592482856
2.066570940094546
