3.9275243942563502
3.81037789692704
5.3134622754807666
3.8634289870700362
4.0248460671386574
4.264459197137076
4.266052322550008
4.181356802302109
4.383799763922518
4.4374494424280195
4.43855691831094
4.191562522112088
4.476939240261243
3.795749283572588
4.8251403593353865
3.990935632934424
4.053601088941195
4.087215231454163
3.006754161279857
4.463376440382939
4.667346438036781
4.537810463816028
4.655921181542143
4.474199024633555
4.229351148527379
3.804455630933583
4.38489360823475
5.305069199965418
4.629372882125856
5.058371664746983
3.197786674854458
4.185424649435014
4.49482600082851
4.297048240078143
4.356234655518583
4.191221371334458
3.4825729207197824
4.121151528594721
4.483481278032277
3.72800278054208
4.165529812546148
3.3709075011482095
4.639769105927057
4.643914302669421
4.6870966186730785
4.173693720185917
4.4538345131786805
3.8832426104571747
4.611248503767953
4.264167993333316
3.676154497440693
5.283853081060162
4.074760026870561
3.769556907242436
3.74416526521483
3.7508659213451825
4.137702244090708
4.728944780883931
3.421057030337658
4.448735748876108
4.154052155850443
4.7113858358126794
3.747526157028603
4.355097653451037
3.951652514392316
