-0.9613602390254985
-0.9861386329252535
-1.615475526177698
-0.8905886315062063
-0.9595913482456901
-1.0749068446963055
-1.1164477618350688
-1.0236091249619677
-1.199172497959013
-1.1731238329242668
-1.1558775734066373
-1.0151070332792442
-1.222543694790359
-1.0837330236443978
-1.2683215957310618
-1.0286709787602932
-1.1539929883357305
-1.1740514048769537
-0.5892221018704765
-1.1177532274213429
-1.324405706456538
-1.3413956067853865
-1.3439566652106438
-1.2462300833588986
-1.1210070480393837
-1.0678097468759344
-1.2380964105216978
-1.5855324858590187
-1.3550876637660023
-1.5334254288218954
-0.8193542313077737
-1.1925284474865758
-1.2992881608543871
-1.2683172939807699
-1.1768771053371234
-1.0635240897823164
-0.737420803808879
-1.0344726678534668
-1.2380732805016879
-1.0461042446000142
-1.0605493601994296
-0.5271223459225702
-1.3708825152475521
-1.396731903532689
-1.3435433108663142
-1.0508819803444016
-1.155461000903699
-0.974326905670223
-1.2860577573288303
-1.089549344591532
-0.9648367884869902
-1.5752569675023524
-1.0763417659773091
-0.9966142397339185
-0.8841244734502336
-0.8638220688860103
-0.9805528380353545
-1.1879259129651085
-0.852084477644044
-1.0992393057830212
-0.8334751110512914
-1.3201389196021014
-1.0509654398201032
-1.206104594827081
-0.9996180214787992
