300.73289498393973
224.65364962889493
243.73764471753864
99.29342405933849
127.56093186917343
369.6291849519002
739.5335887525673
554.7074476349051
190.85181934605995
507.5734540538881
431.3934926681868
409.3056825047688
421.909836343108
173.16817199484333
332.07934641084
260.75217264316916
201.44778255505278
126.7048751726118
265.7108240235441
597.8922057796136
315.7907779432684
202.6944654179146
412.83586105142024
469.4887461799802
704.179100407474
495.2387488255822
399.42464257797303
354.93123507810486
156.9159972921899
472.47424366279205
73.11446802183887
291.9377183113436
246.35677078490096
284.52477505497575
232.32962556947268
473.3561342403642
237.63131564210732
360.38205599701416
176.71240418714748
338.3283357114985
484.25327702457673
92.06738135518948
307.15382638215783
233.85183451561662
240.6874954045948
403.5678241726442
475.66414956310564
556.8414171507341
444.652682334885
329.6101967448593
471.69132138051225
432.9970521567488
159.6773462852908
93.0901610868491
172.35190498460236
105.61794431701513
516.7567809099477
498.2462615780214
933.1216248658328
461.76178990147423
281.1305993873067
1065.2458927156401
129.92195300779562
284.600544459829
371.2431902469686
