40.52538568311997
38.00750417398065
145.64863094756305
29.568680808680412
35.82789182524701
38.00750417398065
37.928239223122475
41.21021104217528
48.317194978251855
43.0178873871545
45.50408732741464
34.27275832933464
47.5213793375216
40.547832546797906
65.35373635150893
31.568502871298094
44.301632687898504
42.41016344581776
24.790657941882184
49.80703257346711
87.38399117723165
67.36137849769965
70.15111263640782
68.67406150973717
44.950754982927215
39.6650527070115
57.01125626097097
138.07363673995718
81.09566509359583
112.64034648495183
22.7076602194414
55.48533106597613
79.330105414023
71.1842011314495
69.2187010616362
42.17579427444922
23.95427193978225
36.51014213222985
75.92473137650687
46.360720510470934
35.65429254185471
35.38307383569862
77.63498239017419
69.41384223727012
74.47508734639996
34.67395766932441
45.017092701038635
33.86199431240689
57.24599992528988
41.43151425587962
33.06040650862637
121.58751405810179
58.694041252205714
47.9085438795645
33.86199431240689
27.18083189824521
33.545736036790125
71.02513902510262
21.692780393287677
37.484723654394045
40.447026022471654
79.330105414023
39.6650527070115
46.360720510470934
35.1934187198602
