2983.465333333333
1927.958592132505
6332.809623544772
1042.539928486293
2291.349604221636
2903.054347826087
5158.06450157871
4298.01463644948
1457.5724267669982
5521.006531678641
3329.9309271935285
3294.5283783783784
5421.440138408305
2116.9807302231243
2889.5636604774536
3417.2375886524824
3132.8184885290148
1624.656501726122
1638.7370689655172
5468.599419448476
3374.058648111332
4227.063969497987
4701.375337533755
5040.117822076762
4639.284069981583
4117.029204431017
3353.535896563457
8360.616828359196
3224.900868306802
10789.395939565627
774.6211180124224
3458.445235975067
3037.645130909776
4607.260829913361
3564.469615124916
6019.246303142329
3089.670822942644
2664.6792698826603
2320.1633393829397
5533.7101769911515
3623.8637931034477
754.4818355640535
3898.395378690629
3817.4262213359916
3575.0243424277082
3638.058452722063
3261.572729781948
5011.448945147678
5333.587278582931
4251.406779661017
5172.410762331839
6164.92651680685
2786.502567394095
1366.9867695700113
2151.5179233621757
1126.9485396383866
4767.0394088669955
5363.150445292621
5109.625
3157.0373772568896
2636.0816326530608
13614.609026205113
1237.3778580024068
2940.7735849056603
2998.281990521327
