-0.12253013286652233
-0.12249163715993783
-0.12263149835027011
-0.12279030746496497
-0.12246240071994631
-0.12243429610933555
-0.12273687124439901
-0.12260517066704332
-0.12254868332983722
-0.1227209044586251
-0.12258608904943008
-0.12263811882276625
-0.12276831509348368
-0.12286250706098936
-0.1226520026170403
-0.12282083794014682
-0.122881591966468
-0.12245673630893379
-0.12246788824701087
-0.12287667067492505
-0.12289223059839748
-0.12290506018293827
-0.12252204048277268
-0.12262669135253908
-0.12255998730627075
-0.12268168899391996
-0.12285566518797963
-0.1228377772492698
-0.12277609473203917
-0.12266495731864155
-0.12268162986936407
-0.12282138686867773
-0.12255148426707528
-0.12288131995706848
-0.12289312211773241
-0.12288449773714405
-0.12255753961206041
-0.12254736859411998
-0.1228281172551874
-0.12287847005268267
-0.12288523691117192
-0.12285643282061724
-0.12288108391910806
-0.12243659355414035
-0.12258509168332578
-0.12265117508850819
-0.12252665205204673
-0.12274018474242372
-0.12259183302771205
-0.12261162716265818
-0.12261084398778033
-0.12263812682296295
-0.1227467629647827
-0.12267981061290816
-0.12260574982664785
-0.12263885973089263
-0.12261927130451995
-0.1226951440094172
-0.12265472726374335
-0.12283338603834194
-0.12280844675824136
-0.12280024177022805
-0.12261969697163458
-0.12261939354916285
-0.12261643313981961
-0.12249698240978193
-0.12249714110251114
-0.1225691219772673
-0.12250971800153874
-0.12260561098361726
-0.12259597583590487
-0.12241355962699642
-0.12265950409560185
-0.12263080918243623
-0.12274604420812146
-0.12250664402584865
-0.12274025256141571
-0.1225294538597458
-0.12276676198049188
-0.12255510020635611
-0.12251649091069941
-0.12263065972296096
-0.12249552179440618
-0.12248220043740106
-0.12258772189394615
-0.12261783657231462
-0.12285248989534646
-0.12258739553831943
-0.12256561314789098
-0.12250292467687171
-0.12249250865744833
-0.12264353523759877
-0.1226247479082279
-0.12280714675750899
-0.12267970727759804
-0.12256706599087994
-0.12260762036191157
-0.12272467638468651
-0.1225114245904086
-0.12257151847637242
-0.12253090377364562
-0.12249672820210922
-0.12243168975750082
-0.12250487134466326
-0.1224159393331659
-0.12262490617750188
-0.12257380177773036
-0.12261288415314436
-0.12273904042643743
-0.12281288047430709
-0.12270942851661638
-0.12282591488284866
-0.12257253221321542
-0.12245353609704014
-0.12252648690417804
-0.1227136711129659
-0.12251170599000884
-0.12270533641478265
-0.12283392292337617
-0.1225238495634703
-0.12254983011664859
-0.12254979543427934
-0.12265468741276782
-0.12284895251358671
-0.12278262433280342
-0.12278452661298549
-0.12248445264855819
-0.12263874270727752
-0.12257333955539194
-0.12268541302377706
-0.12259059493508723
-0.12251146813493992
-0.12251659682837235
-0.12251526653262046
