519.1954261954262
562.2326530612245
9257.388735843282
279.66788990825694
398.2860962566845
150.03345724907064
429.20967741935476
111.33663366336634
540.4342906875544
765.8458831808587
1078.3340517241381
864.9061224489795
1538.857756936303
1839.178057083006
3633.3408880053016
619.6209732693626
1040.1525086934923
234.0732758620689
414.67955801104966
548.4921700223714
699.1648550724636
727.1788321167882
335.9549839228296
433.19205298013253
1285.4564183835182
1032.2662784542083
2495.354959313833
9314.84743364835
799.0324629498941
559.3175965665237
414.72453371592536
2554.6389496717725
411.931982633864
857.0585774058577
3468.276993648553
1594.5620867009552
2894.105578435043
419.28606060606063
6555.8571683627915
891.1771170006464
510.5031982942431
7004.185236025319
708.9868312757202
111.30857142857144
711.5705128205127
994.4570538495772
897.4670981661274
1942.844576362655
1819.1665728756327
2016.3238522954089
524.3011583011584
1157.8504079782413
748.5951903807616
704.2417670682731
678.9615384615385
1071.8702163061564
150.63406940063092
1457.791310072416
776.6325802615934
639.696062992126
260.82394366197184
834.2105896510228
7362.287397787398
1504.5811826200588
4317.338678378103
102.22167487684729
813.7695417789756
938.8937313432837
1377.1740947075211
1202.8460898502494
777.8601615910503
97.81656804733728
507.07560756075605
95.3699421965318
373.4581497797357
143.09266409266408
513.6473629782834
884.0811161583388
1231.7029995775242
320.5540308747856
1921.7146768893758
527.509125840538
578.5753749013418
195.66477272727272
4090.1317485472805
1678.60631276901
154.421926910299
1609.7445342917042
1800.4605855855857
416.68687982359427
1105.552717138876
599.5779527559056
495.2359249329758
189.6291079812207
392.17416378316034
272.85024958402664
201.12121212121207
1623.9204678362573
600.2186978297162
1489.4589269475598
2966.2618839311754
93.16161616161615
659.1190994916485
871.6189042745334
236.51391465677182
494.65127238454284
1500.4830201121
233.79835390946502
9024.893555316865
587.1386514719848
334.60269360269365
202.9431818181818
255.81509433962262
207.04395604395611
282.85796545105563
278.21311475409834
836.1884057971015
217.2138084632517
437.3169014084507
214.5108359133127
1397.8991185112634
227.00829875518676
1253.2910216718267
183.01812688821755
888.7116809116809
7119.978259387992
469.7752442996743
1844.4646657571625
303.09523809523813
1232.9627870150434
748.2538795779019
306.55339805825236
401.6262886597938
482.1614457831325
