-1.7881032351646868
-2.3233683290778506
-3.1734546254240485
-2.908781977685751
-2.6110945135013064
-2.065924748366322
-1.6754897858092668
-1.9642820171528348
-2.05386629935758
-3.138422205628544
-2.8046718717425203
-2.897804920396278
-3.3370645667065477
-4.160499492472017
-3.125092704607877
-3.494042170394113
-3.9720839029225905
-2.580100772984146
-2.484312533637164
-3.8899892455448204
-3.7663959974621166
-3.9096947405971667
-2.105980863571463
-2.684858701008461
-2.6447882280855595
-2.844101443709279
-4.176075203389195
-4.1150897753221765
-3.5166069771171684
-2.8381551643597014
-2.9000608076086314
-3.509914013269698
-2.2955756449798352
-4.296902426294064
-4.3504205759969174
-4.217271179023744
-2.7114707444706534
-2.2926108455317045
-3.9371289737778263
-3.9299601537676723
-4.153818738377204
-4.1842626386817106
-3.566358004204949
-2.1881044137749144
-2.0200073473688227
-2.8284248975835937
-1.4971577456131806
-3.316596859146905
-2.899406631816074
-2.776236419439879
-2.6635731451861675
-2.969727196776548
-3.7097855288855794
-2.689057263235051
-2.248358479064372
-2.48525058012628
-2.495059951032767
-3.2890994939511855
-2.788009137001155
-3.2571261969979077
-2.5977393830903277
-3.3097524856179437
-3.298186576324921
-3.072491448951413
-3.2086684760372526
-1.841364201751537
-2.801331910243633
-2.5675868763798717
-2.598383356109636
-2.9289531345090207
-2.537969803281011
-2.364889832622432
-1.8845941226781124
-2.040359201936257
-2.6904082805255944
-2.202575740723218
-1.586437135717407
-3.187049508371366
-2.9250495177273486
-2.61787050606189
-2.821121501367128
-2.7699454526928444
-2.443763910013079
-1.9671725044326063
-2.9743212061469437
-3.2211423907266585
-2.9848076374880206
-2.457455630949814
-2.710151126083256
-1.1896992499814312
-2.1662940211769226
-3.1252508580306757
-2.229233321358063
-0.6671093467633714
-3.127958245695226
-2.823065140193745
-2.7770117678486104
-3.5861523958563812
-2.154885703476467
-2.8015221366696808
-2.892280612749581
-2.0228054401982405
-1.8595865718418048
-2.391572563786343
-2.02930499804287
-2.2197432470522127
-3.1454605932424444
-1.2756330089413006
-3.6256077949636745
-3.5253289736254296
-2.6251424552516034
-2.8957074794046966
-1.8385223849587413
-1.0018176633329625
-2.855406239606473
-2.574942031814714
-2.62694486876284
-2.451468901596082
-2.8887019653095414
-2.0908875446509874
-3.099580216832732
-2.7154266918709227
-2.6467322161275417
-2.648962981395342
-3.9018567509991695
-3.7344430357744556
-2.5842747119913425
-2.4632220702605996
-1.777366862385393
-2.396049746398097
-2.0001396963975813
-2.3620446738113094
-1.614567908213069
-2.3651491818983144
