9819.03076171875
7535.9344482421875
579666.1376953125
8342.742919921875
12042.04559326172
20041.465759277344
16805.648803710938
17354.965209960938
24169.921875
27113.914489746094
24985.313415527344
14402.389526367188
33980.369567871094
13612.747192382812
71316.71905517577
11518.478393554688
26023.86474609375
29748.91662597656
1553.5354614257812
28384.20867919922
112318.03894042967
92903.13720703124
98636.62719726562
58141.70837402344
36031.72302246094
13492.584228515625
49215.31677246094
611234.6649169922
89607.23876953125
339683.5327148437
6935.11962890625
35602.569580078125
85796.35620117188
50674.4384765625
52459.716796875
16067.5048828125
3699.3026733398438
13930.320739746094
64664.84069824219
15895.843505859375
15234.947204589844
4677.772521972656
97417.83142089844
90757.3699951172
103322.98278808594
16350.746154785156
33679.962158203125
7922.172546386719
46983.71887207031
18453.598022460934
7072.44873046875
551925.6591796875
27894.97375488281
15432.357788085938
7081.031799316406
6033.897399902344
13123.512268066406
51670.07446289063
3613.4719848632812
27079.58221435547
16076.087951660156
114360.80932617188
13870.2392578125
47241.2109375
8076.667785644531
