0.08441058787319175
0.11050472355000188
0.20860040311849806
0.03361302938046088
0.11947278911564628
0.13590047220151166
0.08436458654453105
0.063709844035266
0.07742858097497411
0.17869994208758008
0.13323054780900204
0.049861495844875335
0.19313130193905814
0.08762469135802467
0.11490609418282548
0.14094147082846534
0.12833059066559294
0.12310254359936823
0.0490487514863258
0.12228139381985535
0.23981622449439216
0.3135810089631316
0.13315150223737482
0.07162485154763146
0.06603160943581897
0.06559097468188378
0.14057587453554105
0.2723114615692835
0.20236191639942425
0.38601761927629824
0.2398655744591473
0.13839725052612456
0.32259641074430795
0.237435792549306
0.1536664686959766
0.19067925677733785
0.050362154821186056
0.14173544054261752
0.25194012342825445
0.1731
0.08084252402010407
0.0302734375
0.17888786764705886
0.1035425430046852
0.20117082862478608
0.11869375
0.09579484061421666
0.07016121882954876
0.1862712137518625
0.10793451622389963
0.3006284605387313
0.29990645491026097
0.14270859478647496
0.25912105022953635
0.13923439198164472
0.04587022789955
0.1223848036084551
0.07205945535065107
0.016124697661918843
0.07987748299626142
0.1271652449910732
0.210697763107065
0.18966452807303136
0.23494155541699835
0.04970706799247514
