319.1620553359684
241.62714776632302
279.2483329501035
117.80916030534351
169.43309859154928
419.67468354430383
832.7264150943396
602.7636761487964
254.6447178002894
586.0701402805612
491.040061633282
414.917701863354
421.92539682539683
207.06589147286823
404.66564729867486
276.01295336787564
230.9698630136986
149.13725490196074
298.75471698113205
614.5175695461202
371.7730463266261
218.01692865779927
458.8665158371041
526.0101867572157
767.0615079365081
511.4769975786925
445.4195744680851
522.4035697362186
239.91700404858298
610.825234676974
78.37373737373737
341.5234708392603
266.1696658097686
321.1712598425197
251.13459119496852
475.2388973966309
231.22131147540986
402.4
208.47445972495092
339.991935483871
512.2950191570882
96.93953488372091
376.7982112912242
326.71975497702914
326.23093072078376
415.7737226277373
502.9052077238152
592.6505494505494
508.32945961650205
361.18330605564654
469.477157360406
472.87754364840464
171.52380952380952
139.60591133004922
190.79828326180257
123.20089285714286
486.1030595813205
521.1644034917556
917.2768166089966
527.4133802816901
301.65971107544135
1022.9069881889765
138.8556701030928
332.2636186770428
408.11847389558227
