6.979961766756612
6.734063056895784
6.848262278256375
6.437351658113174
6.334274192805977
6.225222544584872
6.7926825997828795
6.3157878982730535
6.9882912225748175
6.858375528420939
6.626161612161098
6.631308958771753
6.576113285596291
6.998431839513742
6.882192265632299
7.424358941303883
6.997733828530839
6.334180139348077
6.877029697533091
6.94868049065119
6.975079394440622
7.0579737086871015
6.432002568321633
6.675708760350079
6.845564661986562
6.842466524496518
7.399363167756767
7.328459071732934
7.130704386903028
6.650927849214095
6.361666012426058
7.052726585268856
6.487685499566148
6.873941676186194
7.035862794085897
6.945025318935539
6.949538830112228
6.596267527107672
7.140455292348095
6.810518434632876
6.516106557568544
7.132776768676071
6.804295315402224
6.066711376289816
6.944951557553809
6.9033328029150045
6.820134105895692
7.288211261663327
6.721812034212565
6.878265980225188
6.3254909911310575
6.5228520775917955
6.537560784880076
6.500337883643858
6.530592114083681
6.663423184265983
6.211222487235697
6.727509882502543
6.686983552635242
7.003787078203113
6.4012474925681735
6.525660153363049
7.124452113820777
6.678643874479853
6.960342033842899
5.761342183259072
6.762280965295148
6.830150029565313
6.871915035316823
6.704377356185128
6.818238375127836
6.116494762849554
6.798173995788878
5.9973909370115726
6.754410405762703
6.183747607374703
6.7850002767343
6.879255503722786
6.623822785446517
6.452136288141492
6.810170860608608
6.810170860608608
6.419853333005882
6.265629475605935
6.893146871952523
6.646914593253187
6.273445093033321
6.6932123412178965
6.84610050618151
6.651807716750063
6.844163970275459
6.730811571713747
6.611895655216402
6.301498007435496
6.7268219028620635
6.687567885820844
6.600823401737538
6.953118781850293
6.6627013212404105
7.355168124435964
7.012028575602431
5.9936771007993785
6.682348829042901
6.807737717168643
6.411779035841696
6.655754033265978
6.674097472816117
6.954836079560858
6.888893227093733
6.6400078633331825
6.341201247863573
6.261367440839722
6.580754679469937
6.2863844268220594
6.557375645928398
6.614851199314308
6.835745407924132
6.743428101813565
7.0029307191359775
6.5534338582945235
6.990128998063862
6.518901789642251
7.114270303318117
6.512980307352708
6.715894406113538
7.068555042926544
6.492621216844771
7.131456921603353
6.306182924744571
6.7709043147157875
6.592269032303591
6.4585727474311305
6.688253875885415
6.494365014567758
