33.545736036790125
31.65923064077245
120.87290572489313
27.55410271919876
35.1934187198602
38.86613849086897
38.91707382697094
41.31027275695365
38.6259228247365
44.950754982927215
40.52538568311997
36.514605382641065
51.366831034884825
35.65429254185471
72.00352003181966
33.06040650862637
52.19741730713461
55.6640625
20.840639994746443
53.337738109528274
97.46018599409662
71.30858508370942
66.12081301725274
74.86367860007384
66.40937676462282
39.6650527070115
57.81480200231085
138.3402601844113
80.12466482964219
104.12726758157015
29.296875
51.11741854315049
73.02028426445969
59.636988300342225
73.50161803663853
40.447026022471654
23.180360255235467
41.43151425587962
61.27429016523901
38.00750417398065
38.00750417398065
24.76522574599311
74.11471161999907
67.72398862481379
74.59519703312108
36.51014213222985
48.317194978251855
28.96944211855237
48.38662650981157
38.86613849086897
29.748789530258627
132.15267368690525
59.636988300342225
39.6650527070115
31.6002645747058
27.55410271919876
35.65429254185471
69.00238475272069
22.012959218041452
62.68279956907162
35.65429254185471
91.27535533057458
36.51014213222985
83.45308879715094
35.1934187198602
