-54.806081139015284
-47.6406341262609
-78.48064233236107
-54.043533618434964
-52.69218077857826
-47.255916237527686
-73.67836758834656
-63.24825849692175
-81.79911019217803
-54.95247383576498
-77.95044080390583
-76.03345582816192
-50.830299977337894
-59.27181024542658
-72.43179466163875
-43.40495473054222
-46.731885804792796
-52.02409393690796
-25.770206508563913
-78.35354069000886
-54.8465724870766
-41.99179766007594
-61.17919860662895
-76.27855942887284
-64.94748962172551
-45.47318879863055
-66.98631040127842
-59.664426062573526
-56.55248644934984
-47.1428735472929
-16.853434367728962
-54.72284406130947
-49.059232728681245
-55.95850052440381
-56.25258075214049
-51.93062430021505
-33.6379358946229
-57.6098314629293
-47.923575020453
-38.69425407466374
-70.97875747934216
-40.85917770086848
-67.2624735786807
-70.04117284661038
-63.58097779470369
-43.20848951527696
-56.91832764003003
-71.8585865956372
-79.10550034872199
-61.862179888612445
-36.83426832124217
-58.09359767535956
-42.43034971906378
-34.02395943443954
-37.83409057629488
-45.16613026857918
-61.31798953628175
-91.95116619202088
-41.42027834438563
-86.23123877271627
-56.059250861936256
-70.57598974535405
-36.473008496139194
-53.50478273206018
-69.73913271421458
