0.004923460677363735
0.008644984962822717
0.013113472001190759
0.009234098409678114
0.012148967515576056
0.005044513285056571
0.00375018915318729
0.005127606268006729
0.005308415154137145
0.0037645893269701563
0.004936834481281827
0.006615443324111022
0.00569926835926201
0.02701228957503556
0.006386825339462129
0.015454407956102997
0.01774902549100672
0.014650190611800997
0.02892925965383685
0.0032654361270510928
0.011114972107062056
0.0070314302206356035
0.003148389435057477
0.010436444526103634
0.005558221761029419
0.01231290902962116
0.007397605244772825
0.004419061349460542
0.007460539314782734
0.004817742600168692
0.020982030755599037
0.007974070104227338
0.008848238744967105
0.0071773990024341285
0.010120696669874515
0.006341075448528648
0.03689201764117156
0.006532386440331392
0.011295282626472268
0.017147615234992156
0.011925885902358845
0.015060298264300874
0.007592015376054852
0.006305429340309404
0.006231166200523525
0.008124616885292155
0.003554964505409504
0.007030523374342145
0.005243984353752707
0.004172519780746017
0.015214757981646185
0.0038567854800463366
0.007230961900705026
0.013012772190838864
0.015695621394023168
0.014118440610077953
0.003886204418247693
0.0028654009793802142
0.008126915794531687
0.005889130518550038
0.007294275968801216
0.0016652423978928295
0.013204832393231234
0.007013114474836577
0.00487602449789966
