0.04784622222222222
0.06323630061140187
0.04988726121916038
0.09201458686415097
0.09023189757798956
0.04507715711853021
0.034502121935126716
0.039643114774124584
0.0606653651446669
0.04034004831991658
0.042837051186683656
0.051752191380569766
0.06350791351210408
0.08074709215014256
0.0442367598891218
0.052680448669584025
0.07977238330956632
0.07354855454664634
0.05410225921521997
0.05507799317915155
0.04613754564349207
0.09312113272882734
0.047391205367161376
0.05095331480045582
0.03092811913894909
0.0483495242122856
0.042011428709031
0.04909326840717322
0.10319867439751527
0.06762324551196143
0.10753828941784653
0.07091820107221387
0.055427650853288615
0.07874514295267307
0.055855602429331054
0.0636247313628148
0.09008028557036336
0.05022446450639057
0.06515351882697278
0.06254894666771084
0.032783723080988245
0.1071805914546538
0.059835741569867575
0.08284534896473758
0.07488354774050868
0.05778704608336549
0.044236118660726235
0.03662589684701527
0.04731644197582726
0.08006502585568867
0.06842928673409883
0.04059076924744176
0.07554614800252454
0.10368334490165307
0.0670898009262301
0.08619025419712514
0.047564901861640085
0.044765586051058924
0.033575052029136326
0.0333619654911094
0.06310765696584758
0.03645821176915354
0.0773298810677116
0.05920532879851952
0.0501373883485696
