0.3192754648324221
0.3772950998683825
0.3000835872167463
0.4518331833702474
0.2660265778362776
0.22248358351259595
0.1880878278510497
0.282579117481219
0.2934491047182805
0.3477028849151991
0.2676571689220118
0.2664193570112452
0.3378970993481316
0.42267807701478893
0.30109445486467346
0.3739806069767606
0.4751640160343408
0.2965036597539413
0.24609226641849485
0.3981014302407857
0.3533303561033756
0.4462835827570736
0.23627237518376826
0.2375123628890031
0.1920929742092272
0.2886663280514854
0.3795374462638033
0.36101630029792187
0.36495384899777616
0.3391696341941937
0.3322985486722259
0.38683711639616497
0.3552348197922352
0.4380663677790208
0.4193814401177293
0.3952942692466856
0.23389035726655855
0.1727391296949353
0.30758592610987506
0.3828426892524781
0.3980547861748471
0.3181828542265997
0.3817577402348066
0.3188528297917105
0.2575230317441706
0.2436759463259029
0.3054974680308589
0.4230141830083969
0.27916910943880924
0.25216915914436777
0.3128487367572316
0.30450587717368593
0.3446274058653628
0.3347354057293693
0.21894600446086165
0.2414280369920641
0.24218311954010824
0.3570408539381041
0.2959126613307169
0.4346964223598824
0.3728131464462837
0.4925918521574701
0.2337219913080853
0.2902293613053017
0.2286067436484483
0.1957789887397308
0.3092466062775554
0.31183826072783266
0.2580293291078496
0.2989188538794957
0.2972411401011877
0.2221052588577836
0.15363541671806585
0.2556288497909452
0.3877999521804187
0.2498641309617549
0.3089584738762182
0.44851198831503736
0.4335623217194232
0.26460093188503625
0.2600347054951574
0.29116917628087763
0.26678697564546594
0.2556761073053304
0.26683180916295873
0.31008234244060523
0.4796009389671362
0.2739821114731846
0.2742401030856535
0.28314521691280553
0.3456955774743946
0.29699250459009296
0.255780579228518
0.18473065062719424
0.3782171004991135
0.3347461652636899
0.4109327509178273
0.26721403859386605
0.2651797051485532
0.23354320395574996
0.2246962914984544
0.3856817325800377
0.281664791792246
0.2110802278355593
0.24461272192651354
0.3639907560059869
0.3257542475797111
0.21877724404741655
0.2864864455088373
0.3778679081766274
0.3236512550441379
0.3479400343461925
0.3201981769950282
0.2767369353689533
0.2449234801351872
0.40236190020117657
0.3433184927293298
0.407620743306356
0.4427264359548289
0.268243928670883
0.264220733782363
0.32753886016483524
0.3606242913566472
0.602703026947213
0.5053111096140259
0.3983665810891524
0.3733771110089535
0.3499527284745505
0.31888600199299577
0.3203615975556158
0.3604364058236357
0.31411912761400856
0.28344236616377216
0.3035662445841251
