0.8705052463911935
0.8902294709381022
0.8535424093266428
0.9084079809649364
0.8357672702745962
0.8094121444797842
0.774571755703976
0.8539031903804395
0.8467782330923715
0.8713886720955191
0.8332330862710721
0.8341210213029421
0.8694261532657522
0.8953507598299277
0.8570960039308589
0.8815991395275596
0.9125880511345956
0.8532878622067823
0.8235308290432386
0.8890078360316582
0.8830095502561635
0.9096230387336668
0.8238001188275187
0.8178464762661279
0.8004502365280061
0.8535776785505335
0.8872235069467933
0.8761773833388191
0.8732510138952839
0.8704690047655603
0.857292944361337
0.8874165614914017
0.8762888674509011
0.9070647540308714
0.9032311020673418
0.8940993708476397
0.8264719922749013
0.7608361733204055
0.8609955619001989
0.8903375376884053
0.8869133193040803
0.8680074717297669
0.8985231069037825
0.8770722604994251
0.815584541590816
0.8204705658354535
0.8416009799299204
0.9008119080388368
0.8411558245832051
0.8198503435154437
0.8586154838481158
0.8520837995788377
0.8715034569830249
0.8566116303478405
0.7987887015527525
0.8033911918505798
0.8058026904983144
0.879096610363418
0.8553095291072209
0.9031202235732894
0.894641936031882
0.91680604893545
0.8089883708138714
0.8475184451564878
0.809700633740989
0.7897822503588685
0.854084810109202
0.8541685072116196
0.8278824974418413
0.8484573107284631
0.8506344726695266
0.7883541783065741
0.7487114766306362
0.836430667083987
0.8934854625879455
0.823707791002897
0.8637672784201563
0.9049251874678677
0.8998772111131272
0.823067464458749
0.8299664595670614
0.8471236217802152
0.8203678458972833
0.8158636268695887
0.8276854497336165
0.8498278821302574
0.9203221707436712
0.8497516188065999
0.8464875906547774
0.8517972514263186
0.8776055022420424
0.8376957099608517
0.8276432606243669
0.7741251790929956
0.8830037745854791
0.8616134713833183
0.8849522673060348
0.8318271139039214
0.8382410896677809
0.8081576022079443
0.8054863402414582
0.8852417428785984
0.8452806626156261
0.7972050578372797
0.8218408015686451
0.8756776021602951
0.8602199905948482
0.7906188947996071
0.8537770901232405
0.8880104608936541
0.8741228616175414
0.8817670407679878
0.8710542753910229
0.8311465659266842
0.8155912930313912
0.8920360817713837
0.862325778889817
0.8907198324317162
0.9046338344196584
0.8411651815019958
0.8369550253452493
0.8608406345443105
0.8811803364556542
0.9447933916246272
0.9213623767915268
0.8902675982558594
0.8785561062108879
0.8768586641467482
0.8620517940574484
0.8561888500938205
0.8831658231136915
0.8564814561417317
0.8473094474463431
0.8527019867179
