6.213526797432819
6.395427333262682
7.657659017046541
6.137549836718833
6.324158728183261
5.926548310027709
6.162650355466271
5.937363868500002
6.486579569021746
6.388112271207697
6.61689277967709
6.466293931140389
6.592592616776159
7.226191850898012
7.168259251578062
6.6318505051099335
6.5762826735981585
5.8345274395592055
6.413454206774024
6.156678145895493
6.367986307302914
6.302168445253133
6.245466121737167
6.488937474023033
6.695875986527648
6.68718101258067
7.18896127571114
7.619549342623941
6.957214233843184
6.556267459434906
6.8384546751774336
7.140709046702786
6.345796510437177
6.5833007899910845
7.089252860542004
6.922938349142816
6.832259028746809
6.304946193098171
7.4335399420598325
6.719657218222133
6.7129318367851685
7.523475632241911
6.69479375102924
5.291230600520526
6.5771490840088305
6.49534114419686
6.641620473174347
6.936166676021026
7.1338508453740035
7.214405951876095
6.687790360470457
7.2608405608713324
6.84147198579434
6.858077851532278
6.860649928883333
7.11137174945968
6.228383424137532
7.145076303985702
6.924660662193594
6.736221498111614
6.5065120556327045
6.613219313526747
7.6658051493042265
7.049406980762726
7.547709958750005
6.457644700759376
6.846133489148881
6.847868965370156
7.15107559369539
6.925238273496724
6.837501852891936
6.273046401442014
6.745390134704269
5.740233647640708
5.511775262294306
6.086434765599266
5.932801715268262
6.209522863143454
6.636009643671423
6.5022958977722585
6.928468646549764
6.357803050636956
6.606601933856546
6.309709825695325
7.461373169501034
7.098302483029935
5.506255582524577
7.041523258305307
7.050762961054213
6.411708758491847
6.741674462128102
6.51017704697954
6.641582699125975
6.025245980485251
6.374612599431682
5.950899431008842
5.886511133145375
6.81753514166287
6.495610272857625
6.920197749404203
7.184564381093991
5.5726423321321175
6.214852371677634
6.492174718694234
6.065104328099092
6.376050978122898
6.792017514838746
6.089446989429072
7.595638307596461
6.638676221800665
6.409061790237904
6.388414808651107
6.18888040215632
5.632218253644982
6.176369467121033
6.279102885416792
6.580778824795802
6.3221824807126765
6.472769086224509
6.036970246794588
7.039801512602947
6.310534783614459
6.599854353606556
5.533048271752185
6.471841285746993
7.576072145803242
6.13792966015279
7.121172773636486
6.429255729031122
7.006778949062433
6.905457441501621
6.336554326886409
6.3637320251285
6.3523520202708985
