0.17173645725207864
0.14796628110400634
0.1760296082802252
0.20297418658844799
0.2348588143997688
0.1737046450626917
0.15477484804676014
0.18608364459484372
0.20890540056816692
0.16767838597574278
0.16450414162276916
0.14762072323265274
0.20527948576648256
0.1499575081118753
0.18120805412284496
0.21393173311710034
0.13472793149836845
0.15633071054037714
0.1466342571787465
0.19369224844540187
0.15002802659163209
0.1727440621088328
0.13346018340195145
0.14117311898789847
0.11288641073153945
0.123052327024916
0.1352066597312427
0.1591963869709807
0.14870504702911816
0.16894407795947713
0.15129402463276212
0.11977097509937197
0.11895117594133175
0.13973137304959654
0.13773386199873566
0.20974229838797395
0.2400928417069261
0.17043200356452334
0.12769182853963468
0.16690772505506418
0.18103421683482604
0.22523787706427786
0.13956987285920747
0.16149084498790248
0.15089728046062878
0.2229563118025214
0.1568115545418119
0.20073216447465772
0.20509313327341674
0.20847189633951171
0.22302141296528055
0.13072230683360705
0.14027294759128767
0.1573851453851964
0.17946149855031365
0.2242324198834777
0.20992312773224747
0.19160062554188206
0.12787646287369395
0.1727472194435586
0.2408912351880761
0.15453638783140206
0.16677018262729176
0.17195966030046622
0.16283085190510696
