2.7241654327227747
3.1589107003560097
3.6177242521695288
3.5656556574515315
3.424836439050288
3.0820113438714523
3.257071275081314
3.6718013130785603
3.0128355771768693
4.872378783697699
3.3367885390118714
7.49045156169177
4.312176535804022
2.2744717412005944
4.484607108856482
6.68351650698759
2.5454179181676735
2.737998805543528
3.712700289841953
4.166669002963707
2.6732916956994117
3.988379096480009
6.307382286932921
2.889418804210052
2.6973659571024213
6.3065110739848445
3.947051299453834
3.3936612391657963
4.983029597512147
4.36321452843831
6.521924474633615
3.8948486199631662
3.545365996241453
2.6193067480419123
2.8268019680637475
2.900553733725203
2.9793364656898547
3.0686923317917727
3.9476127977508977
3.9531656089335936
3.2370639740763325
5.512186659958257
2.241017219900572
4.146303089145542
4.469028876360733
2.7616511034050606
3.826653968631017
3.437737930943628
20.065311592005354
6.125345741241231
3.787395436601362
3.977029183851816
13.637088384727715
9.509768485733499
4.865530573510206
8.870913889419477
6.091727415669682
8.00737986017587
5.698487926747919
3.4841199676843164
4.288086406201648
3.1239968028360914
5.545948278647233
3.689353948552567
12.37609191239589
3.255753912257454
4.523974095555331
4.263309846171927
3.636569287112336
5.343720783401904
10.648407648530412
2.734462710891428
4.500481758363335
3.8151908765149543
2.8477440547812662
3.617573396334654
2.584659656505751
4.313045508977763
3.8905407553565543
39.723803229823574
3.2338023939534253
3.279222453747665
4.740612788026731
11.930926446858392
4.920107985062346
9.758179781298608
2.137138087082468
3.1567095152598355
3.52948285104308
4.632967533812608
5.9381172972062295
8.391629689596051
3.8373383069426334
3.36484611835634
2.693593738387239
2.853295013054205
2.9241244000751188
10.020046165142537
4.629277575166219
11.78836235780125
4.799703071013439
2.6410212269203504
3.4831037667504163
15.448414722638118
2.884421271881448
3.9160447687827302
3.5728624086715497
3.6440395947708195
4.630880232287877
2.5910340218902634
3.162197968500509
3.9157746660611967
4.4516117520177465
2.612082232282922
4.317922976295905
2.9461050224222527
3.209235981153037
2.992963615826457
3.594436929587168
3.20712157614606
2.8114460135018704
2.796716138631173
3.6374757251500536
2.285005735397075
2.3630439630246287
5.691716191044423
2.9203401298833147
15.409700732103753
6.907908657615068
6.321235420542622
4.163857173774155
2.7345211898482087
3.3596048836418886
2.7571696164256077
