-7.573549658515836
-6.884689852874964
-6.843106017056613
-6.220135883289589
-5.900914915164268
-7.964525729515041
-8.397948585866054
-7.555160425895125
-6.654252847431394
-8.806141649328229
-8.245563622157487
-7.724207509991243
-6.5973146020371445
-5.903459059479167
-7.765913046006681
-6.941133960406632
-5.7079839533571315
-5.53442602881879
-5.89186737232698
-7.065951778291692
-7.460331722191331
-5.540956601157903
-7.437900523814169
-7.124455719705678
-8.233911310556264
-7.265995499482108
-7.488971105400863
-6.786868311616864
-5.944917028185725
-6.074291877023916
-5.417424893885525
-6.443759176244961
-7.191605848217569
-5.916742041043833
-6.531041321401112
-6.571549865757848
-5.185237342837111
-7.848304976392665
-6.5542588680052445
-6.015448363281233
-7.721745840023121
-5.208411814845372
-6.639987649781518
-5.853914805557015
-6.141900207554332
-6.865814878008601
-8.554396317269296
-7.2253220030474035
-7.105635422353835
-6.437133996692624
-6.423002020794418
-7.707139154291485
-6.305975465579771
-5.7418379716504795
-6.333290279883489
-5.981661716242019
-6.898783880709205
-7.72804189377446
-7.761469039471833
-8.539682632993161
-6.73338296647329
-8.115952163122872
-6.069975414247146
-7.023204440451163
-7.417217416350503
