0.6423552836052836
0.7227679701341433
0.5709805589618181
0.5726848994055785
0.4823274470158697
0.6116685700689983
0.6734286687095675
0.5852187053522365
0.5369170680819676
0.6274151454398368
0.6456723480643832
0.698645952421493
0.5280935974836175
0.6775301247022559
0.5849268844618121
0.5418341336161886
0.6937047420111404
0.6898575046483298
0.6887661141804788
0.5862488373285006
0.6566141800726607
0.6066713648535295
0.695836620644313
0.6833898402388218
0.7668318246784183
0.7623141080011309
0.7166683137619657
0.6202970320505939
0.6813692528735632
0.6067963324361818
0.7178045929592959
0.7527824654451944
0.7505808434484905
0.7163337473652515
0.7059286831006398
0.5397019630501774
0.4835211841890662
0.6351377764085712
0.7375278736395009
0.6464410847132229
0.5988244131455398
0.5600136184443196
0.6935147332354381
0.6302053747544034
0.6713711672296985
0.503738767773076
0.6355673066032393
0.5853337546647406
0.5375147574557774
0.5476924379053948
0.5354668959007551
0.6888428178665512
0.6998384510727368
0.6801081448523051
0.6034791245791246
0.5360061914761164
0.5430816543425742
0.5679377495461087
0.7467999472156241
0.6204726184187358
0.5166884586188987
0.652722800518186
0.6554592959295931
0.6320026251779782
0.6496838469713071
