0.4851434861861273
0.3934703831951124
0.28425505968537884
0.2745604643718572
0.12758063032438852
0.2564794143603177
0.463609490403382
0.3266856081158671
0.40613165209471597
0.3319622901526707
0.19327144129955226
0.32767024073922185
0.1347674106168763
0.4146559418453882
0.29133507940858683
0.7530496201142755
0.4384933294015361
0.20529696459950786
0.3129208504509403
0.5188527578779941
0.4725217861679539
0.4729188900087636
0.14547815339658646
0.3798237793755207
0.3354333336662132
0.3045900055631258
0.5127434180518631
0.4986853416128235
0.5382164927123565
0.1875870364562785
0.18201823065389175
0.412574625189393
0.19483826001625548
0.31879169259016005
0.3396520024669778
0.3082037293540669
0.3689425037526805
0.4368956885060388
0.33854045566336666
0.22294746021893289
0.100471089220813
0.43961724174408623
0.32740633408017444
0.2386006626653468
0.5355579712571237
0.40184932569353854
0.34684689363589044
0.5979465675401812
0.3180809045213964
0.3551281255555695
0.17702487634157946
0.18335502978302115
0.23295530425427524
0.1884621799584538
0.2069276755029946
0.3087476786661546
0.2970326522423991
0.2795798368053312
0.2828101180802087
0.4938774592063477
0.3620488725661425
0.12559606592926634
0.4689605846073131
0.15529539149736712
0.4086994996248847
0.0449849511368518
0.1707767552254313
0.22913996970989756
0.2999870007044696
0.2716829964723341
0.3166506360140413
0.25449613639489743
0.41340989171967374
0.3031693831867772
0.4277505818339297
0.25963794837376825
0.3344907216559695
0.2858996836684434
0.14455995035038133
0.226564709706749
0.30305951356917177
0.30305951356917177
0.16219697334018374
0.22350009207592095
0.37544359832120455
0.18437825483221035
0.4167160526414181
0.17674751248845175
0.2111719429145202
0.2823501221822155
0.1905692298420336
0.33356308029183235
0.3288222139004289
0.2563074693378857
0.2751979174691984
0.4395042086466124
0.4711679181730726
0.4706060660584429
0.26628433194186435
0.7802633805711887
0.5229569495635716
0.035830539725828094
0.3352238540379281
0.3123922837327594
0.28146892926685063
0.3342853074930056
0.25001813853034305
0.6177479110523021
0.2812129046558333
0.24099409959067356
0.2193376223909647
0.18987130170668454
0.3727313892175497
0.16684914198627326
0.3147475688841353
0.3583198802441785
0.33348911702932804
0.4705656129230295
0.4019854947654517
0.18718058774353852
0.3781321970780499
0.4170409602998887
0.5685013217845036
0.29880665138523804
0.32909806703300865
0.3632552219113951
0.18443494101445773
0.4869388451119804
0.09403646910193277
0.3260325711508581
0.29444376140834794
0.2311666229157677
0.3489398993666972
0.2116535345628104
