32.53917058993152
36.514605382641065
121.7224260942996
29.568680808680412
37.47167896215972
30.81097866426836
34.27275832933464
26.09870865356731
39.963789953485254
41.21021104217528
48.63234013952329
41.463581329404676
48.73009299704831
75.66465831673645
73.27501306081426
41.43151425587962
42.95714616044693
29.748789530258627
45.63202268298684
37.237543673199994
34.27275832933464
43.385560786575354
30.35340345929102
40.447026022471654
48.63234013952329
47.5213793375216
126.98855971825338
127.51686188142692
71.65578365049402
42.56714594687434
67.09147207358025
91.0383824318384
41.463581329404676
58.34886652900575
73.02921076528213
58.34886652900575
72.10902807084068
34.67395766932441
107.48367547574104
53.253750234725246
57.291199098470834
109.5304263966895
51.3622652406357
19.003752086990325
45.58598787620396
45.4153204388828
52.655150124130564
57.97189399850944
69.2187010616362
99.61927409451529
67.09147207358025
82.11598311673275
58.34886652900575
49.58131588376437
71.0090370337051
66.07633684345262
43.12351832401435
71.30858508370942
65.35373635150893
69.34791533864882
43.691995588615825
45.63767766528729
147.03183635144777
90.57919311420105
121.58751405810179
46.46623349382365
57.291199098470834
53.18449233770804
81.05077136623994
65.02741602274172
74.61583997268342
42.56714594687434
47.27090685880593
20.731790664702338
20.09073997247492
28.907401001155424
28.378097297916227
31.93942272870886
41.463581329404676
40.547832546797906
66.18847563315403
41.463581329404676
54.78645191204073
30.84199372057773
125.28261319734541
71.0090370337051
25.221552772245488
66.91116877955646
66.07633684345262
40.52538568311997
50.87819007413419
41.788533046047746
41.36557572550562
29.748789530258627
34.67395766932441
30.81097866426836
29.71191045154559
54.361663796490404
39.180490746065686
68.76937937092714
77.69169692520664
19.45853691348547
39.180490746065686
43.22719312215086
30.36950583670444
33.92802462718009
53.337738109528274
35.38307383569862
116.6977330580115
61.8969189593485
43.385560786575354
41.463581329404676
33.86199431240689
22.7076602194414
36.51014213222985
34.27275832933464
44.94398640599763
37.47167896215972
37.47167896215972
29.748789530258627
76.0150083479613
34.585065046102834
49.80703257346711
22.508546350519318
56.60887593473947
121.7224260942996
37.29759851656054
83.19334926432767
40.547832546797906
89.7971245354165
84.74161031151387
31.93942272870886
38.817491195087094
39.180490746065686
