35.278109117555545
32.52480953785329
142.27094612037044
30.19852753137935
32.1599097657717
22.359869417686163
31.68941550700772
18.354439579309087
38.70071722741085
39.442125052254674
39.794172970330436
44.647706994516135
44.551483376207656
59.32165058002906
69.03440430438386
40.85837601850006
44.71973883537231
25.58239628404245
34.818938449232554
34.47832703888619
30.586835475323877
35.91108595350956
34.47832703888619
37.546891458914935
47.893894700015075
40.00927817504199
124.72695092231251
117.41615875401413
45.24446839300928
39.982453312371625
36.738094347610705
73.25683447294915
31.451529131226398
42.88265967276693
71.65766489434577
56.06736096388078
60.05859375
32.754902014157075
93.30261292555186
47.69185721513586
43.70048991262587
114.16387364296122
51.4366695295296
15.84470775350386
49.2414149823387
51.79004745018658
51.60326646623595
55.779588177714174
70.70811554383106
69.09654149455521
43.380154965705614
58.59375
48.31764405020696
45.99702676203393
46.553462642785256
63.81744407458585
36.17897178289591
68.39424333942628
61.80182551678414
61.81918314260507
39.08690643787012
53.09932312614802
145.02692926205685
60.69828912627147
111.9144459662933
31.03948256897035
49.41541345732325
49.890780368925
60.69828912627147
59.12237130061689
51.60326646623595
33.81854408383358
36.3859639112526
20.402912515406424
23.619895746968414
19.924029065530434
29.296875
35.399548750765355
62.165317892352384
31.68941550700772
53.74200096048088
34.72637575526279
44.479179054752855
38.029555622306155
113.2580963676428
67.95359475435471
32.259837224919785
66.50132497743847
73.47618869522141
38.45040453634772
51.60326646623595
44.93514155325576
40.80582503081285
26.407846255839768
37.0579413300982
28.442120857833398
24.379858853163924
55.1412018302306
38.001333313689976
54.02076830445051
73.60748745938152
19.09922579649213
47.69185721513586
44.83953476078311
31.314782704734306
39.442125052254674
52.0174245250919
26.890956666043678
119.22964303783964
34.818938449232554
33.403576907201305
30.586835475323877
28.290831907951127
22.740490277724643
25.202124805788944
29.296875
47.171607972962754
29.18680494898136
32.52480953785329
26.407846255839768
51.520035337116134
26.20392161132566
58.336839116425416
22.740490277724643
63.26022328619878
115.38841167953892
39.442125052254674
61.348803490347436
33.81854408383358
56.14385125997109
81.03115245667577
26.407846255839768
29.18680494898136
30.79657623285445
