15427.872628726289
18657.165745856353
34878.865296803655
35416.13942307692
18105.879032258064
13624.307692307693
88889.84476534298
28858.87837837838
72393.40151515152
29530.131578947367
99468.58156911582
44430.180555555555
20505.66880146386
42476.52892561984
76471.04499274309
17213.172910662826
23436.930294906168
13283.417249417249
28715.524590163932
32231.176334106727
17094.391304347828
18530.28717948718
23383.814223512334
62224.269323671506
28342.949248120298
20427.97142857143
41515.23355704698
90430.4430460074
30354.926491994174
18183.004895499907
1447.9873417721521
16150.831560283688
54073.46060606062
20891.654093836245
37454.40320427236
19217.30783582089
24410.272727272728
35882.39417989418
17832.678832116788
12272.46017699115
39009.82648401827
47417.40909090909
77469.98190045249
38430.72162883845
58328.75097783572
9804.163310961967
44295.81828073993
51848.12666666666
29275.23979591837
29812.14990859232
9615.18772563177
65604.46033077661
8572.689473684211
5332.929515418502
11767.377450980393
14715.580459770117
24958.68023255814
53996.524444444454
20052.951612903227
80240.88316582915
16346.02551020408
31027.860284605435
9360.360975609756
32359.901662049862
50384.133956386286
