308.95541958041963
253.1150341685649
144.31737147595356
145.7952674897119
158.63758389261744
183.06005221932116
208.16322166785457
325.6166134185304
286.52719486081367
228.23135852911133
232.7137724550898
237.92235410484668
180.33203125
137.91714719271624
221.87548992161254
295.4074074074074
204.9632428718653
248.7456647398844
276.63800657174147
298.87778695293144
255.43146603098927
227.69726699369303
182.8415937803693
267.1961432506887
209.8848193988381
191.72268041237115
312.50848590137645
234.91371078968774
302.3449289563939
256.0437445319335
282.95292987512005
221.7434518647008
230.5926860025221
186.26108754338603
186.27740897203785
164.8952132288947
179.07822842700685
175.01192250372574
272.61336999934525
300.2564878892733
326.63456464379954
305.42132692830603
328.1113675706867
374.04972375690613
160.91439420089748
154.99363705777554
191.17205926821893
231.3495174461767
231.4733870967742
198.54302307809874
211.8084714548803
176.54359363153904
166.43272239606614
204.67556296914088
248.39817518248176
182.62564671101256
237.04832713754647
186.0553428471981
176.67995276055507
224.84564078132442
222.5318066157761
144.89152424136728
209.17996461369958
187.832183908046
195.5112189205579
205.4851485148515
256.2107039537126
256.7783538561244
250.42937174869945
207.534891598916
230.68291884816756
233.97096774193545
219.5582264957265
203.1266375545852
203.48579161028417
196.61948955916475
310.98274799753545
218.9844814534444
184.30581364481017
209.44600431965443
177.33464788732394
177.33464788732394
150.28138718173838
155.7376146788991
175.33445927832287
191.0237885462555
155.65744680851063
185.67278229619822
196.4776540953647
209.56167979002623
212.51172273190625
201.73514256269326
191.36608996539792
266.42857142857144
126.68695652173912
125.33369447453954
159.83704974271012
184.21410303251736
156.8739534883721
204.2586301369863
184.9177972865124
158.7349665924276
165.7027840481565
212.4250928600908
246.5995145631068
182.039338654504
132.61996933691069
193.14044444444446
192.16005225180396
201.17107692307687
203.38709677419357
231.91076923076923
241.4301221166893
253.7170626349892
277.20242424242423
231.6529160739687
188.1951672862453
211.4103165298945
162.40418574231526
180.64444444444442
148.43870431893689
193.53827160493827
236.48026926648097
195.2161520190024
174.84944532488117
246.763172381252
110.08115323011214
213.11257880516362
207.30940594059402
187.916032470827
207.35065406976744
195.6261319534282
208.1594048884166
193.5267857142857
