-1.1867881113519916
-1.209749225534559
-0.33752830680521295
-1.2873132145999497
-1.0635448863922063
-0.7843412477732189
-1.1869123294704458
-0.9272485902226465
-0.798319797351575
-0.9460584302327456
-1.0786036950460123
-1.3547649538647843
-0.6807441365765883
-1.5473584846507433
-0.5773983855487891
-1.0593890188126913
-0.9343408427779295
-0.9963755771651918
-1.7443347133273548
-0.9490506730039815
-0.4354542339088306
-0.5041241946280186
-0.6255481794432481
-0.949166693443942
-1.1416514671705624
-1.3964928595328123
-0.9189486728851596
-0.24185022493253558
-0.6514099713030543
-0.27359063928124894
-1.2083254050704118
-0.8669401900152139
-0.5685501675322067
-0.787715133685758
-0.7943304522910415
-1.0138441399437066
-1.4117047563087644
-1.029884422219898
-0.5838575979502143
-1.048289871022878
-1.244643237334703
-1.0148740051918657
-0.6311347818216513
-0.7809902648452223
-0.7338597971842225
-0.8918082509015539
-0.6207746457360307
-1.4503333007660715
-0.7073807999595263
-1.019165808912888
-1.0229384147613227
-0.26386075685716487
-0.8938022222330416
-1.0002840235085675
-1.0935142459892633
-1.3663085880619865
-1.319605952268582
-0.8218859212752425
-1.652288127034472
-0.9918974062708024
-1.1082157447132805
-0.6831827143391359
-1.2514092601304796
-0.824105547746865
-1.5101019453012177
