-0.14228928958513673
-0.062279167774590576
-0.18779466340173478
-0.08629121936386223
-0.16231085019541258
-0.06889457967605651
-0.10131333760889129
-0.2096234287893526
-0.07327253374713247
-0.090644438521797
-0.13093836785266197
-0.027923834485692838
-0.08296624361384168
-0.16700830989784357
-0.24823398806487443
-0.11315508439628585
-0.12810737146449278
-0.23797912680880112
-0.257399015125262
-0.17180583424583556
-0.2917553083031877
-0.1556884020601689
-0.1342157947445551
-0.1818362026852679
-0.2955570343378214
-0.06488664934049386
-0.03425296091183876
-0.28688214305088783
-0.26498531860334024
-0.0484088913199478
-0.28227157852862045
-0.12743516322735346
-0.2432435698370906
-0.1386406544003234
-0.2927332276866279
-0.14621579801217668
-0.18001290427326755
-0.21754492589579597
-0.20758257481971626
-0.21353352686083385
-0.10048010023206344
-0.29171373161804554
-0.0935799982113914
-0.13054051181075182
-0.054734563821267394
-0.12673845035319067
-0.17108392264708944
-0.22188555266701585
-0.12668123379198057
-0.021076754363468623
-0.1226295186122621
-0.12210673297848763
-0.30341535464283087
-0.2651588464159477
-0.23616950011643517
-0.17057871748855583
-0.06718734669299585
-0.2623220865617703
-0.14722301985065042
-0.3115657683422191
-0.05380461432097319
-0.2619902241347756
-0.14914293771218412
-0.3319698903240496
-0.23827982473673784
