407.039834128993
388.4263351292119
583.3608459662537
262.03983029563966
165.21521869968063
98.22716876003749
68.11553777529782
231.38682822526832
254.05332827355363
580.6035127389082
434.4017625722527
911.3814032691832
524.9821664212643
1772.0941459368782
305.0326262617757
766.9254779080583
846.4983300955679
216.394128070834
189.74004774544318
194.32018240408559
294.6068762780259
284.89563706684396
200.43295899212623
206.5023036016321
168.79299589132532
543.4564488431305
617.1527223639446
631.2021666773692
387.2613960012098
477.07956611668936
243.03178182629762
912.4504843710988
341.0128726415378
577.4732320638017
725.2731405535678
396.7888683125233
193.89212961583783
116.30362837108223
751.2191528765777
285.60880392718985
317.88054003706895
880.7183536537273
258.63760569563755
96.83506587443752
353.81315169950636
372.61383147651986
215.45525267035617
537.0820140493609
205.16574070698027
255.39391937054643
241.68651740337285
355.0342609668705
419.3754747037667
406.5896104641328
232.53367452266556
325.88344343072015
89.77926569294719
531.0868949022142
300.31423639638945
479.33709951173375
395.9778415497042
482.25622727159754
454.8419948380739
169.90681498398558
441.6551704671376
102.62658060060836
148.00921536544683
345.87661956314537
467.18571502682886
591.7579978049763
200.46696064356155
158.29419948570307
135.14877645535313
117.92948019723394
112.50812356924786
165.12371124694363
148.65357273904277
792.8923814024288
410.39580528816117
140.68857058256359
216.69424399354043
589.2100688185348
142.36742426880068
171.1633054359913
638.0203545624587
451.11578158543466
283.2719536917936
213.09865771622106
218.89198333703732
341.8441299637236
252.46050763938226
298.6216547518057
268.77362056899847
86.45320079066124
399.8526125062821
778.1900025100454
402.43071849578905
357.37369703891693
225.07308299643267
149.30373812968259
210.78301018050647
120.50211159768372
196.3503379119734
145.9954953140815
162.21935390063396
337.1933250533269
405.3944119102737
109.36484191110745
415.77464241482835
244.09260557925592
303.8820287585822
259.82785503762835
271.4169314536663
204.08444152369225
241.35299276644687
381.8939839410181
610.93421898881
314.83244840501123
410.6576273737789
223.851375744418
530.3104686430976
437.32909567108254
356.30796071400977
999.6313343962887
323.05615289066486
1087.3257792743477
255.22713243104903
796.8276265411928
859.3414401293364
468.99055145161043
387.93792280239234
220.28099020800119
400.9680354242798
299.7529772752708
