0.5648199017384732
0.6209001359918248
0.5651265475000068
0.5927493047278506
0.4849716515893957
0.6406466842336408
0.7037231831538809
0.7061637026544958
0.6619896435686163
0.4976013914437973
0.5801790317869525
0.6937043918918918
0.5820116621812124
0.7003431372549019
0.6458411033411032
0.6131134751773051
0.7380454340980657
0.7650316455696202
0.7249161877394635
0.5850357681776146
0.7327200684780207
0.6292358574440154
0.6867990658759753
0.7062225197527191
0.7806289645999591
0.7661550296520084
0.7505464821745871
0.5758790971508279
0.6129598040977123
0.5930296504933418
0.7021221532091098
0.7358715494211931
0.7477296414892951
0.7013921821958758
0.7084496211268663
0.5438870603694342
0.5578304239401496
0.6687992539475589
0.7116121481865584
0.6824646632251722
0.6530913154533844
0.6274930953898449
0.6904174244045072
0.611461840673704
0.6395736657675649
0.5385231516675437
0.5813840899318602
0.5081837787154243
0.5630581136507207
0.5187122715936275
0.5109786766724627
0.6878856891115671
0.6829136357153046
0.6476555800563519
0.604070182667216
0.5240596270960864
0.6126863846641166
0.5163327028356933
0.7123275089605735
0.6166544309625445
0.531751429525892
0.6371344885414535
0.6827263003075277
0.6409260529826567
0.6204120589784098
