5.121971020673304
5.499714106341647
4.58039122012008
4.070951719215593
4.192997439869469
4.144952527292514
3.972644796883561
4.7887662205065284
4.929852307499381
5.103870057247996
4.5966240177842765
4.940627496550581
4.988815375424273
4.99584897214498
4.976768807690563
5.120300088545868
5.313200025800134
4.413806592267836
4.518825147144273
4.585627125848708
4.683341709354648
4.646502266561623
4.271109568513699
4.535166662015077
4.393527794517282
4.651987965085047
5.889268877188131
5.420674618945364
5.355612840165683
4.5464713957193315
4.4495857996706425
4.946097894009705
4.438515280125011
5.021748858221231
4.7556534482538435
4.65688613878523
4.957822420154808
4.1160557901535855
5.114594433399765
4.529818717409701
4.227210136118764
4.742216219836859
4.543698714551865
4.6122924478834735
4.745561253081692
4.727543330761073
4.728499761916536
5.746818613223059
4.685253156150129
4.719033990687796
4.468412361990656
4.563387621089597
4.690820189973288
4.64741740750543
5.507802559692331
4.397230565871364
3.9739560571743504
5.049056471264143
4.79568939164167
5.285507324108264
4.7669895669955205
4.565133037830828
4.845700990228268
4.212042239684274
4.727592622455257
3.445324300092351
4.385007335519201
4.416327984151691
4.434750627133233
4.194720202841282
4.33651869761329
3.9794034308820803
4.562833907431615
4.066432317997769
4.858957970250301
4.158789029814871
5.074495306699052
5.471460024700502
4.592837948720546
4.413197579653353
4.48337082365976
4.502750723705669
3.927733516812169
3.659375257062821
4.612558292307399
4.56618283008383
3.8093212773376774
4.69453398017449
5.079332138397088
4.911577214167047
5.133729793990628
4.829130404152519
4.380375217582181
4.716281823478696
4.6649224668668445
4.704148088216578
4.846454334616841
4.778860802195943
4.403261487298435
5.207069764077411
4.771925723926708
4.068422646600727
4.437991640268259
4.397054611030823
4.497746763140614
4.492103109288658
4.081357817878385
4.212422846796927
4.914846765923387
4.669174042894823
4.260975110984649
4.330704185935076
5.010613085817229
4.985637550287883
4.02938245235821
4.703066542878238
4.686108011663265
4.458387754026754
4.844626557641303
4.4719220132623665
4.854398163188543
4.552720264090621
5.345553293949461
5.370571276018054
4.962354318870296
5.284758756598707
4.2233700660119355
5.681755968075325
5.435574774151444
5.315146292030568
5.254575585416151
4.433576417742867
5.108545166226991
4.470740769164661
