192.84697477501382
138.59335015800224
129.8650644955983
107.46077431676625
75.63585269218547
72.74267799904176
101.26111426002971
135.24916954704875
250.73115277568274
168.9445933738566
146.37518837579393
137.79851718189974
133.79607062474912
160.99614273555466
334.10484793397234
217.52143422891552
167.05242396698617
103.4614710369552
143.28548753796304
114.88939835917652
110.5727446636005
116.88170006482694
94.22496233941048
104.7812859210042
112.60078487033284
120.02930887219509
356.2003232946675
234.59307916349442
155.30925386010827
136.11372810211736
87.25238980904959
158.7993494524703
141.34887149066034
155.25154167537337
279.36506228026224
140.34037665570472
129.6805691531846
76.00483688779363
235.12248006301544
121.13510172846556
115.49216220695318
126.02564931377627
122.63988560086884
152.31856528497497
285.75206146717005
136.4168973369492
141.58420405425787
219.088648023266
162.77755872449526
157.25967537790217
100.97726524265299
134.08456532221135
124.70416363300312
114.60999574639273
188.05395220428525
116.94897525142116
161.38958584696118
165.03583754962568
142.09865334781333
208.11298836766358
111.88870342347505
120.83979969735304
277.497571297433
197.5258302778578
159.06947394057576
46.32242922445338
191.53275408441957
171.64447713660172
155.21503096231743
118.03260014683191
157.80915404246758
99.34684180019258
107.77358284574458
75.84066940996843
118.41788732433668
93.58117687428852
152.0641547083903
209.6162132612186
132.1975984538878
118.42701528160782
123.81991737623841
123.81991737623841
70.39613974286144
67.82961381473628
180.8929179342992
106.63615925959878
90.33337468380573
149.60727553767006
155.51282588784125
143.60682353592458
186.51722897494582
160.19721932480067
161.83188482811494
105.16348071321949
137.82515126828523
116.79159404661924
131.7364899672767
119.36073304767021
118.58773294856593
211.4576650862184
241.88693884252785
99.0240773086681
129.45335106497757
227.22444097489185
115.23537401956598
116.7926088036142
95.7593777674344
138.6859953873188
176.98667966156074
158.81200840047137
88.27697469671978
96.93158005914327
166.12678209814774
134.4011813502376
80.06956949841405
121.35788449243
168.03399391259538
122.83186689517208
177.86054326420913
123.95127378797574
174.89617108454198
137.4550552805198
261.003412834026
202.3856250817033
162.89574701698075
256.0655443443558
123.35938280298508
326.69336064500925
171.8623840360001
239.21385886091903
211.34428307129747
104.1572919067762
117.86219873661516
129.73978465580893
