1.6696329705696227
1.66303753073973
1.8078831920306633
1.6228244196622101
1.6651478707150658
1.661127077518435
1.666766128115535
1.686336466115075
1.6929166150121155
1.679485168883531
1.6894427081793362
1.6454404143132944
1.6937723483980918
1.675957555653848
1.7487782354373544
1.6532059000350985
1.6999614365465165
1.7136222804585544
1.580620277023043
1.7041145807809255
1.7828474058112176
1.7429462825858715
1.7404793258061984
1.739728361157262
1.7426123482198856
1.6672076481212752
1.7146311538058039
1.818275756635728
1.758239187273776
1.7957219591839846
1.6415159693638186
1.7202127770492581
1.7564868789104229
1.7412240981373852
1.7520349305719534
1.680788252782429
1.5898605043942917
1.6635466947932742
1.7539475076447526
1.6926377277112425
1.657386851485195
1.6616137038967338
1.7504946396413539
1.7384966259692651
1.755359624452107
1.6637710858912604
1.7029162579013464
1.648743463486796
1.7180964291808736
1.6697802627082663
1.6364404929558647
1.8041135713216299
1.7264202456128932
1.6933678902820128
1.6440653990614578
1.6247366768995033
1.64609959380755
1.739568110294738
1.5838985163174684
1.7348134521291536
1.6673030097322472
1.7722401262778293
1.6653450697512384
1.760424071734993
1.6605325265423212
