-32.203194972262764
-87.92978926100542
2.328913451959063
-929.2519428423731
-48.730843556937465
-39.93101135504233
4797.060799960071
-2.7452942702835985
124.5906319681969
16841.692729966082
31448.50052749463
19525.757449398898
334.81440302040716
2102.5746892825105
3505.468334800479
-907.8907077278993
-64.06419121517817
182.20919099902252
-86.59456855524233
-375.02557550456487
308.62327116444146
-290.84089112161604
252.41299203927898
744.9206995741258
347.94097166403435
4587.078621666271
770.6534113074251
-1813.5292045526803
-403.16278417190944
1789.2576523401258
-2.207154564414984
251.5058231108714
-272.39032607843603
-198.66742740790932
-439.6570572153302
68.21159829398948
796.2106280084632
-39.277445808573695
86.66837618917931
47.527380907538394
10503.850851497717
160.59705425320968
31.54207292402416
-898.7662712915583
-47.12801237119912
29.84976766764571
124.27350605272987
1132.0558478132366
1701.4692039987485
1879.2053993205427
64.57286438762092
1560.7915503619367
478.0169973164042
177.45911688476815
-39.03687733155418
240.17472935679942
993.6287723302803
-64.50137246143981
-95.1666554864002
1076.77303071587
-470.61060206907655
157.49813468499966
217.76960974946815
-178.38825453487775
-3878.591828804712
