0.20924914765954544
0.19073511622246112
0.2334750887749392
0.21149862289134574
0.2286595028500921
0.21947068823017013
0.2358030614270743
0.2257084173505496
0.2335087424423456
0.2014926497287812
0.17880236752120696
0.18251675976738366
0.17463729194858774
0.2374746178781469
0.2315743178081095
0.2623962684452893
0.20295862909218565
0.24935984023177066
0.26531211560294915
0.17895648158903155
0.15559603362243926
0.17129986974897202
0.21400584044603616
0.24819302834626475
0.2178692544217697
0.2003005910892287
0.1998900233131703
0.19919538541400245
0.19737872561697206
0.1938980219875322
0.2076626409017379
0.1943863566773999
0.1874155609635303
0.17436723696188747
0.16928892639962262
0.180629444830798
0.1907798834419414
0.2321858121312858
0.16981651144952709
0.19524093926279765
0.2079219625401575
0.19517457453491016
0.1871233670150623
0.1718232845819453
0.2530396201838916
0.2614798436749508
0.2487943371728784
0.20719842233894667
0.21486017157469328
0.2306806984467132
0.2405599141395725
0.21677663491566465
0.23843393693168136
0.2017692226053759
0.25474303633520723
0.2576701400252226
0.2728128024599987
0.2399752337030049
0.2617895304491066
0.2321343353595084
0.2420916437429595
0.2407812251009017
0.270176531506126
0.23263627050911764
0.2618465692104111
0.28042972500603885
0.1875432866222331
0.20766309612878528
0.24522472636546494
0.2470995955065289
0.2496803970089033
0.23974262615975395
0.2497734975163537
0.2432561359231577
0.2160984113653336
0.21832302731211944
0.21224910435836103
0.194596565520469
0.22107712377928104
0.21470720701394827
0.22116373765685127
0.2210767385226801
0.27083854154586495
0.26089288240591785
0.2581696509151008
0.2367360394361236
0.2751310156817617
0.2324686373053342
0.23199307018677875
0.25374220101937034
0.2178139553977454
0.2518883300977112
0.292399426634432
0.2634840925153409
0.2619420263536206
0.2729251452701337
0.2611769104797209
0.22804982187970116
0.24199569624881506
0.2750710402910052
0.28115209530962515
0.2433225222576745
0.2497210446215937
0.22061618574433767
0.27507721150347303
0.24638939971271734
0.22719596919361626
0.2454511164946423
0.2223153584560001
0.1989735843418516
0.2140356945113335
0.22431376896487448
0.22491729251319065
0.217725201448853
0.2210247147395948
0.19712318400138265
0.21207067809516927
0.2578503536827097
0.22169195744782466
0.14901819621494705
0.2612431341190835
0.24701298472357694
0.23322697652547025
0.21185500427827944
0.24119609045884646
0.22399592970772128
0.25336502946444706
0.22492820455397106
0.21433456731628014
0.2337525903031745
0.2564725154807556
0.20231457209121576
0.2157872350924732
0.18899234864672387
