-0.18291226948381226
0.07040445756471847
0.10525365777852376
0.1297922069195204
0.2503435908429569
0.0924415334415562
0.2426087010012197
-0.2920867861951534
-0.0036486877737972796
1.0317928954565776
0.4142560543240173
0.3278650030659766
0.0777965140735097
0.7533819455596013
0.9638186177468404
1.9463124186375915
0.8834094094263175
0.19236174070130435
0.2781459264765873
1.1218304459193986
0.6725534521223703
0.8782933826164229
0.9083166557327578
-0.017352903621627738
0.20432085949886802
0.3071097545106757
0.5888069992443367
0.3544883376157682
0.6784893558657347
0.37491042210228015
0.8749777616083645
0.481059032473908
0.22241481532435875
0.3028349932915146
0.05348303231499287
0.1151213041707739
0.27445495168620404
0.1588711022312153
0.6589234763712604
0.4744225418657948
0.3699625842950107
0.2437597248114854
-0.2477305600800862
-0.8006038160213045
1.0788866350076252
0.3973960822741294
0.9161106860093332
0.3075400055944675
2.441308616439005
0.7133974661479308
-0.0039514652288237025
0.3078643780316238
2.328497722870968
1.3256207405779608
0.2035510153770096
1.522203813090989
0.33692800850529325
1.3430187061030945
1.0046603356078496
0.7828493658647205
1.0343777622293049
0.2927636111220828
0.7622732484973305
0.377199965100904
1.784324356639242
-0.22102443077567965
0.4964433674763978
0.07725894783042414
0.2229317470555625
0.13562951805098458
1.420341954482136
-0.11658448567085923
0.06862978776748924
0.802017201349465
0.3853216561755179
0.21611475556186333
0.2546816726542636
0.9648083430290009
0.031158238976157264
4.349582748770459
0.3791173231841489
-0.3119892878378978
0.6530227632709589
1.0161322367785837
0.9417180680589924
1.2194175389588688
0.1225329792925074
0.34400166530575776
0.3280658732580038
0.4244944775048801
0.7788601268592009
1.2820601206212914
0.44213621081228177
-0.1891694523599963
0.006215165600732527
-0.2608779865657243
0.08993453765754847
2.4892086860908647
0.6833477446189512
1.875537724018632
0.5044942259895375
-0.17723563228790054
0.0942863084109566
1.238664526342232
-0.17023305311392448
0.3074073747701347
0.42397459505642027
0.018366743155301443
0.19909897483713287
0.11034455911989237
-0.19552971539448374
-0.2353811804646992
0.759814898969041
-0.23102142068821704
-0.11184724005774176
-0.0878835922905679
-0.12449248360453966
-0.4316650186561239
0.23656624815977215
0.5528820656879878
0.12234840429266312
-0.03847041223141488
0.7911858372577691
-0.1363176948741246
0.43375895682396176
0.7717563734233697
0.32755089340151883
2.039862737932671
-1.366909732933005
1.1447533703690296
0.3165414164075819
0.2038162174758366
0.5418439196679299
0.07354526012169517
