6.820416689972383
6.542588078588208
5.776925620518091
5.7905861153350235
5.90408875634186
6.0979084859971895
6.273250550234278
6.894161180104617
6.715002314558448
6.399648621644809
6.426447005600811
6.456983289176128
6.077508575040187
5.7162052549333175
6.36078796058719
6.757638410244958
6.252042397936474
6.518474865118146
6.666032985280982
6.7739734958490985
6.555213321113043
6.396422562054476
6.096285446117527
6.617716439822152
6.284533991660856
6.160841581195338
6.836451759052247
6.439422235812072
6.790116057993779
6.558532416053924
6.697489447152802
6.3599696049741805
6.4138270766393735
6.121483878685246
6.121603104874711
5.956294307126811
6.068035149793532
6.036875777953814
6.645630596285318
6.780413548049441
6.898550818726028
6.804294161172496
6.904896298164902
7.089954667781103
5.92330422332002
5.87278828112965
6.156921816191729
6.4183425215184515
6.419080234593993
6.208535211065817
6.297039132372277
6.04869191037067
5.968835747077364
6.250120535150026
6.516540102824121
6.0946792699008645
6.4519033462187405
6.119980093231211
6.0497391762244295
6.379076506721293
6.364848942002327
5.782248201412312
6.279924905088833
6.132915727662288
6.187527712249312
6.2555225486334125
6.559436188771843
6.562504810222785
6.52781358511893
6.269110556369273
6.41436615994791
6.433876001705389
6.346358828684848
6.239728951292477
6.242145103910566
6.195242290723714
6.829587197203906
6.342764102623503
6.107129198285139
6.2816662690178084
6.054756798674468
6.054756798674468
5.83126823001404
5.879234697207172
6.039372066503835
6.1558644900203205
5.878541453592503
6.117179797931791
6.194257272829526
6.282422774040032
6.301584113651582
6.230329767161674
6.158304293964241
6.613718251867819
5.602949656864529
5.588669479485525
5.9142439309275545
6.106452389843612
5.88902512240525
6.247330673697421
6.1116374344240985
5.904915929126244
5.962895305870259
6.301025006067657
6.506484573140397
6.090309383058102
5.663909483165301
6.170885817627202
6.163947603893808
6.2265022621706825
6.241481550009948
6.42168212134864
6.477195708805043
6.545879737458405
6.668871867640453
6.420148770942949
6.135544122448763
6.294459631544555
5.935739526814937
6.079859444321125
5.8146981308370655
6.173691782376876
6.448592270513161
6.185466839532833
6.035616637925136
6.507402362385246
5.416837391254811
6.305456134898546
6.267621980982942
6.133523306824968
6.267894400161485
6.188329521895329
6.273225437438356
6.173610845922951
