241.87952319425813
435.33165890195534
159.57755907289396
85.21664419974512
86.22990346276985
79.57102715159074
79.11385439614165
155.64594975384045
209.53982132541915
268.2976401961196
149.38387510966834
221.06890506917568
236.58114193751103
234.52774873826561
263.8089837168974
373.6927289361316
371.86875528657316
150.5372472277054
115.26399373381064
157.95563697682576
180.02638241938126
167.13584354292303
110.05489684412252
165.97341518050217
116.24124148282762
168.061035293959
665.8231827934418
440.0971330147982
381.675825422128
146.14780779350198
124.65991818189906
248.19211903321332
125.09439144275059
289.54309175989613
204.2359773585375
181.5746367323541
241.57525531496455
81.03669991319154
276.8596745159062
136.07926630595102
104.00599334317309
194.98181764512645
183.0138332716589
151.21328850470698
196.47518194164437
179.3693791559224
181.79309759267272
550.6755887365625
175.0645081657961
179.56059088800632
144.71660134755416
165.22322845284015
178.32486437710884
175.3939196318235
477.99323301407577
129.18761663441356
74.11396031695763
263.26473293399783
167.8596912088462
292.1887453521653
161.49417927244588
151.02853057579497
185.37579853067058
101.3085358980978
190.05534990122186
43.07434914215025
131.44909351338495
131.67977735125228
128.15011574074518
100.57231552764101
113.35530826804629
67.19848799597167
137.20988556977954
88.87416601285412
223.7914713109227
95.16674799172549
257.9192344334241
484.72205064061086
167.43998402754698
133.0604641720434
128.69532524551414
123.12839532593752
78.6937549214691
64.14564672064652
170.07664956599018
161.36791470416614
60.04536478653779
173.72118956709124
282.4975432130538
216.94701153309762
288.59766473471194
184.7750494505751
109.35706232644431
169.94639994473042
151.3289109888698
147.31899990667355
173.9954977402277
188.08315341341893
124.34171040992472
209.24177324692292
141.83152846294908
96.6555934332369
135.68161732943634
132.88625283389086
110.38399639427013
152.13494339887188
82.72481410890433
89.58567236344746
244.93005178651103
214.87925236714835
124.37616391370993
149.74496297179468
241.8887101241044
211.32164294481885
82.96407612528151
144.12073526892328
162.8045188936778
111.81301031525184
167.56934794203846
145.33212075167037
182.86575356809996
125.82949109899155
324.269692783729
327.48191508671766
228.59518256099847
354.8961727967723
101.91139239773987
522.5893061733381
406.58474621268914
346.1638005234733
309.40143683542647
104.14020700003832
229.4334893989512
139.44888692041485
