26.530152972204903
23.76230413951645
5.987819948470899
5.292183209300448
9.193383404044026
11.094240985028806
11.194661177437228
29.010514240153086
23.772610788835713
16.66656616325258
22.49174451247453
20.746671419384636
16.638994008946877
12.002429587760481
20.640568035504053
26.026491047965635
16.005719926306682
21.40971062339859
13.793285139284832
12.610363473014482
7.217918836715298
2.7386265875016655
9.130568538650905
16.22074024295624
11.097981734540364
7.18915958461985
21.786281162988942
16.975833166102543
19.778213237005012
16.114151724655972
21.856236772199303
14.667437943057799
13.259945281994879
9.797294598118272
10.165933523623668
9.967562186640196
7.0864149959616505
10.769246071352418
17.04335657702702
18.963068422499287
21.319271782259538
20.160720403206668
22.377791712083805
23.294755971906564
11.054472193418494
11.454000176274873
11.36247214729874
18.43176071325696
23.056630147058094
21.29000389421329
21.380294069559582
18.66521435260325
19.90826487679163
17.911852139540663
21.611290194953327
16.81786353230184
21.52331544997809
16.600845312322495
15.443477895268273
21.72140465291219
20.28610887953536
12.234997266201523
9.96779679419355
7.300491374705203
10.607803420171994
10.870535858867573
18.79252511275182
18.272484706771962
19.13474666878542
17.025188758111984
18.44674870623372
18.902358886480275
15.056141044370428
17.099457000608325
12.845789031291137
11.90195666957822
29.314605310011245
19.60808586757308
16.366151042841675
20.311491692789673
11.56170314211286
10.590481936823132
8.54620315513883
6.903854435806898
12.436445772113247
15.608526173499765
9.285250713549578
10.771351434003162
13.937940937453634
20.40730414169212
17.627912446847276
16.541259204476546
15.583076626919956
19.738709397484143
3.3980224131871837
-1.226012359060808
10.49330178210613
8.961953072611866
3.2397707544663756
14.208876886904672
12.496045707963273
8.4472209913822
10.64467055176143
7.413812008556509
23.972715032664127
11.614259609195397
5.5229017179977244
12.534613676142438
13.551895397182403
13.442744517471892
13.617155305157816
17.6457499918311
21.130106302993035
25.09133280927774
17.56890684526191
18.596397820247688
15.056878909892628
17.20801355952958
12.976353637035015
10.775464187945927
8.901160212322976
16.93244185521187
24.11394512509428
21.252679677285148
15.55922872172643
22.439002706409248
5.514039416179996
22.2424229902132
25.037887761949115
22.089786550470063
26.713846424749025
13.726889629516187
16.93739178703808
13.035022012845086
