5.437264987590786
5.221124386931264
5.516879902689314
5.4602333096262194
5.342340871328056
4.97115214514752
5.884786899580995
5.189092201460211
5.233415045684183
5.757474067621317
6.077715987125475
6.178297432195247
5.1611198578751125
5.839859289975813
5.414939480155901
5.176019150332288
4.968629848194278
5.192936580392166
5.46713182436859
5.621632776676711
4.828592581473053
4.862412989006658
5.257158927146732
5.66123723410383
5.659159704531344
5.546098982568031
5.476350483785836
5.16162737907505
5.281706807821643
4.897091333440719
4.31476630722508
5.204808887130796
4.981200008785041
5.167964742851662
5.167608664925016
5.384369390343454
5.162640462276474
5.310105367608859
4.826361831331987
4.952481274640061
6.164060734258512
4.3790316474065225
5.223452184611705
5.672012644814321
5.553684094276035
5.101482585025044
4.984324234518244
6.096913836653991
5.409322283950513
5.564758698155074
4.750036199321628
5.204141858391428
5.021740874385116
4.67827869648697
4.829659065953081
5.350141344002911
5.852953606308646
5.843022134606651
5.701682892470983
5.783153818989711
5.604377183523469
5.497470675788613
5.143539956320355
5.132488503771145
6.191683203130276
