-3.5842838613765196
-3.482746168769058
-4.987071552799725
-3.657003764679095
-3.5624552987179783
-3.105183893425452
-3.6964080162880517
-3.0304908277158447
-3.9559818014445467
-3.9079283718780835
-4.065565317980925
-3.929794979068732
-4.115468524870082
-4.396696720894745
-4.713377478636459
-3.950031664189881
-4.070305391560964
-3.3026016473071964
-3.8934231834948068
-3.6155285706884643
-3.7731918529302164
-3.7058571147147084
-3.66343917777214
-3.867303102486984
-4.223519565430507
-4.218415752888956
-4.391991822121058
-4.896076180856034
-3.8741362486224804
-3.701816232242944
-3.6585509888850365
-4.362544906715885
-3.526538820054418
-4.026864223252427
-4.567231442844758
-4.354770767370971
-4.5084045900567755
-3.688003977706
-4.718961953798866
-4.000260231735318
-3.850742754803214
-4.82754559167937
-3.829528525775524
-2.7859223865186595
-4.021287425945696
-4.189482398582687
-4.132428976019348
-4.343313278799441
-4.336259532237829
-4.437917269595426
-3.872913346930328
-4.227549670561424
-3.9919216809239284
-4.027962276522743
-4.087599704980449
-4.349106975444878
-3.293645846936601
-4.372824488485553
-4.149245294368971
-3.817285249545817
-3.438924484534379
-4.114893325116901
-4.986590180226588
-4.369504650044901
-4.811400086157882
-3.180200235278439
-3.980187535388427
-4.137041781503634
-4.289367640464023
-4.0842413844667265
-4.099779874504777
-2.9485179187797113
-3.8601684777453187
-2.7864674358510837
-3.3634058618525637
-3.1920893845282903
-3.803561295000159
-4.050663303784667
-4.241011615302225
-3.5646237856512437
-3.8912764306289187
-3.8912764306289187
-4.026983950618774
-3.330243364950538
-4.799429844108016
-4.396642978625882
-3.1841003421552743
-4.348648259999138
-4.394642480185312
-3.898529215875776
-4.239400594085009
-4.079390717478642
-4.086930950316967
-3.4077391852331465
-3.8121054936234433
-3.4860945544103
-3.2174063961361083
-4.31360180193022
-3.9756587023860517
-4.208567939305329
-4.684157645633694
-3.274447916244252
-4.045236662592595
-4.015771756609658
-3.5024948557520426
-3.8880975858761864
-4.359798787568595
-3.537244516867535
-4.980477736833216
-3.8536250022083927
-3.61415460672774
-3.416842603728041
-3.4006508414566423
-3.2426025547875024
-3.4942535656924214
-3.360548532605911
-4.0447410075785335
-3.4321799839123512
-3.7714457775014574
-3.6358041338942884
-4.364727428332118
-3.456916443296743
-4.159777029277571
-3.226629299707327
-4.115708277169958
-4.891266489995766
-3.9345327287414027
-4.372555011775434
-3.563593129204919
-4.208864290306017
-4.080186212748064
-3.484346450408304
-3.5326167341004884
-3.551123466261434
