1.8116534517037342
1.7685544527157029
2.0911522899266166
1.7861304990276476
1.797883008815036
1.8668494665661028
1.8478932981815532
1.8514934811926425
1.8691454947676895
1.8700722894069386
1.8762298473095889
1.8243986939365302
1.8918425166524573
1.8022120447520686
1.9433467464860366
1.8099749513218313
1.8984213999649762
1.878673565664485
1.5899808185294566
1.9025004549860693
1.9770720383915308
1.9731086332890224
1.967725876975806
1.9763848151102112
1.914912919591998
1.8254108799127333
1.9345699709741233
2.0627407051302415
1.9533765374595446
2.06500711235976
1.754197370460914
1.9293571328060728
1.9642120812052668
1.940997745070308
1.9181657205070626
1.849092345391125
1.7076957731120248
1.7857568232270893
1.9427689232137517
1.8359432858076667
1.824110812953417
1.7463682538094663
1.9972933450831767
1.9624560990856978
1.9928328856904598
1.8518409988438027
1.9163271017302146
1.7589063341391429
1.9255774343961527
1.8619967829649848
1.7698955175252171
2.086001353881819
1.8527449822862228
1.831375194124092
1.741725499648479
1.7690023210965562
1.8201430953506668
1.9109789582562975
1.7154383133025108
1.8599921679553653
1.847336216333612
1.9782780458953273
1.8179324973167696
1.8741505979219664
1.744437097675334
