0.976880237964444
0.9708234616765252
0.9831605879446568
0.973211919953754
0.9667506535282052
0.9588350751575242
0.979490236310778
0.954684131718023
0.9897144692534602
0.979091152596885
0.9793723936763824
0.9802030632000864
0.9707419361108468
0.9815712141963756
0.9952276044127468
0.9900392062267328
0.9737598043054578
0.9578878053403574
0.9817705983209529
0.9796252023561678
0.9749135616793788
0.9733666012702784
0.9649764411724336
0.9815486440404608
0.9791090468877364
0.975358739997314
0.9942946297359594
0.9903618007202264
0.980570222576458
0.9698666072451819
0.9647480125633248
0.9817504082842816
0.9704914843818868
0.9803058804276426
0.9935722478023254
0.980208815081225
0.9807100534135844
0.9743767744800972
0.9923228550109192
0.9740117950781596
0.9783825477328464
0.9822899199215328
0.9802978510937026
0.9621689427605732
0.9950375561340616
0.9799738742952592
0.9788261411947464
0.9875067244400124
0.9845224257185236
0.98247887655436
0.9730674811538969
0.9758280766673108
0.9740593681334132
0.9758441940592386
0.9927137783375668
0.9855808619139018
0.991250273208074
0.9827108854906508
0.9778980284631013
0.9867176810424771
0.9726129771954048
0.967835079463444
0.9958952149768416
0.9893317131832324
0.9898418804754404
0.948455682709482
0.9856802147045868
0.984208855579782
0.9877388213474508
0.9811504436842884
0.9867882151601802
0.9791242830090554
0.9798371368495674
0.956740250625836
0.974652149565254
0.9681868810785346
0.974804477087468
0.9845606914502258
0.9724002431186012
0.9796011500074162
0.9703188096693606
0.9703188096693606
0.9769952237166905
0.9584138906641024
0.9923622738395756
0.9755154054835194
0.9798715957828608
0.9822850211961291
0.9803647930028287
0.9780826404909824
0.9759251630651279
0.9844428024448091
0.9875077735279536
0.9629331743213956
0.9745399466950324
0.9727677047958146
0.9737811693978572
0.983582711445792
0.97718255322958
0.9935338550478712
0.9959161074162868
0.956893983498931
0.9792111222780364
0.9931144882923829
0.9764725933549676
0.9729480247309698
0.9739779093718632
0.9900260431467454
0.9895044830128
0.9828661393100556
0.9640447306812696
0.9638227009582734
0.9789755683104536
0.9695309778209241
0.9694930817355942
0.9688541532484398
0.9837357064657692
0.9779692440842209
0.9819476812129604
0.970653159528132
0.9857371946595951
0.9855234921485044
0.9904170367237732
0.9750848413556414
0.9791694221297732
0.9896648940201604
0.9744938496426658
0.9885496431936958
0.9586891236127494
0.9838988295934236
0.9834262466952256
0.968767141900652
0.9673488214220364
0.9702278996004642
