0.9274358974358974
0.935552370334979
0.8545274223111239
0.9193178692582744
0.877055003044449
0.9346305868044998
0.9408764442593942
0.93876661582044
0.928596531122734
0.9200371803245744
0.9377483126705279
0.9409563409563408
0.9172034424629579
0.9059915743485722
0.928242844688468
0.914129841789416
0.8970206581542612
0.9086925732495352
0.942970822281167
0.935201518365524
0.9172547134773772
0.8800286771055675
0.9185764730319186
0.9238093058384638
0.9457430230910896
0.937020683244248
0.9334938623812391
0.8553592380286188
0.8670126906378715
0.8654645165976611
0.9245102723363594
0.9150969244468801
0.9142964776794122
0.8969974394051001
0.9050018178985094
0.9172472629034552
0.9175139075388452
0.9404773844148028
0.9049081589916436
0.9037610619469026
0.9411140583554376
0.9383732901897336
0.90831440703071
0.8839634941329858
0.8911565480753522
0.9332598633458232
0.946771693666532
0.9322297955209348
0.9131797349188654
0.9122238274780646
0.9272852707830288
0.9032250637207384
0.8987360521378494
0.8895767958612502
0.9148046020728344
0.9168717235476624
0.939912304444324
0.924226854570366
0.9616935483870968
0.9397188177675984
0.9330847723704868
0.920662966926312
0.9280755345737296
0.9245019131811584
0.9367480860371856
