0.053455356442138106
0.045554657081150654
0.06270197210285726
0.029962346156418414
0.03865597922540013
0.1073295526605456
0.032089480114683565
0.07902131454416028
0.07466617080442534
0.06633447367194484
0.050421312034308316
0.02480312135547135
0.05457625812429475
0.031686741146044216
0.04078270380654747
0.04549940692115029
0.06834895725246867
0.07717248197683091
0.023337183899954463
0.04799450100570106
0.09339769486604332
0.1108968835644024
0.08617853856898253
0.04485162217762258
0.04543293190744943
0.043434706020809864
0.0532874966002073
0.0657897296487166
0.04270760733731406
0.08506181790202984
0.05517308769094143
0.07794465774553838
0.12739201686305582
0.0967272743181058
0.07505159309746806
0.05841845681357041
0.04896305810309342
0.08426911381388684
0.09094640364580656
0.10591852318594593
0.05022284292682474
0.15544052318115795
0.0891966354197679
0.060664672353377
0.07146715466955336
0.08239751878887194
0.1301806167787897
0.02206971272785069
0.09830839079816947
0.036090316858980565
0.08188405689447202
0.07909007829936426
0.0512092914747796
0.07237687109423188
0.1061734702286962
0.045908409649935984
0.04499901192994514
0.04186200487923935
0.043369130813626096
0.06035632812637055
0.049760203038477134
0.08331316410570275
0.061097466838258466
0.06843227080649934
0.025790827161133748
