935.5052281371447
758.1280818383522
22647.568916606982
773.7627160761328
1033.073730943959
1940.1666136565134
1669.4179945326387
1681.4806463009231
2217.359098451727
2621.8838060285643
2443.84163187169
1407.572710923663
3026.509098893427
613.530411228738
6695.508063889383
1052.260221568201
1141.0316701312006
1234.0365587211645
153.8348965779409
2696.3377576731727
4979.093205330816
3701.4188609708704
4574.722331962418
2670.540151522541
1772.3463620871228
663.2502069661921
2303.597413120856
24760.83639035345
3871.8675542213145
13363.011697352464
323.24342448421237
1647.882714595888
3937.115516160249
2210.4302243120387
2274.733010749623
1440.4551427704791
325.3694951750291
1348.0093378888146
2951.1515074782155
664.4394207702618
1450.6302184057654
416.6261754005828
4190.205332689792
3758.455872249201
4477.215250688507
1494.6129054597186
3381.037365667575
762.8732226929268
4178.562670356197
1686.0992295644714
656.4149244809076
24007.868316682016
1217.2023543694236
662.0777010403866
655.121143192993
554.9243070670233
1220.0012611686625
4858.709281343548
382.16461102750867
2670.82817059344
1506.464644110126
5289.575008331527
657.8071184525131
2160.788952637288
785.5969090780223
