-1.688136326108431
-2.2293092978116333
-2.2915969126160642
-0.18063669084522813
-1.435632104424227
-2.7497653982370225
-0.7413593950583984
-1.6836292735357803
-1.8042676540849054
-2.582778570825545
-1.1204161748858215
-0.2657337059981009
-2.2035329116353353
0.16382700565816785
-1.8862972968156115
-1.4638196960169148
-1.7827029913622854
-1.713226978925077
-0.5382849110867048
-1.4388287541427967
-3.032008393326556
-3.052029381925083
-2.607932275504808
-1.510243460071158
-1.2629980134655727
-1.3838748289051492
-1.6907434767455538
-3.646221964668282
-2.2611151850499662
-3.6484405041436143
-2.095346570803403
-1.439522845286587
-3.4965041974149855
-2.319100439741506
-2.066813157175523
-1.815223391010028
-0.8239222171352737
-2.3285666721836034
-3.1652023452843325
-2.1729124124797776
-0.9720030776020295
0.059664650312519385
-3.269827842177986
-1.8571400552968444
-2.5552746119588603
-2.9886691888649954
-3.0046824896654782
-0.0937132784858597
-2.4577520168301428
-1.3948818539136647
-2.424659084135271
-4.02808354058877
-1.5594596433739394
-1.8208690946984984
-2.1335841511144378
-1.5588690901273743
-1.2068595222077376
-1.1642820385575634
-0.861901663701682
-1.7172388039090778
-1.4665479598965059
-2.350346582400736
-1.906646938711202
-2.384965061247889
-0.7194376911343849
