-0.3269062876338555
-0.5678870023897215
-0.5131805631600843
-1.3966858626055554
-0.6185945479107894
-0.2670659547249063
0.008853211279586567
-0.1772620694539571
-0.17907742564265103
-0.8357470135044448
-0.7770352413667455
-0.7185488875665378
-1.1238109893223684
-0.8168264930819106
-0.4663240028817472
-0.6878436621464673
-1.2491805737478339
-0.4431988746144428
-0.5436952073899066
-1.4056692704150944
-1.4866159536659636
-1.7450327861097328
-0.6799954890985622
-0.5663813448128567
-0.47460322635779806
-0.9990683456249236
-1.198742008956733
-1.135058122691324
-1.0128691292446776
-0.8781756178788274
-0.7088025306340766
-1.065698807648772
-0.9334674663931634
-1.5821928499197404
-1.5110599135900376
-1.4090012385008064
-0.6539791706982434
-0.06297863446128135
-1.072637608158094
-1.4338376745312498
-1.4498626321303192
-1.2044955050455017
-1.4121246488701726
-1.0853091229743015
-0.27604934157514766
-0.01680217742993054
-0.5252875321004886
-0.8178690508034212
-0.37770881676790713
-0.17975376469032806
-0.5697194828627598
-0.6284908347142267
-0.8207010865870816
-0.6381800873888659
-0.0006986674309300867
-0.0990820850958019
-0.09922593374488398
-0.6591313566687232
-0.354088063004495
-0.9092149529561024
-0.7138551334956182
-1.1503826355383986
-0.3356478601457091
-0.8088290599976362
-0.36224961034184094
-0.1964002602756865
-0.6612283872351021
-0.8120837169614447
-0.4770287899196836
-0.818389613402448
-0.7131544722008747
-0.4266166888488677
0.3292642996215647
-0.9151924978823034
-0.8944687785966537
-0.6377349409938475
0.06779630238434306
-0.8200859012811738
-1.1576673529092294
-0.5631358084121029
-0.46975283500724463
-0.6706963918772337
-0.1706644553486348
-0.18238422577588778
-0.34318122882021174
-0.6148939618176459
-1.3046045156864412
-0.5912537170791283
-0.5920633958172566
0.13395108294133684
-0.14856411689920163
-0.24955977188594688
0.0037612281680800496
0.5060191823621148
-0.8453675845167152
-0.6578633022904209
-0.9445729232886735
-0.6430125760451472
-0.5010432603613793
-0.08202657198221713
-0.14622317826069653
-0.9600771339090476
-0.5345593571547742
-0.2729870722256169
0.002721495921612025
-0.6607201160726692
-0.7774406795376994
-0.05696934416124726
-0.8313074035938965
-1.2386788333357581
-0.9877435737491956
-0.9982581842957767
-0.40656128995568847
-0.19682382702109708
-0.5228004439987965
-0.8570780307615063
-0.5005757191648091
-0.46852787114485733
-0.9176488706264266
-0.570071256811865
-0.4646177716832956
-0.6762906119886642
-0.46124791452446373
-1.493795114132759
-1.0508245625257027
-0.7974811935195564
-0.5790101921056569
-0.11271754004785643
-0.10685962002499841
0.20386015105571204
0.015540660560764
-0.6723023792849875
-0.5757719111432985
-0.6895843890753058
