6.1165252011887326
6.6403116647979274
8.181659446352638
8.302580037073975
7.583488564020533
5.742273820430755
8.288827236588354
5.921789349089408
6.27230803592677
7.802054182112339
8.379099902112324
7.995253093607574
6.677687985723273
7.148540185469502
8.888652554105557
7.036725764249806
6.315415363450346
5.863044726741975
5.473395364042344
7.597436502965775
6.116974038569302
6.731489886918225
6.35776198104772
7.75094826698297
6.973976697820528
6.681424866861233
6.7977566878879445
9.318654850196413
8.609820246712813
7.394939672164629
5.023523783478176
6.696489001797114
7.0318704880977725
6.636723214452838
7.368272544643186
6.997456172241104
6.9532481075814205
5.461392970517233
5.395415900446806
5.3877592656103515
7.6493802501093695
4.685652203500692
7.3732531747319685
7.148738318704539
7.26190822430248
4.980530589291308
7.0530678676164404
8.090178725383273
6.7545991162247265
7.427108601795012
5.169773771033944
8.332743130975174
6.410370640108627
5.552058016369936
4.722309013432197
5.493397102295187
6.581422661651162
8.152835408737678
5.954939092778928
7.833313814716175
6.852905054241498
6.716273268125838
5.649521435951612
6.557125350732621
7.9628625499407875
