7.65576763087086
7.711555594752487
8.34612438928561
7.594938253269443
7.680835243174037
7.208269420399605
7.343419517026324
7.459716755847472
7.768456641104006
7.792193134163202
7.957685170890728
7.889424467402421
7.973408312648245
8.428573005834489
8.134756726092451
8.044442922288544
7.917085869808431
7.28289232404266
7.883136372008833
7.827627679767904
7.895357781774187
7.786688361417445
7.629138876588071
7.865071991845262
7.926295644949836
8.010005451005119
8.286610038453077
8.453459638286786
8.087287716535585
7.781568593822331
7.939097182945867
8.120231789709143
7.603640763661029
7.915489075888895
8.230427125922155
8.017325588797513
7.884505290720194
7.617595918934367
8.427351819079435
8.032308259584813
8.016721213304184
8.490115763839402
7.877238410538537
7.210148670970091
7.85511024980836
7.692086122263579
7.859030627786761
8.140338291144687
8.051874223574549
8.04876142196223
7.804622740183986
8.111294274392645
7.879759155957519
7.856986649924705
7.878390972721288
8.004598108564338
7.489760778545256
8.110062334863734
7.902758358803258
7.908522174860382
7.723643056265219
7.803906598930727
8.466304657286182
8.10949333788554
8.36925249471154
7.638457310908388
7.899180842250673
7.9445598543214855
8.107028015055773
7.982098746867845
7.9429312651303885
7.72986218377474
7.875825442939006
7.447071165790352
7.311055347270623
7.610747017949363
7.4701257331116135
7.678702730162011
7.902269024476021
7.760868859339082
8.095686932534866
7.787251932562119
7.80296189397492
7.4093992973150336
8.420509734840227
8.075695059296612
7.450964064826835
8.01019420168899
8.052574052107332
7.651665221479081
7.770915034712939
7.797008588296463
7.758610880595293
7.307621104787188
7.855977039262179
7.754557479432804
7.7338842430497445
8.073546048117974
7.747703133219809
8.041108130041406
8.164463081268506
7.092632756421581
7.626177979267873
7.793169490297874
7.515387756410256
7.677954112413928
7.962289572492003
7.518706366455121
8.402810247256449
7.802560618412134
7.703001244690933
7.665209305493234
7.5641535858166415
7.17419167462734
7.696509116534679
7.764017242490325
7.8728978981474445
7.733063750671934
7.856738086453668
7.607475924945836
8.195540750278486
7.816863079923565
7.9963441950873975
7.591019828615722
8.000306963137565
8.354008164002837
7.537430348445474
7.955066604798066
7.43839362116887
7.840241240265615
7.820941098030492
7.725931754057514
7.738865289906785
7.769309159266859
