-3.2882492472433675
-3.479774600658898
-4.2151197955064275
-3.5363428793425435
-3.3530649327198825
-3.7019967488155707
-4.318036878374239
-3.398727182604973
-4.003667621337687
-3.7659147247927995
-4.1035691619161545
-3.1638679719847933
-3.8222983014409477
-3.0606383021468275
-4.214723677667989
-3.6177491657023437
-3.4932777665064956
-3.1425698219125016
-2.92945524380961
-3.512080334027896
-3.671657832172598
-3.9358999180334013
-3.6746717681210592
-4.111233764575712
-3.6124123900006473
-3.3476104807217633
-3.755722800231194
-4.536887010697745
-4.045641618992054
-4.048630852090555
-2.976691579141794
-3.491688289796973
-4.302435856999029
-3.6935579395918756
-3.7058715692570297
-3.60687888042328
-3.2166427037585286
-3.620267799523562
-3.6651359763307756
-2.9955582335684876
-3.5060652861896715
-3.425835345746554
-4.208363131306462
-3.9683624217249696
-4.220965977576538
-3.07030909816078
-4.02018920947156
-3.4671746376717896
-3.570474678857976
-3.5631770623225414
-3.10625069515647
-4.471712659461175
-3.436435247719881
-3.227922119359788
-3.295872910749719
-3.21721771598607
-3.1669631146330284
-4.021437676919919
-2.6503793657712253
-4.000858495115437
-3.26330634409836
-3.709675804347417
-3.008960694188619
-3.694479949166911
-3.6123092926722196
