2.6519682670848566
2.224204240984551
6.354031249583808
1.9443153662791175
4.923993547479661
5.026556258828246
5.656250450746639
3.9654939365352413
5.239482338369731
3.478032536401539
5.493548421516439
5.491338466927807
3.9001949125311044
3.886329945319108
4.869338563927423
3.3594600939266397
1.6899003700750372
3.9578840363756385
4.74316546676706
2.5345201518595926
3.200587025008121
1.7388020448479662
4.833718025485112
4.815643229435327
6.225704206420099
4.283151521229298
2.7336386259882666
3.8018372608295157
4.12043398617611
3.797535176674679
4.143015092061093
3.151109976651736
3.118322813149336
1.6935433730557128
1.8141995574413674
2.092856789246394
5.630198843083832
6.651171859164618
4.140781200504639
2.2787548274157237
2.411007066134541
3.4502518742833526
1.8342266919133503
2.067844790648108
5.9698066221877495
5.344633957086025
5.550960584607608
2.808354935295551
5.80490735417443
6.474249583011258
3.6889404650469166
5.483252192362733
3.412959591625119
5.084982892946343
6.278914001974499
6.938015001271682
5.19239416407705
3.3698673418125105
3.8884978951707714
1.7746847032379442
1.8165231701740294
1.5919078212643027
7.974350721173461
5.598705952957828
7.493130579419578
5.725853728474144
5.214044819836946
4.991558869729406
6.270001093267913
4.626482137956753
4.5624453251353625
5.32371845683046
7.411741329363399
2.8725430465829436
2.269690727097929
5.108750003950769
3.145996449841078
1.629452603017327
2.072498086484712
4.765274053272096
6.668718773865917
4.36361567914407
6.034450657296228
5.853379158728627
7.414388603503626
5.45136313556938
1.1511224071696255
4.744261568032821
5.0647518259486075
4.608560448406225
3.222769849863723
4.568343546661454
5.903171703567901
6.130002688383181
3.2298395145077334
3.7084796051566844
3.3074735213246456
6.049220803061433
5.411002712144376
7.1963817934684045
7.0395916243342604
2.02936624448187
5.163704849468784
6.724765310677855
4.891735228151026
3.185557329014816
5.114938020762183
5.634911914526144
4.535145705690724
2.433275873087362
2.421841894823419
2.5893736737706416
2.8100302790421634
4.067048632984194
5.607315730762144
2.540215201039724
5.193153177116604
2.765056759597187
2.539812829060451
3.7001017460388925
5.664332087672152
4.018870879297634
3.0118826900544913
0.4435651109918269
2.0404883852838163
3.4407258983069133
3.300658456170068
3.5290823433637697
3.937435361079723
5.134376470967503
3.156624623996929
3.8726299014215
4.0905518429613394
4.811328141601308
