-4.540633554023997
-5.094634570562544
-5.611771734522465
-4.602022767523318
-4.61558105303096
-4.355192029997077
-4.1935700503472315
-4.271920517586173
-5.21103742627143
-5.133701369301766
-4.646949017626084
-5.073641887095658
-5.248909727142615
-5.659184724964964
-5.5451631439192335
-4.925923761749015
-5.023671099317279
-4.983938719195514
-4.835019267907643
-5.3527929655358415
-4.736901446582607
-4.958455962313958
-4.800347692947067
-5.00141744854479
-5.336085926026003
-5.1779877456987995
-5.794116866013127
-5.675805889620052
-5.094323229057962
-5.433790557926361
-5.70577875588296
-5.839644381723898
-4.393115720787972
-4.863717876634613
-5.24598168019579
-4.494845749158507
-4.914500204373218
-4.945755354473329
-5.6218068721446945
-5.600575639612285
-5.121888006781641
-5.813546408372194
-4.65377231541635
-3.736027814355652
-4.8484744974309155
-5.472570008144297
-4.740301011858555
-6.058679628334307
-5.33414997407955
-5.307035569520545
-5.11007724255478
-5.379087728433215
-4.861500419253853
-4.894766508625321
-5.02955112612019
-5.408421978131611
-4.410207005963346
-5.339359590841809
-4.590494558945179
-5.219948508060773
-4.966209360223809
-5.140697887239269
-6.144705016423414
-4.996993235104882
-5.557142328808387
-4.934782082054276
-4.933217177603986
-4.811560503947469
-5.186969489095355
-5.5388902040782755
-5.04548858438146
-4.830467460713174
-5.030656058619014
-4.337564447671248
-4.207966347845921
-4.785585963741634
-4.201725585556553
-4.949680541494722
-5.163460645381737
-4.409714698143449
-5.339634975510484
-4.68650294697269
-4.526773948250199
-4.797294363252899
-6.148853981700347
-5.702603420340269
-4.189574697399902
-4.9491121171105235
-5.003179064709236
-4.967957407180214
-4.9174640850944416
-4.605972562384847
-4.681227847046018
-4.357552985676766
-5.105056274639378
-4.910933850730866
-5.041147250071468
-5.119592529089433
-5.085344244238905
-5.149185714621887
-5.465563176226181
-4.268755908237836
-4.6481877435430885
-5.312968428790935
-4.71450784949376
-4.836832347121931
-5.652821314493301
-4.670391067038616
-5.385981611141109
-5.4018386848116355
-5.0811911277854165
-4.933643518008235
-4.809250953671192
-3.991820926520429
-4.8708875432911265
-4.944122762957076
-5.348513627857141
-5.140315707075088
-5.033508908818559
-3.9290326751868774
-5.6220554372524365
-4.990482681806883
-5.0219216836669105
-4.480787389161704
-5.672694004361873
-5.791572104046611
-4.795593261616557
-5.524156148034966
-5.365321219690842
-5.826477474342709
-4.934207660347533
-4.961925630245753
-4.527702564848679
-5.243277298478415
