0.8087677968045962
0.7967470611480609
0.8139218383262291
0.8310429075121999
0.7950675406130278
0.7402535127308666
0.6890704228032422
0.7464004753757701
0.7794156835576916
0.8535712667837886
0.7682801365075029
0.771536832572193
0.8016010854127731
0.8643000321733693
0.7955686579066266
0.8576709237272276
0.8833096737527575
0.8244920333331329
0.8058685973588109
0.8782412965210378
0.904449542871788
0.8993828256490761
0.8484285676766838
0.8056372648629234
0.7953492313981836
0.8604539848456455
0.8689244594961762
0.8572366077988952
0.8463866245397657
0.8584278517582862
0.8240067004738562
0.8664674438111786
0.8679476301613346
0.9045799494075956
0.9027077697583008
0.8852288164108373
0.7597447851762179
0.7195665132548975
0.8562636268412095
0.8906613906227345
0.8857334210068427
0.8548701990161175
0.8576952048829308
0.7710807793653319
0.7891127225538438
0.7710791188350914
0.7924794469720493
0.8140248860050117
0.7696355576726764
0.7608945291852017
0.7857870732947779
0.7980924316647648
0.8527896264072503
0.8066539361079599
0.781105270466554
0.772928368295728
0.7441394700957437
0.8178777453316756
0.7817817729968938
0.8620105337437759
0.8314700269564048
0.8637133519987816
0.8011159907423308
0.8463562172914283
0.7903698144699122
0.7511046845762211
0.8204545617992025
0.8258938352618075
0.8216826679549315
0.8182294104630247
0.8260439358728384
0.7383910283559844
0.7004162998332985
0.8126333593300751
0.8383105680365047
0.8187150712487828
0.8103680033692234
0.8520826989303109
0.8631575817311459
0.7936337036724679
0.7872090640981246
0.8353765463634079
0.7790873399961159
0.8037199112145281
0.8219863057648913
0.8399594942262791
0.9300620271431088
0.8094619186168169
0.8279311521797659
0.7354165640133792
0.7366511647165421
0.7542274262465656
0.7266040392513294
0.6985801930258293
0.8593803869797606
0.8906094665840749
0.8610780423764487
0.8143603337811777
0.7922665034022913
0.748041031773604
0.7328325256756626
0.8426654979656505
0.8148744487441608
0.7892922844200759
0.7583111987431319
0.7995640475222883
0.8094832698595494
0.7414449342145605
0.8278638161327417
0.8671908991595474
0.8635851595999378
0.8588811337513484
0.7833147807954457
0.7849011123789652
0.8194537451269235
0.8183078871396379
0.8367770887299985
0.7943925453831098
0.8313879594880458
0.8843689362852606
0.7915512159720717
0.829865156936568
0.8216320594289177
0.9244948617385462
0.8452193851559058
0.8374242699121479
0.8574714722610628
0.7549076505981934
0.7763448703575333
0.7599182086206212
0.7195956329589246
0.8058309400030856
0.8111086186768561
0.8328038136225193
