7.56673315560808
7.475606898017467
7.126999274487456
6.605504036611456
7.134583465979013
7.620044679368824
7.378760369203609
7.633774855093751
7.295955732205462
6.932580779570532
6.385666990560728
7.1957522173631085
7.3851957930879095
7.71629821685064
6.825103666658154
7.0649235162685295
8.771997989893173
8.900411566876537
7.748375175500542
6.9108135447594465
8.094543120141797
7.995736649065554
7.876340762163855
7.784776970797606
8.31491618003116
8.164311533560184
7.69278717340745
7.6446722848753526
7.4169751218756295
7.767309571420334
7.496658411601072
8.562644204664252
8.370704972878082
8.187542883671957
8.288079159117006
7.341224298235919
7.175634250092049
7.682222812133143
8.242322322403695
8.419636998489091
7.028856739538283
6.62685731139998
7.831227920790445
7.454264267475945
7.578109964380604
7.028856739538283
7.012547288536466
6.347758259347344
6.991910191744358
6.678938551055417
7.236978986123265
7.997904598810898
7.887999999943293
7.917914968628437
7.445026231393812
7.226331024516429
6.945491920423262
6.870822104505861
7.31624027265681
6.410408176340705
6.434741219857977
8.212332729985443
8.069897167661525
7.945032357078248
7.197568031694786
