2.805615735535209
2.9786769150259267
1.9087003298604197
3.0468756830697235
3.4154052306526164
2.517902412486837
2.8248839317714545
2.5239370978691755
3.962080313185473
3.1272110523043755
2.661374976306456
2.8873382290177085
3.199706737508938
3.172933996790359
2.7667218284356125
2.0523400237815315
3.9829989799641536
3.0223927018503955
2.5739487016954614
3.8841767775257674
3.87760312695479
3.5603323109586063
2.912702622721548
5.364683826128187
3.312810243508805
3.6251682641647784
3.2871090152576388
4.974305970327803
11.409170355180747
5.220198457551214
2.655965497957777
9.368539219304406
2.6985333931510507
5.951466782556418
2.790569131566292
3.610495477913544
4.0508898476626225
4.018213361683683
3.447942301796272
3.1679870279417033
2.0645003800609163
3.042130338072545
5.148137127372603
3.7941467843720136
4.118922846956102
3.479736657530666
3.1077401441981536
2.152986869663673
2.9223992866318818
4.4876699085442695
3.991268676301973
2.436577543741341
2.509555540911716
9.006417906559689
2.6585011789842508
2.9237908128096635
3.0117070783808546
2.4787714565126717
2.5067359844734303
1.939160793338797
3.2067794957361917
3.2031586751723884
2.788825992933372
6.442940444376577
2.975025219219261
