3.0167877942371324
3.2320390365695078
4.489074874679832
4.4785485123984925
3.6069335391619144
1.9650339172449394
2.009790287662551
1.9131504875352952
2.6443928353447803
5.491437966145993
3.960631458445862
4.397189387520852
4.7145327512632775
7.159253953586015
4.5711398895409365
6.390202167882637
6.794417917791219
3.577073342814438
3.465659078253198
5.3914636423471025
5.727270472235882
6.222065622465364
3.6043767927760797
4.3579267511204325
4.005254428793262
4.039762232215374
5.618552333539268
5.748393860012012
5.140942803610506
3.893892841924868
3.7211918158600303
4.896109219758913
2.616151404144725
6.110870113195302
6.128787025474978
5.894741569382069
3.8393852117361655
2.7875089178033776
5.570431406961162
5.687823604346144
6.032882302696995
5.704475427615891
5.4396644536468655
3.1212839565145303
3.989827014288673
4.120600841043131
3.7986853563471783
4.36221822017755
5.568903565422879
3.9768662912501895
3.491614528822346
4.05069993102364
6.2966516906730945
3.8806180066037386
2.836572370143344
4.247095228217709
3.0234530839546516
5.386691238733515
4.211596061457441
5.0130938884312695
4.506877655313962
4.7603757429438875
4.524454105370369
4.295564102997494
5.414017823238816
1.9349641754851896
3.5781452201571
3.536473688535068
3.3898371584392883
3.73839342867316
3.4462275214514766
2.8865280354286234
2.4893081880743533
3.7142038604720673
4.296610960136655
2.775918593934801
2.4071695361283414
4.437500271861672
4.205743707666192
5.3654345341417615
3.6227975626239752
3.366078716314882
3.3216907428702185
2.5211220222853785
4.517960597564149
4.759928431721883
4.419954276017725
3.476795686260917
3.9545943494461167
1.5976048841466581
2.702858880682259
4.546280067017727
3.0540487599575443
0.37880545773551877
4.343412061744838
4.114853415030448
4.241970633294785
6.531697911346563
3.5611214272034255
3.631125145710593
4.147076664763626
2.554459952886584
2.6949996220755343
3.3146813031909077
2.2209940853488637
3.4297401169414203
4.19469915049987
1.2167008442708125
5.135383340909751
5.203101893444699
4.015494964648316
4.620241860162834
3.8378179484075625
1.160304054311172
3.400236770259435
4.105422337817784
3.6668268274814406
3.6159989773640584
4.230792542884471
3.367041383539282
4.396364665201406
3.9662590276677214
3.966544805454021
4.246981178356223
5.995230781000742
5.765863202581835
3.506537455603718
3.441345866578412
2.0318546102912944
2.9003366727736624
2.423298834835457
3.616039067937512
3.5557549935497126
3.5875843838898565
