0.7911774025692786
0.7055655336032137
0.7467235232754715
0.8228764268084157
0.8098114822779516
0.8253188423262384
0.7526628544467521
0.6973345613045427
0.8391886209967745
0.793340564292317
0.8343436447038421
0.6829720472094623
0.7991680279068761
0.8405671195130893
0.7317482540096653
0.7794578539872041
0.7584300223560071
0.7742311278162026
0.773620605215375
0.6970440555058964
0.6920070663425759
0.7855255600172112
0.7821498464932841
0.6744770117527614
0.6539729182013354
0.7657422807268603
0.7667054556845597
0.7303359486472889
0.7323696115109395
0.7395999728760629
0.8556438834073272
0.7344444775671827
0.6649973609749554
0.7119123565284589
0.7516680225811246
0.7725585779431684
0.858036204328473
0.8025728803968114
0.7199470569103774
0.8238213561228461
0.7950500026159296
0.7650242725573436
0.7309107021593426
0.8167029111265334
0.7451598658416626
0.8048076853398185
0.7507517408134201
0.8183283081731495
0.7381808779486284
0.7851424939012288
0.7912721816586111
0.7074364129044564
0.7935890670250326
0.8239295442006339
0.7853762858031598
0.7352827344407209
0.8189869178648991
0.7109961297517688
0.8629897775735673
0.7116327887016297
0.7110563493074924
0.7151273888859468
0.7607610294676846
0.7213504748422023
0.8218324495700997
