150.86040945211496
223.9800681193887
744.2070052145727
885.6514197530864
537.8503609199796
102.66100967276195
949.0002705766992
141.91104427367657
179.46885777868306
665.0655959435611
1020.2896266667476
826.6369060140238
224.48336769294247
382.44141076115477
1364.8191851410445
316.08784525923926
184.94366454549944
134.42575867075246
105.24856209150326
488.5599473246664
152.09471805828414
219.36634108114256
180.65948515104816
582.1448778650831
328.2606047560778
275.1720078186142
261.86857038494406
1675.724962530499
1110.5117334824015
412.17506616281736
64.74305059523809
253.22157879484672
274.3578097133313
185.4969194906871
349.040444183122
309.72360544919985
314.34016240999324
80.39638597539691
82.74969631634362
84.93298135591957
567.8179329320757
50.097526583085035
379.0807659324907
315.5914827651859
367.7555684912947
44.527460003901936
309.0788214538716
793.3017153996101
242.8604963063051
481.64259818695336
59.940030407533385
814.1541248222431
213.17097360141946
108.39356342621224
42.58486917633861
90.17937334153521
208.32037112040712
792.445550107516
144.75907529239763
590.141061490021
269.00085869726763
225.3313551322119
115.27766381728131
203.23728028126362
763.573626984127
