4.041025304008056
4.029449178791817
5.194265404847657
3.7798612717577287
4.042075656119594
4.175684042864626
4.217270878629838
4.1896924456012234
4.425763353152344
4.342853059227322
4.3686644174419085
4.0324016422115925
4.4844184482642655
3.8475211857816123
4.723375540978499
4.010015045614107
4.043676436699747
4.104895612476238
3.135142549422257
4.39537509031569
4.657393399784543
4.506356694536907
4.574901703816778
4.382707942001619
4.2011786094960035
3.8547459851222645
4.337307041076253
5.200479357110261
4.572062059136783
5.0258622922356135
3.269487681902449
4.222867353890151
4.553291982326562
4.480454141150628
4.338108950366279
4.197370363814983
3.4018068602007445
4.050442128519095
4.433060265728536
3.808580539139162
4.117759189843998
3.5545100427091
4.615508676119798
4.607246543962938
4.613301499553958
4.1215845124482495
4.421511476665649
3.948566650633419
4.622827794818954
4.210740371958063
3.902643293781642
5.163730708581847
4.048877677147754
3.8073530829703968
3.761671333831879
3.6915349061529916
4.0096863647592
4.627643664764655
3.5240488636006426
4.366607285993752
4.064610605307096
4.614768371404895
3.76133893273636
4.321122312751401
3.980821089340572
