5.95472377845766
5.852422023707128
5.957913073865396
5.48430006852834
5.708871572878885
5.991142999166998
6.1044455444411785
6.107951281699435
6.090261624912692
5.765146502637913
5.516579275974205
5.799674132676516
5.779940280864726
6.049861134712064
5.8822098356299275
5.676112765457666
6.630924435808219
6.603954378203338
6.015165545551481
5.70741175254794
6.630482714340216
6.136282952424136
6.197831535716646
6.472925630868919
6.548924700302316
6.370685633631377
6.295650261333547
6.607606335805345
6.259152810016629
6.407690741142004
5.8214543837973425
6.667558639211442
6.448620246780084
6.537523369725224
6.395754099995684
5.8061431924816285
5.6028726670294
6.152136157382712
6.437311039445339
6.2908369702552225
5.804853646457397
5.335562745845204
6.387894143483194
6.056431005653145
6.2147687007931225
5.663854244646738
5.767857112739215
5.35403593966367
5.789211262428351
5.573988254159542
5.674590842649049
6.4344573592035275
6.130359334840367
6.333107026273619
5.838947017583771
5.69563462886151
5.577441715028498
5.630738008661932
5.759697031616216
5.540405876739691
5.440478321986282
6.323251931165747
6.1044455444411785
6.322590399802764
5.831497997040942
