172.8786059021359
148.66851323143092
34.44134721770701
20.08783664911368
64.04686862441551
149.56596856927638
120.86265949944516
124.25277505893814
95.78575314468807
123.2449279735842
65.37039060319707
61.92903540438546
84.84100201921511
61.7194110037082
47.848914608452574
47.848914608452574
124.7778386506667
140.29080854445266
123.20123101205827
89.16587427785947
108.47985413167521
70.53857138368467
100.03457539545708
90.19261291436909
180.69065816730003
136.2818030697079
95.71371381839407
61.88598964822515
21.39247453405975
58.51153005537804
19.831786972367986
129.9008682736594
113.90803351580452
87.41990094810758
107.23245293607502
108.53925479514173
77.85312169035629
178.14921045630246
118.70657505892432
124.2135836371764
97.9251417271902
29.523168445698435
98.23826229577585
50.97295522951261
64.11194249200356
132.44696725967077
138.76018618385328
65.0734783822854
61.112077227996785
33.68182433008668
145.13568884054962
93.54260739906864
65.57698946048149
65.97937245240361
87.17562973208399
127.74128276355269
104.32159411452074
99.62014563186155
172.3926085885839
93.23452281911104
49.884367946921046
210.59761922751102
165.59577898928742
159.08875614403075
98.04099775145686
