0.6185661338761481
0.5984609657768607
0.6250734401193783
0.6473021544008563
0.5927469244165707
0.5170883544423618
0.4546812138500155
0.5201110582971293
0.5678967605761394
0.6878355695058
0.5558980755850433
0.5594400758319927
0.6017227867577932
0.7082958598360626
0.5925381560356876
0.6947349351412311
0.7408105235548034
0.6428014032003104
0.6091981506561761
0.7347618897407033
0.7911279105629319
0.7779019750827948
0.6792362901498831
0.6108771585521094
0.5915763657994497
0.6982211721100217
0.7219421896257574
0.6959722493934364
0.6788824865675599
0.6992021426084207
0.6464672565910473
0.7157388241293092
0.7167128106078202
0.7886651760203207
0.7854279993446353
0.7545307139726862
0.5409537889521717
0.4899923663498745
0.6958833951769096
0.7597843263737833
0.7488311386254433
0.6912650371334998
0.6992510478741482
0.5597268607857797
0.5865140515426135
0.5595212244115662
0.5908985456077153
0.6232813938965541
0.563812566673204
0.5535460269161276
0.5911509521797536
0.5997616285742304
0.6949992413447027
0.6129543459877907
0.5764792387108654
0.5622757233159579
0.5256215184314639
0.6329275402088249
0.5782970362276819
0.7168707590650859
0.6614242160184216
0.7112403119617103
0.6017892265558886
0.6740733569514512
0.5875104404556974
0.5358318635951573
0.6378216707875649
0.6434933804816508
0.6410504902769636
0.6314932005156364
0.6502205593094088
0.5145682339332549
0.4622425756209623
0.6258002370600575
0.6668505148730204
0.6308374638342023
0.6372751806551261
0.6862869264952682
0.7075019582867236
0.5921271517216818
0.5812055330167104
0.6633017885602589
0.5723315620686212
0.6158950459948227
0.6364361662680711
0.6692538055765247
0.8548740113697246
0.6163648927292341
0.6487772880330278
0.5072611034666444
0.5076857389681224
0.5348238164596306
0.4961721801476855
0.4684636994757009
0.7022644634747555
0.7625807247269006
0.7021059507046788
0.6225956950756694
0.5866817405795575
0.5234627584087891
0.5052209551287252
0.6818120864443448
0.6228390481972299
0.5836387930747888
0.5443646601267342
0.6043478629736714
0.6132905807060728
0.5186077839497046
0.6468076273008733
0.7135693247301018
0.7167225851912712
0.7123195320472256
0.5857915948172779
0.5863933898485019
0.6313518943371026
0.6311106243103711
0.6638769670584105
0.5946512381312363
0.6507536642356874
0.7662314423097631
0.5854863121193025
0.6519723152626677
0.6406961255200627
0.8305239353353809
0.6808528041538744
0.6642548733375405
0.7050232790955966
0.5393182342249447
0.5763874824892409
0.5501012289559196
0.49350813502779
0.6115924343281934
0.623991551168847
0.6572604376562606
