52.912281609817384
36.76531791443636
103.99725040556652
24.511167107405228
22.48105335222057
43.876929286146115
60.84988134313813
35.06519650134855
26.7075212710223
71.28532649515302
51.71181858697692
59.46542503720239
27.701424697913776
50.310065911467504
47.54806186705547
43.338441103299076
53.34901953900137
53.61995781046269
44.75286170013135
29.193263742438607
98.6970095983033
40.922567683309225
65.75697826086956
60.451713282956895
96.36540653820721
67.77804373402572
64.13697181995528
72.34760680771177
46.33774763085435
54.065254384619635
46.34385798816568
57.347794792755536
81.63889859824495
49.813599862494605
69.87164887857979
29.39570624099441
18.10919540229885
50.668438939513464
63.09169221060768
58.337292914733574
79.71568281268856
19.516044285982357
74.30185098080592
49.644139905608036
57.26820388365128
26.837083002110692
45.30955836816942
45.920183775505606
38.86025076849335
24.26609603024575
25.757043158861343
106.58278420424776
57.78777332812722
47.43007650340313
32.85135661012109
25.54896427724157
30.40691345035533
37.790959649923494
66.02822030040964
61.74254340612102
24.537866648460582
68.93737089476252
28.581869463747715
46.73657586489369
45.99564931362659
