4.6970187435949295
4.752016015143521
4.93303454673576
4.681139556049444
4.488486615078299
3.8764942198114265
4.051967532797095
4.280990974088491
4.480193716215187
5.001085581532459
4.4551047078878465
4.360007426273326
4.755602097814296
6.1560003688576295
4.970420067492403
5.397615533553871
5.704478452809519
4.6069936376123675
4.305557113137508
4.726445685615898
4.930741295577137
4.998525604319573
4.306305523947871
4.516190122838325
4.522698770899357
4.426943512244546
5.2315682291114385
5.321830348925689
4.9707978779454125
4.525099975757841
4.5288419775519815
5.004665469054786
4.16913806482791
5.389191351850778
5.406686648997649
5.314084857930466
4.410034895653609
3.9544646300813113
4.887882587502563
4.853409358896679
5.161398941665894
5.058923803286628
4.864639830656956
4.085032439949727
4.713143624387914
4.911718132776165
4.672558042481315
5.1775292683119805
4.501274536892447
4.719304078755624
4.514282246735144
4.774086905333147
4.966047246770495
4.262991876962387
4.2643432587002845
4.367154260056203
3.9272674685822286
5.014076888418658
4.804007295463047
5.2688764944322495
4.883568437976553
5.153071398431903
4.713374971212222
4.5773484489202305
4.7338330939597375
3.7720964756338655
4.362738713421578
4.382036765111693
4.382143815963532
4.4162581715313785
4.235869982758094
4.199723136985503
3.9232565577341343
4.057238624824075
4.563363884540472
4.0640486836457566
4.254389413030959
5.237437196700947
4.714815832973317
4.226782894019444
4.4568346179084415
4.396080946393679
4.2966063867712885
3.9612669994456913
4.759804712345504
4.818241183574168
4.7319916991881055
4.426118338671558
4.51523122066409
4.1219691280964765
4.511609129502781
4.9485269770541835
4.411706200303086
3.567093852697776
5.017391249877462
4.862694591514214
4.880753028815024
4.773279376936992
4.2834861896413114
4.5075010300661305
4.775352142910639
4.087219882602783
4.185847506173253
4.061758504958197
4.151587935557456
4.606266847910503
4.816909560053332
3.771995293912767
5.001793260911938
5.019860875037924
4.4118111750669655
4.620465870296652
4.746422296014516
3.9298967658900463
4.1166630116144844
4.930068200107758
4.7926692073714365
4.57528660036437
4.934446346943725
4.431032648508213
5.065633193978392
4.7764457147142965
4.928118243640089
5.068177352901179
5.5175728899356065
5.322748116823815
4.804414114405686
4.701535194321929
4.283158809835826
4.47941938369332
4.510315577424921
4.728148356276663
4.6116637591640135
4.6840577892864115
