1.6144038589736336
1.63188124732926
1.804489402077359
1.6164051503559238
1.6387321806814956
1.6378696769052827
1.641528372625165
1.6771404517063286
1.6544688781343029
1.6717300942024675
1.6598127624118706
1.6404001071695837
1.6893555560501592
1.6392720549872368
1.737218107109605
1.6172850242883825
1.687263843509976
1.7010321060837725
1.5372536043080622
1.693961028872258
1.7713890042829734
1.7278141106744653
1.7221064499274825
1.7322523025129348
1.7301690724834036
1.6390744279484286
1.7007021238931537
1.8181618145928653
1.7490853099133592
1.77878184771283
1.613566170598275
1.7004820593494487
1.7509099356125875
1.697896184561686
1.7343582771877484
1.6430582074961242
1.5244088162595868
1.6680562940483354
1.7337023376168066
1.6382274507258652
1.6403820554827753
1.5875198167885423
1.734455531732858
1.720149561767459
1.7309285854327068
1.6287619226407393
1.6840037550545541
1.6024700240434233
1.6940040869440613
1.6424770565399218
1.580991059254879
1.7901152350653906
1.709894091391673
1.6435102645526254
1.6123111590568073
1.5823606146316345
1.6273667444088602
1.7257356922639158
1.5344238521440854
1.71834644173376
1.6312116180175593
1.770885872818085
1.6367257121337022
1.7551596565886984
1.6313021115723507
