204.7683823767258
120.07543685951302
754.4551100589126
82.12247791576894
99.3449996233243
293.40760342000334
629.7978634153636
580.0992928933651
338.36958820457113
241.13900748166583
198.23139385358317
345.7343540699034
169.58177747845264
332.5614947107797
389.0254125432358
258.71651063067674
666.9807589636506
658.756925087592
389.52600663518854
132.50400661909995
1042.3158243321288
263.2771035276243
661.7668086712092
746.3682896317952
1576.0472806845028
720.2010462028363
855.2000805132938
924.5717731124907
310.78553964593175
528.1153456377994
171.89558418255544
766.0181218319425
780.1781923480054
473.73901057656815
792.1659530129843
130.27661592457244
71.18226803989958
229.43218876368888
632.3125813561705
665.391969052885
507.4116541846953
41.363818965269154
568.3248805699593
324.5041515927524
406.7241848485535
98.132330037425
154.1815554948017
207.0780073997395
293.663104432769
81.48816985070081
76.82867057814641
1136.1975764099482
342.6089841731582
261.68420600382154
196.88239046177844
53.5749869270007
240.03127065297844
162.60616519351152
497.285294380467
313.5894173968151
79.94461172626522
691.2292165429002
146.69069025442306
356.39252134880235
249.25507482098723
