-11.16315677404816
-10.863536350505928
-14.623560474495282
-9.645794508802382
-9.905563585856735
-12.304095079482796
-13.182366696702294
-13.015479563208629
-12.330010402001935
-11.740670127135182
-12.07989366287531
-12.023813253340217
-12.032405991054468
-10.95975184971803
-13.628257970683595
-11.532265486767475
-12.331107268414996
-12.619157846681569
-8.213330532547593
-11.368340524897473
-15.50976816282837
-12.627028897717558
-14.496429504889464
-13.786171513268952
-13.739048638327597
-11.454015940699929
-13.90294511297092
-14.694048299233623
-11.946072420099634
-13.647703122657948
-7.729147141316733
-13.095974275153987
-15.019692440124025
-13.504889134117526
-13.759612777822671
-11.005881367749744
-8.581230369750251
-11.672132621838756
-13.621593299008369
-11.239520282072757
-12.555249266504578
-7.660407861018367
-14.084047898944386
-12.35075740057988
-12.707625585774679
-10.403550914673458
-11.77692200648901
-10.734082709816489
-12.888236420906038
-10.131628616858093
-9.618973474864255
-16.82219423824546
-11.900731539909236
-10.28599896219858
-10.464453260554563
-9.030049064166327
-10.99478304347683
-12.027357913764472
-9.945105355393762
-12.427980706609834
-9.816629149003461
-14.188891980289538
-10.267092534580563
-12.253745977310588
-11.387517814799462
