4.651435788797647
4.95643765076977
6.789663773861326
4.491557429117097
4.84406219423582
4.256256076217645
4.791410294251085
4.231584924828392
5.192835745408804
4.817060272367757
5.35698675317082
5.203065575262906
5.301905464940185
5.75253211359814
6.230526908270498
4.9735514967662935
4.806459910851119
3.9625275436937684
4.927539146114543
4.26353526539772
4.433317320848097
4.518006237023717
4.6151448102995385
4.981923193900998
5.391129436849685
5.309934482273557
5.7267058090767105
6.489132140651433
5.359382945091046
4.7110535096538335
5.257140181901283
5.608562619008289
4.430415997063763
4.792413386716742
5.759792053504221
5.503160672245673
5.701981545260274
4.971945819951963
6.1692365874324775
4.768239151309384
4.6660439978774475
6.369037147331
4.592987297829856
3.27146989094492
5.253876500775663
5.001671712461905
5.402802710184729
5.791114874161125
5.786569880750697
5.936208723130207
5.004765241240504
6.030239161553347
5.1032316049012625
5.345979897743617
5.322902886929315
5.783138218035547
4.487991518094957
5.752320952853257
5.40190578144966
4.856926874290279
4.561737856431359
4.702074476102097
6.791571252287301
5.5870859722090795
6.52490167100623
4.780947829669795
5.3517538480712545
5.306136037605665
5.890653501145707
5.492096671003686
5.315309927057408
4.742463975137376
5.684641004525907
3.9085734930643605
3.492841749680794
4.476455000617351
4.245738255618897
4.337858005217467
4.846561943458805
4.733505679076757
5.895067035000377
4.721824063631141
5.469381242544549
5.03224332973925
6.356730116239511
5.630416066568938
3.1186562082487326
5.619487539448699
5.652599195986723
5.160216163484285
5.680053987742817
5.208692687251648
5.494650221527666
4.613800410215934
4.64465313439828
3.924030776706784
3.8656459673101207
5.560165502474101
5.202053736035067
5.910641883154075
6.350684485829516
3.772953815226923
4.700107470036429
5.200199001769148
4.497103553451719
4.897513963923501
5.5748250307081495
4.674951308617852
6.539470956846296
4.532634624125472
4.3749584108491755
4.267296897415663
4.638664694195375
3.8891532479430317
4.572455190270325
4.558840374807069
5.232841977012496
4.795780868853399
4.900101792764281
4.316805362107821
5.870239175058579
4.6010957616323465
5.229853933288443
3.0884665328500094
4.900235954258511
6.598402162926234
4.503141131891166
5.913800919074127
4.777872180940583
5.735708106994481
5.545570278777819
4.713310074246862
4.705524736875725
4.788529989882994
