36.70868655625794
28.177083025079124
45.89352886792302
24.329740859602992
23.845309146929242
32.49992105263331
39.03177862122192
31.968061000649264
27.045106947019118
47.453275781385116
34.842313796211194
39.23552069554362
25.509229251606172
36.26436224667276
34.592005477962275
29.380188062511465
35.947763519644695
40.3099287993306
31.990370333991507
27.842076558790605
47.5991083510436
34.577101471615286
43.96185573433971
42.68010979962094
52.04258189379109
43.943628381303625
45.05241777394094
53.291549942847794
47.04414766995099
43.94875890768991
32.65433493484881
42.675407719602106
47.427594263862865
40.25530445924025
41.56597231344225
28.335093082719588
18.20989963157995
34.790730182132116
43.21801556575884
41.227722242099006
40.88731894568297
21.208708417537718
51.059840424212325
37.33738626906287
40.79279495685152
25.971402872559892
33.378098556374454
32.83482184463423
34.46726489222372
29.987839168165667
24.543811724338788
51.51244796498555
39.20847552545935
39.60971445903017
27.69864372110312
23.197626795801256
32.185357106414024
30.307903503455282
40.81438459549392
37.81240620729682
22.904154491826304
45.130917034441744
27.95081389449005
43.2760786789932
35.18487468574636
