89.38968792995466
80.3106638196013
192.6548090488474
241.5101030223378
152.9636392239158
60.876738547133385
157.73539654841244
114.1016704668058
152.72394659513532
46.24187274585447
162.00651134413312
210.2823536764146
190.1130551234877
202.82938806633888
239.51068232964488
157.36582987001395
110.80585885519231
114.51479778289172
93.46374737357952
158.61343948097038
137.96616542089714
124.87064398800855
88.71701504673678
163.56073689053517
93.68715547749555
74.89698170610654
137.60696785542498
138.38861656711487
157.9941785406203
121.96233491363729
45.80090858052418
160.36352878518375
111.26968215521616
127.57938288127924
121.02255370049835
133.4104359018798
111.29647842152357
69.63055955356754
79.13953279685593
56.79688853700059
196.6561225523496
207.10262638356224
94.39946688143273
123.71478121778809
115.66449219386723
37.953390279090684
60.09805429368758
274.8314087530737
128.97075146442756
194.86135827013302
58.7344688964219
185.7924236608411
131.08319758822932
112.16885548877615
46.4970322293283
75.74732287687273
80.67604665987906
242.27706675529893
95.88773092711159
157.01411740712211
131.15126246191107
110.07060404074127
96.49464158245752
61.44522784497984
194.72679547832539
