-2.6283388588871035
-2.500675483808435
-1.2513228481672527
-1.3932133225897667
-1.1064966703864276
-2.90457137426088
-3.723738290955275
-3.307957320077468
-2.042461966244408
-2.582957388997102
-3.1514141517520664
-3.05777801380976
-3.2771850628675274
-1.87029723584725
-2.676176305368338
-2.358407814284809
-1.9798585505993995
-1.5712163199832638
-2.178725045873804
-3.947248187635548
-2.1065086316810735
-1.9334432248873872
-2.434058509374395
-3.031637836043663
-3.571762311243166
-3.1980422709449563
-2.627947909290891
-1.776839680957683
-1.4064747652450544
-2.5418949700887166
-1.1245644885462156
-2.705910979905078
-2.1643399615644787
-2.576049810143714
-2.13147022258794
-3.413870183772423
-2.7668556754334563
-3.1245474177704393
-1.7413796288834513
-2.711538621739297
-2.6353306093823874
-2.0141410812107106
-2.515302802902573
-1.9563123321329847
-1.9842638379364466
-3.4337155640353334
-3.4172561839398403
-2.9419063914431933
-2.654503975791192
-2.921036769503973
-3.6253227257390557
-2.374267661488115
-1.8030259472680814
-0.9865291473147473
-1.8394008564482407
-1.5072722179792784
-3.419907177111596
-3.362749297715593
-3.379016877278858
-2.7665793221348367
-2.8675736898997024
-4.196083519795965
-1.4048417667034503
-2.6698269289490737
-2.8990235128525508
