0.0014666141799334086
0.002519749379980836
0.0009170755035976453
0.0028315139262474376
0.003884696880155313
0.001691816699501178
0.0010928970127241171
0.0016893701864147982
0.0019195149193910349
0.0011181421428093012
0.0014966865920643302
0.001395689703773405
0.0014314186102807151
0.0031245446126072227
0.0016640535203204345
0.004402641818769275
0.001442826061570691
0.0012480351838094915
0.014625961579850447
0.0009435042150617599
0.001765766081102118
0.000998737869762308
0.0006327968600327728
0.0015080843463963704
0.0008858843502758326
0.0030759723689811613
0.000982094724319094
0.00025582596982635984
0.0006386460930756697
0.000500600583227714
0.0035660755774576647
0.0010417732588945175
0.0005990482106218285
0.0006062596825967997
0.0008062821206262321
0.0015306604682564658
0.01417242304970376
0.001800056336856047
0.0007746786020630219
0.0020755810743619233
0.0038788298822046204
0.003905960407889642
0.0008357901145297757
0.0005982679507225369
0.0005539877467653624
0.0028582817304513702
0.0011373179851921866
0.002768047281185319
0.00141213600512836
0.001404097718007968
0.005569629336307913
0.00022194623154483291
0.0009154292730307217
0.001978606394074485
0.003430137004420062
0.004275418271421142
0.0014855384101136822
0.0008064436783840178
0.004731387084542108
0.0022394795650356935
0.0028332763553300696
0.00034112639107803755
0.003447953957689388
0.0016633747638584106
0.0017414228330041458
