0.07825957486912839
0.07391562731885454
0.0464283600964736
0.03514089746278646
0.06895067023601159
0.14262641948594146
0.12721058412596706
0.1370750773775937
0.1063402680045734
0.042235340990508435
0.04696354372682681
0.060141504309244614
0.02783161917887217
0.01480196200778181
0.04903686533395295
0.035191230654705044
0.017732700481716625
0.07055083861522203
0.07411441779948699
0.023083036744977838
0.013843116207443731
0.012880104975262943
0.05920196069930717
0.058986994463316574
0.0443707934174508
0.03919785522133085
0.018092124761826287
0.015396186336926894
0.031936740955104535
0.05677072191843961
0.054837939133470966
0.02775385048574275
0.07351971019979155
0.010609278686736496
0.01000539500188522
0.01178142122335818
0.0477337635674994
0.12762724694894445
0.022880237275915944
0.018688318886779014
0.0148960555871836
0.017228133041110105
0.0170241346202897
0.06501117605784278
0.07872221602503188
0.0641283071196414
0.0625665309667055
0.037348751041177804
0.07616497549223768
0.06396207427660265
0.06133263777432135
0.046123429525245466
0.03880150536449472
0.08102008043551774
0.10111234766496832
0.09224789118698108
0.14133279802496834
0.04350552872202966
0.061457522079212276
0.026007579136846037
0.042291154401785214
0.03092023645783295
0.05326281209608345
0.048812328105140364
0.04890205974829129
0.13950213573407438
0.06582032408868572
0.057100152064072374
0.06295837889773387
0.057843040225712926
0.06802315599269325
0.08820661010651386
0.15531146719275662
0.06992012526047149
0.05067616861432323
0.08539355094319431
0.18712354337158596
0.048723258274551866
0.038231435818396345
0.09774620384788167
0.06440271064606125
0.05675216547408887
0.1031012592094655
0.13307595584136536
0.062274042489925664
0.046010194941354464
0.030504833856837905
0.05695500233804553
0.05374669157027735
0.1848691542273365
0.1032842036367827
0.06809119289052169
0.11601267212098068
0.2814156336912956
0.03823215727888708
0.05952542172818031
0.05518693349637427
0.04928367760553784
0.08558262243557359
0.0903226641385133
0.06620854001433385
0.08372076011025846
0.09329872121377286
0.10492397551241488
0.12149420863934927
0.06175751393112884
0.04674838893785027
0.192646073815776
0.024987304944327784
0.01915236524379386
0.04171437411615959
0.03941326290588107
0.08370813789940877
0.17356424456374864
0.0914327156722022
0.041562581372106125
0.06091521089889153
0.07550093928212072
0.037829620920806065
0.06564743191583139
0.04199724082073498
0.05531741950340245
0.06719315242623274
0.031892605232866585
0.0294544311794122
0.029750296973087537
0.06856863009808536
0.0936586275145268
0.13956058202221006
0.13826651036445753
0.12953408545837622
0.053015937077602764
0.05784517532503575
0.05627068400699379
