0.9781061698272392
0.9815668934546804
0.9828168516278122
0.9666382710893988
0.9758532826763662
0.9714341934593164
0.9766056485312108
0.9827629628470638
0.9831893795877672
0.9804059922431324
0.9700388730692118
0.9808633266276984
0.981452873614638
0.9822845860481362
0.9786595985804863
0.9828100161392366
0.974795509655992
0.9673992416319545
0.9887865063839965
0.9645825387890756
0.954628607541832
0.9749227015718448
0.9659150255076188
0.9801006055054188
0.9802127626342368
0.979955121233486
0.9955599109513292
0.9927547868362812
0.9876899377874702
0.9675886881650669
0.9750618817027412
0.9787108759742668
0.953801998341488
0.9831096236467224
0.9748976992856432
0.9786256486921938
0.9829680323291284
0.9784990937840888
0.9952818571118396
0.978920926823832
0.9734165172428544
0.9818405469329364
0.97466578937267
0.9591886689210146
0.98343822086562
0.9802569117933092
0.9804356133175084
0.989921263002307
0.9888238456714418
0.9919034029810626
0.9771532175114196
0.9701338082673748
0.980373330100837
0.9649301401847938
0.9911193519016184
0.9825688167974552
0.9746288328514542
0.9822499542685964
0.9875300107621268
0.9859965767262054
0.9755007259369098
0.9774151515505036
0.9961970915473624
0.9867905371155092
0.9912101230383036
0.9535739082693973
0.9784723619071638
0.97030428871455
0.9912961724270324
0.9770690003391648
0.9855016157119082
0.9633668320971376
0.9822234846197884
0.9584709329016079
0.9863119965958572
0.9557972201230466
0.9833893187561388
0.9865897243739334
0.9776171971544986
0.9623539555773829
0.9898369251943842
0.9731059850920948
0.9650392670264084
0.9636263025127091
0.9849021293564536
0.9794261160530968
0.9781057262853596
0.9811689975626894
0.9892151985748042
0.97570977813382
0.9773887922995352
0.9844923330041444
0.9816873417161124
0.9879691272152594
0.9737385206839836
0.9786197742587665
0.9797713649204745
0.9845790309042132
0.9704671820437114
0.997506812374782
0.9957627539938132
0.9636630671279156
0.9772258234065055
0.9776260984816052
0.9768858940168972
0.9722253670787472
0.9834822535936988
0.9776002134751064
0.9855095825166291
0.9703346703010686
0.9599060544580904
0.965227339513212
0.9761215252540544
0.9655415288614402
0.9786976818395478
0.9606923555111444
0.97319812625573
0.981487751552343
0.9756063979873304
0.9331929682824924
0.987890835095646
0.9768771961260944
0.9943150644770384
0.976579172239646
0.9743374246604914
0.991622680404392
0.9691428140893475
0.9851471947752584
0.9605699750569088
0.9756352916464308
0.9860214205068124
0.968075040593644
0.9887654624610558
0.9681980334889392
