17.111101634896407
-16.347899254516
-76.77322135342442
-61.915525803697825
-50.85706151697471
-44.436017737587086
-43.365843774355824
45.93957250902445
-3.0014185112904768
-47.21793332507041
-4.257814475811351
-20.294901033807424
-49.012474637660866
-62.65705874975557
-33.81072876647196
-10.511769933819812
-57.1096875991241
-12.730718394072394
-37.201108330383015
-48.102652769037455
-66.06458959644205
-76.630434789033
-58.18197531261999
-45.301306900030966
-52.327126034170426
-73.01426015135884
-66.07963055232712
-72.70186172886271
-46.77192224011794
-33.298085717380964
-3.3079334570954404
-51.55296100625042
-36.34056493219254
-78.29521461256809
-68.28169611797875
-66.61277636888052
-87.40926876576775
-47.06671004424805
-47.20593289901307
-22.625109028787264
-6.237893115303395
-29.111715327874627
-13.407300077452591
9.9481709795445
-60.1306232631746
-57.93568125270051
-58.48441675531903
-65.60929895424287
-5.052701138357783
-16.08473708859649
-12.867059936443535
-25.278100380462078
-28.036109368021755
-31.280143812446326
-65.5297046701957
-33.533404395193
3.4200691618523704
-51.94770625966566
-41.92038170656912
-15.73792315126146
-10.167187288430043
-51.94770625966566
-74.48748856749941
-64.90157425163395
-73.18031843351775
-35.27238454804974
-19.99293187911769
-20.400324221582288
-22.43728593390529
-26.103817016086698
-22.029893591440693
-8.229938257619354
-36.16371169379158
-21.531735131987077
-58.77676638021672
-40.597643985247494
28.275508006838773
-57.21403718665029
-37.203483946750154
-12.786590517439294
-54.95632142651578
-47.219587900525035
-56.166717899895076
-57.88710757905621
-58.008770080332276
-44.267825988726294
-44.42620931072097
-61.01709703783961
-68.7683438876183
-20.063546390072524
-43.41523036162111
-36.58820831088844
-34.212992222207234
-18.18028362360916
-73.15241640138082
-76.82670120039501
-57.842896405488396
-72.02161369794194
-75.24566201074599
-41.982804371514774
-51.088005573635854
-55.400995616745845
-57.317880080350285
-69.65214628603094
14.384426283238492
-53.69661047377689
-64.32375151097122
-40.67832614012662
-68.08853360411743
-55.18471460277632
-40.990513701301104
-31.527713100317612
-16.968081684886613
6.3572464417570975
-19.219109291081306
-13.73971162448515
-37.36918082263972
-19.154798315728904
-41.7997062972937
-45.10901617715225
-67.73404406016398
-20.467110839707264
-9.711206903802056
-16.77152069590991
-46.93831598946164
-32.88796512308979
-64.86582731987053
-30.670140602783068
-10.815100782746704
-23.52232626756998
1.892124702076572
-34.928856776700876
-44.42602141077799
-43.97377547582193
