3.5181757828362334
2.962377741760813
4.183354669484808
4.592513846971925
3.6444392446898703
2.582157619925389
4.5025663983862145
3.4422622529179523
3.82694893775044
3.3223688220038947
4.635969709326958
4.777369066553357
3.2337385470687283
4.747404386221965
4.343427124033207
3.474843002274719
3.2480543520537832
3.241791381014485
3.601660371806847
4.087674997124108
3.137809937855034
2.822903820386826
3.09031292373736
3.9811434846467457
3.60600295938248
3.416912938567812
3.722475147147122
3.920884703465117
3.5100857057785997
3.130774539210784
1.6669012555967784
3.5497368974092254
3.146275176241359
3.2980034951637056
3.5938145776361847
3.2081808032233705
3.6163318783599503
2.9258168892932113
2.5182438520255443
2.5572592435680317
4.244272846959499
4.508111655809454
3.1600892211666047
3.5514406431701913
3.4545830677182665
2.3571866970755457
2.886676705784305
5.012310332759487
3.8540794442638378
3.79459163896109
2.6631173527853815
3.6683960445603425
3.162645560263899
2.972962658103377
2.2395410948962233
3.020565155100146
3.4881553534352525
4.231103358557787
3.472478716551788
3.9885084430393087
3.774691750287319
3.5373790161415166
2.9565541729079285
3.147829700220253
4.196636974348783
