12.966183574879226
15.12625538020086
218.40105158190556
19.28301886792453
26.994930291508236
31.559950556242274
20.20108695652174
29.36737692872888
44.67165898617512
24.279892521271833
34.282732447817835
19.397228637413395
65.10033167495854
9.587064676616915
92.60403530895334
18.49703440094899
17.611825192802055
19.242652599849286
3.3380281690140845
55.88285843509725
44.43815077051229
67.61106655974339
52.788999098286745
35.42619139868268
14.516369902354967
7.9444444444444455
26.758758314855875
253.74635146544446
61.92428462902001
180.49826760044232
6.28125
23.041128084606342
39.97990196078431
34.81293103448276
28.412605042016807
28.95400340715502
9.959349593495935
17.867595818815328
38.02466293982243
9.196721311475411
19.105523495465786
12.342857142857143
46.24615031027351
58.270638525247136
62.68001780151313
32.112099644128115
48.314913212894076
13.560386473429954
63.027704096669616
38.40191036002939
15.26953125
201.81870773242082
18.429482071713146
11.26725403817915
13.267135325131813
13.477272727272727
23.58896982310093
81.4056050955414
5.997084548104956
33.22392086330935
33.87003610108303
53.36557377049181
15.587646076794655
30.987792472024413
12.262699564586358
