12874.603271484375
12436.866760253906
631095.8862304689
7201.194763183594
10479.92706298828
3553.3905029296875
13011.932373046875
2669.3344116210933
17372.13134765625
19028.663635253903
23062.705993652344
18178.939819335934
31937.599182128906
60896.87347412109
120780.94482421875
26281.35681152344
27585.983276367188
6943.702697753906
14737.12921142578
10711.669921875
12702.94189453125
12187.957763671875
8188.2476806640625
14110.565185546875
37207.60345458984
24890.899658203125
121931.07604980467
490728.37829589844
36254.8828125
22521.97265625
17509.46044921875
117382.04956054688
16925.811767578125
17028.80859375
68716.04919433594
33748.62670898437
71187.97302246094
12102.127075195312
277833.9385986328
39808.27331542969
25440.216064453125
358995.4376220703
29834.747314453125
1991.27197265625
25071.144104003906
39542.19818115234
29568.67218017578
52090.64483642578
100782.39440917967
120883.94165039062
30555.72509765625
61626.43432617188
44734.954833984375
31808.853149414062
47395.70617675781
81041.33605957031
9475.7080078125
95357.89489746094
57695.38879394531
37284.85107421875
17045.974731445312
50451.27868652344
649377.8228759766
94894.4091796875
363578.7963867188
5527.496337890625
38555.14526367188
43395.99609375
91135.02502441406
75290.67993164062
50846.099853515625
2137.1841430664067
18573.760986328125
2351.7608642578125
8960.723876953125
3441.8106079101562
13166.427612304688
19869.80438232422
66209.79309082031
15518.1884765625
53970.3369140625
14934.539794921875
22247.314453125
4488.945007324219
336112.97607421875
106979.3701171875
4240.036010742188
103305.81665039062
105073.9288330078
14977.455139160156
31096.458435058594
20419.12078857422
22539.138793945312
6892.204284667969
14428.138732910156
10170.936584472656
6875.038146972656
53300.85754394531
18736.839294433597
62098.503112792976
139766.69311523438
2806.6635131835938
21946.90704345703
23843.765258789062
9570.12176513672
16419.410705566406
46099.66278076172
7613.182067871094
573503.4942626953
26744.842529296875
15569.686889648438
9046.554565429688
7501.6021728515625
4806.5185546875
6943.702697753906
6171.226501464844
22230.148315429688
7149.696350097656
12196.540832519531
3553.3905029296875
53970.3369140625
7458.686828613281
38623.80981445313
4257.2021484375
27096.74835205078
449735.6414794922
13458.251953125
106121.06323242188
14265.060424804688
76972.96142578125
50039.29138183594
6497.383117675781
10866.165161132812
10359.764099121094
