1.652187972279007
1.6425136442715067
1.7911407848205616
1.601416122337443
1.633319390007237
1.6425136442715067
1.6421933735538332
1.6546630727534106
1.6771274291403842
1.6609071881242978
1.6688733956791137
1.6262242189593041
1.674867672031042
1.6522701028303515
1.7150211088722735
1.6126463987841015
1.6651051441243063
1.6588530335808827
1.5692181758466999
1.681209876193959
1.7463040004316785
1.7185022524938172
1.7230866008340457
1.7206945246382144
1.6671583410339994
1.6489872116690534
1.6986154554952901
1.7869865983010884
1.738703397526531
1.7700601236970597
1.552060406809942
1.6952165522592282
1.7364068081604676
1.7247147957523963
1.7215855645244786
1.6580488868152252
1.5626009197159239
1.6362866085179815
1.7317506384728794
1.6714671001928993
1.632550677208709
1.63133827529679
1.7341277569446871
1.721902237930252
1.7296712843858175
1.6281007387649173
1.667365639110047
1.6242681552983098
1.6991261119215024
1.6554496240108771
1.620345432092754
1.7766240847404302
1.7022074192393701
1.6759741499560041
1.6242681552983098
1.5863980253012668
1.622737458767042
1.7244664460637904
1.5428093922546093
1.6403824465516696
1.6519007218264987
1.7364068081604676
1.6489872116690534
1.6714671001928993
1.6304820788567198
