1214.0
1177.0
1922.0
1786.0
1292.0
989.0
3220.0
1317.0
1655.0
4618.0
5265.0
3348.0
1232.0
1604.0
2175.0
1091.0
1063.0
1403.0
1138.0
1749.0
1113.0
1077.0
1669.0
2433.0
1670.0
2286.0
2106.0
2389.0
1881.0
1594.0
414.0
1544.0
1185.0
1131.0
1373.0
1555.0
1617.0
1100.0
983.0
925.0
2190.0
628.0
1554.0
1871.0
1848.0
882.0
2725.0
1965.0
1903.0
1887.0
697.0
3644.0
1359.0
662.0
678.0
1237.0
1924.0
2642.0
1518.0
2805.0
1453.0
1780.0
1005.0
1326.0
2323.0
