23.494049790942526
19.206661406296266
26.212633707558187
18.76444257837065
19.589875053552774
21.427815464383997
23.63209666985278
22.205495862759328
21.054332590413416
24.673538425326186
21.345149775601584
23.676355401743184
21.330301925554025
20.913639757358983
21.054236777559368
19.675949419005264
22.78896894395024
23.281077346787722
17.620809915197935
23.166155137385797
24.0791757781326
26.126814288484155
28.304303881513878
25.96817248063863
26.17351890714747
24.62194916622236
24.685587130128297
28.748441423143102
23.340333198542666
29.304234141072737
20.516029915813142
24.389832748003254
25.354001372326604
25.758294281441742
24.776859808009554
21.820775853190728
15.945085218531721
21.51002537151042
24.118106822979176
25.883672311984263
25.002253448934514
19.04638449492743
25.311413071593815
24.608396776960515
25.653250836300042
19.224477025859102
22.961165761386184
22.65272276561023
23.45040682784711
22.161891148457343
17.717597162647948
29.877145367551563
26.35227443617694
23.184396611163
20.189494659338884
17.22382299678463
24.95152685767561
23.581687795972893
22.880181013138667
23.212046752189714
18.95636156998774
30.26451900998189
19.063413085608413
24.34622286590282
23.152129984426956
