1.2698706560665078
1.3699727068652732
2.399674356221462
2.9617239048134127
1.6852632767511007
0.6750572132160353
0.7785314355735696
0.7429229433111733
0.8881795139388918
4.129389811272837
2.1157520886370973
2.0324303207298016
3.618945133075744
25.85026160449101
2.439926308531599
8.404207778885974
15.140525682455815
1.4829093587132398
1.293853029237811
5.994585764614742
8.550435551066784
10.371603488066777
1.8018813691954203
2.4196512137205013
2.2218022069694188
2.2460637811679107
6.932275823761708
7.426638176653101
3.9485732638232736
1.9397752034586224
1.8494000521942118
3.8274738822220784
1.1392773848139368
10.99473407441126
10.725693053465225
9.383151851837434
1.87242874087848
0.8730686822877298
5.369688186406513
6.132744483869338
9.451871038944322
6.633583846580014
6.475518715339482
1.5926240833244765
1.767579653194092
1.942377635953311
1.7194968234265835
2.835446275363187
2.314407061785421
1.7902304295109968
1.6004291484746058
2.167049545700663
5.051354379141523
1.4988245871232215
0.9790496450890728
1.4656333905474606
0.8457801514332072
2.9900726928225576
1.8164200825407444
4.575112966937202
2.767014857067747
3.4506177440540373
2.372794662695087
2.364099555555556
2.838720213983514
0.6341629795001631
1.6725411749049337
1.6075461602561292
1.4497333401539252
1.7062883303239935
1.3398373312526437
1.1608997440121882
0.6513023595321923
1.5636293733179547
3.142082002869175
1.0867255461850058
0.6294300878865418
2.831506504754421
2.5007543596369444
2.064510031216073
1.5942613383659494
1.6361256076518784
1.0500960511176856
0.7640509540446118
2.0987100801611795
2.6725475660016387
3.7519506711631285
1.530592628293637
1.7393726991479062
0.4736673609105041
0.8452052214151898
2.1632192855271204
0.9173230888429752
0.3052526720742449
2.829017061518313
2.344264746225926
2.856920408163265
6.3413386206868925
1.237772278343498
1.4330788643839878
1.9032799820663917
1.0633266302786557
0.9534900066886598
1.0681761848106286
0.6898616067561484
1.4903323298093305
2.301196656120758
0.4740401365096995
4.208888852636274
5.166245327934746
2.2570723754723123
3.460217224066543
1.4034519702188084
0.4903036651264782
1.3353156404755009
2.4830097130071977
1.737000275328933
1.7081869257716968
2.766307979337036
1.5433817521210171
2.73881787574075
2.1867499171506117
1.8356670052255464
3.4192779329146483
5.923110354383067
4.552976608645643
1.5153841502397305
1.190139657295757
0.6500922055936071
0.8564021155820091
0.8380808636937371
1.9360582222222225
1.6587385805714054
1.7675209375886662
