0.002604252532032403
0.003981829330344899
0.00011569387739586585
0.003096269530302373
0.0021519316282200733
0.0012432982366078846
0.0014342005068298015
0.0015371063916910044
0.0009855657710047593
0.0008672232406074746
0.0009048866730439976
0.001834036774755907
0.0007181840292926547
0.0043789835849124895
0.00034264592258123605
0.0023009582012090603
0.002030949985204832
0.0019394079991327535
0.023619269143050244
0.0008505833226303671
0.0005566876906485963
0.0006543807387651846
0.0005172659186062885
0.0008408031203758946
0.001508804045218914
0.004509055293308398
0.0010269363456569076
0.00015718298446882375
0.0005610169709340338
0.000270510330746665
0.011341508049688484
0.0015216616406491944
0.0007257197154916668
0.0010932639129264156
0.001013184727900037
0.0015346502457550815
0.0075768261742345565
0.0017719484547984085
0.0008805153364118371
0.0037416519626524017
0.0016027857002963533
0.006949187585452825
0.0005417583779124413
0.000520501202894865
0.0004842994503236998
0.0014818638274385146
0.0007793938280784438
0.0033094468859029376
0.0005255221176204354
0.0012944921820703175
0.0039049310735663908
0.00014667376323074217
0.001822543365895105
0.003769125503667604
0.003911420605383525
0.005094068521546529
0.0018622539135624344
0.000437319575889564
0.008228898947749409
0.0009070064244020977
0.0016314940953374873
0.0004303616179384787
0.0043701823570658545
0.0011606592215729994
0.0030622135513141127
