12.264211246952877
12.529119081264676
13.034993960164165
13.247730574716186
12.99414827324756
12.158979402876046
13.34119579206289
13.489817243399786
14.228664301315714
11.51781677771454
12.99414827324756
13.395641181287804
13.772413403103297
13.510593262826227
13.529885024271216
12.8328199669632
13.063017414068744
13.268370281729492
13.39848567356244
13.524382801669207
13.488428235908884
13.110803064323775
13.219541531669314
14.103344725345682
12.808015655790388
12.702013031558163
13.981362121637707
13.006762922567905
13.387095180745025
12.786385636490614
11.627295961138937
13.302040525588971
12.68147786949912
12.978320887557203
12.705424632965368
13.234403587950803
12.725829254746888
13.690141035501924
13.482867255802647
12.89169332903747
14.022841079149142
13.224006176569231
13.646351333865816
13.299124302865955
13.216562221475732
12.826221430707827
13.25658969547574
13.682215395608285
13.466136582104616
13.946877127735378
12.298625328898144
13.516114918982911
12.729219251456081
12.502207549715934
12.702013031558163
13.224006176569231
13.006762922567905
14.830293112973706
13.99116060331282
14.983843499728977
12.494998011879398
13.34408048392785
13.148909787037338
12.355273659046967
14.304072695533057
