155.0
149.0
12.0
27.0
81.0
100.0
85.0
197.0
94.0
52.0
131.0
138.0
63.0
14.0
55.0
125.0
32.0
149.0
138.0
135.0
89.0
69.0
62.0
146.0
73.0
41.0
10.0
29.0
145.0
115.0
194.0
54.0
50.0
1.0
3.0
1.0
37.0
97.0
99.0
170.0
175.0
144.0
169.0
215.0
38.0
47.0
79.0
88.0
121.0
82.0
116.0
67.0
43.0
95.0
64.0
74.0
160.0
58.0
71.0
116.0
139.0
56.0
57.0
68.0
52.0
153.0
132.0
84.0
123.0
95.0
110.0
161.0
117.0
113.0
77.0
96.0
189.0
28.0
51.0
88.0
76.0
76.0
59.0
63.0
35.0
80.0
76.0
44.0
61.0
98.0
59.0
94.0
76.0
173.0
8.0
34.0
59.0
47.0
53.0
75.0
51.0
63.0
49.0
106.0
160.0
70.0
29.0
94.0
27.0
78.0
101.0
121.0
119.0
151.0
191.0
120.0
60.0
114.0
28.0
72.0
16.0
112.0
97.0
64.0
56.0
64.0
20.0
57.0
124.0
86.0
102.0
90.0
97.0
68.0
