1.2145739167667595
1.1914101764374028
1.3940665890617565
1.2696296061266283
1.1972661110375653
0.9999889556237385
0.7291819858985908
1.0404864575063344
1.1172664853826941
1.4425405781532679
1.1714076600158108
1.0182680551986893
1.2252740751140807
2.0687884161179277
1.4023620816605022
1.799877532156475
1.874531704155733
1.2992300291377126
1.2900351033989619
1.601967629248171
1.765683466929202
1.6157625951834027
1.3466742815706712
1.3748656114314162
1.3262504535159925
1.4685322105864238
1.538482137350488
1.6386087701514673
1.4138713613138112
1.3265603094817442
1.2759379532261992
1.545152064253092
1.237052239491479
1.7342952861268273
1.7315363002655861
1.6687136529295106
1.235209960840581
0.9396734382109251
1.5806099174383974
1.5602251416200323
1.6257915491860933
1.5659617750599173
1.6632426985025248
0.9876077649931714
1.3096792959863013
1.3378123882549642
1.257562187526262
1.3834495088629108
1.287086227451601
1.2632874987388156
1.1885243964761596
1.2997160881698568
1.5006731490970304
1.2282542277386768
1.1900117378076653
1.2483365317614703
0.7273866374222132
1.4019024355279865
1.2659126392344444
1.536857266945114
1.404080602634701
1.4222279818395258
1.3971659647939885
1.3654512590772523
1.4240383406985175
0.9172737639769921
1.1848613331377744
1.24444396045277
1.2502922905202642
1.2092001270801975
1.234143018167281
1.1425925101916914
0.9439437081104717
1.2245649821169282
1.2539811776989829
1.1697645209345027
1.1883861186024869
1.5542380708038082
1.340620036753062
1.1950237082493564
1.245905252054896
1.4052918740898739
1.0532180758621001
1.0085000076591277
1.447732582086547
1.4418125482080197
1.6170495288138191
1.2955369763019218
1.3157319765549753
0.8390017133474864
0.9908449288094507
1.1195964537129532
1.0115764720666374
0.6091277662448762
1.5216254236646916
1.5300158927991758
1.447756984441414
1.5763706802682214
1.1368246731926241
1.171886144111171
1.2299664049358578
1.1000637242337783
1.1762354096326468
1.1325347482037886
1.0437510697303727
1.2561769875920996
1.3313775270339478
0.8029265977222367
1.526564468608981
1.5895101017768476
1.4033188712151565
1.4698850916891828
1.165709412707785
0.9500066452278835
1.228587171710861
1.405499398853227
1.309773623163311
1.2206335299118116
1.4179142337786983
1.3455989594858584
1.4698197268084452
1.4325491448529948
1.350742506300878
1.6669313902186464
1.47149849632722
1.4483147491161008
1.2910070101911006
1.0888868654920547
0.9113456822152444
1.0281347327959685
0.9333333694800378
1.3457080780825608
1.417787257793599
1.34008983318838
