10376.930236816406
15990.257263183594
593845.3674316406
8711.814880371094
13458.251953125
5433.082580566406
9226.799011230467
5561.82861328125
19964.21813964844
15707.015991210938
27783.39385986328
19028.663635253903
26041.030883789062
149534.22546386722
125844.95544433595
28821.945190429688
24985.313415527344
4454.612731933594
16728.40118408203
9149.551391601562
15003.204345703125
12891.769409179688
11183.738708496094
20127.296447753903
33980.369567871094
33302.30712890625
134634.01794433597
522623.062133789
69025.03967285156
23912.429809570312
49919.12841796875
116523.74267578125
14316.558837890625
25491.714477539062
100130.0811767578
62493.324279785156
48811.91253662109
12848.854064941406
284099.57885742193
36357.87963867188
35791.39709472656
379560.4705810547
34057.6171875
1484.8709106445312
25088.31024169922
20410.53771972656
29551.50604248047
64905.16662597656
114017.48657226562
144933.70056152347
33456.80236816406
166322.70812988278
50210.95275878906
52545.54748535156
52888.87023925781
106790.54260253906
10848.9990234375
117965.6982421875
62999.72534179688
37988.66271972656
21114.34936523437
27637.481689453125
610530.8532714844
89349.74670410156
411077.4993896485
18711.090087890625
50846.099853515625
51172.25646972656
120111.46545410155
63171.38671875
50022.12524414063
11939.048767089844
38692.474365234375
3647.804260253906
2300.262451171875
7741.9281005859375
5518.913269042969
10299.6826171875
29268.26477050781
20891.189575195312
63557.624816894524
14574.050903320312
27088.165283203125
13046.2646484375
310483.9324951172
102910.99548339844
2291.679382324219
87358.47473144531
89847.56469726562
16616.8212890625
38314.8193359375
21191.59698486328
29517.173767089844
6780.6243896484375
15200.61492919922
5750.6561279296875
5012.51220703125
46880.72204589844
20410.53771972656
62029.838562011726
132127.76184082028
2600.669860839844
10411.262512207033
20247.45941162109
7398.605346679687
15252.113342285156
43859.48181152344
7810.5926513671875
481733.3221435547
29422.760009765625
16702.651977539062
15827.178955078125
9810.447692871094
2926.8264770507812
9544.37255859375
12093.544006347656
25337.21923828125
13372.421264648438
19294.73876953125
6995.201110839844
86731.91070556639
13037.681579589844
26564.598083496094
2403.25927734375
19320.48797607422
451469.4213867188
8728.981018066406
109949.11193847656
17509.46044921875
79376.220703125
59858.32214355469
13853.073120117188
14805.793762207031
14436.721801757812
