32.693729653624736
39.073582091608635
49.46104312569611
40.701294487244404
35.8658805119844
13.05586433526715
15.764195011337867
25.35479058159723
30.31009580490637
69.9237591142317
28.644534931901607
35.2148121564371
44.75510948606328
376.1974965450485
54.52649601764161
169.37351942375514
254.4413537632167
29.174690909090916
19.810887278806053
45.934340170731566
53.052488888888895
64.14266304077536
17.86447482638889
29.28527968991713
18.63461247637051
25.249584278155705
82.31929877267102
82.18244388250713
66.90141379734888
39.58525691663988
33.17084626618153
60.7237353489544
20.07810232004759
85.34407268787156
85.10276998292193
77.33721148677759
22.085558348928643
15.061456000000002
46.38588141677579
53.58152177330114
74.7703108598675
55.22512396426653
43.699663284680206
14.63486842105263
36.54492882815659
38.83925108997183
35.091911414982164
75.03137022837362
66.20154280529665
34.94574451305094
29.170092842587643
40.65993244521701
113.502877121688
31.49799245289415
19.09118445991053
34.15971531671016
23.146461216014284
73.05699752365416
46.81175539877409
87.95274599918899
59.00490556015561
76.29090192649069
41.0362386474109
41.649499521936
47.813494778219564
10.919864282319
28.837584801289808
26.144929610545944
23.207364050751725
28.9200914114919
21.400898671402643
17.295172020715206
17.270353554393616
16.454444444444444
43.93138783693473
18.869017283950612
23.23291559813552
90.69838865529758
37.28579850108143
66.10729109274564
27.740939295410804
24.41889235749797
25.187143595041327
19.137164137356102
47.304174441677425
57.58343789825783
47.405426876632994
24.965046549250626
27.6277594031788
22.101577223481986
31.8118687487563
67.38449896694215
27.017308582056604
7.705110870740942
57.06879378806967
59.779298036882814
60.998611164692704
104.16480369376156
25.088378820769577
36.181031107801104
40.59717130288722
16.71603821584035
20.519480139759953
19.86160192719265
15.84911526937645
33.37316613423367
47.410880826463654
11.292628501077251
46.771716595286684
51.131073629751434
21.23892583080516
43.015792926518365
46.709539669158794
16.20150302768166
28.081969446925765
50.62546300030098
40.73369986670833
35.886088819822994
57.84669255072979
25.163350678502198
53.028259288358186
41.59779636881453
54.149197904621936
79.56508624752567
167.9643693487707
115.31060888624485
42.904317373091295
86.05917872216635
42.083271149127
64.6345659355103
54.117939824556466
42.278298412698405
33.3493667686628
39.289313131467296
