4.061343287511741
3.9428780506409415
4.235953456174013
4.043053983729998
3.934666302365768
3.909562716825565
4.126906893905573
3.9707321920625973
4.252830080446273
4.149716534045905
4.1166568883382455
4.105987650189326
4.175596438827214
4.131290350497818
4.262255825457087
4.261900617913551
4.172079903150591
3.997459932924177
4.100042417441445
4.138926376912368
4.13015739966412
4.090194914375513
4.0054538154410455
4.107815424552099
4.152345107903573
4.139002072575158
4.394703619075457
4.302310034786247
4.143899889358637
4.036529232155193
3.921962305109428
4.212145208442243
4.12816118284705
4.233348546821753
4.238716953592114
4.24099410846836
4.212947309967999
4.057420606982618
4.211664797373273
4.036260449211792
4.141871769178882
4.244096853059116
4.170519677114732
3.971494429286944
4.104856541510937
4.135793949057508
4.075584150280529
4.159348707048891
4.153256940184942
4.170809726730427
4.114253775622014
4.06262022759508
4.15666168086664
4.061528226176107
4.373339078411587
4.236012592133004
3.9745988478649417
4.196644496427376
4.077219675165557
4.065895621997785
3.9539628879988995
3.9672591074029353
4.340900553178127
4.104468299252641
4.346679417583022
3.802978451626617
4.037296513005637
4.191205468595255
4.178458688852906
4.0865895832348835
4.098702394719151
3.8376399073745553
4.148570610701038
3.9236302759079154
4.080934875837174
4.00269677107013
4.0626543778153
4.266551545320684
4.078550913815938
4.079024460972384
4.074044947071237
4.074044947071237
4.144523365994771
3.9579473951717614
4.273002235441555
4.104605717121482
4.025195035143064
4.264843412354731
4.171182008994556
4.109265092017478
4.157709461299252
4.15667452215152
4.155932076828299
3.989099092058221
4.14316355206168
4.028058061695896
3.9864248493146808
4.263202117640182
4.100731882953377
4.284636135243469
4.433082536416608
3.909507781764737
4.135120853939718
4.062588651574251
3.971488356394574
4.108970316903616
4.120629763907643
4.133661151597165
4.29338814682712
4.071009521719563
3.9875215295285567
3.9404002130119453
4.065311258491489
4.010208243444385
3.9612672799053574
3.956379292126045
4.0813940691544195
4.035666298148823
4.1066855754199185
4.022405374124991
4.214578100271542
3.9659425444196366
4.191655098312138
4.038325604054186
4.119892757794709
4.273070440098416
4.042664005017693
4.2187468173675295
3.8180247539770953
4.0570535318232235
4.084827936096698
3.9757529535207783
4.005567176775302
4.024691883298926
