0.02391013191015821
0.008725557708282186
0.002551475539235267
0.006977423257722146
0.00576817281013734
0.013554317522356295
0.0033735315372943717
0.01658677503267186
0.009474969421003895
0.005288977729601403
0.003746212729558155
0.007408784758087866
0.0074279203831348565
0.014355141183480885
0.0014109929777752616
0.0098854507678508
0.007973773250102859
0.022070383857973795
0.04642005554487995
0.004210532138048413
0.0108748784008041
0.008348684800601157
0.009014410904610559
0.00578178329303001
0.013077008273713006
0.019877760986941773
0.01158127871570196
0.0009031512270140467
0.001999876065716766
0.0034160126784791205
0.03454302085667479
0.009026321196407141
0.004539409209063225
0.007210938040972626
0.0045835890163048575
0.006771773738059394
0.013589833499140908
0.023605005357396163
0.017440272257827828
0.032223981402289534
0.013596502169506112
0.0758201723957116
0.00334286294380614
0.007721278484494081
0.004216899360961435
0.02817750480584033
0.003746475737467669
0.013724163314445544
0.006323053625450064
0.009550105304917015
0.033937634793726155
0.0014462143112077667
0.018920001982640596
0.02884800185624358
0.039925982613029584
0.0309174028843129
0.01513549938568619
0.0030799752377655035
0.05135675543115182
0.0030244166160412122
0.013201711412997578
0.012837807890252458
0.039847101283087286
0.012918804782699774
0.016735004336574974
