4.349509758594631
4.511850883283771
4.464489719069511
4.233881774892005
4.2737078234208115
4.250131794607068
4.325286726340376
4.203844552436659
4.361995358850592
4.435045430680775
4.3760499655740634
4.446100551247712
4.4989532662597
4.413844274023571
4.4588375346310745
4.581463307751852
4.458136322139501
4.320382080966873
4.269452011739183
4.399123216539802
4.382941148709357
4.344208256797294
4.307128654327667
4.471185866771773
4.367526610597525
4.409328196422677
4.692107636048657
4.638537177096427
4.538359324055605
4.274364511336411
4.249985184973075
4.447607135985693
4.215768677547565
4.564657820246849
4.501746624231568
4.469826285243484
4.563275391107261
4.29247026845306
4.548775148644368
4.411161064152249
4.358615135995084
4.545136078583709
4.480727848983617
4.313817706791728
4.3630571325502965
4.384292525750815
4.355682649856481
4.568787336643151
4.363489442937286
4.396820336371538
4.360053218820177
4.346253556203707
4.419654674448129
4.33621722490481
4.67325388449425
4.403566379052874
4.149638264884505
4.439451075396502
4.325878094309367
4.381932609506436
4.224188253396183
4.292066137993743
4.56178965025592
4.332450534473792
4.554855088852005
3.964018743851665
4.3363913500643365
4.309459378609959
4.421754152102053
4.342111893866098
4.363723405031273
4.014222162614605
4.366175693123726
4.16140413911245
4.435692680127992
4.176270040792527
4.382921175562364
4.541259856468208
4.367908680325775
4.271138460651744
4.375908195516298
4.299409150333927
4.302013251659077
4.095243799495047
4.440515045339307
4.397395065610615
4.070687520178237
4.340860140846016
4.478478652149676
4.309525604001448
4.368625559483277
4.288869029340146
4.273366634255523
4.302631369055288
4.235667448919927
4.187647760037962
4.239394369512212
4.5071121147080495
4.293777466319005
4.454251837166825
4.430100603318386
4.179528573548056
4.352369829512418
4.412953221351512
4.20506408481114
4.27572459815705
4.348930105499255
4.308300848404823
4.53529662669488
4.406432711306322
4.297300419423515
4.356225427438838
4.348654909266938
4.294882513536065
4.2982575163794845
4.200186084959141
4.31988906270129
4.25359208026037
4.288442729934746
4.135548153004924
4.407983481007366
4.187647337036953
4.38428713249387
4.268662798029144
4.318650456279802
4.513818908107025
4.187679443783673
4.38535353529392
4.278248948171674
4.318556076306626
4.294897901864402
4.191204033234388
4.43461463075197
4.270219233539977
