-1.3709686957587173
-3.481777477142057
2.9080456278589724
0.10414595795805957
1.2666986439573629
0.3284391544209768
1.5477418565915069
-1.2737196208004005
-0.9871408462767444
-2.238748888511148
-0.6172059237055096
-1.688273570411676
-1.0032990135898758
0.4590980128055285
-0.15510071007290788
-1.4645800888826639
-3.2089977828106218
-1.697314897070404
0.713467139506669
-1.5111697335655545
-1.613531778025078
-2.0736428230785795
-0.24031345814283903
0.6854502849686372
1.6207410841886767
-0.20910886740506332
-1.8258011587831526
-0.1802297894789682
-2.939994025358661
-1.5306897737215026
-1.1035602587208964
-1.7114127178904563
-1.883713672766895
-2.3265642819489805
-0.633664502261211
-0.43041355193519687
0.7648034187413971
1.7608217127957089
-1.0691346321948876
0.24969402190473938
0.564317873184752
1.8947074665475168
-1.5126201496030287
-1.7095198933258087
-0.5333826061975568
0.46632113943934883
-0.313560894305822
-2.124513054402828
-0.1610512511084804
0.2275924257070022
-0.3831071260203836
-1.1885528053173697
0.14424787850312173
-2.072695700231608
0.030540846091661036
1.5991510783298626
0.3097960766354781
-0.8738416016957853
0.3727357306874678
-1.8622840063838455
-0.9945608050217853
-0.5272786373416073
3.321287163016495
1.8068055560877863
2.84513190202935
-0.2614606744300086
-0.4798069861154546
-0.39435062094563644
1.6145366001519204
1.9056096942576055
1.5872703042050595
-0.7850185863371493
0.7393258335351054
-0.6897385363760501
-2.2460171432033
-1.2850211575748525
-1.8047811974785095
-3.836126015602359
-0.5885551935949715
-1.4226179199947326
1.3305758683655193
0.20188556513462622
2.160801061061611
-0.7349564507362666
1.9600189613986068
0.38116831298615533
0.027945848260519716
0.38688564469471537
-1.3019091835277057
-1.359112358654627
-2.3527218870954294
-1.0610334469832317
1.4187375209827795
-0.912059550732567
-0.41427749088369786
0.27105697880845425
-0.7188437495173435
1.3959009286790405
0.760075462693889
2.1886694878078785
3.0681722086486887
-0.8850565119875169
0.6420933360934897
0.8425131442967829
0.18419761827654868
-1.0930827159977032
2.566554915132571
1.3154012262244674
1.8414482094401785
-2.3330023883168813
-1.4517845131833427
-1.7575102030177365
-2.264972513266589
-2.33027466162577
0.7541830279943511
-1.120135658666941
-0.17250761303625486
0.1959741091850854
-0.4901080950659932
-3.111396185855231
1.075091125072953
-0.02119107108368862
-2.2306660432071737
-3.5126478045369747
-1.8785202835634367
-0.5776592435296
-0.8857877906284023
-4.215131307456125
-4.8148740399346
-3.198829381691234
-3.1118980918834103
-0.7178024455950209
-0.7587030563814626
-2.060585199911288
