-0.5090369642102872
-0.42596696061375133
-0.4370423661115292
-0.34616203250104616
-0.4338866299833212
-0.4673973664799055
-0.5543572399838285
-0.46548898568571484
-0.4141975446313776
-0.41342666675385153
-0.37750789428857706
-0.3908966753479764
-0.3853137727572768
-0.3402411254929643
-0.4603146845682843
-0.3817219581802828
-0.3223900248596753
-0.485590683435017
-0.45234005195343846
-0.3819118598285395
-0.47362336916941095
-0.3735601055623346
-0.5136032655329406
-0.45204631170259313
-0.47895765789772915
-0.4584027157066745
-0.39234631239751877
-0.37978455746243517
-0.3712816093440644
-0.4025088617848877
-0.37677009770356357
-0.37123557630104576
-0.38624804481738384
-0.36800194583197166
-0.3885276289941741
-0.4063118496150639
-0.45315482356709313
-0.3695004578503474
-0.4544762618559492
-0.4157867257406746
-0.38608332704502785
-0.4677086030145386
-0.47191077099449424
-0.5476098904214924
-0.4448210034023729
-0.4810305265975584
-0.40990188037853553
-0.36183876701307915
-0.4382362290758122
-0.4523517562571427
-0.4211898958866423
-0.4262923507024915
-0.4013833633474323
-0.34342864028214687
-0.4744845332976556
-0.4009585570068012
-0.43575950913634076
-0.41681835345728807
-0.4869787367325369
-0.3752381976127427
-0.4735611262149075
-0.29717660829333176
-0.43901966542812876
-0.40869480813707365
-0.4553406255869893
-0.5081692902892034
-0.3862030826641094
-0.4020369932804043
-0.4370593497578201
-0.41049984433617626
-0.45007876502882566
-0.4312726144336643
-0.5127640354958777
-0.5456327663763061
-0.4070096017384395
-0.4726406535833518
-0.4583675927758867
-0.3441266623067542
-0.3433547165628051
-0.400383096911966
-0.39056256167455644
-0.4157425025618424
-0.37354669639493593
-0.4483530862360898
-0.4186460155135457
-0.40583209999812414
-0.33077828682825633
-0.4597757707741408
-0.4514407761873139
-0.4498743675438106
-0.42653277702078785
-0.40533591371644445
-0.44770062163292274
-0.469369753735021
-0.4095239130909599
-0.38198128402371206
-0.31200623002994915
-0.41565050650825347
-0.4442483266068823
-0.434135908458601
-0.44534900593320553
-0.38543472013384555
-0.44293066289831856
-0.4143353995452629
-0.5035143483432168
-0.3757506955704854
-0.39108755637799053
-0.5185953882342144
-0.4647651097128639
-0.38946927346047233
-0.5087146603656828
-0.4553912860476208
-0.5097474841969485
-0.41741263056145456
-0.35460751452672745
-0.38646477572355964
-0.36957759880043517
-0.34677621817449883
-0.3480154260838969
-0.5342736832766571
-0.47455473189954156
-0.4165507050944082
-0.43393972744468945
-0.23871909915541834
-0.3002393571900476
-0.3625131902865377
-0.38115845805786447
-0.4198281075973423
-0.4398210104900349
-0.40055311227169876
-0.426876630376015
-0.4143916439744484
-0.504073247058676
-0.437641147018713
