0.02249776932754797
0.014068575909340995
0.003329597780480727
0.007523447207890562
0.014230611117625353
0.017069046303761746
0.010519568559776395
0.014130584305212475
0.003837434948866761
0.00939065428989087
0.0030900726245090392
0.0259667896815468
0.00655484203146617
0.030530281633287783
0.001794694597877148
0.008109150999954743
0.01826154026756058
0.025337956647503903
0.02560584605081726
0.01683095852475067
0.013374920906078126
0.006741994969390693
0.010808847581774035
0.004578609393284335
0.010139929846832242
0.02561631449206004
0.006584941005197175
0.0015142905055664539
0.003708159636682537
0.006807320205724868
0.11788714254071946
0.011740378674595216
0.003508430913510994
0.010827780608592621
0.006596859288599042
0.011386658508475556
0.0182551977826008
0.009784253651233107
0.013264615985249277
0.03371161444165096
0.01024978299232704
0.00896802021448718
0.0031291436856453183
0.004699626787743035
0.004557463605784762
0.03901964905281796
0.0046650246486817475
0.011971338511047187
0.013249903971167851
0.008057388892899257
0.0316501528463909
0.001496303534323979
0.016577187011922415
0.030768755458942764
0.02302387046854054
0.02137428736895273
0.02972077226622593
0.0036505543656296852
0.0565713961832939
0.006766578932182165
0.021110520461532084
0.016927917520906218
0.06022093553949946
0.01469100839929592
0.007425320551261913
