16.570753626798602
15.662709539100083
22.428858624949104
13.574940097606714
14.376139480316631
19.43129707823212
24.191532606402824
23.787866570816345
18.327727366497133
17.69626174371984
17.45665812808231
20.559196040704332
19.390615311461335
20.623643160484047
19.96418597672259
18.075521332011913
26.07898671085284
22.95989501696158
20.123089926168227
18.543118127388343
25.651909403433542
21.58733907104369
24.625647219018774
25.183363231758705
28.293060251370445
25.753359826662074
24.699227642476092
24.910135490901684
19.80055760292968
26.844795983391105
16.225312022536244
26.073532361536028
24.646238061348782
25.341426401993317
24.185906908937707
19.296480893322865
15.763846561833134
18.459070446281554
22.281868134114003
25.66804010439491
20.255421348822228
12.164150680685117
23.72988998416739
21.33453926079313
21.82499893882122
15.861501442490196
16.974387295419653
16.68147498518345
19.975347778693376
16.66337302534962
16.274788959353412
26.66380037760268
20.987551048753254
17.70438272580946
16.55186970979742
11.867868161396466
18.470369625531603
17.569988133164678
21.347865648557526
17.731462313765892
14.449984237185737
27.08270699811893
15.827499340631661
19.47515551347353
18.648231962491803
