0.0966907140482008
0.117775
0.20216353251561026
0.10809948979591837
0.10151925078043704
0.1906475762189989
0.04417063711911358
0.13368665837434426
0.12161827465325407
0.09302982204450412
0.0579074605048631
0.03830821947624703
0.16733242119368558
0.06572544137618833
0.1399895400880572
0.14371804236669106
0.11432650218006382
0.18578441590178896
0.0217283950617284
0.09145844984352927
0.2504354268615906
0.35280661157024795
0.14048381391772394
0.09143176361748813
0.09057887861026764
0.06069258979311889
0.09458423185603806
0.2682950803410637
0.14084120042574852
0.33933615056169397
0.2636054421768708
0.13653817857329326
0.4093370550062077
0.21748736
0.1484164903725483
0.11968090859924282
0.04535147392290249
0.06960342236096659
0.17682991181300473
0.2187228732638889
0.10316995574980832
0.3987782911739369
0.18478669698875824
0.12285431200024527
0.10696221858408866
0.1514864111796982
0.18533804838766152
0.05317590095351357
0.18171197243367412
0.10385856385799708
0.19162947473549516
0.22465750192121356
0.1300056295740289
0.196688879633486
0.1258323628654185
0.02938475665748393
0.05830102866212875
0.09301263788443276
0.058029546179190136
0.08131581458976235
0.1131881583971609
0.17691040909919378
0.17719163516068054
0.13752687084620152
0.012656147271531885
