524.1773333333333
571.7908902691512
12694.518441954087
308.61382598331346
438.84300791556734
840.7084980237154
1059.5160126296796
1005.4504249291783
1587.8368718086535
914.6910516002612
1152.5718730553826
682.2621621621622
1554.8943483275666
464.17241379310343
3445.691584277791
540.8524822695035
757.0620782726047
957.0069044879172
116.6206896551724
1250.0589259796807
3575.594433399602
1882.801736920144
2531.353195319532
1604.0728949717345
1237.8830570902396
544.5790533736154
1557.1211296359304
13095.221311692087
2102.344428364689
7716.331633616619
154.22981366459626
1147.473731077471
2805.090789225843
2068.933424532604
1421.7515192437545
702.1025878003695
129.6284289276808
674.8761408083443
1856.320197044335
405.1283185840708
739.4310344827586
215.07648183556407
2858.3504492939664
2280.9837155201058
2468.25502368894
565.4045845272208
1314.8443279050512
369.83375527426165
2164.923671497585
694.5226752175905
347.685201793722
15224.152384088118
707.8100128369705
374.4818081587652
318.76514215080346
230.307371349096
550.3033075299086
1975.5149491094146
239.52822580645162
1211.4225530566996
502.88520408163276
2513.9204141054674
376.19614921780993
1203.3993138936535
503.3380726698262
