0.008442489994019621
0.009974131783460849
0.007316933672110349
0.0229037610084076
0.012926082737590168
0.005949481847513604
0.002762794316873652
0.003784123034656183
0.012966353992658296
0.005158155700615742
0.005454498376826957
0.006907053166466754
0.0034306362146351967
0.009517296642223479
0.006061941256650054
0.008844283192123608
0.008865285813386607
0.015522870202392163
0.014626247866333203
0.0024237666973615274
0.00751877555933323
0.006753063608564568
0.00536934395279424
0.004531124034293842
0.004020626970750938
0.006944993195617654
0.006554525131975427
0.004746465811501291
0.008387731400363897
0.0027385864878164386
0.032120764063349176
0.00591553773986126
0.007769201546747801
0.004618030409247877
0.008919438688752859
0.003266245964057322
0.00851932748528687
0.005477245153351058
0.011806300942190416
0.006576390929042068
0.008310953647392238
0.020533398170054937
0.00508861408999126
0.005577151775247339
0.006216783225952736
0.003888501817126853
0.005081403807548699
0.005259953552562743
0.004760908825587806
0.004292446004027582
0.0035987018415770604
0.004293627148534282
0.011127766918916659
0.019974432915847457
0.01651586488942431
0.01989230513269384
0.007016978220670439
0.003032452465236677
0.008337928820195663
0.006467583372893616
0.0071240591623765075
0.0017380837583616596
0.02059632432236805
0.006748444207223383
0.008377836036851214
