411.7932421670767
239.95131202285302
209.5174331854432
177.11373988808083
151.59890916971815
397.80610897857554
632.82332602455
461.8260568412313
310.1975201090669
789.6565521498437
450.5582010049072
447.42361971951624
240.4370760569044
102.49599462465159
333.42703444612437
188.35432206234418
103.76204422164629
120.84684217826886
146.31221314628382
475.4697345575841
284.71097482601124
193.67901767532572
558.4326758039971
330.87207809272155
519.9863670253691
359.70274420049134
323.6271569669449
357.4342796909346
206.53821525098854
353.3435656861206
105.82114388025428
213.15273178275152
236.64389757290604
200.80566057110897
173.8619733665994
258.8900494952778
57.99311908670808
354.80909039260195
186.17136065482933
185.52246295797107
586.7443354725477
111.09234130102017
245.13145176152733
216.57160504510415
263.16496917333905
209.22728929828256
656.4977202330658
474.09392077910684
383.19361178725677
376.4564204644622
151.92450429718104
444.827903108312
222.6737165864684
143.92535039568008
156.950030509515
136.13969256087304
526.1253385972022
514.4814317299923
888.5836082024174
618.3377579188975
239.10775074235957
969.6585851737815
143.62665107427645
359.38253742847724
483.9386865929297
