1.1254213761649814
0.9385403886147876
1.6332720947253898
1.02114188981225
2.120091741170974
0.7386897621645292
0.4394746874213126
0.4764156824008229
0.7857048260227729
1.9034369517089185
1.2110951082932502
0.4826242738905231
1.2829527041704376
0.4757750609906526
0.8592584334652176
0.917680133277801
0.4722805979826474
0.3216628411070347
0.3732943754565377
1.4699952741020794
0.38007013531713657
0.9539628372138058
0.5342134652976341
0.4620252742363697
0.26795751548132857
0.3121319181667993
0.3450671850279593
2.1317748425341128
1.1633972914529094
1.5627359801650569
0.4578340026348788
0.4222312083028107
0.3401831307820832
0.5125931019713421
0.459838885764691
2.093083446699844
1.4955902099609375
0.6032846880907372
0.4935312946337482
0.5659071328211729
0.5983871645944053
0.6530033386147579
0.5949395161388162
1.39818548650617
0.9682799613108116
1.8622353415872075
1.2681497571463345
2.0209703330405784
1.3513469124105977
2.1335925157749838
1.9956438572318038
0.6152082113309914
0.6239463118323902
0.6814641548472149
1.0364764096373422
1.89005650989947
0.8153431110718431
1.9729027517626336
0.5153044956956105
1.1637291213723466
2.1806738883811634
0.8060508738905575
0.5056340453568728
0.7431418238443701
0.7736716757015305
