1066.777902472273
647.253115982644
241.8646914172018
249.1482893863187
155.92347479314824
175.87716429141656
265.6342988045521
733.9066961837309
660.1053313065684
563.8666711324585
353.76791254390173
366.0506835442975
360.0992526630725
571.5918380555024
401.27284100796606
1098.3399140632423
727.3024502969048
349.8607751456878
342.49066715480666
341.09047320387043
358.19903627477424
456.78109054735495
235.08765334095543
211.38755200000043
256.59030783993967
310.98596365717134
990.21915353926
639.1282672533981
656.1583758414771
462.40655066167267
235.01119592283047
481.1098530676421
440.3344088754618
441.3351773356926
487.5464152719011
374.360143500864
301.68188486598507
173.38783084833062
384.2181362953727
322.0261604206712
199.0974385251949
299.3369735165849
285.5770444060166
733.5943056903085
552.2658933216936
373.2740620328876
422.99943959060585
975.7721985879698
339.99103858204563
398.1103199670307
205.72930750577737
320.43176394141176
304.77294811586165
241.7826909582993
215.36287187217303
185.48408264541519
228.42453837869655
391.385610442381
387.98075286406737
766.7046014216727
361.4222744052727
351.0588630205857
354.6499486436106
315.41064774705865
248.25797472975344
77.04745061166041
410.8212375620542
394.5699252378053
341.7701695170329
247.834684030199
315.7810185103835
276.31432134366435
240.77387790549733
242.6937507212241
417.1095391563504
230.12739725981683
584.7879070858507
574.853605040516
327.76762672157406
267.26916462920707
429.9923483140935
429.9923483140935
99.28410186774259
144.07200505441205
228.53703890776825
203.6971840791343
199.99365974418905
306.2625409728493
391.02405213791724
398.93628830409307
648.8829367366815
421.3451808242665
303.9706728384766
342.23602546846735
440.3329076525027
443.0794575557055
585.2162833787444
275.0979381412522
257.8796978361736
781.0307929358187
326.44103097623383
271.5053341431112
332.1473555209468
483.68524308798254
312.7125202375889
329.019436576741
193.52233622312468
375.8751214448457
256.0553957111853
328.6293936630102
222.5297713608967
298.6606364668576
662.1853660210575
467.289090469404
191.8321649481596
504.2175077950235
473.5928006910662
479.14622515943086
695.7629765495914
360.1570701367807
453.0776535647186
340.12818511514536
944.7193567200284
880.8419898074094
483.7244133461553
623.7668941051237
295.83492473713625
1530.686115750023
771.6180681048149
840.3768290382296
674.7948624162519
316.4233407831437
431.1460036469
408.2576736725353
