-1.435692793755452
-1.6243370642843145
-2.522884380018478
-1.9118312320546642
-2.34395213448625
-2.128385741026182
-2.453449145953211
-1.264850169740644
-2.026251164015955
-1.6564816720693998
-2.439588954651525
-2.4523660170885937
-2.3781941001375997
-2.1207165544675637
-2.294876782555002
-2.278879219588392
-1.6844798648405293
-1.814828438196416
-1.8502501767804491
-1.7340780667298796
-1.593821634954202
-1.4127941314317298
-1.6330258982624464
-2.2009308176230067
-2.1245184011232134
-1.7857301031330524
-1.9849332778676876
-2.0492623367707674
-1.8212864395153159
-1.460035118183715
-1.7682649563193409
-1.8753745964382842
-1.4161739112656742
-1.8535178418200713
-1.9423062411673502
-2.1154106978608334
-2.302633437786472
-2.841088483048473
-1.8917990799969129
-1.6635657345304318
-1.8895826680827912
-2.215252740137101
-1.879037726069039
-0.6434747354694469
-2.2172634106565607
-2.5657733954683373
-2.162863501065397
-2.121716654341012
-2.517153577546879
-2.5769106786175393
-2.6232110620503977
-2.1408685469117925
-2.318007593221705
-2.1001454908305583
-2.6520837236094965
-2.9187580652455445
-2.5869379832176356
-2.342334274808341
-2.3352368412252225
-2.3397393333476115
-2.273079598376464
-2.094483767218103
-2.713856572491451
-2.0639036286067536
-2.7387465363070986
-2.485967414679907
-1.7283952107507097
-1.7835181828068896
-2.2880621462708564
-2.2537322155056616
-2.2192898963302397
-2.1238153706183174
-2.7721702990176817
-2.0068392416880023
-2.080608633489319
-1.952033428106977
-1.9004305269032675
-1.8651009035043238
-1.8131243260365713
-2.0795322452885068
-2.253225062560442
-2.253225062560442
-2.667980980645861
-2.017276155965092
-2.6755717949206335
-2.325001804136786
-2.864342778640848
-2.3414498418687124
-2.2072474552735417
-2.3559574329514774
-1.9178511481458127
-2.489810374212517
-2.5430635035677205
-2.0181686802377836
-2.3038317465466336
-2.3920131106038625
-2.0673053860266335
-2.577673466147863
-2.4289020886728596
-2.9332099030201575
-3.4080833960201433
-1.4826104712276842
-2.3004980002336852
-2.1458081365849764
-2.292175544160639
-2.3177380952726128
-2.4555853964618244
-2.667115148264479
-2.473981021346536
-1.7891114447576124
-1.845869418511196
-1.5835729060962151
-1.7859611056379086
-1.8896302523669133
-2.277028992459401
-1.8152368871271911
-2.030702601191753
-2.3863413223000562
-1.8672486644256499
-1.9509109855461546
-2.529362937702086
-2.4454725361109126
-2.3565921230058735
-1.815892796851489
-2.2994741257201357
-2.1355118647908005
-2.454279475092414
-2.2657279506785213
-1.5711384602885183
-2.3362626941335254
-2.355438950322897
-1.867475032241705
-1.84643436561962
-1.5595750852515278
