-0.1382994143786564
0.18758400658476376
1.537205550691591
0.48461967035917697
1.0842679321650837
0.6270040026819226
1.0813570857041668
-0.44917790334603963
0.7181376912439871
0.007719587299454476
1.4854823930940741
1.3674465381558103
1.3964052951480408
1.1183998658051701
1.1397518673126277
0.9811035602280122
0.18394118994366743
0.5403963805726687
0.4411613812545136
0.0942826620477019
0.01799567825322773
-0.1518725185429905
0.0454310345950453
0.8485601397738612
0.8992000309666086
0.5568126701266244
0.7420700086076075
0.8172083487235375
0.5913731711054576
-0.2642710128102339
0.44824001480637155
0.7116481292772816
-0.2228627146532406
0.5589257479057266
0.6721771540557212
0.9285415394999176
1.1590026943297957
1.8546386161650754
0.6228589203694891
0.2231107986389406
0.49683982225362167
1.0490910615770017
0.4254799875786564
-1.9493868217610135
0.7611403067080863
1.3713518860225569
0.9048162561079152
0.8325902842788362
1.3519744946860968
1.339292892667266
1.565750829932716
0.740557930027735
1.0420921462536992
0.9326030548142602
1.7443321286838058
1.9919559086244416
1.209295634688319
1.4159652896893673
1.1033007252285714
1.1286574737160322
0.9417234794324515
0.9178549512676777
1.9020785055296643
0.8437896066420495
1.9585975837641998
1.0987650448105997
0.38079737183745843
0.4877071978041603
1.3724426403911807
1.0265272576341713
0.9578564247571372
0.8795966653107741
1.6180229066836056
0.3386023808242017
0.4478747270129273
0.871472817754086
0.49632137386750935
0.7970543603277885
0.4018594774773398
0.6630364150561459
1.4269862808677205
1.4269862808677205
1.7596672441922232
0.48429929103426345
1.6309896897038798
1.064064929719287
1.3136049481969707
1.6696263909228253
1.0974142745219198
1.236857158397127
0.5294281088903127
1.6125537648500832
1.3725583729969992
0.5361790903376806
1.3516295990182738
1.0490066737444264
0.4623943837955468
1.7663026033362768
1.3076675910746274
2.0946056826157755
2.870146133897989
0.11387851728358442
1.1096844177954732
1.0830627063236054
1.2337693275509145
1.2044052829528966
1.363886673050636
1.8441752187058547
1.3949232918830115
0.3003807432129208
0.3334269230789083
-0.21576567722278797
0.5819538896842037
0.6629887656021829
0.9669317908496745
0.15116166694267547
0.6537800603369968
1.0146092008826464
0.5834744578684544
0.5188071173850021
1.589071916298087
1.0789528862404936
1.2221860757830378
-0.05402067378320073
1.007566489792765
0.9670978158104487
1.3547365347293832
1.0653813214416799
-0.10127805452990783
0.9979993996795281
1.0541300093393327
0.4156396657325745
0.2633551659111769
0.20982223150496085
