7.58884974461239
7.005817139177095
7.375424175753112
8.076485424186716
7.0222764197410115
6.617320359575989
8.647396745814595
7.655496228745781
8.063419468348247
7.430610917621667
8.861910216342208
8.763621148211964
6.596540138996443
8.800299461681561
7.569886553668319
6.615269007224471
7.176280688336132
7.19781671464293
7.938531549967464
7.808745849583249
6.728302610314485
6.168905148923711
7.013482437058186
7.966309120488143
7.58117521370143
7.34483785507279
7.682356763162326
7.3042002978584755
6.874901094720571
6.456585010973762
4.971196186901963
7.051593510607528
6.594994177938807
6.7739882550592645
7.0931125785602775
6.819292563397423
7.249116530150446
7.283867199007004
6.5434150408657406
6.606016321664057
8.099438269992284
7.9064276550593995
7.302182213709723
7.31481447909491
7.206195346129486
6.546579618030868
7.087631010452311
8.723867889000378
7.91656867063356
7.311088621595913
6.386481841254712
6.958205443510572
6.443944338229029
6.220813645903974
6.3998264298604735
7.283570082828723
7.762790210263732
7.972742833035221
7.851851888080353
8.383733106160586
7.315358765048151
7.352590061499487
6.713792291907983
6.932571943220077
8.144805509001353
