3.106720541907256
3.161977738548896
3.360508670008416
3.221486463313643
3.1295137426956714
2.8424302672175488
2.7618161907137373
3.094950384975033
3.0706096847193702
3.307719474815294
3.2577142673447876
3.274925052958794
3.3310133406792017
3.673922714005416
3.2915825764026234
3.6426533006650015
3.408331114210923
2.9902689106192835
3.307719474815294
3.4696074682944396
3.4696074682944396
3.408331114210923
3.323365631139687
3.2488903651533256
3.161977738548896
3.457939440185262
3.5343621557707294
3.61350165731542
3.4866105252543336
3.3156021271887375
3.395122939991406
3.5084078011448914
3.1825683883762106
3.3676231683310407
3.421201434589451
3.3310133406792017
3.094950384975033
2.9756537473746847
3.6262132991203737
3.587022873126257
3.4810074578968417
3.7755582690574148
3.3156021271887375
3.0829172051292235
3.274925052958794
3.0706096847193702
3.151374781800324
3.360508670008416
3.5393919626980233
3.4337498497966963
3.192570766659985
3.408331114210923
3.5292800717280857
3.3385484728262553
3.2307816038529884
3.3156021271887375
3.118238320211098
3.4810074578968417
3.3532932313200976
3.4866105252543336
3.2915825764026234
3.274925052958794
3.5778634598454113
3.3746393587055286
3.5778634598454113
3.0319165538460915
3.2833208642807663
3.3385484728262553
3.2663909744149686
3.360508670008416
3.4148074827711885
3.118238320211098
3.0829172051292235
3.192570766659985
3.151374781800324
3.2120235333335434
3.0829172051292235
3.3883868516806053
3.395122939991406
3.6345040205521966
3.202387004466886
3.2120235333335434
3.161977738548896
3.2120235333335434
3.61350165731542
3.5685273886554265
3.2915825764026234
3.221486463313643
3.3310133406792017
3.0319165538460915
3.161977738548896
3.2915825764026234
3.018382882852663
2.7397596727566578
3.2915825764026234
3.360508670008416
3.3676231683310407
3.554177638108485
3.161977738548896
3.3532932313200976
3.3676231683310407
2.896170452394385
3.1405562577066592
3.439908028163986
3.004505938946463
3.161977738548896
3.192570766659985
2.9756537473746847
3.7308611023764553
3.323365631139687
3.2997141752106467
3.3385484728262553
3.106720541907256
2.8788202902206117
3.221486463313643
3.2663909744149686
3.1825683883762106
3.094950384975033
3.323365631139687
3.221486463313643
3.3385484728262553
3.2663909744149686
3.3156021271887375
3.4337498497966963
3.3532932313200976
3.5778634598454113
3.106720541907256
3.452001146929051
2.8788202902206117
3.118238320211098
3.094950384975033
3.161977738548896
3.2307816038529884
3.1723730938891994
