3.410098288646224
3.5627804510179035
4.89703194730252
3.391294726222945
3.5205966571427267
2.909599317730787
3.194672862655604
2.8709332164268377
3.6866277925668385
3.7534539654257113
3.807111922760549
3.602776227349537
3.8704287517790164
4.701503821568856
4.559301789892152
3.991245451957836
4.032232835675645
3.022635742719758
3.646681235728776
3.5212040830412095
3.897526949202057
3.782337921968873
3.508566997429298
3.75541137755835
3.989118234098049
4.076483921064397
4.423800441207952
4.916897492575179
4.0674083434725405
3.612990913682227
3.83864769613857
4.370540016678681
3.4160897617201034
4.132565748183251
4.697661577918955
4.467008239119746
4.110704994288481
3.406217698387017
4.695443581201847
3.942057541882343
3.874747916169264
4.8027510521015255
3.8195253510981835
2.1266002379996873
3.8414657021615572
3.7561569564818376
3.9219702373718737
4.313375966842223
4.173861487606305
4.261753572090769
3.639644273789328
4.40324751373659
3.977440851042026
3.885775969805223
3.793499749331851
4.126772529686393
2.896290458718487
4.293004758085233
3.9222735108846405
3.891599444510449
3.5519770597032556
3.7037109870895217
4.8758667796229505
4.221229298728751
4.716975828857822
3.2294459718002293
3.861796728675225
3.8945931014906785
4.253504946534422
3.963221848765809
3.877141087625464
3.3734404174112003
3.9342782255459636
2.8903946237987483
2.6584372372777585
3.2404222475311566
3.120413456372721
3.463240982093331
3.76237732717621
3.331061570401783
4.250322494406126
3.649922304637838
3.7987499377894998
3.4933518036471938
4.669513470840856
4.235511959047132
3.091738215935075
4.137800992732818
4.191285443265004
3.4602961645647485
3.9140973600901385
3.67742545319405
3.817011179054746
2.9150317660178837
3.740982556816429
3.334992337354429
3.0911225854243067
4.126281681374047
3.728479949575712
4.161868996852336
4.490393315783782
2.7718247325714556
3.4125320043846656
3.7122288781950425
3.1312286575541717
3.612242046952223
4.146383473863965
3.137755715794038
4.862238534533154
3.7413751927908514
3.477856464477165
3.444764619421153
3.309611059446567
2.589944217099124
3.364330645333887
3.5059330046164443
3.894310030673792
3.4980070445946523
3.7687785585763085
3.4929317007941836
4.42639700121667
3.5921039558501
3.91586166809249
2.9915097666343335
3.8346001343743947
4.833146767950004
3.458984517269727
4.0954340707025985
3.206952163472785
3.9717198495345274
3.799102009281455
3.633656888374351
3.627503311832509
3.6632884802188936
