2.5113631440811437
2.3550264288288503
2.5652691275059385
2.1844320826204306
2.163317662677802
2.5502575361860504
2.623001634128802
2.587349100205642
2.406490990535663
2.532147265415526
2.557051404249445
2.4939067378473143
2.365388715131176
2.240761974690561
2.554628116688424
2.532862774883558
2.2321743490977237
2.3129254016995073
2.4500631504741914
2.427650947848694
2.530169662659338
2.1678232548693983
2.500734799737312
2.4502851202372176
2.655440558187026
2.4829829669376093
2.523454127700516
2.4879741266426043
2.1035885082588655
2.321777019116116
2.1231098231477703
2.284497644880278
2.4400228048049084
2.2497799905952194
2.4289279623983155
2.3719185570685473
2.2037748393141636
2.4534788141687933
2.3390334857031445
2.38235137901928
2.6969642188125262
2.1246625523887497
2.3895719826743935
2.249841343939743
2.3184223225729492
2.390432841109996
2.5141273647485165
2.6807821543327797
2.480186984701935
2.231525375619296
2.325752944538117
2.5778777270657827
2.3437948048987605
2.1032659013904658
2.3699329219127034
2.2432229136699604
2.502241305591878
2.532317840798739
2.7359264909377674
2.727454911943964
2.379427643527126
2.5962265819288417
2.2554725290655235
2.3613825817019696
2.4842241392626
