1.8689744287703232
1.8549534295622343
2.1080818903260856
1.8199331046299168
1.880342260207332
1.9031825406307594
1.9034777665096152
1.9167647822708394
1.9017828556957086
1.9350255073400726
1.912529016384017
1.8889298987249599
1.962624988835473
1.883388709512135
2.026139963125098
1.8654751861084014
1.965843215966849
1.9785354148915901
1.7432324188584623
1.9701460306087704
2.0761095970578167
2.0244351299409837
2.0109245616928426
2.032920159604073
2.011714815554208
1.9077514537159797
1.985864141157162
2.1267439330636213
2.044487201889401
2.086235917722
1.8356425569727604
1.9616442771628633
2.0285930300970634
1.9917794558959787
2.0297376108817766
1.9120998015083164
1.7734896854874422
1.917408989383616
1.9968817088477546
1.898122414931206
1.898122414931206
1.7916469485520548
2.031180328641229
2.0152547697031307
2.0322993107090204
1.8889016265403713
1.9501503738258903
1.8327928896685868
1.9504466201380652
1.9031825406307594
1.839502812034635
2.1205318250757568
1.9917794558959787
1.9077514537159797
1.854496313455314
1.8199331046299168
1.883388709512135
2.018605688290016
1.758958650582427
2.0011198760857787
1.883388709512135
2.065803559984442
1.8889016265403713
2.0512675872102624
1.880342260207332
