10509023357.391356
10341878562.927246
688664578079.2236
11001036483.764648
13609346923.828123
11340094619.750977
34418858127.593994
27381646842.956543
75470749969.48242
13513257957.458496
49589499881.74439
24637291053.771973
62339780834.198
35080677040.1001
107579072055.81664
10734541637.420654
30114075874.328613
39422893180.84717
3174955410.003662
45204352260.5896
170156955253.60107
87374851295.47119
114333211326.59912
129874483520.5078
38135022239.68507
16563101234.436037
100618034408.56934
699294112152.0996
124253072822.5708
342440553955.0781
2266919837.95166
51215606872.558586
77441620399.4751
74755580383.30078
44803440032.95898
22581812335.968014
2995618194.580078
20756748950.95825
91567528129.57764
15345053558.34961
33193038585.662838
6443932399.749756
167856013229.37012
127780811004.63867
123611928085.32715
14606922786.712646
39723917781.829834
22782414619.4458
88045346248.62671
34542039276.12305
6337570186.61499
837745098403.9307
23103296081.54297
11846313926.696777
5952485137.939453
7518572788.238525
13565015235.900879
168759427711.48682
9143736911.773682
102607273395.53833
11613439716.339113
133263599235.53467
16172837677.001953
34171279197.692867
26785688426.97144
