0.9100346020761244
0.9216589861751152
0.8723832052040212
0.918032786885246
0.9171597633136096
0.8929188255613126
0.9557344064386318
0.8913043478260869
0.9178470254957508
0.9258312020460358
0.9506172839506172
0.9616306954436452
0.881511746680286
0.9447236180904522
0.9028046421663444
0.902439024390244
0.902116402116402
0.8817966903073287
0.9782608695652174
0.9263285024154588
0.8524390243902439
0.8160237388724035
0.8941093969144459
0.9258823529411764
0.9171483622350676
0.949748743718593
0.9200561009817672
0.8477574938021185
0.900459418070444
0.8151888507372248
0.8235294117647058
0.8878143133462283
0.8120481927710843
0.8480325644504749
0.8824306472919419
0.9168443496801706
0.9545454545454546
0.93
0.8977635782747604
0.8609865470852018
0.9208144796380091
0.8014184397163121
0.8804809052333805
0.9096431283219438
0.9068364611260054
0.8981288981288982
0.868448098663926
0.9559471365638766
0.8726207906295754
0.9237918215613384
0.8605769230769231
0.8616610633794048
0.8902439024390244
0.8828828828828829
0.905940594059406
0.9705882352941176
0.9526315789473684
0.9322709163346612
0.941747572815534
0.9347826086956522
0.8997867803837953
0.8863499699338545
0.8975609756097561
0.9065693430656936
0.9873417721518988
