15.87274956312729
14.059382940219376
14.083880498589213
8.967294221131864
10.088993209069988
17.339243905549743
24.662330698479323
21.33043662190068
11.770486546356171
20.247017206068488
18.567203810133453
18.392865418484565
19.650060854634614
11.813409049361855
16.050872539730033
14.692084726406074
13.499817765736596
10.37965662619234
14.274235158879366
23.710747614589273
15.585480603774695
13.803511558082686
18.439594645486817
19.623206182910906
23.40178851060902
19.956325857675377
17.610565287849052
17.058302320925783
11.46799716169133
20.470361292727198
7.828954335418569
15.740296971590974
14.705632784032982
16.103095703248727
13.98805881648382
21.32005688381884
15.125841633252065
17.416441733936672
11.945136821038716
17.038518230265552
18.952650346973073
8.945161973001941
16.004259995998574
13.996558322119995
14.036258787399097
19.757607295562963
20.940592944915064
21.201572855569772
19.397123910746068
17.27489877310967
20.996417543980893
19.14976344013369
11.679388727868064
8.576064588029206
11.740946217640321
9.402743458447722
21.73406910411632
20.890198503822642
27.039757129321707
18.759941173961888
15.382397269204313
31.69584801117838
10.448588331119748
15.676575350975606
17.122914331041688
