19.8445022057607
20.99014102307764
19.65337664323407
16.289202508862186
14.187894907040997
7.227391728215227
4.633342232648591
18.050191647078993
17.58035617021469
20.045625097368312
20.572986292042426
20.93952877514492
22.164673977737937
29.96109627536667
20.46050068667901
29.06747206954057
23.06987741523123
14.516360742636644
14.148557681156726
17.863710718483976
17.863710718483976
16.449476990119624
15.067485115711847
13.383894035976484
11.410900696130923
18.180242027388864
23.227803457464773
25.2514309471771
23.348084165865878
19.397644186831002
21.179466802299874
23.885897307355336
16.58873531959193
18.94255799016231
20.149466001520565
18.138459928783362
12.805416255948895
9.859724939895317
22.79729687021119
21.845554637080873
19.39921100447491
26.70500046725239
15.88282219281954
12.076001075192952
20.388105406035102
15.938367979011778
17.65035577208468
23.656429957634714
25.792920765161405
23.16023951396327
17.82017576959974
22.556989829727257
25.531563268906197
20.055139415253148
17.692699508532595
19.540505786623537
15.347680390000356
26.072555353181404
22.88598245451393
26.219396842417822
21.444845923920667
21.06552934992797
22.01968354673707
16.861813607603278
22.01968354673707
8.282104373434334
18.30900733641029
19.485169989626332
17.955780453601353
19.963766942506457
21.176412576829758
12.768776114877157
12.007421081125942
14.36846581682834
13.481307560621989
14.788951822397646
18.989678615504204
25.58020493650499
21.24107729141708
27.200303770154985
16.151676581112476
16.356032914522526
15.397087042742694
16.551187500174443
25.30859124840105
24.15220821302915
17.37539351283854
15.037027309719264
17.557136476661956
18.284966689899203
20.967619407500532
21.759050440580122
15.734372918626937
9.949943412876184
19.065264790076686
20.65827057223833
20.82618160005243
22.074417386663228
14.12500168647035
19.528549413578883
19.876508386225893
8.794480620720107
14.564125737049832
18.7886487021689
14.776270145762735
17.94728163049648
16.676139834087444
11.774715454059313
27.278563047166113
17.156686686069783
16.638997138830728
17.49169367917638
21.263525466949766
16.782111205660335
14.772103682028844
20.03789988582199
18.307669374428347
16.584656009993747
21.267457431557684
17.439929536408982
20.16770643734257
18.568457378599902
23.0172646745095
25.808412517592508
23.880325056495767
29.617283954114118
17.56702561255899
33.39549547766825
19.699725097708576
24.72491244023894
24.19965238564805
17.143102570411685
18.566852653452003
17.355106584823968
