22.89777853628715
21.613813666089296
68.9389871692854
17.99368937370499
21.995595922698197
25.43056020682797
26.201745215384012
22.105004621976647
31.02564151958923
30.58640418555669
29.2909370027742
23.95782121414597
34.427955962556176
24.767375136217886
35.36583074829585
24.47341084876682
24.60668935270309
27.21921191634942
10.864543192431443
29.800289124629227
42.920067409437095
43.61475147986783
48.023376913598774
30.864906615614125
24.55600957380392
24.112994008274995
37.184673215020865
74.51685363240934
39.680203974947574
64.99715506620636
12.372859760517088
28.482395956870675
42.11543022139644
45.4312972119612
29.457370845073143
24.424205938028607
13.72685118101346
23.418398652145672
37.5693818444249
24.939371343218713
25.3000721835459
17.169360973369272
44.93737344261459
48.46165468787627
38.99824497950613
24.508906209181283
30.088483312180887
21.36847878272472
35.8249185744892
26.96772564299645
21.740169643463773
80.60984350616728
25.801482137398683
23.441235275106273
18.498383987414574
16.98501961182271
23.83331137264793
35.52208840812902
16.79345726260827
22.64568336957303
24.478059569735237
38.98145907691515
25.159201445338397
27.59798756098801
20.954160004674943
