2.154397045029203
2.06139905297234
1.7277338856111961
1.7585075535863084
1.5596145635698153
1.636501782255967
1.736811460169222
2.090860035516901
2.012482584185824
1.9783576744078282
1.8355377344004153
1.8392555394493426
1.8302899740177478
1.953787739543751
1.8659427488518476
2.070108542150295
2.0371852632882503
1.8372855006432132
1.8193291839547197
1.8396957981248898
1.8775767787028537
1.952064245189661
1.7331891240910664
1.6596885862181736
1.7434263167253612
1.8032258689156304
2.0561077667514045
2.0024876384951296
2.0293171258123923
1.9311064658443295
1.7058364482583495
1.9402630322033045
1.9001400613962192
1.8859546082786995
1.8752422513655407
1.8370996257758887
1.8069706663713034
1.656789642709178
1.8476569413681865
1.8094509569644142
1.6479564102927382
1.7748223477527079
1.7922149844078534
2.028039548529514
1.938417615337832
1.8498197105458867
1.8900379911801406
2.1145731178629705
1.8151372485998098
1.8859164019708161
1.6805107547906941
1.8068248839951617
1.786482146942639
1.6949912257994721
1.594521187940706
1.604904206419589
1.5658347276439202
1.8522552658563123
1.8537340910592996
2.037411488838073
1.8296340923104388
1.8348857245537005
1.760549496076716
1.7364492885375316
1.7299059630722033
1.3544631670588811
1.857655295836545
1.8667637188957251
1.7340292426416628
1.6834798694228639
1.7850575737637202
1.6306939008248398
1.751624091239798
1.781477487221419
1.9101360064237647
1.7087967890186746
1.9998964161125277
1.969599724699264
1.8032538536254474
1.691190084453341
1.9332453293291814
1.9332453293291814
1.4348655152607634
1.5904333974040081
1.6878314101027714
1.673497862643536
1.6837149985940698
1.7497946842736738
1.8347414522381071
1.86886108212742
1.9853379260859059
1.8244063958849719
1.7529961626155892
1.8656360599891648
1.9154035845197606
1.927217300819164
2.0324617328872634
1.722421423672224
1.7329663822557086
2.0223691214099913
1.7345337805610708
1.774803017956979
1.8225044542688524
1.7062419302404443
1.7821268558680594
1.8429706315768517
1.6622200102371187
1.7987969705764129
1.7329443099645765
1.8482355503167462
1.7323608223366294
1.7864957513955788
2.033572929312769
1.91805300462902
1.641549572564852
1.9716300442528756
1.9027774885139508
1.902082595997052
2.058360657612505
1.8446802969030742
1.8963588657667219
1.8055210308365486
2.064495561936607
2.066616278866248
1.9395699163000362
1.9744114694593362
1.775877596818183
2.198017153669465
2.068652953099647
2.071503797203543
1.9922090662839793
1.8152857861850822
1.9099714782197046
1.8752299721778627
