0.112453936696052
0.06754566422123064
2.4496693681097708
0.12957275115428282
0.1774403031125041
0.06479437926210863
0.16184357508062697
0.05164703877017037
0.17222575621273434
0.1342752939743059
0.19929650412135216
0.11090824437275708
0.15259252564616335
0.6056374969532917
1.1004208422323445
0.1763542486092663
0.19100834591602964
0.15835478357918334
0.19655464291082134
0.08641480413964163
0.12588488560454958
0.11344306742844636
0.14889256774325368
0.14421176852655246
0.4052903227907769
0.2098250966439141
0.08571592955218361
0.5533230963073926
0.08471739359080922
0.15922762884565714
0.11095939666056312
0.3394758223407557
0.15498803869056568
0.05245923755345026
0.3469246437876271
0.195531868466969
0.320671520850845
0.18181153171954945
0.2788198638237893
0.1449854177899749
0.14534016059431826
0.7952973496333698
0.08887108680159637
0.03165967705154692
0.2823398762545154
0.4576044693815042
0.3445926174004794
0.17206214812514553
0.4109081086247538
0.4149600786081044
0.22369737734569525
0.36392749895687576
0.22836510765281784
0.2001223398899381
0.1253894172376199
0.4375543333311253
0.1362837968895649
0.385416100683145
0.31273046345794275
0.12733658406177795
0.13568859396437044
0.4175792878493813
1.0662530503116048
0.5271316248445388
0.9489447389074837
0.19126708844879256
0.2503618628523573
0.2832951747887246
0.38230669185461297
0.518171628540925
0.2929791032477058
0.08538307850986139
0.17868630754552586
0.06893585790598529
0.0735762614486189
0.10614387777018422
0.10954275936524382
0.10999156915216912
0.3426109354967013
0.1491187272711891
0.4638239894000261
0.20057853014113194
0.5997700625867299
0.16331956181856178
1.5583972470863767
0.6043246547559045
0.12415457152110118
0.5483069999763153
0.3182541919327575
0.24268136994226205
0.3239141364557985
0.27733783615929314
0.4779824107731931
0.13349148920811935
0.2797342225082026
0.20723350408521465
0.10717150877212572
0.3183841156194828
0.3727765879660205
0.20812547644907956
0.6745130876075458
0.09682306051417974
0.3081403912229361
0.2340035526023003
0.20952242782591984
0.3169026969604985
0.5733441583151015
0.13777699073412975
1.5709749841523222
0.1368486884512778
0.1676155528850631
0.07281012766630501
0.08786307352048398
0.093532233737873
0.10123545719881287
0.12388512072314932
0.2801767327374773
0.11630802455696028
0.149939485465704
0.06484972849831441
0.4709449949158019
0.15150871215431835
0.21210795774866092
0.05753440233968143
0.460879669627934
0.8940987493438101
0.33217839126677684
0.4005846879579224
0.14433803225445446
0.5716892362915387
0.3326706029058355
0.10970234285263944
0.07184719183645483
0.1608505126705607
