-0.3743164652245795
-0.3741275822683735
-0.375457901810431
-0.37285775464141124
-0.3730443793389936
-0.3763866986759329
-0.37223561814221023
-0.37452642934512353
-0.37136246533042866
-0.37490125868744795
-0.3774234405633139
-0.3715340174576258
-0.3726235306343384
-0.38287481366298387
-0.377275438660392
-0.38006223765694935
-0.37917837913867175
-0.37602914569299145
-0.3772626835524777
-0.37755078861991753
-0.37887576287367225
-0.376848713376224
-0.3724371745011369
-0.37861081270580393
-0.376786041545386
-0.373656352060446
-0.37475159899218874
-0.3773065653038329
-0.3745420428756582
-0.3730572449252536
-0.3732913544394959
-0.3750417660257288
-0.3703012912361811
-0.37619947723772074
-0.37518193067342376
-0.37663786188214304
-0.37826887951408067
-0.37510856976126644
-0.3761353148840136
-0.37360544895324443
-0.3743616095342811
-0.3747897615946587
-0.37981317126102654
-0.37646559965973425
-0.37931557086756923
-0.3810492767144599
-0.37742085953917553
-0.37538899571882284
-0.3784653490306198
-0.37977935211754366
-0.37559055669100394
-0.37474996074978245
-0.37672882994320933
-0.37356515152733866
-0.3767715216988497
-0.37677539084155937
-0.3708928731850179
-0.3761557533372324
-0.3763766987387366
-0.377416044639891
-0.3777448269463707
-0.3751133717640562
-0.37602502237322005
-0.37068403926970767
-0.3782440317580205
-0.3702766081874629
-0.3716720715486437
-0.37178402191582904
-0.37214834425335
-0.3714928746619565
-0.3739335553023453
-0.3785308544838629
-0.37531691247003124
-0.3778429393845801
-0.3773580019639292
-0.371535948160228
-0.3761508401645
-0.3802970725821368
-0.37160922800268986
-0.3738915804366992
-0.3756493995216411
-0.37625466723443124
-0.37109705502927354
-0.37307597670474524
-0.3772464907859248
-0.37575868220326697
-0.38289739187478194
-0.37340176523485136
-0.37344508380110186
-0.36946076172411785
-0.3723752814981107
-0.3763329434480037
-0.3743665557841875
-0.37052594159709973
-0.3773739104949581
-0.37709176662700794
-0.37641633776508526
-0.37885920924682326
-0.37238926069063777
-0.3752784126744561
-0.379667403541566
-0.3732002835617751
-0.37248811526665954
-0.3711641671087922
-0.3735758763883318
-0.3777780386304521
-0.37612832723592227
-0.3699137740986574
-0.37782752728330143
-0.37720858680982106
-0.3742738350544754
-0.37837665222317685
-0.3779975020848355
-0.3743771254721112
-0.37388876292647977
-0.3786914282860126
-0.37238611559772133
-0.37582014461682106
-0.3779980900799714
-0.37711932269290505
-0.38027134434572385
-0.3770798447171547
-0.3765417274667889
-0.3813988791330016
-0.37714747415161753
-0.37416377960735964
-0.3736525488490017
-0.37312202033371206
-0.37253825230318305
-0.3738238075947673
-0.373551562106507
-0.3781926517950876
-0.3799022317809183
-0.3740903929694244
