6.802849244036267
6.794456203874038
9.292591772424217
9.540071664096235
7.935061705708883
6.449599535446232
9.672725363267201
7.411395007419849
8.903350251990316
7.3362587363593565
9.59498591169884
8.846739442531653
7.877510673854612
8.553876399969058
10.950905935561238
8.182330082835291
7.444125365369431
6.616260397117907
7.251520997018913
8.260248645572634
7.107192960848762
7.610854671361887
7.326836215013081
9.125614549930795
7.715103833905028
7.258121264365277
8.259207696028472
10.37810585918808
8.645960657274639
7.61924745763831
4.408948819644664
7.567588824462769
9.19097986770865
7.684073640268224
8.915277083158365
7.3204319484250755
8.312808180641975
7.387625616005352
6.612143349993549
5.946591960175425
8.594258110806672
10.228976578547893
8.742058058269983
8.521538937748455
8.962211686954824
5.603286112343707
8.083196373337138
9.697155464884233
7.606420754133222
8.466205321725578
6.090712604556791
9.86810392232578
6.903042081631415
6.290123920977805
5.952213019300854
6.572762082340221
7.013806195721613
9.33196367154827
6.82230841490224
8.659694830019424
7.469913460745146
7.753462372439318
5.999222946698352
7.815527055346157
8.857693911084144
