-3.7964441851648063
-3.988812926651745
-3.2588349993693737
-2.9919533048057456
-2.889400024251414
-2.919529789738161
-3.1246271179524268
-3.7141428793161433
-3.5677441907766507
-3.5299267328606065
-3.404326156197975
-3.4645062309264603
-3.5333403513141137
-3.624475065187593
-3.4846359723506892
-3.4809541405261233
-3.6525635231324545
-3.118327310081743
-3.265491098174719
-3.382347481425832
-3.4716112836651987
-3.3141168979522133
-3.042379036171029
-2.8462741493532877
-3.1302052636002773
-3.3062216012303103
-3.827680414475967
-3.6345953588424553
-3.600948624262641
-3.3151865369220497
-3.3453859382726687
-3.553545283083498
-3.3235307552768236
-3.569572524583458
-3.3994030274075877
-3.271029324947351
-3.3227898217254346
-2.89408226531551
-3.633717291339746
-3.237355471750268
-3.0094965762967774
-3.3273209765737044
-3.237029919599894
-3.32995972291898
-3.3824338367242395
-3.347306074745892
-3.461152408597723
-3.9797004511337057
-3.3684035086656183
-3.3403987306189413
-3.1177156943391204
-3.2988054714032145
-3.145634501828981
-3.2557128883599455
-3.0944321145402958
-3.181429596059752
-2.9699375654062394
-3.46277007914507
-3.3836830340734414
-3.8550984346648405
-3.3902456492510824
-3.311725445499333
-3.3579036140674527
-3.0491362595879052
-3.178568978032166
-2.4932678172614895
-3.2880455405583633
-3.221802634535134
-3.171350487076965
-2.9978636402760377
-3.1928719891138737
-2.853773355742293
-3.30503703285459
-2.8809655002649532
-3.4140324400177815
-3.0766077166652477
-3.740587354181542
-3.6877545994537857
-3.2865321582933738
-3.164454671451535
-3.2443900766612397
-3.4042692930071605
-2.6872608526824955
-2.5877178198662265
-3.303318125370189
-3.281666859934235
-2.9243737570314634
-3.366114973967114
-3.4565206177438355
-3.527438404441309
-3.751137374941312
-3.5012355188316286
-3.2055627061885708
-3.3060392396477867
-3.4738227721442927
-3.506014452009525
-3.407673166052723
-3.197666559704569
-3.1285246332383254
-3.95866800430463
-3.411002895043196
-2.9012260089981963
-3.2392464197122735
-3.160448718535393
-3.326582893136977
-3.3142708386299318
-2.941509147843526
-2.9365658231721166
-3.326794619632922
-3.2949150900904214
-3.0959888704713485
-3.113221767451755
-3.5123962335481314
-3.6061198315499268
-3.0326246932841934
-3.499662362679433
-3.517901974214422
-3.5691151765913274
-3.455013705000404
-3.2922850107287647
-3.48575319128672
-3.465689347941072
-3.9742019556159454
-3.9910737836681145
-3.4920150314786413
-3.6971047232200545
-3.1481403214198265
-4.206668557729215
-3.840540964513144
-3.865542825110561
-3.69396268577764
-3.354530442318579
-3.525749566541758
-3.3304327572599366
