397.0
328.0
403.0
336.25
353.25
221.0
499.0
287.25
280.25
397.25
470.0
730.0
285.5
537.0
334.0
276.75
233.5
299.0
375.5
478.5
193.0
180.0
301.0
405.25
394.5
355.5
362.0
235.0
292.75
195.0
132.0
297.0
228.0
283.0
258.0
353.0
245.25
360.25
180.0
190.0
778.75
97.0
282.75
484.0
430.25
272.0
216.0
723.5
313.75
409.0
184.0
266.0
222.5
168.0
204.5
326.75
549.5
524.75
521.0
476.5
427.0
379.5
254.0
254.0
818.0
