0.033257578673510445
0.02670258451005237
0.03521732080295114
0.029606336096277736
0.04362869317381948
0.025026347892912974
0.019270685692948715
0.0197672419090188
0.024264529148039712
0.04263098964897684
0.03250646331483745
0.0208469959256139
0.031641639219023916
0.019657703450462062
0.025227043555029145
0.028280073145742844
0.01781832114759326
0.014345932542722612
0.017923636144437854
0.032414384269939624
0.017997369745450947
0.027334016496306644
0.021357114604387144
0.019859844172258837
0.014258276074616218
0.016151631325405928
0.016163457983869686
0.0358426779290076
0.03011301803472375
0.032671047767983935
0.020620174655245925
0.017520411665945982
0.016021053533948
0.02009930787663122
0.020002180572866728
0.03868066434719865
0.03882019687497898
0.022627790201307844
0.01982786887820749
0.02195995034934979
0.023889659731323582
0.02635056126756631
0.02173663347424647
0.030450356955837907
0.02740755438842294
0.03866969964995872
0.032888814546873486
0.04113844171652743
0.034143220346500205
0.03797057118239793
0.04095223210644376
0.022035140877416308
0.022315962243403917
0.02495468305362196
0.02740980465126733
0.04015273786700671
0.02861832561938055
0.04015200258538405
0.019075216188196967
0.03025850418978492
0.03995242192236654
0.02625959820010486
0.021414862581622358
0.0256069246628937
0.0267533960721437
