0.19964204041208847
0.22912102109700103
0.17865578125065815
0.25959707950243377
0.16125559862998232
0.14381183595687472
0.11832029408992364
0.18112922736530845
0.1693880115040823
0.19830637608926846
0.1563860303345405
0.1567935462007488
0.1930130045537552
0.23217763184255194
0.1837153702298247
0.2096864209355163
0.2704615023818874
0.18277535940691936
0.15305234487539393
0.2246856153453722
0.22090901559146567
0.2670969168474731
0.15566015033841293
0.14618669234087514
0.14222348662800055
0.1804065469361688
0.21731064419685267
0.20188270801390365
0.19894586939704406
0.19551259737818588
0.17623906565393732
0.21992691137304488
0.2029633771316746
0.257931428544816
0.24818257878634786
0.23298110491297744
0.15589999340615499
0.1158228269085412
0.1866979617160316
0.2266883535537677
0.22441038244478756
0.19807641363907388
0.24582144487865734
0.2097459878839409
0.14376455885403666
0.14958382877526755
0.16493446790879654
0.24454396105203086
0.16416331544344612
0.14501586424332716
0.17747565498502607
0.17494064808422347
0.19656152917943928
0.17482452897256628
0.132168192765971
0.1328160057527956
0.1333044889129259
0.2089321056645334
0.1828229387783432
0.24974145300422645
0.2376337372534341
0.2798780578703359
0.1381494700046577
0.1705363888888889
0.1395629935402012
0.1334727311455696
0.17274173236496626
0.17593702030612693
0.15122867331086945
0.17046122310131534
0.1733679099327744
0.12519265518707484
0.10940925345571187
0.17301038062283736
0.22416585681891804
0.15067703396941726
0.19071159490166031
0.2544879823462754
0.24364010625235735
0.1477305826313885
0.1532413707625037
0.16685978221862624
0.14329121466140696
0.14259951625907016
0.15117116769547326
0.17098166982784618
0.28064317044678083
0.17581889819720967
0.17185869570273313
0.1796693269859611
0.20767714699528506
0.1614373307712464
0.15417930090041831
0.12177138691084832
0.21733675240413816
0.1826182603958504
0.21573061224489795
0.15477196150211445
0.16543073642834286
0.13782666463755353
0.13721965068971054
0.21553576558460213
0.1698253012731127
0.13412614478448304
0.14891523694536027
0.1991230185587113
0.1843433759041496
0.12468139034844147
0.1796624318114778
0.22023526010111644
0.2064618019306151
0.20800426403465336
0.20578867770243015
0.15660975800767485
0.14111808255524622
0.2296989002948026
0.1857127588997604
0.2192292947319717
0.2516284585095821
0.17282267489752887
0.16333632902824585
0.18799906893069054
0.21294434713929894
0.3738038211498769
0.2931188709929647
0.22425282355274428
0.20810840563321464
0.20530581935163225
0.18931489354083408
0.17838765615802835
0.21257665822985572
0.17975288888888888
0.17552613581847318
0.1773467687149418
