27.122385408090572
28.636224226099692
100.75006260825964
23.3376090329382
27.206883348875593
30.530958600606947
30.46340846954543
31.00845501121612
36.72814323143185
32.970363705909435
34.140384291885056
27.10190733475404
37.59431751068555
28.49328894660398
44.30344724970439
25.172497650629893
36.060384913925795
32.98462743572343
13.55258261786725
34.74274536052054
51.2457943453794
46.67517720401376
49.40857439839868
47.709175406623075
36.73590567730201
31.23724338249652
44.54533784585415
86.23210977883669
47.313513922084645
89.04776181019011
18.613331241712874
41.725267790367276
47.70952184004162
46.53519587390278
39.46472608542045
30.592535997817816
16.84630924468219
24.30773408973728
45.772538023654135
26.158409069414848
27.65685042810237
18.74236674906223
56.98995768108821
50.666181110553524
61.66170721792414
27.676627884166965
34.804040881423475
22.511845893498613
42.544908977824825
31.775764686427024
24.30954642818181
95.02159933402943
30.94755569120367
26.657969291169
19.542625480674747
20.670344690667086
26.904804763304266
39.139210545033606
17.31446118055855
29.81223154452992
29.91721004849772
52.649095835902855
26.040322606352106
35.041930842158216
22.86858077322389
