0.757400158648223
0.7954860955172461
0.7663232991788476
0.7782522579044614
0.7122620671906877
0.8043827366217805
0.8394888776298013
0.8458833636547403
0.8246837530631543
0.7194029161192029
0.7727805840698669
0.8367357998900932
0.7754890474052242
0.840564281559046
0.8127060629362335
0.7928428114443056
0.8683050890395508
0.8759197059000162
0.8511921921921921
0.7769067919020143
0.8585610984911907
0.8031672868369472
0.8325622569185566
0.8434384423038064
0.8855176560121766
0.8792064938571622
0.8695823474831824
0.7832991212474937
0.7983386912398927
0.7877018076011207
0.8370390320802956
0.8621493085408591
0.8658302734716942
0.8425683338881937
0.8447054343964604
0.7600001943994192
0.7750578851332199
0.8206278911564625
0.8495462893625867
0.8311784389614578
0.8099290310061054
0.7883831777391809
0.8375447752731751
0.7987013582077066
0.8146995603640992
0.7519718730778976
0.7704791419623678
0.7244558056204656
0.7590254629876644
0.7359886079130328
0.7285030678413981
0.8361751877312112
0.8306870336187447
0.8123737054075287
0.7734677532186565
0.7345752715775156
0.7862574841040105
0.733789327891362
0.8500447232157469
0.8000131201321904
0.7518785925671191
0.8061052169604741
0.828802878708092
0.8059054305367788
0.7893060110949142
