2.5440481074206107
2.6080353787378288
4.494404507106203
2.9615582278176866
3.279163756126324
3.2052233288718592
2.8284588826260064
3.200263948183522
3.619302546325448
3.053418175039898
3.241547064456373
2.7915056660120974
3.8167955820225563
2.3273590800406274
3.980906179614199
2.9051412579481055
2.771502532954273
2.816761434034696
1.3886276262368695
3.661608414860866
3.406663348651653
3.764636252148472
3.505751325395917
3.250160896565136
2.5501113717446664
2.0529777679319845
3.020381895154407
4.564419082742921
3.665829568613793
4.390240984068204
1.9382012969976299
2.8889599585080643
3.265606067233066
3.2268219749319584
3.066385031994899
3.2818060630518238
2.601556890621262
2.8315169616707325
3.2585664483457712
2.312796455798189
2.954212356813477
2.700657451634147
3.4457632811238934
3.6761622129770775
3.677195174420612
3.3698184957353723
3.4984878814956684
2.6858574088058202
3.790748075414008
3.478454185464735
2.803022244796029
4.3311129787223575
2.7850174711319355
2.4438041113125193
2.6350157698252024
2.738199638452547
3.131804018191726
3.8918336655550267
1.84453150504134
3.2592602284285963
3.416042466965049
3.5494382296985907
2.708426200957548
3.2163635720226567
2.529858794610953
