30.586835475323877
30.19852753137935
140.41885525198646
31.62163058338316
28.779613336506596
19.924029065530434
30.481423896510954
19.652941208494244
39.30588241698849
40.22323305980268
42.50571717347727
45.43377661895749
40.51557622833789
60.927639677008074
66.80715381440261
40.00927817504199
41.27637540118761
21.776467891579838
35.671276353181405
30.19852753137935
33.04838136526898
33.81854408383358
32.52480953785329
49.826224663168794
43.380154965705614
46.806285083995476
135.15515630202356
118.22659437879534
49.132353021235616
37.546891458914935
41.972310884456256
69.4063930106375
35.91108595350956
41.250374532213065
78.67997462106905
64.88447633891631
59.754134924915455
32.425698663835924
90.32279302422656
48.89156035628507
41.041774588247755
120.73192067772396
58.04183424655943
15.081489464336428
53.07911405857453
47.171607972962754
56.372699428399976
54.69185948025724
62.0789651379407
63.95179673713791
41.66444136717156
61.610568881288344
55.16065542117989
48.69366251541405
48.69366251541405
61.050779250511845
30.79657623285445
72.15006067983252
63.665958433888854
59.484200696036
37.346334328072146
49.826224663168794
140.84607866087543
61.348803490347436
119.09458959479204
29.62463146897952
48.69366251541405
50.95466932888502
65.06611029642424
55.37419386162832
60.69828912627147
31.62163058338316
39.57789868976454
17.08286687942959
23.16121333131137
22.167108325812826
30.481423896510954
42.50571717347727
57.12890625
33.403576907201305
31.451529131226398
31.451529131226398
44.06721373972067
30.162978928672853
114.85720185886323
67.73219543963022
29.66082529001453
64.40316778412287
68.39424333942628
38.70071722741085
49.99818798596488
39.794172970330436
43.47897093649169
22.311835271085673
34.818938449232554
27.010384152225257
26.20392161132566
54.02076830445051
37.28883416413434
52.284868059301026
70.43446453225376
24.90234375
45.99702676203393
46.806285083995476
29.479411812741372
40.22323305980268
52.815692511679536
31.992670411877278
117.7901982010232
34.2911130196864
34.2911130196864
33.43568030423826
24.90234375
21.126277004671813
25.58239628404245
28.442120857833398
49.826224663168794
28.138729559031077
32.91826912242807
25.95709738281643
51.4366695295296
26.407846255839768
60.05859375
21.776467891579838
61.19120676036745
110.21428304283212
36.738094347610705
60.3970550627587
33.81854408383358
65.26367991194961
76.129608165154
25.58239628404245
25.202124805788944
28.8912347509512
