2.236573616552499
2.1891617004921557
2.2376021840730944
2.1983875094278855
2.115541515083482
1.922382177516307
1.922382177516307
2.061877930402587
2.1327448125433537
2.2604493709019975
2.1129007309695127
2.0127115181433695
2.2189327852305856
2.6729128475417547
2.2269254527289415
2.323787576915702
2.503130817682423
2.1848646946478985
1.990312752001197
2.1938284844694094
2.3605221457318244
2.316005354524768
2.120739715380973
2.120739715380973
2.1885606874487116
2.0798724835888076
2.3375989078265333
2.388195223207514
2.247152834855794
2.0804262191808722
2.175833251980755
2.303424819461283
2.0804262191808722
2.4047197530329916
2.3783534569615172
2.3639802100710736
2.1295182441372007
1.8380964103415156
2.176715571337085
2.2279632860297007
2.290235779504327
2.2279632860297007
2.290235779504327
2.13975362083612
2.141627211331255
2.268957674672692
2.2327120783714927
2.3300130127493386
2.0957680179157236
2.190091574862466
2.190091574862466
2.2276259499774294
2.2606012274458553
2.0715777770911266
2.009097611722625
2.009097611722625
1.9314832181414276
2.275757836700931
2.149172261725577
2.404550692031599
2.239724278605656
2.3355571142617206
2.134659070618756
2.134659070618756
2.173869639846443
1.8923759412301928
2.146377524352015
2.101503929796216
2.101503929796216
2.1015039297962166
2.048732179943736
2.032558084226935
1.7847718623204778
1.9682850302499484
2.170656444352719
2.0176538208423644
2.0049867516728703
2.369180503601842
2.2173536812132193
1.945593959035224
2.0968722735429237
2.1312722974736036
1.9718374864079022
1.9718374864079022
2.1551279436087354
2.198192106806232
2.2888349432089923
2.1152002450093574
2.1596116857561087
2.032058757578774
2.188011838425928
2.2055254819858074
2.0983209106536127
1.799915500825879
2.2959465128936456
2.1855271266713783
2.3033583751982207
2.0725052576638734
2.002277842198926
2.0377817164484404
2.149854882669978
2.0377817164484404
2.0377817164484404
1.9334330398742188
2.0159059797857797
2.148115166421843
2.238184028277551
1.8729685691226023
2.2720890109606624
2.316335804764629
2.1526524042347552
2.1127802530395945
2.1550351334010696
1.8693252985609794
1.9451953309113517
2.3053057944070843
2.195796593403815
2.195796593403815
2.3053057944070843
2.1692610656117357
2.274879724679474
2.242306607930192
2.2426775517602118
2.4215564401192755
2.3995100779469345
2.3376339710358263
2.2933972808902063
2.322348505739344
2.208089954237043
2.1258958818584843
2.2713908293945235
2.245532192239758
2.208556157862618
2.208556157862618
