21.71541501976285
30.340206185567013
213.3573235226489
20.82442748091603
18.654929577464788
33.27088607594937
31.06289308176101
35.269146608315104
57.290882778581775
34.24849699398798
50.31432973805857
30.108695652173914
66.45079365079366
15.953488372093025
113.00815494393477
20.12953367875648
21.23013698630137
27.326797385620914
5.5094339622641515
63.14641288433382
93.9845577912962
56.13905683192261
77.7341628959276
48.648556876061114
29.033730158730158
17.2953995157385
46.36851063829786
234.21118306744592
56.72267206477733
171.19326339039205
9.606060606060606
34.88904694167852
80.62210796915167
56.1240157480315
37.5559748427673
34.55589586523737
9.344262295081966
30.10294117647059
50.43811394891945
13.459677419354836
25.51596424010217
19.065116279069766
84.69703745109
73.63552833078101
72.92442267319805
31.327007299270072
66.17027501462844
17.087912087912088
77.08948285880301
36.51554828150573
20.121827411167512
331.59698976520167
24.17989417989418
13.886699507389162
13.111587982832615
15.5
23.318840579710145
88.3811833171678
8.826989619377162
45.93802816901408
35.81219903691814
64.21948818897638
19.013745704467357
45.89688715953307
21.85542168674699
