-0.24354500395610282
-0.2396355523962976
-0.2534187353835401
-0.2677997596850507
-0.2605557256037491
-0.23927781229297407
-0.2753516947066009
-0.22852698197254695
-0.2559423467090826
-0.25784756292518896
-0.24418110371337987
-0.2417714844264824
-0.23260346332874896
-0.24713057640512515
-0.24743657025784055
-0.2728387449265327
-0.2460186254671762
-0.26169051025760365
-0.2334167380185854
-0.25075360257772583
-0.25103995783953015
-0.2250302073199665
-0.24233424921164132
-0.2697822669211103
-0.24438897905259474
-0.2445397211325546
-0.24302104016069864
-0.2499419728089838
-0.2545890201314355
-0.23268943369360612
-0.24288224659549093
-0.2508866593536475
-0.24539531202925458
-0.25572955038480155
-0.23983535419278423
-0.24621000099435122
-0.24268875009869822
-0.25848778091150354
-0.25199821526089433
-0.2510044705047027
-0.2553873566796587
-0.2571588627301069
-0.2770456839107699
-0.2552610008499564
-0.26455869881937605
-0.2549223758224574
-0.2580568577495916
-0.241621245444962
-0.2557613232360535
-0.2511128915432852
-0.2490498135121481
-0.25031107676862724
-0.2526317482206138
-0.2486492429392367
-0.2324953846303298
-0.25229782177295335
-0.26248091025556686
-0.24750707954586187
-0.25028552687349653
-0.2509121181560577
-0.2583581062160082
-0.24007145894372456
-0.23601952877995536
-0.24141100883055056
-0.24567938168469008
-0.26930458329106316
-0.2600002910489866
-0.250524954231388
-0.25924611954126336
-0.2559517603664814
-0.258330944105072
-0.25699964712320156
-0.26650552952990747
-0.26646874497814643
-0.2477865228842125
-0.2318012007439028
-0.24882649473413754
-0.23886586475086813
-0.2578049710595142
-0.25851033984787297
-0.24115222635279565
-0.25859726963085644
-0.25407832703171374
-0.2703057108094215
-0.25131023372451294
-0.2544967960851652
-0.268709477018093
-0.24862212166335287
-0.2436338465954022
-0.2435662651235447
-0.23108662209739667
-0.24579047501732143
-0.24825184771444211
-0.2649693800178121
-0.2541376347902806
-0.2538153402112149
-0.23484762365969672
-0.2580901835410176
-0.25340179318977935
-0.24257103848102127
-0.24035884304017355
-0.2626771690449721
-0.2542709352193567
-0.25284331368450264
-0.25873578468020725
-0.2621611492188052
-0.24861211124226712
-0.26180211026191696
-0.2518252695749838
-0.2631582961220054
-0.26177498704942326
-0.25076736089557455
-0.24988664475295472
-0.24358895506373437
-0.27544062117320156
-0.22193898508313267
-0.24706775817022045
-0.2551128305318379
-0.2365525505377177
-0.2193868649247633
-0.2573963816873832
-0.25836976510541676
-0.243470514765925
-0.22489758193295428
-0.23368549769270652
-0.24847933661873917
-0.24430166458488545
-0.2268735184814902
-0.20997421327631
-0.22694348871892675
-0.2362957651050724
-0.240070392510483
-0.2473225998379865
-0.24969466093873413
