40.58002074168235
46.253941728812165
47.981018556589476
51.08000724210033
43.70381120747804
37.61492558763444
63.637593741037556
40.5472123281044
42.473087080296146
55.97202952713505
63.532030706207614
55.05354763054312
37.176654036798304
47.48464897787675
55.84182044716582
39.1936956038988
41.08492495455838
34.829513026583115
39.57189599920739
49.91586355258601
32.67364511782897
38.15724968107927
41.05924121843775
56.68553487183383
46.666036645364414
43.57415808184108
46.575357120206
58.01117978173597
49.55612711875538
36.955066477138615
21.200260976162145
39.57615043297665
45.03719221429745
41.74887309955285
47.418529382101354
43.63819847298968
42.84262450451396
39.37754498419087
33.93329173900247
32.69188124787426
50.021650134846865
23.303963469160127
50.69764464309625
51.1055082616237
49.8627608624
33.01835180935048
51.6484467328783
53.47427255862278
44.51814624052496
44.469368412232534
29.803085261350432
52.93451265884206
33.79760227429407
27.482637140028668
29.887007916578604
38.099484867550956
48.48500686183553
56.046120085292685
43.878504829198505
65.08697168077144
45.870916208048165
43.04400644667477
33.683583047588776
43.84292035957339
56.39921797478829
