8.113580414377491
9.631698847412697
10.957325481133212
7.950903504319144
6.333392541739651
11.4010003620459
14.014835262714222
15.763614577608774
13.287496176759774
7.639873563350752
9.277408678985136
14.225212868040016
9.722980228410016
13.051546061943894
12.119436250559366
9.692884935254023
19.30054010486853
17.65500153419743
13.829667837531808
8.891812282844969
25.02873862407614
12.517580330417344
15.772828145902475
17.67283573048474
23.504979551132198
22.002293013483246
18.81124740603042
12.415952176934786
11.257999889403424
12.72707769034584
11.801814060586127
19.6667681073748
19.108969259725413
15.346476637025011
18.258575275109997
8.669347230538346
7.959867766820395
11.880029841031414
15.176136235175257
15.837492014888545
13.506905117298073
5.944964255895648
15.666920480441888
11.86923712810625
12.800783663765651
7.923182833580898
9.995525218719028
7.3934930044827585
9.92073660581293
7.378899814315175
7.570102736001423
17.511939261849864
13.021918984109448
10.829672295634
10.539757630757164
7.006423538641638
10.25447205160475
7.946842051355702
15.194395051394839
10.46937026164298
6.413626954399708
12.53664163941667
10.926530929202174
11.976198145264012
10.61605356781294
