0.0499308031194616
0.05987977824879675
0.02606585889860568
0.027180531809782357
0.039467737723173066
0.07383006382845676
0.03382823687260293
0.04822315414478383
0.03732466127846265
0.06180701621628097
0.03740653743828837
0.02532375223268825
0.04789132743277162
0.03050842491719598
0.02756373478311979
0.04443479951745802
0.05758146474693256
0.05523105335703353
0.05778446323556341
0.029524368803523514
0.05231573873675003
0.06177518507915555
0.05244373296185261
0.036225417603812336
0.04017668370212461
0.060078693259226386
0.04268190270879243
0.04174037858264162
0.04282880460128628
0.055774748971901635
0.12334473540257836
0.04096870524865933
0.05383026355652832
0.045795076909685185
0.04203951838353688
0.04858012399268258
0.04965795035615244
0.058015215735259924
0.07549754723200723
0.07764682836151514
0.029119774297731493
0.03177768114189849
0.0535047409689119
0.03967023497681789
0.044561510513332174
0.08556378222490588
0.0651520020915671
0.02049091255566896
0.04058453988707183
0.03504850967113998
0.07111971416942821
0.04150706589735503
0.05058461297564994
0.05940752122232864
0.0851495076343504
0.05710271006235437
0.04190048069069538
0.02608377501916484
0.04821214109954716
0.036288218302727784
0.0384821526339862
0.040582847870360136
0.06377537997246445
0.05453999776758257
0.028419803167206638
