2.0483990100668343
2.065488800396732
2.332280634725722
1.995868238732679
2.0418762341612817
2.039171146279582
2.0108970980864505
1.9741026029264832
2.063298735480684
2.0599202181829037
2.127865328257643
2.118081624861438
2.107317251457717
2.235569062129979
2.205734554447214
2.0871383863063464
2.1026565239099884
1.980389303161541
2.0870108283856483
2.088884064402996
2.018862355253088
2.0902550267540607
2.0767112700776873
2.07182967899588
2.1220697185804402
2.1005414798862243
2.302757053285895
2.3095226945438556
2.2155618094081038
2.077550053200829
2.179881386040436
2.244183921678759
2.0722404717339287
2.1464606632562475
2.235549072579511
2.2056221695544287
2.196775636292717
2.022312970480156
2.3257938774866074
2.152512974067813
2.155568118710524
2.3053741200009727
2.1263936314920246
1.8693464516343905
2.107507112047746
2.1348855775543627
2.130162033455559
2.1775390127422276
2.207536197259964
2.2578584745236547
2.1790155805242613
2.2286332962559987
2.1496376506295856
2.113458668061059
2.1898314608077665
2.205673826434902
2.091906102397657
2.2055140155705977
2.213468900983618
2.190798573468468
2.074902729812194
2.142365438771509
2.3574408024649496
2.248889180782153
2.309164013560842
2.100294394180606
2.1838472540894873
2.1576383160462123
2.235417115452144
2.1795898496723316
2.2077169812614184
2.097115938746859
2.138015867992565
1.8585397568720914
1.9128648110642625
1.9664968923371344
1.9806748597915989
2.036793377915695
2.083625950024405
2.074411486476439
2.175429816442572
2.074411486476439
2.1371529429161793
2.1090084954542654
2.308392922090329
2.210451151230307
1.9628675613781321
2.187328154768097
2.207417215665166
2.063443473588791
2.15749620138999
2.0778251742006217
2.0894604511470263
1.9744835968489907
2.05770038703996
1.9841803674278995
1.9724411635601
2.1576383160462123
2.089901734663944
2.184041403053176
2.2121083185463797
1.9151985182889966
2.060242986306195
2.095950691985796
1.98436270393574
2.0187657860973047
2.157978616106365
2.0269890914180047
2.3065060067041694
2.158519419132619
2.085313430355896
2.0666949740366465
2.0254351915443776
1.930677113326342
2.0459865193767564
2.0592578777770654
2.1123942641782327
2.0603951689157287
2.0607305272548375
1.999107861873269
2.2067095597979502
2.018165107266271
2.1248752806795452
1.8846788104989396
2.1426087769109063
2.3082668301391727
2.0594291251896677
2.226875887760229
2.08571281978077
2.243839334564121
2.2433639441792446
2.0202547461995533
2.050869406047821
2.0574175735908473
