-1.017230314140835
-1.0452624901990837
-1.8038047270309028
-0.9377753749538563
-1.0297882174984214
-0.7283844956697287
-1.0152334546992265
-0.7435799722958831
-1.146642860408657
-1.1946217686934275
-1.1588856092123005
-1.0878714323841028
-1.2912496902274553
-1.3613583597246834
-1.5089948286958441
-1.2606630470882239
-1.2404942286012042
-0.9822136513623098
-1.0408705025072833
-0.8918181506509877
-1.0781800643707797
-0.7724747482708442
-0.894656617655384
-1.0156916598071835
-1.3188218160923346
-1.1920745715641248
-1.42437755002951
-1.7077926647524844
-1.298197423981189
-1.1751277598920702
-1.1945422768770861
-1.4192693376666803
-1.1568075344858824
-1.0247981614205646
-1.2622903048496263
-1.1455508409104034
-1.3731937224051762
-1.0936479281005065
-1.6423894374542096
-1.3053452831800791
-1.238294182871781
-1.702162111942018
-1.261749641435066
-0.6086107891064502
-1.192261656944049
-1.2894470792078891
-1.1961353030402495
-1.275722664622223
-1.4953293423702072
-1.4404938838652002
-1.2427775977326756
-1.38984646416173
-1.3677903804752236
-1.2043272990241507
-1.2972524004084414
-1.4610369425679188
-0.9976947410955743
-1.4641400364798463
-1.3468935750134237
-1.1999092719475497
-1.1384808225632954
-1.3372393255050907
-1.7652037912898686
-1.4776466460374247
-1.6987587573169114
-0.8586751347278528
-1.2834338609607687
-1.2684124670896713
-1.4102572024160123
-1.3731885898277574
-1.2650609406269309
-0.5261946624321426
-1.1335569567361354
-0.555021677287685
-0.8024638770345024
-0.7687203974129226
-1.1002747901589227
-1.089685533328563
-1.337211893375231
-1.1135804066919626
-1.3546003873430685
-1.1301413840516379
-1.1356545248000243
-0.54245158548902
-1.6823999822004845
-1.4968682841067067
-0.639589417058008
-1.5284697895372994
-1.4636390829039405
-1.1190534212148182
-1.2400078602053513
-1.1499243698368695
-1.239961892025823
-0.8884053006930891
-1.0671906622070897
-1.0318855776123121
-0.968996200176405
-1.3943933230934582
-1.1635145025624893
-1.3540120539029243
-1.5019177717768275
-0.7364415535445904
-1.1294448591531474
-1.2015236562408533
-1.021156575224208
-1.0597641965172035
-1.3165650369381299
-0.9784539097786127
-1.752028859523554
-1.1482943215710695
-1.0571479681681608
-1.0020149606026576
-0.9283866490383854
-0.8346583163757133
-0.9305619551381478
-0.9079528540493194
-1.2087375698632508
-0.9691600619898014
-1.0389332915532217
-0.4316499287948634
-1.2780253710356637
-0.9700978067142451
-1.2161659290540772
-0.8949135842889813
-1.1747035547279352
-1.7221525647827243
-0.8742877888388817
-1.4353463238388988
-1.1191490659203005
-1.3932225082600849
-1.2994149196624236
-0.9707106806125979
-1.060559812647501
-0.9928785168356442
