1.3041825095057034
1.295
1.5161334056399132
1.2946428571428572
1.2903225806451613
1.4448742746615086
1.1389473684210527
1.3924611973392462
1.308641975308642
1.2596685082872927
1.1645021645021645
1.119700748129676
1.4542294322132097
1.1861702127659577
1.3668987680771292
1.3716216216216215
1.3431085043988273
1.4718498659517427
1.0666666666666669
1.256844850065189
1.6266094420600858
1.8545454545454545
1.3913725490196078
1.2579415501905973
1.2794117647058822
1.1693121693121693
1.2759146341463414
1.65971022198591
1.3741496598639455
1.8441526263627357
1.738095238095238
1.4052287581699343
1.9258160237388724
1.608
1.4326347305389222
1.3093023255813954
1.1428571428571428
1.2258064516129032
1.4175563463819691
1.5677083333333333
1.2825552825552826
1.9557522123893805
1.4746987951807229
1.3313856427378965
1.3229859571322986
1.3912037037037035
1.511242603550296
1.1474654377880185
1.49496644295302
1.2756539235412474
1.541899441340782
1.5715317919075145
1.3917808219178085
1.479591836734694
1.3442622950819672
1.0909090909090908
1.1602209944751378
1.2435897435897436
1.1855670103092784
1.225718194254446
1.348341232227488
1.4497964721845318
1.4184782608695652
1.3542673107890502
1.0384615384615383
