68.89260226935761
71.41078517655609
99.62149554746873
79.32591705987466
40.709473571891216
15.762822908308484
14.57200435430294
28.931005986330362
42.36328336853876
182.24280098182732
50.24219899660846
45.29037570221882
80.27965394785332
1638.5507857743405
127.61993614742508
517.9009918240145
887.7076687868611
74.43436474606922
40.053076860515844
79.86132651922996
140.23618877860156
179.21469137974782
32.185060207834745
46.260874683154036
51.6943859566012
46.068785593011036
163.97048838148845
205.2275146594399
137.82835969221992
57.70518012741191
55.531165871073206
129.75823615989665
27.874983303028745
226.71382368480735
220.01338532565512
183.83661274024175
41.67582595122507
16.09464346638061
91.93442683101928
89.39930694165218
138.7877804637968
113.18068771326985
108.82020760569624
28.45627152847184
98.32396719799117
113.81130370603569
87.56153208991851
138.42532522664308
84.82974107009755
66.78974370832171
51.25359824269306
76.63350535908634
219.3408606920351
42.73140044155162
29.91163378213394
47.917628844893386
21.476804867545265
155.64649437184875
86.31307502548854
235.37079353558812
141.39607637633534
162.89443048617463
62.85526216854778
50.05881621779479
80.05292440509706
12.87450162959783
35.504309826025356
41.36549667006147
40.00618984350957
42.5819441448496
38.08703395498718
25.04522541798976
15.067197784401849
44.07044128962011
65.48568393281916
22.617653094718694
35.92238859766474
173.55944386543706
76.50019782441083
59.97874004146617
43.07347506896549
39.58595538400292
35.96960944595659
21.67325194616536
88.17908739213193
98.8617237547596
91.70879431468668
41.8894102549796
52.06574838402977
30.17137253286109
61.51412678681694
112.70473541504327
47.68687325948392
8.423705723227012
123.97604750247886
91.2909223739239
101.09141237784316
216.39799480702231
39.142984174399814
45.146311667956105
70.33070834183187
29.37014449350369
30.2259813931336
21.625488569098703
31.76287894360747
67.59944991807627
86.86645819745048
11.60003897245152
113.88526075067104
135.94082789127432
52.39068936012
65.56853289248232
102.54560895647309
18.294591816226816
24.862488883483266
106.3138561279037
78.46354413841365
73.0654204743578
105.11024611398086
46.563134124192345
114.12027764222245
77.65704829936143
117.75996782503314
166.05459767032352
382.15328947063597
230.93684353573084
91.44915595426613
131.1618677135003
62.234313354122726
92.21081245349475
83.99484013569534
70.14588387490838
65.32139924614378
65.18631617803635
