0.09303207816157613
0.0734395625584038
0.09889768210056116
0.11585835972013098
0.1440711422389634
0.09447727072006716
0.07920698325594183
0.10478228906991433
0.12254240467089635
0.09092070470244436
0.08631682509371645
0.0760688930449907
0.11911092800674995
0.07756082546406119
0.09958994506587836
0.12582640080423693
0.06824082301738171
0.08129270108721219
0.07200060500717753
0.10931970028659507
0.08013606144753882
0.0946754298591868
0.06595112298062789
0.0719984645702436
0.05389602259780802
0.061233643928296985
0.06808118189357279
0.08574369366011719
0.07640985152422561
0.09279732569851863
0.07801172859712119
0.057269200156874235
0.056824874883657624
0.07054256624927674
0.07034113138391708
0.12297932413596033
0.1487213873208659
0.09199816971962264
0.06088513118166505
0.09008173357812646
0.10393112882196352
0.13837875725808307
0.07125445938259954
0.0870064887643814
0.07874001436761968
0.13429192405578128
0.08278122304530207
0.1158399716894605
0.11980473459306973
0.12186890441129684
0.1338492006521765
0.06508335258289798
0.07021008831659435
0.08306270233152221
0.09769288027475374
0.13531582284068694
0.12355594410913835
0.10815363764855727
0.06421144371195632
0.09441579631784207
0.14884229182065836
0.08190990523255308
0.08918658549654497
0.09603355628159348
0.08591356107025162
