46.15034979634671
50.55915093278706
1326.0053393130988
70.98387492237806
110.08759701967377
98.42228096520391
62.518644708565816
91.68660419676937
165.5652281588763
79.34042810002344
106.64645114063832
72.01353314584456
257.01794443345324
54.636184123557996
329.6690461455932
64.48680310669513
117.46775490105247
124.78519193310758
11.247686447179529
188.44591720541348
225.3898546479948
421.4036907316524
263.6753096391149
176.1217313182103
66.760598360356
35.13924694783954
130.91935657059486
1588.9874633698762
367.3874689268745
1147.0609078033085
32.29868366843544
137.84188718485737
241.24106387064663
219.1247501711367
175.78854295500298
115.66418857983773
42.936758445355395
61.477291731518825
222.2184364674845
56.327913810406564
65.88226166118841
54.03141187428735
289.46919354982924
358.544322675288
365.61186059670524
111.05541147978113
141.662880583821
40.92048301512651
252.11514153979988
141.7606073688361
51.11627552512063
1192.2263289540347
106.32243060391434
66.75042188353743
56.28183498622418
48.292593293497156
84.21207376432316
266.9416445103471
14.617567341351267
98.96478925372028
106.33957285283432
224.0614208603689
65.94601561656783
135.17650821158853
42.57228023940512
