1.697232841593581
1.7032771900849928
1.8190789824614075
0.804538789210606
1.2975450580011627
2.3104147761925833
1.182691651249808
1.6573837805965435
1.7165983501642736
2.1738302723113283
1.5901666361883744
0.8893147611426795
2.056992567737617
0.8952849150606023
1.3210687234304783
1.4412040361265614
1.9671989413115716
1.921115431050541
1.0116713770330918
1.4244252811362428
2.549833891301012
2.540269817265068
2.276191501861101
1.4253223933638213
1.2991317574962078
1.5754552571444063
1.8083717489255158
2.6086572722891455
1.8552890214440532
2.940198467739617
1.7724927542352038
1.524088543436399
2.7688032335077235
2.301548044410336
1.754704096494779
1.848654298897557
1.1394436271471258
2.2682608687446226
2.732742712777853
2.043775850903232
1.260245632784621
0.5993962199494951
2.5570589352741484
1.9893752566373812
2.203390073518299
2.6344794431270877
2.456936384719105
1.0654488693979305
2.061996766315812
1.4798329167507922
2.1722075432743164
2.4189261130899333
1.5623904890856604
1.7363824972512172
2.1918128520139657
1.513362464040943
1.588118969777574
1.265086133244308
1.1611190326684426
1.5799042740892628
1.5064422689423889
2.2701495422482205
1.8502521321572818
2.0358355301944164
0.9933903465486139
