7.350092942830442
7.164878374444914
8.518213218897788
6.811546013052737
7.1855587786494075
7.261063165806143
7.991974071904664
7.6754545896678685
8.290993454226857
7.75608486943194
8.383886211006233
7.653886227448696
7.56365604671697
7.0179253092969525
8.277102701252973
6.874854047544978
7.08461053172216
7.257026466039273
4.942085767961132
8.248786064634206
7.755407734005356
7.256580564713843
7.919001652081982
8.108506437219207
7.673741812452911
6.745684371271633
7.860400499517557
8.034360168740108
7.7117326808851345
7.6459070397489235
4.305710711369864
7.47108700016396
7.520136717868628
7.671300799033627
7.6115980995278525
7.402792227883864
5.665409909995867
7.319330189183876
7.282454061286414
6.545331177224733
7.763313266850297
5.362634494360624
8.115793997574572
8.035206061758696
7.947529012580793
7.104005585654924
7.685267762519975
7.453618122883322
8.469620410092446
7.6587762320644925
6.6691363362871074
8.018718051629747
6.935722611001276
6.363788743688128
6.465699206589719
6.4594071873807035
7.371193675010943
8.519383841569011
6.0852889250836455
8.307228095093068
7.223358498248984
8.175710772751481
6.4408870946299945
7.436000612639072
7.449931699262757
