0.9268292682926829
0.9005524861878453
0.8662752772341813
0.966346153846154
0.9032258064516128
0.8934911242603549
0.9422382671480144
0.9401544401544402
0.9361471861471862
0.8934210526315789
0.9202988792029888
0.95
0.8691674290942359
0.9297520661157024
0.9192065795839379
0.8962536023054755
0.906166219839142
0.9067599067599068
0.9508196721311476
0.9048723897911832
0.8524027459954233
0.8256410256410256
0.8962264150943396
0.9384057971014492
0.9417293233082706
0.9428571428571428
0.9087248322147652
0.8453728186144897
0.88136826783115
0.809075503671625
0.8734177215189873
0.9113475177304964
0.8393939393939394
0.8509659613615456
0.8985313751668892
0.875
0.9494949494949496
0.9153439153439152
0.8675703858185608
0.8849557522123894
0.9383561643835616
0.9696969696969696
0.8791208791208791
0.9132176234979972
0.8852672750977836
0.8948545861297539
0.912948857453754
0.9366666666666666
0.9043367346938777
0.9232175502742231
0.8555956678700359
0.8373681687440077
0.8789473684210526
0.8502202643171806
0.8921568627450981
0.9540229885057472
0.9273255813953488
0.9371428571428572
0.9838709677419356
0.935929648241206
0.9056122448979592
0.8725743855109961
0.8634146341463415
0.8822714681440443
0.9501557632398754
