2.239009929209877
2.3042075023792834
2.6576397587834917
2.175887979607974
2.261707674560166
2.139552013732799
2.2422758197238957
2.139552013732799
2.289134668113083
2.296302896305357
2.3537463030679135
2.3195876315520874
2.3342960489862628
2.513003328770503
2.5095726738384805
2.3554391733150473
2.3229092730606045
2.1109592266283337
2.2947472266389237
2.2325060386426885
2.3229092730606045
2.368152080927645
2.2569090677924977
2.3783698201695644
2.401744516691129
2.401744516691129
2.6865953484386864
2.6654749864214167
2.502315517155219
2.310548245489348
2.4777906864925567
2.5324606797120603
2.310548245489348
2.384932271269009
2.495187194748185
2.430891370048547
2.465365576326801
2.244131624606195
2.608749840713206
2.407767646291396
2.4301806446950853
2.639883353614793
2.4317745937717605
1.9940644345064769
2.3659171910382457
2.310548245489348
2.384366959158014
2.442378038502507
2.4968413863523007
2.632228476930642
2.442378038502507
2.556403709961465
2.435424569559301
2.4257044173119993
2.5172844287097975
2.5008301095137107
2.2558565688169043
2.4925578467544183
2.466707960953816
2.489710141519937
2.3402566380674474
2.401100445812214
2.6891422394283357
2.5383356137668063
2.6610166583155794
2.361655633641788
2.419808685027699
2.3999761515166007
2.529744273544297
2.472248089942645
2.5146171927243306
2.3229092730606045
2.395735845116742
2.139552013732799
2.010341711520065
2.1960865856074845
2.1496325916529386
2.2274492511828217
2.363880282921194
2.331079468563385
2.455395664897505
2.266935801090898
2.384366959158014
2.2422758197238957
2.6518490206209497
2.5140490640279793
2.0452079913245806
2.448698574829249
2.4720608144862783
2.275750621323991
2.377259831480948
2.332468586544341
2.334793662880345
2.1832342481693274
2.277532582573705
2.2116685266039986
2.1832342481693274
2.369497566985041
2.3138009202890384
2.452019955000591
2.5611601991121913
2.074760805524793
2.275750621323991
2.3240166601118344
2.1547693814515227
2.29318161269543
2.435480954146245
2.2402710690442307
2.652736812258863
2.444751667647797
2.3217698071694364
2.2999472822353946
2.2521964312698195
2.0611826167968452
2.247667029544796
2.244131624606195
2.3321079274940506
2.275750621323991
2.3136027063240276
2.1832342481693274
2.522324995964497
2.278124451468134
2.4105838667404234
2.0223288966024824
2.4082904888404504
2.6590999010577896
2.2318250024709636
2.5592835977843493
2.2980964600686384
2.553714478522917
2.552402186031178
2.2650396072785353
2.290434473633932
2.289673480504895
