1.1519344269544693
1.2208361417694706
0.8751559795050639
0.8713742467331445
0.7691770294196358
0.8279827195817352
0.7432900721677865
1.110653111790669
1.0547738132936737
1.1255472446403478
1.0747255807294875
1.074960004096864
1.1310992070670105
1.0654707377361081
1.0874280925308888
0.9737259019020752
1.2218298132000183
0.9917842575116996
0.8381010870586091
1.0837951857200014
1.204579934865914
1.0899393835044315
0.9217541109285855
0.7409940559881781
0.9066951846184192
0.9927456652667143
1.0958969193107548
1.0628856943914757
1.1014368168704378
1.0998538962650901
1.0147802672006916
1.126510174508894
1.140978983315659
1.067557711863799
1.0861523744373645
1.0030860153561665
0.964677046289936
0.713911324619369
1.0912970024173503
0.9397565797187564
0.8745133512927692
0.9489487594481053
0.9841228187507973
1.1064843110017706
0.9789973603225078
0.9443620966491769
1.0038728380850113
1.1958820634423606
1.043173283237116
0.9703327063180931
0.9011199804043203
1.035992188559548
0.9147040377877442
1.0995956804067735
0.8286549605551159
0.821185310747763
0.7464452325123021
1.059999100269452
0.9805483771065523
1.210215379716627
1.0649974379262217
1.0508437366217913
0.7494841351657802
0.9024794255143581
0.7747313529788777
0.6525926657630698
1.1225601011950828
0.9852619925355302
0.8128178232054502
0.7955970484596958
0.8029195132594564
0.8408851327292348
0.8946961707580271
0.8660271273365563
1.0216367598674625
1.0176457930391916
1.1567534641483561
1.23871823843279
1.012064402622535
1.0480120927296472
0.9648848596597525
0.9691259392492129
0.7101826046664069
0.7105580817126597
0.8720110531892983
0.9778262340497068
0.7373499346294585
1.0484607986200896
1.045043945356802
1.0783890278951007
1.2420633546323399
1.0496906507676824
0.8627721670424372
0.9959262088347438
1.0562370595074193
0.9838864102237525
1.0262157867862551
0.8556757612749757
0.9118717051857703
0.8135994845380925
0.7670752591172303
0.9101266523342637
0.9052492758908317
0.915587564137572
0.946708649115592
1.034649677949376
0.7972330168482257
0.7083442686953915
0.9638165848552387
1.0765355160367351
1.0180660526946645
0.9423088836573961
1.1317631144409195
1.1767897723707479
0.7826242103200307
1.2163980563239443
1.116877392461904
0.9092398244807169
1.066821467528632
1.3781437305918989
0.9286900265394062
1.0180663704924167
1.1916818583107414
1.297104183714851
1.1411302279561573
1.1247599514525508
1.007910551781515
1.3710715299194878
1.4021780558690191
1.3434532170372118
1.2322461191605747
1.0805099330030057
1.034968864554062
1.1567948825406364
