2.389923266573442
3.368208132835752
5.252064173777519
3.1143135116622167
3.327555192047702
2.008713313096851
2.411888971481414
2.6166238472418506
3.3977634245968322
3.525501061131254
3.3836007587029484
3.2366940156088226
3.6995446777274754
5.40967219817756
4.457367079292165
4.192094791571271
4.1131721976421005
1.8658442477366752
3.189240716485224
3.2587153053793854
3.8288247615221276
3.6874911031216993
3.242103708041085
3.2583177446246534
3.6521869508341283
4.409683082991018
4.823330189784795
5.621576260875985
4.142044926420406
3.373346869816388
3.9445852225666975
4.544465055320416
2.9944962536872928
4.28147676524647
5.191186794117772
4.555344079172515
3.8142785127429044
2.610651723465119
5.1465201416874455
3.825731426221504
4.04224091002034
5.3393509129830115
3.231270032908088
1.061916304774561
3.4290569140531946
2.9404786032040646
3.595047235969804
4.232383738480152
3.8069700305180865
4.121606191298339
2.7934999397961753
4.320722433521857
3.9298966726854196
3.7043936672716145
3.5003675880054765
3.9425546934156315
1.9266993438820617
4.100463603307618
3.317510193155025
3.261773038666142
2.4626398622192434
3.5388661974143054
5.420327972763624
4.292711318735298
5.060111420891808
2.556734347614549
3.6625740002135303
3.8715686635545152
4.414308529247753
4.018710442784785
3.773113006176352
2.4624135079898055
3.3423641939407704
1.8327573425591412
2.106244445122486
2.7699705105784176
1.8489312704438814
3.437238667089856
3.3450652906175353
3.172867560487446
4.153411556148611
3.052591139971434
3.534440321294523
3.156059806652138
5.036534551399126
4.472167581647307
2.3910378474802765
3.936989159871255
4.187512916561318
2.9017079325793973
3.5543639965732488
2.926497966940154
3.1752722544651384
1.3282067779883642
3.10616170351235
3.003071772292863
2.8749419321442047
4.151017458446375
3.311142354843363
4.155473725622823
4.391508605623802
1.4489620563081278
3.0527246973393476
3.4264350168217463
2.154864101684837
3.037439511578121
3.9844224088620983
2.5108176931050874
5.2205757494288205
3.6911757984846862
3.0061670382773547
2.8702400586528043
2.0037452149260964
1.3777238978013158
2.8663646301451804
2.6860333846018767
3.8117376122549884
2.672812760898373
3.4110450534803776
2.4950018210424667
4.174000173651506
3.1878704849441926
3.532127149362396
2.7398830051626284
3.5260445938583156
5.349434190955462
2.6732248385625006
3.993272769963303
2.5862072464055155
3.5351710531260214
3.2488570895581192
2.727750306530718
2.973760214061902
2.8742709850976738
