38.82279631784263
37.95251669350517
43.43620665009499
50.15255309482418
38.098682166125386
35.31640764721847
63.122790418031386
45.10616751056385
58.23148560484648
42.47959362801595
62.979873416163215
52.53591859179692
37.32554942014209
51.60890375714205
56.984704043485934
36.636901645783574
41.87829834993666
36.067965419994465
45.93721699927265
43.878189368542785
34.75835922718966
34.09509530221341
39.79793255872791
56.049582410805804
44.808121506073626
41.01084572899801
47.5877924296219
54.75774346972537
42.12433001650756
34.33196186793892
18.243869853329862
37.220162363005606
46.78052845685843
36.23629926049242
45.609774266288106
35.642951557723585
44.612164140154405
45.172818150389176
35.10002356244439
31.39095577709838
48.90167714196001
54.41444929886915
54.50455383612621
46.19117491321217
50.05767336043469
31.390916590833353
49.32110120499103
53.677654190519554
44.10593279733495
43.0306174206325
29.82780492298601
49.79098549790644
30.424393725271994
26.994362444461878
32.96476957247026
38.85252950210039
43.36578348010023
52.849993933906504
43.167833683246926
59.04498657180073
36.050562789994494
41.185163912836906
30.256692240846007
41.81320443133143
52.82777288915756
