4.761201862426022
4.934870667547705
4.902049864408377
4.365621050105763
4.107378455082034
4.781060766658756
4.946035890797116
4.644981295039885
4.447130081652693
4.918298062981839
4.853549925595528
5.171286345304557
4.432100943252661
5.0101770439163325
4.7051857529578
4.248246295521634
5.321331352776612
5.033581990461169
4.685004098497859
4.547038540824556
5.180763393450028
4.869877091121932
5.337299285128122
5.267485134191633
5.759565078601473
5.494482909093522
5.382907652080064
5.223070301067339
5.272117541332435
5.0534270462218664
4.77737055294226
5.595490887448208
5.6671006641520085
5.320944129637604
5.3575223683801525
4.388225356785652
4.019241966368593
4.761589142651676
5.413790726036366
4.949003992334711
4.998129457299953
4.271994534856971
5.4546939634304445
5.141835484719095
5.155856458433832
4.260751745442073
5.00215351651518
4.393802758028186
4.480642973325642
4.429454827551462
4.1088819456845345
5.5017700798579385
5.2174797740577
4.993972631857208
4.626897064887447
4.180903001010032
4.388698058937741
4.590969626001908
5.3596832874798706
4.878449850924062
4.010480274314987
5.228636943102045
4.721821629415132
5.012221118587167
4.8202340017218654
