0.009356339735156292
0.004258106865962385
0.004460900975565886
0.006385754024893263
0.010067360958265579
0.016169112165029042
0.02112885250561956
0.014618174438214532
0.004299511330267623
0.00491609114341737
0.011365139939012132
0.0054322363218009175
0.0043815268195302745
0.0027768792034243324
0.0037559712727262334
0.008202640651522167
0.005106195432147009
0.009385425801517015
0.011416476931467762
0.004075390140534077
0.01040620195854834
0.005925264215105999
0.011476047861963648
0.009156799103766095
0.0070031195304769145
0.005352463346892211
0.001693940141870381
0.0023604180451241626
0.00438324970608235
0.0024996391760006608
0.001904409358977216
0.0018625549843148638
0.011228122995459864
0.006806268591734753
0.0034889579627347075
0.008582215724312465
0.009490908768760973
0.009068919269075377
0.0027326837909672
0.0020383285739488527
0.0038683592988494244
0.0019074795185686753
0.009322189872251195
0.03137705417681935
0.009940696715194866
0.004224963469958996
0.008928025361218292
0.0009907456137157932
0.00459096480222016
0.00576742211003714
0.005469322624899239
0.004227282089250265
0.008232541450174803
0.008110602554570471
0.00821046733029068
0.00490963910251672
0.013412247206241644
0.00368043065592301
0.009407130095822329
0.003458993221011361
0.007694698149038204
0.003202689043293173
0.0018655006278490555
0.007097437497599735
0.0049963573972117365
0.010137820871993249
0.0072915865827382015
0.007506609542289258
0.006353659644273248
0.002975478319209418
0.0064427264558859325
0.010898565469323513
0.011703801376145429
0.014374702753218309
0.011580992360759948
0.008748673239458094
0.02342460191822109
0.00490452133533165
0.003598784541902243
0.014621484365045831
0.00529172496360121
0.010118613172588184
0.015359790035694284
0.009950105998545669
0.0014779687770056155
0.0025084784999085765
0.012798765500492752
0.00896149075852028
0.008560180369450917
0.007406620830241074
0.0068856938006882
0.009916827426214149
0.012398870942550029
0.023271617650388196
0.004279836885177571
0.006285876102523457
0.0031916283686323453
0.006800897556887408
0.006139930775588843
0.007726429142618497
0.005669098684333547
0.01892889378769442
0.010406046282971327
0.005551805657856347
0.010566908157976769
0.006826975026923714
0.0024559511749599147
0.014468105113916043
0.004581067696067875
0.002930818657356683
0.004840541938672007
0.0074284506582017905
0.007190907632872408
0.01905182225144924
0.007218481864997663
0.004532164985789081
0.003752499289646404
0.003352986356904833
0.004134107551681661
0.02391807278261169
0.002787676499298625
0.005527286835988438
0.005731520601754796
0.006067345118438889
0.0015352006785374244
0.0019176602432557852
0.005905911974733867
0.0027076086131808392
0.002685026088664981
0.0017589327820834927
0.0052511514928117895
0.005961600837551818
0.01102550483199837
0.0039969026928209465
