18.69579430951966
18.35268464883525
8.972259374515714
13.1132199213232
16.538155616220145
17.70732439450361
10.57207178646703
14.121725386757115
16.59297268061224
12.14826749138338
4.817968854555715
11.202424511343239
14.669745408092588
18.070477914281994
9.696175874376479
12.953268483121336
25.433150038765735
27.910655090975027
18.46821092757775
10.57207178646703
18.212470633374377
19.374039326315554
15.973171272261839
14.535772472999849
19.416475583561702
18.918941933495987
14.768974617607174
14.56944761409472
16.1173986008525
12.367930837202717
18.188930236845195
23.22176614551643
21.935260155029848
19.310097561870798
21.369204386499078
14.535772472999849
15.527507675930305
18.76319435915541
22.377884589467367
21.11353896190254
10.946343149456444
13.761570205408617
17.229257825544252
15.497066828162462
16.48304540167868
14.669745408092588
13.761570205408617
3.739055532779484
9.758190063858803
10.00069367940461
15.527507675930305
15.88562730799644
19.07262042464669
21.369204386499078
17.458350868713115
18.070477914281994
10.461456597357161
11.302441136295746
11.450020319051255
7.2014202346267915
10.516979287878218
17.483507083583728
22.93551851965638
20.79601794023351
13.724738940670571
