203.8063728888889
119.11462987491433
756.2517303857422
81.4806462657031
98.05915616014929
292.21682790701306
628.8256294036588
580.320567178579
335.00362845420506
239.67700358495725
197.0063726331091
346.0744042184076
168.698366265836
330.40949047311443
387.09039739187006
258.27047935214523
663.056394229631
656.2744196270729
389.5457788347205
131.21017068973146
1040.5311558449844
261.69531405038293
661.4963505927551
742.3506881576753
1572.8843261720408
719.492668214257
853.9087500047757
913.8610141216141
306.16359132614707
522.1795523308017
171.74685583117937
758.6510277695621
779.7379549421208
469.97753516193484
788.9091827565094
128.90656209320045
70.13553398299761
228.1999935405897
628.9867752714374
660.3072957455555
507.63047166072135
41.00920926117524
564.7097208896153
320.67752872986216
403.2009684027986
96.73385144621143
152.83501144930085
208.0076155886699
292.82892016149736
80.64593203341776
75.67715095819341
1137.7519903649122
341.1178550065009
258.5384678034009
195.7226749134046
53.056536179711806
237.6494068811003
162.17896196216063
497.39605554110295
313.4714239460024
79.42297114158161
688.2795970727678
145.86924833577336
352.8289781664014
247.99841023836444
