181.3095910869553
134.18348705443321
157.08797935879588
116.59313944954576
109.08375080703264
246.32820156140224
256.95231460507244
197.1008336998096
208.02559122589602
355.1362146819922
206.81461913833667
206.40936914061948
135.61067368558514
114.6384135362996
199.60351072957909
118.52744554663664
103.56112491079232
116.27011868093929
114.78722261968548
187.06639782034063
211.4106280386716
114.22446852904145
218.69434326622132
162.63126300349938
261.7082582953786
162.87291421152838
209.26994615309133
334.84007582243754
257.8121262617762
224.77008232455262
94.07511872572569
188.9762324210329
179.22380757359886
167.6313025662716
154.75074144701912
156.51004755504508
80.6263881344172
191.26914646887332
149.22065717953046
129.1818987838438
210.67076641414613
84.70221930876644
235.1669302304761
170.6642872341244
184.2227362829893
155.14077980106626
240.96333883995388
164.40837875705637
196.5976513203334
215.42669364694527
107.09465551158598
232.1838215331644
156.40834839681787
145.33347155381338
105.40275808916373
161.3935859310922
178.63838004427737
211.67510622290084
222.25601524013229
232.4640159400966
137.38427020894736
270.76001332564874
99.88309231649929
297.1906162155532
182.78715520888758
