2649.483846849121
1605.7065373454755
2978.7723477421086
2983.471663142633
1986.0789174423899
1098.8686183200837
7864.683075800605
1714.6610130036129
1698.2479441416342
9146.453407617866
15620.407661332896
14006.63354462676
1522.1506621585174
5840.041507682158
2697.093445666299
1412.2593236580256
1117.9552736426847
1703.9904725706715
2777.224149006467
3529.379372941341
804.6473957646554
935.8635676694073
1880.4763513192806
4384.899514987148
4521.470866422859
5234.682819845321
2960.3465563390105
1650.7146699068132
1786.5802248917307
1013.0943475794617
276.49761503245867
1470.2167135123611
956.3026450019746
1358.0139048345661
1652.5249398617966
2218.2241596812823
1685.660444457929
1806.6691982571313
841.551800491431
1047.094916228905
9561.303278512243
561.9847417599652
1738.9750920064569
3615.2606002536095
3132.870119018411
1300.7810831070394
1129.2437229393504
8794.146760239495
3030.558354751713
3469.4036170714503
639.8155173966047
1868.8675315091816
1210.214972189446
643.7523257502432
779.1557033477634
2332.5601536485115
6030.5860184048715
5488.1099391316575
4592.524648848535
5034.326752625929
3313.4894672311766
2940.9091030407258
1529.9519388603326
1524.919126942312
11095.456035203078
