3.787150511910318
3.633335706664827
3.5781227893229195
3.6864767581299547
3.6864767581299547
3.034210105013657
3.191497376541938
3.7377020618356314
3.6864767581299547
3.787150511910318
4.092552662849957
4.206039097084296
4.1691796074908005
3.5206616681468965
3.332638672358334
3.881200635999715
3.191497376541938
3.2638676463889205
4.1691796074908005
4.311376485104646
3.881200635999715
3.787150511910318
3.5781227893229195
3.881200635999715
3.6864767581299547
3.969477276731204
4.531434168031083
4.01167258656932
4.311376485104646
4.052674919647795
4.052674919647795
3.8349462374035648
3.926014068015502
3.332638672358334
3.460752104869524
2.6513752849759986
3.2638676463889205
3.633335706664827
4.531434168031083
4.531434168031083
4.409699499781244
4.616645743496183
3.633335706664827
4.131368411096508
3.7377020618356314
3.2638676463889205
3.633335706664827
3.969477276731204
3.787150511910318
3.5781227893229195
3.926014068015502
3.6864767581299547
3.5206616681468965
3.7377020618356314
3.787150511910318
3.6864767581299547
3.969477276731204
3.926014068015502
3.7377020618356314
4.01167258656932
3.969477276731204
3.926014068015502
4.206039097084296
4.206039097084296
4.01167258656932
3.969477276731204
3.926014068015502
4.052674919647795
3.969477276731204
4.052674919647795
4.092552662849957
3.926014068015502
3.633335706664827
4.01167258656932
3.969477276731204
3.926014068015502
3.7377020618356314
3.633335706664827
4.324869622970453
4.1691796074908005
3.926014068015502
3.8349462374035648
3.633335706664827
2.9482011494608056
4.531434168031083
3.8349462374035648
4.092552662849957
3.881200635999715
3.969477276731204
3.5781227893229195
3.191497376541938
3.7377020618356314
3.398165398342184
3.332638672358334
3.926014068015502
4.437969527369891
4.531434168031083
3.881200635999715
3.5781227893229195
3.7377020618356314
3.5781227893229195
3.2638676463889205
3.7377020618356314
3.7377020618356314
3.6864767581299547
3.5206616681468965
3.633335706664827
3.787150511910318
3.926014068015502
3.633335706664827
3.969477276731204
3.787150511910318
3.5781227893229195
3.460752104869524
4.01167258656932
3.881200635999715
3.7377020618356314
3.8349462374035648
3.8349462374035648
3.881200635999715
3.881200635999715
4.01167258656932
4.206039097084296
4.501918610559584
4.409699499781244
3.787150511910318
3.5206616681468965
3.5781227893229195
3.398165398342184
3.460752104869524
3.633335706664827
3.7020388737890606
3.633335706664827
3.8349462374035648
