-7.225095366928865
-5.4125272711923795
-6.845977926061956
-3.067548769226825
-5.279741904286189
-7.096847506017926
-7.631852528177002
-6.341537556503705
-7.558001849420339
-4.933413402999483
-5.099969630737172
-4.8862862140596395
-3.954612148903918
-4.045112355413635
-7.895245202201928
-4.65241722796509
-3.399183207029286
-7.8820899831181945
-6.996957887388463
-2.6908509192496908
-3.3448821980028267
-1.9755357177130481
-5.6749668238515225
-5.2890100268536155
-7.790282068027472
-5.1013905549719105
-3.517208301874279
-3.949889963010445
-4.153919762605378
-4.227318919082211
-4.84123450507023
-4.143992566279034
-4.579927557474945
-2.5574646931791847
-2.957730069490178
-3.276772276466967
-6.278532095494768
-7.250744571313379
-3.9470487271319783
-2.7619678288656035
-2.6589486029209937
-4.000751008725266
-2.8415380039658245
-4.317474046187126
-9.683428200289837
-9.86703880462423
-7.620023793925176
-4.891840762244051
-5.993378404931312
-6.986021218929395
-5.289674740898601
-6.374674799622563
-4.92923092915958
-4.08676682788986
-7.309467689752359
-6.763841217562826
-5.466405869085293
-6.303370572797737
-7.267981704515257
-4.379960962104351
-6.049069614680651
-3.5295760475112012
-6.633247698530405
-5.200149059984802
-6.750692852441547
-7.023840697191454
-4.88913035984117
-4.9207915876973845
-5.997507789487673
-5.478116438115521
-5.047369908813612
-6.650018308809447
-8.131164725692502
-6.533076785523682
-3.857653221119407
-5.4667144469555184
-7.431176192770583
-4.54285732142948
-3.834087063022123
-5.46296179794225
-6.059441232066697
-4.919311895416903
-6.4036430406604605
-6.6848551692480624
-6.524851809144024
-5.653724996545465
-2.783699769539671
-6.729830834897572
-6.304159110829711
-7.472652594139032
-7.593771604593509
-6.2469895704749545
-7.86430617850102
-8.403225709118207
-5.645394625954933
-4.406425053588809
-3.624656042476397
-5.147894340568496
-7.350146808015889
-6.708289605394763
-7.744643523008235
-4.049202643941608
-6.750249143193471
-5.932850737647344
-8.112344495944848
-5.938295841692825
-5.707011774525113
-7.125840372903415
-5.888576355197741
-4.065043803692561
-4.544194940768316
-4.339022729447085
-7.843864474717636
-6.953317107384754
-4.7099783377266435
-4.447864121365012
-5.492982829205309
-4.541871074660566
-4.287788263493724
-6.106045370193074
-8.39083400371504
-6.579620587764065
-6.567645859142734
-2.3917124991978165
-4.415712248187213
-5.1620513572576
-6.603693242154556
-6.750310154748993
-6.132484485269055
-6.918249758687651
-6.177832429620088
-6.401644912190294
-7.890361085663965
-6.636603132710496
