36.51467911210772
30.261098546060484
1341.6047868114135
30.15716073257759
43.58225263288662
15.541787397758295
53.12829168278752
9.492212520675132
67.08766656559447
62.99351358520912
73.86606681447391
53.717511096892345
103.05031786232072
243.772537697482
532.3393235257762
108.38267626670799
95.87143878388952
37.93553166617847
67.69653976526921
30.6348032807408
32.735919515483126
34.621488905117964
34.591317081136395
71.41683109604107
155.3361576912269
89.83703801278737
155.23363440061055
733.9815643569359
53.631612706066896
42.100147116987074
35.153272372535895
182.26904196170864
30.50378930032577
43.19117618538107
197.0222819449521
108.37335403292494
235.59946863355674
51.92093916348915
345.18177532175974
70.4201265977353
54.141280441163566
578.188124476347
46.95944983338924
5.976363895235601
112.08611318566851
178.35045970767302
132.80408609625903
151.10640129224038
208.920150926862
251.0583679542975
71.2135103271957
128.87101338111316
105.83640887527288
64.94007794378003
123.91413018362536
192.18944779352853
27.23174489479616
220.56807186030645
142.11507253022518
63.79555065686138
37.36252288510989
128.43973778382966
1534.3432038850915
236.4050149596721
889.3988428304832
19.710615010443163
68.26774607596997
85.96863958027036
203.0826073378495
186.4966858347895
111.32253913639776
11.43991079357957
76.7486681343877
13.597086452756846
32.08668862919531
16.171534699884678
41.162173868384826
66.33207822587991
133.83484694389088
33.225419710382944
236.89611678266647
51.99574144606421
142.09942776386993
30.67339606279921
768.9612778758137
247.9742576443947
21.192238942902122
244.70911630472645
235.22763449677208
69.52604093235382
126.1256237922578
98.26760398725824
137.6462252420169
32.598455691296266
67.81324662050454
48.526940309622596
32.389248811936234
204.9162892373253
96.92864262402023
198.19524338966355
689.3943889719471
16.84729970944804
105.38198848732388
99.02327074104731
48.55753024501065
80.10325751319175
199.27400529833218
33.66283108965092
1180.6991484475086
47.55958783178753
33.1807496990698
21.569488397912227
27.143536419704645
18.92479849273382
27.14792225817776
21.191641817717084
81.71869132908992
28.59774645452897
40.32939031055405
13.619656274145985
233.4144183174776
32.96811245453456
137.36794327108905
13.700608244442305
128.96432277388482
835.755116800577
73.39753712226397
182.73849301940083
30.672033719167704
167.68289538199204
123.62275462179852
26.09888366054396
39.93126240301749
39.68582651440837
