7.086525764235708
7.16531871520896
6.923539061458454
6.457201556033394
6.576649307517935
6.288188768642198
6.793614022707256
6.416820461780798
6.867373616006618
6.932703625217166
6.8211995448173095
6.949729531023884
6.904602433607002
7.001744271392442
6.850600453347664
7.0908873584168886
6.909132324571531
6.333051019165278
6.6961117187420705
6.872298077034747
6.9560167951693614
6.680015754371428
6.427983092757333
6.515877817830861
6.770877167543107
6.793978376307602
7.430065078751332
7.272010974701389
7.025308833422736
6.517278094070733
6.516536541746087
7.040749401251014
6.553245667376901
7.106549891036915
7.0260132418307455
6.879369320579338
6.992289931986273
6.6348778956554035
7.342542415994411
6.800137337265289
6.538499962944338
7.118418544403732
6.821483650745763
6.290153224087732
6.8250480658786135
6.895962654453019
6.8305978145648005
7.3186778597514595
6.761523568290027
6.876511475913986
6.562044090325655
6.69999539792941
6.587934589785548
6.557352167699312
6.592889298509473
6.790559752071115
6.21660828591796
6.745256761573375
6.742284695647642
7.10212364462117
6.5428718661604535
6.522886895645809
7.0313361175282045
6.582806540720786
6.890061968076355
5.6109995058920665
6.745764460081763
6.6410929171809725
6.828275293744781
6.642857109520169
6.830017326955643
5.8802870254796336
6.939609263631509
5.867160709984004
6.690690731548974
6.175656522151524
6.976139056670838
6.866813047476678
6.773408446642934
6.453614484699202
6.766058566105313
6.921859443736367
6.345769489093707
5.724740456140605
6.9258966984346415
6.71253371675163
6.254054450175118
6.657920045216698
6.7312441585770975
6.6918929945550785
6.780003096538994
6.638199693336129
6.559519574100996
6.559720512198032
6.715850627716949
6.656272277158113
6.550471668079019
7.014562175003425
6.51513669059384
7.607718171278727
7.036010210526313
5.8705271149634815
6.660777002827016
6.7528193818573605
6.609930832286858
6.5484041779523015
6.774485120073148
6.5704473057789405
6.924153912499308
6.6848143640162645
6.466840148629843
6.259053348097286
6.752370155997378
6.456309543439929
6.571783577747956
6.550816117323297
6.859102908109256
6.855745490555259
6.919378578556664
6.1701163427154295
7.017511993932862
6.6431953054787805
7.0930913081822276
6.736893237941092
6.649909482518474
7.12112278064962
6.369442568776139
7.1077708053226845
6.436503193477535
6.830539058001978
6.603025600942058
6.464177680578482
6.796913866954151
6.520800669820863
