0.4764267990074442
0.4610842726784756
0.3266462392322368
0.3704433497536946
0.3227040816326531
0.2432859399684044
0.15813953488372093
0.3364197530864197
0.3576956147893379
0.4546448087431694
0.2950262588816805
0.3170951736580965
0.3638760711931444
0.4887498565032717
0.3265584504160415
0.4705181655747469
0.5362418412916523
0.4489402697495183
0.2319138019497178
0.42589118198874293
0.4874141876430206
0.4946737683089215
0.3330775134305449
0.2434968017057569
0.216468805253852
0.3456185567010309
0.439755195715925
0.39921169321727706
0.3981596617756777
0.42426417803302224
0.3493810178817056
0.4642015321154979
0.4448441247002398
0.5427609427609428
0.5305160294873993
0.4660074165636589
0.2326358361174609
0.18303273213092847
0.3448942598187311
0.443342776203966
0.437410071942446
0.33634842386142644
0.3654233870967742
0.2254335260115607
0.3718782073212453
0.323380992430614
0.3613128085971537
0.4184078286167681
0.2889190003011141
0.26613762880492714
0.3227296049256029
0.3304778614924141
0.4680341880341881
0.3224436458673636
0.2661473547549497
0.2706960295772384
0.2373417721518987
0.4109429569266589
0.3621253405994551
0.5273384545865342
0.459349593495935
0.5372670807453416
0.25021087555530563
0.3346781940441883
0.23339040380841025
0.20275229357798166
0.3200540175557056
0.34283797383428377
0.3297127340288695
0.3372282608695652
0.3400823610157859
0.19410496046010065
0.12755102040816327
0.28
0.376865671641791
0.31929046563192903
0.4603421461897356
0.555
0.4463343108504399
0.3262119967132293
0.2649561107359892
0.37338044758539457
0.30006337135614697
0.3157894736842105
0.3179631779731299
0.3639699749791493
0.6554307116104869
0.28630379249361365
0.3425678257546809
0.3119834710743802
0.3342293906810036
0.33738355609558524
0.2823495202093632
0.23037974683544304
0.4488989271597967
0.5313432835820896
0.4691780821917808
0.2989747345294764
0.2636669470142977
0.2404870624048706
0.22307392490580746
0.39933993399339934
0.3454245671887881
0.22933446375582875
0.2958236658932715
0.36691052335396734
0.3518590998043053
0.22417582417582416
0.29982539286605137
0.4054842473745624
0.40801644398766707
0.40130151843817785
0.3867016622922135
0.4457478005865103
0.2814748201438849
0.4031227821149752
0.4271680216802168
0.34082156611039793
0.4052491103202847
0.5141104294478528
0.3000494804552202
0.3989466754443713
0.4445880452342488
0.7392857142857143
0.5117725455353176
0.4768821292775665
0.5309734513274337
0.3772053083528493
0.3941176470588235
0.35899653979238755
0.307427588184686
0.3166047087980173
0.3605797101449275
0.4019024970273484
