-4.071121381101482
-3.516566538203943
-4.2671581554069435
-3.8415566799176593
-3.1662074974348338
-2.9585173774176288
-4.079028434952028
-3.895816835460608
-5.026614281044563
-4.55958698212433
-4.201772325635605
-4.10680512303841
-4.324197856813435
-4.287243531802636
-4.815199341011774
-4.457654723211385
-4.594862797243972
-3.6615318294145256
-3.7799089498621252
-4.049676110518284
-3.96020228038813
-3.7997250132069507
-3.8968900844103405
-3.845012256255836
-4.065654831065602
-4.119495154103096
-5.538013689120773
-4.9321411146468455
-4.267446031199448
-4.177047327922918
-3.4748624105979515
-4.478721055438693
-4.515602939699121
-4.6375387490464215
-4.6278745664098215
-4.314390047636707
-4.323663890515815
-3.3082134984736213
-4.410999517743949
-3.6873213350942886
-4.215076813091034
-4.2139233818451425
-4.096795997121398
-3.690207436966434
-4.197451019139953
-4.075105402498896
-4.1455228136632805
-4.538913138154539
-4.301465861944726
-4.315321573699157
-4.021443240026535
-4.253090854501133
-4.331140532146725
-4.037613580736317
-4.884403990990269
-4.1518437045992265
-3.448789177254723
-4.44862909926108
-4.1376962685303
-4.061547235989269
-3.470674889884658
-3.8437100992310493
-4.415635487721179
-3.9405319561710104
-4.410015869268802
-2.7019996040119265
-3.9615112583499554
-4.622136088286889
-4.211207065323017
-3.932834309092437
-4.0866971178153415
-3.206489856163207
-3.624482697751971
-3.3576821539463904
-3.773819771808556
-3.5146686154416935
-4.161268742237727
-5.013675408472206
-4.2664721658701446
-4.1217294223306045
-3.6471803063486177
-3.6471803063486177
-3.5250479601848066
-3.0825203346836796
-4.3817708025904025
-3.8628551561487443
-3.4679337185735877
-4.567553978374189
-4.3705991611540735
-4.344993875026552
-4.70277846845385
-4.0811101106872965
-4.31324529734602
-3.732733161199942
-4.32178020751273
-3.666399307650036
-3.693062491107272
-4.157430909088484
-3.666610990839554
-4.298741069048681
-4.605331974754218
-3.8666899256134553
-4.189132783830094
-3.4267636819942795
-3.6890183784107164
-4.123710289607407
-3.646474867468013
-3.453916031466818
-4.668082948056574
-4.041488821371079
-3.826195057856476
-3.7587233165431186
-4.240345758167398
-4.009667319725393
-2.9287418152888187
-3.7759812915461866
-4.318323411056835
-3.485452934968841
-4.173658537960894
-3.8536482554906124
-4.5182456880481
-3.582944345643943
-4.6982852982325145
-4.011363187435341
-4.447095068438868
-5.0499359577232505
-3.8542926778344757
-5.279742013160112
-3.6452273489035725
-4.480748640344956
-4.652898099789532
-3.6518563552659673
-3.39815632060178
-4.009278427670806
