2.0267616573249656
2.086883119329965
2.3341400321867023
2.0355638293150347
2.0399529457326255
1.9724411635601
2.009894344490152
1.980389303161541
2.0612124075892
2.0587709661474873
2.1424579658981218
2.101594574619642
2.0781810772113025
2.231131753035535
2.201386032352035
2.0983334786755785
2.086699754030941
1.935328891971679
2.0679408881944763
2.0983608929483113
2.090273835663585
2.106823291493637
2.054552916895674
2.1322767441155994
2.1185969782794882
2.12755694071826
2.3210295979215396
2.319079256276529
2.2059878713696914
2.0927140672363183
2.1798769359252455
2.250739011040158
2.0673412184720856
2.1146018117045573
2.219446044523571
2.206044910761434
2.169812439017195
2.0184912233828345
2.2857396278962496
2.134908426423745
2.150749002930525
2.313427246696662
2.141457419000248
1.8369412345096836
2.1271055937773338
2.0966428083814623
2.115886715372626
2.1750488150031617
2.1999091283954346
2.2816410613627722
2.152512974067813
2.230252601145146
2.1440480626919833
2.1444374214965047
2.2044122311143552
2.212790784660342
2.0691272653011183
2.196033690625999
2.201846431395585
2.182416658274358
2.075976700279021
2.1307206417504916
2.347743545781075
2.219678168311048
2.304793212550284
2.096157378140542
2.188721604123529
2.1658893192681448
2.225889085995844
2.192071403271193
2.239261490604042
2.075998157721843
2.138139779971547
1.938091331596014
1.9128648110642625
1.9985196966379453
1.952493340290781
2.0284714341379138
2.0930765413494616
2.082289455133084
2.1715303934868717
2.046567459211026
2.126048243481245
2.0986125259197306
2.3030670527493027
2.2217452731072536
1.9330942600083192
2.175359323969025
2.2231644078000508
2.0647737222532365
2.161017084657311
2.093930589819671
2.0881534482248276
1.9743736802868819
2.061050828830844
1.9971587104161392
1.9654087790917254
2.1319418245046586
2.0679408881944763
2.16187862831568
2.2445147733064283
1.9111708134368361
2.0343655847644553
2.093930589819671
2.0035389957309078
2.0575844766320692
2.1458363222523076
2.0248721774174294
2.3065060067041694
2.150662421147118
2.085313430355896
2.050197755173303
2.022312970480156
1.9166024852402272
2.04052748557416
2.0418636228420786
2.1134347573169223
2.0389664097576716
2.0629676664873533
2.0216406971359557
2.2065598030591387
2.032307352063594
2.132819991525832
1.8763726440762305
2.123956424066233
2.3124988202376437
2.014109449498057
2.2358248020224
2.060058661424883
2.2394606076349293
2.226609837407876
2.022312970480156
2.047300477075136
2.0535088062691096
