0.02393372924312663
0.03459511840956698
0.0015626400005951796
0.030343368727475777
0.025481680272020413
0.014229598526027298
0.013320118540865008
0.016097549675847082
0.01091841632715125
0.011249768065357569
0.012116272304145382
0.01630547810023633
0.008800522907748836
0.04590479629885531
0.004098701514385347
0.02403659784638542
0.0172490469574037
0.019350853131975508
0.11747752573464933
0.012701032818049409
0.00529729990434901
0.0072806360325081716
0.006394273103042939
0.010433680559594384
0.014823605382393391
0.030497273955356726
0.012833692388272776
0.0011165765890137882
0.0064229029688371965
0.002076327495689345
0.04167987928807111
0.016902671016368918
0.009386455982820313
0.01510654826332464
0.01194832057889095
0.01937844163227033
0.06340574058805494
0.021511370216705555
0.008195447597262458
0.03826494622131275
0.02537498856157017
0.0471836854509872
0.0071555299252788985
0.0068361819345261615
0.006919565802689513
0.017095698864389733
0.008782498409041366
0.03136676879213288
0.007675557581511336
0.015573376557395043
0.0315544081863092
0.0012199766950157555
0.018878683471128463
0.03151514639279454
0.037890641313804575
0.042832242402484
0.024153282821795075
0.0065147125760118595
0.043913285136311694
0.012331912059929496
0.020862525342377213
0.006407028119925204
0.039597163297709584
0.010377721542596028
0.0331179896293899
