5.320654965752807
4.897634158638519
4.310543875582996
4.311283197571559
3.815428814551609
4.035855416985556
4.420845541402429
4.95637759441675
5.00605347045579
4.8990124507805355
4.505765551119178
4.579193751674814
4.495537184196757
4.841409432507099
4.684725320323358
5.476928086638405
5.224111370369367
4.540518367216506
4.490370130941843
4.662341507282788
4.6726840326264005
4.763091588368619
4.199680961903521
4.206593182609762
4.381102390236993
4.513408439177058
5.220671866633045
5.094582513909868
5.079432281598953
4.6738536843130705
4.156979501082809
4.865331045281747
4.640595312183923
4.717797331202934
4.736799708600502
4.563684928815301
4.546395583135034
4.09500685610386
4.631535024450296
4.399763227011778
4.016089486530563
4.557938473619683
4.372446694088364
4.702008168709041
4.9201341787375386
4.659863048412332
4.7163481416366375
5.305057565100589
4.604386865932332
4.6859814073864055
4.124896188816046
4.463818659798045
4.427752223887323
4.2570431762447765
4.0281666880357525
4.1095592340028695
3.977966862514132
4.64557304048242
4.595054544622824
5.063900541296426
4.523175403067032
4.440754944919141
4.5514154946645125
4.305306690715378
4.419802587576839
3.3399350872775915
4.4978983605812015
4.537932742826259
4.310307614733123
4.231642373109666
4.4007975500819265
3.8932391186479993
4.345930821025946
4.1550604471897365
4.698411969991582
4.145402380837497
4.835912214600402
4.905795980567997
4.4617275739116815
4.219805165578645
4.581458471738316
4.581458471738316
3.5985913732365917
3.9172186616304248
4.313092139892299
4.144011148907648
4.0881059946239295
4.357908932059395
4.53786476177161
4.6203325872037
4.910236300832828
4.543323174067623
4.4014599896513715
4.475691918907264
4.688020925732065
4.698812399692187
4.8600649991647975
4.467146017711652
4.330585905882876
5.0756438779436746
4.482418626917878
4.213164475403561
4.512206387545437
4.222555378327431
4.291636722043257
4.559606571550613
4.148340179208936
4.436397420000524
4.358946826103527
4.509155554303376
4.242146241020781
4.311863133299415
4.892661063370364
4.567503274784558
4.078377457358858
4.7796583027215345
4.710256061290943
4.605074820127262
4.955815037885927
4.459314549466517
4.718159016187911
4.403917818703485
5.258375229077913
5.040954902679594
4.82189406694878
4.991614144597016
4.335828433516988
5.580763704074147
4.978432238700852
5.17353547790879
4.975496624090561
4.358465421646036
4.68072347236605
4.570917603593048
