-7.085942661145493
-7.196045012295188
-9.710703422876769
-5.94670909670572
-6.927193948963313
-8.076000307476424
-8.98687054191613
-8.879223258872175
-7.420342106687504
-7.460810151113575
-7.667527075032597
-7.745403415917716
-9.077783443201353
-7.809105282796552
-8.799335832888193
-7.627845083575285
-8.701617062095332
-8.538952760242749
-6.105611595697531
-8.833026872529278
-9.649438900696572
-9.33282205257754
-9.50536736206868
-9.107883261690999
-8.790823435364347
-7.803293364473382
-8.915595446976365
-10.065668294197645
-8.65060459116445
-11.163869988640377
-6.014834396585274
-9.124793286056393
-9.271372864693236
-9.935328920658856
-8.903436195137413
-8.70390809737712
-6.70050016860752
-7.9268673087423265
-8.472337437931333
-8.07348386674982
-7.623005012926145
-6.131215242139683
-9.744171858799497
-9.468834186963177
-9.396255794365974
-7.886140623929774
-7.5366468607133825
-7.3276099082244786
-8.432731489209461
-8.237584928160052
-7.77187651702623
-10.46794170253103
-8.385908038041135
-6.719535767481621
-6.320865170732668
-5.9907084085702635
-7.530993648985682
-8.794225622596516
-6.744966337122122
-7.218418317033072
-7.120176374202454
-10.178868567492916
-6.104865289463638
-8.162273715396793
-6.994551143826533
