41.46751143237958
39.339130642491725
146.98475661359518
31.615731912997546
39.01048568223757
39.41491420041126
42.70279983525121
46.549456148012965
48.698478508902426
44.89464460010271
47.60133170180386
35.37846783466074
48.98831535686756
43.77943764093196
76.6456563715453
36.631946100332364
50.94738448957047
55.979947450864614
23.364763435784155
53.68816505881732
108.2891681809058
72.44173010257214
73.05598372352877
70.64347492384846
73.61702002395255
40.09549453044101
58.3224662613026
166.23858080202174
82.97889716963152
125.52109401987109
34.518900683459364
59.641663723925504
82.3638528740242
70.94264031830244
78.73278775501207
44.101614398773705
25.473692244785234
39.01048568223757
80.46622758485873
48.61988407474257
37.84019598428246
40.048317527911294
77.75743062613455
69.59501158277821
81.99035960027747
40.6431757717874
52.96694606533665
36.16029866728193
59.362174293201285
41.09686597026743
33.64221975725312
137.45060125603138
62.51780703358894
49.320965909262725
34.208743007373585
30.131264949241782
36.2922588406648
70.78303538380176
24.937912404562983
68.50566757033911
42.13702782315728
96.67878976855928
40.09549453044101
84.51063642203289
39.01048568223757
