-0.30562212672999933
-0.3169116449484272
-0.6124412217969376
-0.44505784355851763
-0.5563330384903284
-0.6399563659712295
-0.5875460420095808
-0.26575519861908087
-0.46249761869101663
-0.3687542069985394
-0.5178030766082159
-0.5944619463404582
-0.5450505098625852
-0.46995435814538544
-0.5546297431200866
-0.5820344949822966
-0.38041655306976707
-0.36251020493786057
-0.41048861291074074
-0.44851616461794314
-0.3590674048129166
-0.28789107524247814
-0.33961374868638927
-0.5489937085216202
-0.4891843878146857
-0.38213249745010863
-0.40138655280045704
-0.45255500016157063
-0.35942727894502224
-0.3207428205420456
-0.34630174656714885
-0.39607686155652577
-0.31661414706166785
-0.40534801283348154
-0.4288089677977694
-0.4510844946693197
-0.5376427895828219
-0.6622493103770344
-0.41411138678133314
-0.3375450678611449
-0.39343892808022307
-0.4996828571403705
-0.44840313174092805
-0.14370685657612403
-0.5530672696633561
-0.5920540081329071
-0.4816499871729776
-0.4739773700222249
-0.6292757268753564
-0.6024533639854908
-0.5901669781132967
-0.4889252146782231
-0.5385404498025559
-0.49092336591793956
-0.5848082754160326
-0.6778454827692447
-0.6450242695847525
-0.5492722058129063
-0.6178493851232852
-0.5074944279564702
-0.6425871438957271
-0.42699920064197017
-0.6303590377177242
-0.4518246910607404
-0.6291771457250607
-0.5662679881755857
-0.3599309180021016
-0.3751689587973632
-0.4838282968826967
-0.48494484235548896
-0.510357574938651
-0.38036632425303024
-0.6156870633104965
-0.42727352985490435
-0.5243883218169215
-0.39140951895487647
-0.4257453072205516
-0.3642914211196172
-0.39469490476792796
-0.5014363377009606
-0.45623131742856876
-0.45623131742856876
-0.5428755511149168
-0.4337723292325982
-0.6321275656028682
-0.5491592529645863
-0.6842113486204179
-0.5024288470694546
-0.4535100465306826
-0.4796540806417052
-0.42897068211734946
-0.5234557393539627
-0.5590076068906932
-0.5930427141849898
-0.4442469161211498
-0.61454582671624
-0.45957503181345627
-0.5984650389379399
-0.5215659911023718
-0.6856393512154779
-0.7416879284528293
-0.30316308263721303
-0.5777736813967965
-0.390615694139655
-0.5295116115652314
-0.5344458809727385
-0.6494395539751185
-0.4858989714297918
-0.5690896396817909
-0.3978591415735229
-0.5626312722464855
-0.4030611226117793
-0.3730590938123758
-0.38737429737941875
-0.5392145140622628
-0.39898710715377983
-0.4542398457158368
-0.5999235135057753
-0.3824581638778326
-0.413824270871849
-0.5558140681037155
-0.6153372303481278
-0.5364518106383493
-0.4071732582093466
-0.5588442243267056
-0.48805464250217534
-0.47269743867966296
-0.4797457291790996
-0.32609220019291035
-0.582540455364641
-0.5827271493723345
-0.4341121451587951
-0.46265294000552254
-0.3452682486764546
