35.634950738013636
38.153139503110225
-68.56196868229618
-55.343956201462746
-11.868548271123665
19.37999103412949
-49.434980403763895
-7.161324197334225
-28.555641019253517
-32.34380404885445
-65.3505816487102
-67.37447015899963
-35.00451849512176
0.3863812770842725
-81.99644117487254
-53.599240679324176
60.8323608120416
57.56924078997682
42.355006775419476
-48.6442530530796
-10.485664606027976
-17.67417596091417
-47.25661171912291
-28.8911199089209
-1.8261846096758292
8.081514919512097
-36.86560977387703
-59.537739536126175
-40.59644046383241
-69.42930682943515
-34.493132984982196
39.20486356555225
16.57187759886574
-4.405036223916877
11.0516371191861
15.668505822001569
26.73487282084314
53.06611345312171
25.313902361072984
15.002696584651714
-54.01866512975558
-37.96603778955865
-15.696345754171235
-46.231217431541936
-44.29429613884695
23.25018549510566
-24.37661924625508
-78.50841890453533
-81.20965752248561
-76.01362656133912
58.36494672159245
-46.34918022329362
-19.342024413159848
3.9735057826390894
2.2187218562607787
35.750720399175954
-47.82020491856765
-41.38878095597707
-25.321146414009643
-46.6651478775714
-73.03311808746899
24.753670477584173
98.51349249592207
50.569608184002426
-37.667958772645285
