0.5894269702183147
0.6349011981539607
0.5407403280715462
0.6434945537697434
0.6011605556280257
0.6131314568585216
0.6326395985415325
0.665739148654272
0.6817197710444305
0.6105413273303845
0.6495885740129839
0.6407428979441898
0.5901637872453688
0.5763242686559901
0.6470697007528938
0.5516310171713985
0.5780335100808243
0.5295128721791991
0.6254553251208483
0.6348606539896751
0.5659897067706853
0.578720820216484
0.5730072477996601
0.5789422861141469
0.6380679533145195
0.6122090433174091
0.6160563888944011
0.6183615062109512
0.6397263459788021
0.595780862457725
0.5385700056122567
0.6070488075818496
0.5633243310147038
0.5956200265169476
0.5903645813108269
0.6054162981156356
0.6392534771489269
0.6697088360622233
0.5983354131612041
0.5456075386071869
0.6462075640286544
0.6135177338405926
0.6150399883139159
0.6137740555702849
0.5882191592860222
0.6423011575856132
0.6700421285136554
0.605009330938047
0.5793494867713028
0.6004966588141681
0.5948941273084565
0.5639972719935431
0.5791960746228226
0.6108427893285011
0.493439576084896
0.5958447884945584
0.6593519342824044
0.6134051711186673
0.7107205480231308
0.6648841768511599
0.6705137484983638
0.6267957200422862
0.6164408529454432
0.6215994635355573
0.5888444015014215
