0.4155966713374704
0.3343010596603281
0.388276823533072
0.638560157790927
0.422748309006764
0.31768035999419364
0.5288816326530612
0.4338325272420022
0.4372211720226843
0.38128913112021984
0.460567788578104
0.529846292801729
0.38621383421167216
0.6203512396694215
0.5339042084208222
0.51045
0.5095058304654349
0.4350270720533112
0.5827664399092971
0.4333520071427321
0.35945786496471266
0.3237620951343222
0.3582589942162533
0.5066934291857028
0.4852587726325909
0.4744031221303949
0.4712742382271468
0.4369699748911008
0.4325851004051696
0.3632858484046675
0.3806228373702422
0.4917355371900826
0.36998489289269776
0.3756824965420175
0.4528099821029404
0.37885416666666666
0.4625100779360387
0.3341064453125
0.3873036888239591
0.3427169421487603
0.4992381630473478
0.7094942789763298
0.3650856562198264
0.4111067342712877
0.42260576105442177
0.29143924159724216
0.3811354607202358
0.5637846101579752
0.400213863842912
0.5007243298587285
0.3889422657000611
0.4024579363712886
0.4070447576593058
0.4403051700348998
0.27284183994959044
0.40641975308641975
0.439439681197923
0.4982347139932216
0.44782222222222223
0.4244291710326129
0.3972159592196843
0.3276438483404205
0.4025607638888889
0.3448563098708871
0.5324173373824035
