0.1558176578286769
0.1800133753528685
0.05819379716136475
0.09856050141370244
0.07722443814368038
0.1043461723574975
0.07766802052238464
0.20288364762527644
0.10334714317585812
0.10216549414461444
0.12507659286245432
0.09269009752083147
0.09704503762537392
0.09931224500520712
0.0853066032386367
0.09893465154558607
0.13757682868788038
0.11053892218143364
0.06341951380366764
0.14157037518228455
0.2004382033937792
0.15635310867368055
0.10270888112608982
0.05438298447529067
0.07152452409832996
0.08352679422077386
0.04658891136915675
0.047877186571019616
0.0936539556200474
0.12404819809362075
0.09992401202782868
0.10961694105990233
0.1789771631598661
0.08470949445291333
0.09047303145752723
0.07984608655098419
0.06310972192122552
0.06549516391932825
0.04267319734594273
0.07629547726936907
0.06615229411668185
0.06660599048261814
0.093376031061532
0.20585224100628535
0.07368804960192908
0.08433917455278833
0.08662646818892156
0.10370645872508252
0.06477529148025236
0.04280988801768579
0.07753416435800836
0.09447525265578917
0.06668450978824084
0.1107263238583559
0.03668728800653502
0.06013067953330815
0.07221850590347696
0.07072534234580104
0.05803619537702999
0.13598411812399722
0.12071658926621695
0.09519475098264384
0.01405607001734698
0.044246933950858484
0.027987269577006115
0.07596019511834304
0.1154366316552062
0.10098603912268682
0.03834135245809178
0.060178651168524486
0.06267448088725926
0.10620319292261853
0.07480157705889483
0.11153527579728156
0.11554893893390088
0.13944689343885666
0.13389953211461011
0.11492110752011235
0.08403379010767738
0.1281067805133547
0.056800950768449925
0.12021136408816545
0.06972540249440838
0.07169931983505437
0.057203476038357716
0.07031531846435753
0.08838347486745643
0.06567067460997664
0.051160280037209016
0.11177850103282368
0.1238694465404676
0.08698065978524404
0.0641380164592426
0.12318124009591873
0.13006497343769274
0.12744862538758406
0.0995262580478024
0.059400614076896126
0.09264587332942628
0.05056014392055425
0.02295475392652211
0.10469069202682492
0.08414902562909854
0.07780069351765435
0.09004181804131108
0.11606985769317538
0.04943489050281824
0.0798444153060646
0.0491902208582717
0.1058843405861176
0.12767835539747086
0.1196236541982278
0.15114696781476206
0.1978949879906445
0.0832136166258707
0.20727909737021505
0.12864803815590628
0.11308894767443248
0.14091575699006234
0.1559644246900591
0.061577788856298485
0.12248875062632217
0.08172381595885411
0.2393284951677664
0.1268370710226484
0.051819422743716495
0.1026416015461495
0.15862073319494566
0.26860919432620506
0.16817260517228486
0.1028535236682299
0.14772499858169785
0.08290189396482303
0.14408493289415622
