5.3292305028832
5.3195917496351255
6.172122097464741
5.159616910875453
5.331483202573388
5.41183486804469
5.436203167300328
5.4238944334946755
5.567169072738454
5.519938850345947
5.532136558271449
5.325760492274709
5.605805162354164
5.402980049673446
5.7556105142666265
5.312301456113131
5.510243741827863
5.550161421594507
4.729619533876469
5.548752346744336
5.867786300222243
5.783440195393967
5.818451905245492
5.7077259375286244
5.604706250490238
5.404519231214125
5.676860332105641
6.1767934643694735
5.8174507337806185
6.078178014409782
5.0699943797670946
5.61335523024714
5.808690909404926
5.767114412595801
5.678358565205393
5.4297346600354155
4.9222472289690264
5.336178571127326
5.738699831706452
5.378732890854012
5.370943362807881
5.006091058297016
5.84269042979272
5.835425424621509
5.838880008041832
5.371417552168984
5.56177315464191
5.262326259864593
5.690572755871689
5.431939744166677
5.244762726116849
6.156320227003545
5.521811707913832
5.379421091017457
5.148762741011874
5.111876873473682
5.314048569381885
5.693242107150879
4.994548671722342
5.527099645436473
5.339662382562366
5.840868000252745
5.35610328024933
5.674483437306989
5.281726036067598
