38.80879339458662
35.34238406845518
19.733737922706375
19.140680787917212
17.76712698411013
3.0792414218869597
2.2745992665950565
32.73801725627618
31.926081579849768
30.184564530013514
37.87197876611012
39.11110214456189
40.154486488715875
43.862957797285475
24.932951747061086
39.10035811566736
30.59445431665712
22.496343872211064
19.297516383822614
24.876301728043487
21.04218881241678
16.47371362316135
10.125923450316552
16.419278024396355
12.64531331880313
18.479869226158833
39.71482989908698
31.994094984377988
36.9969533915865
31.508944275450737
30.87825787368108
30.47921415757493
28.214600530990452
23.197933109967646
25.740885007773205
16.8708275573838
7.83144826844947
12.234829234538802
34.17666930699245
33.914825144431454
32.8329244521746
35.544709836840035
23.763429222104357
24.489293208583202
28.03920689531983
20.219034739445704
25.7396114484778
40.407091277550265
28.783486937935685
25.080857820588747
30.67694021578186
27.53434701536096
28.30151529695209
24.19641227212439
25.638157474400554
23.550175998360512
25.846964454469575
35.95082389220383
30.249575900885056
39.15904582922554
35.543630916393354
36.80434239398681
21.750793819507244
21.70274421541814
18.65351987907021
12.954626340831972
27.42882996425229
30.364827906161878
29.0880046099158
29.801734701470114
30.555412971998518
21.434258897725307
13.47321894912954
22.440260053649542
21.90927299763516
20.606030084644864
36.73225403701021
38.922597476150344
37.43725534801614
32.7263676142919
25.15742601767406
25.92810963803668
15.63278332526936
-1.17323601067971
38.73912270182531
26.685371563432497
31.573730976090847
19.391623058802658
22.240395839142643
30.623092452338895
25.365478212106698
29.03416732226101
21.230371510801508
17.47706197467314
31.961896914423903
42.32104397709561
43.50226657343552
20.02091242583072
13.661402993491755
18.88919873971328
16.361289024507105
9.600531042353829
18.60579137557934
14.318860434628458
26.874437831446087
25.292288377960528
20.690774818646346
19.09901106405464
25.312049321374303
22.37426401981258
25.19513820328151
23.407502718880977
37.26368719292751
34.14512089089433
22.936872748631284
35.117472392001226
31.00057316828337
31.732388162314834
33.928747180082944
28.094049921355708
30.687215208489782
32.71795807384897
44.95631603273843
58.41697989957178
51.557464494232
38.94757700818846
25.711991002072143
44.51910935722428
39.40977276645679
41.17360118689453
45.059387214804175
28.060038694876937
27.652018529938907
30.26608167009081
