0.7161748572917317
0.6175345445747491
0.5389825133070021
0.5981245053920763
0.6478726956761328
0.8451424471888719
0.7954393161936111
0.5559672318424811
0.8185377334252528
0.754893305771389
0.7760439142086494
0.7457682057474323
0.6675168006390705
0.6799543157325788
0.5520544071498364
0.8007989329260704
0.5431584420408382
0.5561335773018286
0.4810120231738018
0.5598057232401827
0.4748711075829399
0.7311330531528915
0.853062301131109
0.4719221310274073
0.4013097935060719
0.6977141974035923
0.6934503051614684
0.497371489606026
0.5710188347992646
0.6646874804233261
0.5518645821467068
0.5640988027750603
0.5246825519119418
0.8096756099313961
0.497415494301854
0.7110307952004042
0.8365155399549962
0.5529169671200159
0.5797762269446973
0.7538108970118078
0.7580731955842754
0.590641996970207
0.6815782894066819
0.8169032624990135
0.732221221697953
0.8066879951702347
0.6482929130901489
0.7312068942017108
0.7742717239482256
0.7814785369730545
0.9270044178385208
0.7495066058992457
0.4869621507208915
0.733450471182723
0.6594420663140185
0.7288941408890066
0.7640199829140121
0.5950970074356516
0.7179087245112605
0.4155801672992043
0.8362801579210339
0.4381450892325108
0.7797880187219229
0.3691466238501174
0.5989925460204331
