3.9529482267197604
4.0062220449192
4.524968043770448
3.9877545865215422
4.1442924934638725
3.9829270256846674
4.225502128183554
3.743152778859298
4.07911793118758
4.0013293025274494
4.063191401361039
4.067255368669574
4.175665586001973
4.28512001080539
4.317080198783531
4.287619766660192
4.051403565572919
3.9715714417056387
4.158000259019689
3.966313608781629
3.9180428692172313
3.837093398217056
4.0828729157339625
4.329986192831923
4.332221785871818
4.20297310210207
4.320681142469202
4.4063616826976375
4.065815536453235
3.90437568615418
3.9639477762073385
4.124091084543589
3.772525731705682
4.106786306489041
4.217186694803802
4.210656185358544
4.3883090068554385
4.238490675190577
4.190335237690757
4.17493549146958
4.184501964948999
4.459490603336067
4.060972409395735
3.7389259005374815
4.135732890607942
4.258238184858592
4.157353994765257
4.202150943363885
4.200127438337241
4.278059548419531
4.161350076828724
4.05632041615777
4.261337009265877
3.9461606198963013
4.460235890220735
4.351561973068923
3.9436480628864015
4.215389027552303
4.201787374849617
4.019241992084955
3.8843037865754044
4.1146938544828915
4.5898808866068395
4.335620586215
4.561053286894579
3.706267575273609
4.032466953363294
4.062194152402405
4.365744434641339
4.3411866008027005
4.273245175984122
3.6227502153139253
4.22436760403302
3.8484978416071667
4.002764880660426
3.73911298886168
4.008691878036025
4.118533519111722
4.147331540316844
3.8623790537710816
4.311054402382115
4.076564551588249
4.341648257300119
3.7873993136381214
4.434252795619937
4.294956176569756
3.6923023716974575
4.272335715551833
4.220942115923069
4.0658973460268415
4.041441058225048
4.07579857551621
4.257122246963788
4.043000024948487
3.999605377777247
4.081852249762818
4.01568481340711
4.411336395012045
4.207425158467148
4.384980021393525
4.515389968069249
3.9567202585147605
4.22660232376803
4.266100720491351
4.065837573340496
4.055781751340885
4.378982967775526
4.1841115929656425
4.488632837098586
4.02162726590645
3.948331484511873
4.014612972656601
3.9063131778276348
3.850146930382758
4.070223708921535
3.77091154526788
4.060589144859927
3.975424712985894
3.9656443416243174
3.561431182925133
4.338144206446244
3.9762169272099412
4.050075079365118
3.7942791121486166
4.019546437402794
4.306787471529843
3.849643058953909
3.9716481928944747
3.81474549648573
3.9537480537024283
3.9340019634013093
3.774804743842157
4.137939093685922
3.8282571851254827
