8.50039120315529
7.9480595510460805
8.017393899202704
7.402971675458544
7.166772437156965
8.808707005964726
9.170138324776712
8.649673655238429
7.929210888797112
9.593147821165307
9.050887802890617
8.734141998419437
7.774659709783458
7.095964411492183
8.806672577992773
7.905684050819933
7.010020399860613
6.949762759691358
6.9246748865465975
8.196610184033256
8.551081698005929
6.96123934249284
8.59607537839734
8.34677221395448
9.190425545480554
8.295849005525769
8.605125637941551
8.314187119609263
7.447741013895477
7.681569907757566
6.6172305938321125
7.692028363409816
8.330150493801701
7.31961114771183
7.708167026246794
7.832519879659596
6.385624587787858
8.714658750722037
7.849659917054546
7.312928245918073
8.978687951651112
6.5079526480253005
8.07463696204977
7.386922992825342
7.630307175707734
7.984187508554584
9.359643391976297
8.33166190138177
8.374685539564815
7.803122499250906
7.532724619873747
8.69935759183636
7.5175907093611825
7.0776768538450865
7.459897194858812
7.202767823075434
8.063920634052572
8.702713738349367
8.53905876869916
9.375107370698537
7.8265460390526025
9.2050163808736
7.3047811712967325
8.338313850044171
8.44086189246556
