2.8492831881557237
2.8944671235874044
3.436723786957041
3.4370964527654393
2.9506645401333245
2.348043230779957
2.276905195215132
2.333229303721136
2.602371955075061
3.6509838345451344
3.2841028135184924
3.1471331988406823
3.639462120728359
4.878808626555928
3.452366701048687
4.048470040891332
4.514321544931431
3.1219380857033423
3.0019600885577367
3.8594375728165984
4.25720032975925
4.428431350176641
3.0845646155938384
3.2338531117576177
3.3889956885655157
3.3318828231261635
4.1265803995397095
4.286931900196518
3.7091118745636127
3.11751119351672
3.1035875076610613
3.7159721661146174
2.6502023045821628
4.537297990051568
4.5294646230889
4.396817859071635
3.2755346615473595
2.564573658092661
3.995788260259857
3.9445686089303016
4.2468823990086015
4.169125320514642
4.081091299386972
2.8896376363606606
3.1912169465232836
3.355080120178379
3.162932617001366
3.435415053961953
2.9876635607549034
3.194313959928258
2.9948116344478044
3.2943287759237685
3.6959289349319113
2.8836570677228286
2.7241834142046084
2.8913831840713686
2.36121897018446
3.4743514324715727
3.1451170978994014
3.8492752122447365
3.444172840972085
3.6271272081546906
3.340516196624089
3.2117975570510517
3.412872516318631
2.3168015546995755
2.9123214295298494
3.059385835573185
3.0390135685538815
3.0764734619057204
3.0023901797985384
2.79774380726836
2.3523657645467067
3.0507208808612742
3.2498059474464607
2.7048629152905432
2.2548595812003764
3.350413314075083
3.3342288881277935
2.7880944464917032
3.0762613066503404
3.0194418731689296
2.7006529708309377
2.401610822882144
3.271861859776908
3.397577200053582
3.4748842418142107
3.026159816475153
3.148832231383826
2.054076037485161
2.607174319736833
3.263101184480859
2.7090988709683783
1.7464696253623502
3.4920939153850035
3.2110787037481376
3.2073921057538928
3.6891984476539337
2.842984299299736
2.894250396649502
3.2352593089450354
2.595922643312326
2.6657144261864523
2.69174732644856
2.5182432352037765
2.992324353431207
3.3563353191705407
2.032619774455834
3.8833567771316257
3.9926457062216985
3.2809189083933363
3.406382761172527
3.034599385829409
2.07671906599747
2.7729262224286018
3.3560365139601647
3.1407930300570226
3.0030913630717007
3.3147504589635197
3.017211516735041
3.5546330947031586
3.2571004800158048
3.1533836881231516
3.3823670899949367
3.851114827394015
3.7850332399448163
3.0909953111338484
2.7336100815788598
2.3108437163080318
2.486284150390901
2.4520301237467033
3.16662007976866
3.127574771122125
3.133327986925866
