0.9176805977591443
0.8877908338734921
0.9312466848388684
0.8845263136803594
0.9133183341549864
0.9041352170013144
0.925425119068294
0.9104525305967759
0.9124211077444294
0.9301102851118233
0.9075106261408634
0.8899029976849946
0.904127110664734
0.8998343432340199
0.9158653624705368
0.8994629069710446
0.9204216945844016
0.9045965412967988
0.8855783944896728
0.9185234937873824
0.9258425307764904
0.9097348404035202
0.9151336441601936
0.9380793998993656
0.9178877810278924
0.90196546346727
0.9167561924979902
0.9626566566467171
0.9428675640596654
0.9522979534898356
0.8599198668598647
0.9324265364658004
0.9102758351099296
0.9431410679593506
0.9089534210012756
0.917944836945226
0.8846543544926697
0.9188703968922024
0.9232452825667584
0.905532324333975
0.8953204590648706
0.8782551604928337
0.9329123366090528
0.9216413207814458
0.9305454482190186
0.9039411888010098
0.9045416067562126
0.9104792027310212
0.9215454270705524
0.9195369162274254
0.9018403192704242
0.93304263970414
0.907223219941636
0.9358355823766432
0.8853212341860055
0.8825132292210008
0.8933166484443011
0.9167961733517084
0.8766141343580537
0.8964783188836413
0.9143622414310802
0.9391154316756846
0.8768510732744645
0.9311370286360872
0.9079915512292304
