7.577682991523728
7.602888658054815
7.76784810138327
7.286711437574068
6.806145215652608
6.220811107954859
5.083316252523533
6.742811320230553
6.994371047485256
8.515376354808355
7.098210668847097
7.185907481534933
7.3830975077212635
10.64466116306389
8.331770533594986
10.39645476455684
9.844914550271586
7.431906213892743
6.7060207094138145
7.98569086253898
8.471416916603127
8.09304445362735
7.129171782139206
6.78642433644107
6.637933873615294
7.806962612297857
8.117753609515303
8.505188265890569
8.145304942213938
7.642250041212639
7.416005795951679
8.38074759307391
6.82937115884049
8.631101294172845
8.728651026816404
8.507383930212404
7.16074161295269
5.971727121953402
7.8701678891247395
7.592242879959725
7.809215782606326
8.023221696888385
7.919292160628484
5.427498409559812
8.237344029478384
7.967198502176895
7.9639708202508865
8.116112826305088
8.790960973439649
7.741713922664172
7.091358359611059
7.4906384356147635
9.337587998506715
7.8769046853017635
7.211741501208565
8.136299091487802
5.419442675758627
8.874518967297742
8.036913837377478
8.683959093238045
8.421623549772718
8.288490181932339
7.686521095183465
7.003187332866269
8.472271260034795
5.060367990971526
6.758153264075002
6.985181333364595
6.967643534736521
7.0303049614032656
7.484957691649804
6.236354970658011
5.9408666370563905
6.859868511868409
6.6474440972414035
6.402452186395601
7.216305862488012
9.24435634236423
7.555996197351784
8.695567508108528
7.097766533262276
7.616199608333711
6.599514374425394
6.8492080647024585
8.119209699785152
8.313048427565144
7.92940239970885
7.047927365663962
7.194037017964245
6.543432861618001
7.489458672540904
8.194414866622418
7.081533641253524
5.301626455937244
8.192278508975765
8.103073635004765
7.74660679894481
9.414520965150546
6.888951767503735
7.8010689658682555
7.392889837385266
6.080568927782788
6.926368920802515
6.573404939891787
6.425030076519839
7.855344378073238
7.875282658035597
5.523880524363099
7.9789920292008025
7.954204945331269
7.0844824886659135
7.714180293685614
8.226758202982886
6.730238559316713
6.614911407325858
7.914633619100617
7.389588470783215
7.07665378970243
8.175929032884657
7.4857142051685885
8.081244078317905
7.774866785686118
8.206926662270297
8.84680124327479
8.260605611001631
8.777626378464284
7.557896830473594
8.95888699224785
8.234819115574343
8.427657806229192
7.725190379897245
7.5158706132869675
8.053675240613668
7.395317754744567
