16.543859649122812
38.526315789473685
609.3861546782043
35.89763779527559
48.10714285714285
7.620689655172414
7.564102564102564
8.625
32.42
45.45751633986928
95.93388429752066
62.721925133689844
157.65139949109414
633.1126346718903
144.97590361445782
85.60076045627376
122.37831325301205
6.103448275862068
25.227848101265828
82.26037735849056
47.3936170212766
93.01818181818182
24.65217391304348
34.256637168141594
63.02197802197802
76.47417840375587
323.8898043254377
1043.9408934707903
129.0051020408163
56.268965517241384
70.77142857142857
224.95460992907798
27.66666666666667
186.68049155145928
629.4422310756972
321.65789473684214
134.67582417582418
20.876923076923077
652.5946911689638
132.56294536817106
128.13488372093022
740.1322654462242
50.684684684684676
3.7777777777777777
22.756756756756765
36.121951219512205
46.72093023255814
177.43875685557586
116.53719008264463
130.83684210526314
38.843971631205676
165.31555555555556
90.44444444444444
67.6063829787234
37.304
78.11627906976744
20.785714285714285
130.07253886010363
49.62962962962962
62.36322869955157
10.483870967741936
60.35078534031414
586.4089912280701
164.0
351.29768270944743
15.0
76.92682926829268
79.16450216450217
129.96954314720813
75.75
70.95238095238095
20.59375
31.160714285714285
1.9333333333333331
8.3125
16.62264150943396
7.857142857142858
28.214953271028037
45.645161290322584
38.21052631578947
173.17758985200842
42.097744360902254
61.240506329113934
23.305555555555557
380.3232799245994
138.97922077922078
12.549295774647886
81.0
96.05882352941177
27.65
51.201342281879185
48.219858156028366
41.54385964912281
9.333333333333334
31.976377952755904
20.49367088607595
31.891566265060238
154.23413566739606
24.768421052631574
144.02483069977427
156.5151515151515
7.7333333333333325
22.88405797101449
62.20710059171598
8.333333333333334
21.309859154929573
117.25753424657536
8.179487179487179
542.7142857142857
84.19024390243901
22.95
16.979381443298973
12.764705882352944
6.9
37.837209302325576
32.88059701492537
74.17699115044249
28.62264150943396
41.09032258064517
18.96153846153846
111.77707006369428
15.057971014492756
36.72222222222222
17.3
60.00751879699247
693.6415289256198
17.776119402985074
94.68382352941177
28.506493506493502
50.098039215686285
45.862275449101794
29.0
14.321428571428573
34.32673267326733
