4.081477504079041
4.026918623466002
5.334302830593944
3.850459775429828
4.050371727210675
4.187966423746478
4.303255613413568
4.26336628834292
4.524829164197173
4.388662525346696
4.445586228551652
4.101914707890427
4.510477044177728
3.8756381004369977
4.844254606862098
4.009877167297552
4.05971880808582
4.1278662567104645
3.127578972174146
4.4521402132973
4.693515157845908
4.484588623170124
4.642580116547763
4.478191167484101
4.280071891655247
3.9002898665792243
4.394479931804176
5.323771907776621
4.627857108894171
5.08133203557158
3.1702333737001016
4.272789432628003
4.56705701686649
4.48623808557693
4.384305378413598
4.191294605775689
3.412862416391123
4.090209096156958
4.4575563950173205
3.7771897760901765
4.18755780525301
3.6118139712675936
4.673832163913776
4.699120661374502
4.6847156574733395
4.122447833875928
4.48577022318154
3.992489906816117
4.717394449149858
4.272642106970254
3.851076287668298
5.273262840468729
4.01726698687817
3.72030458505916
3.7229770431703697
3.734992135895598
4.060016997966944
4.7505915047299965
3.6016782157494034
4.4582956879156335
4.085113518107409
4.666387712671426
3.6791118189288534
4.352428936778303
4.045409013283237
