36.310266527832944
38.094518464421256
144.01637498151862
32.92819678936014
29.99939600018601
30.672144138051234
37.92272500624677
24.872367374527837
40.80125414846817
41.7528126391654
52.53499476004996
46.494808440449155
44.46555958694192
62.00678855893585
79.524172101093
47.50373424106471
46.159543384164564
26.903108597284174
40.15418377618259
45.039371475523005
43.83319465025416
49.744734749055674
37.21497331574486
50.1570181624393
52.482594829236156
54.4688325006995
141.06417966019268
132.40827853548828
60.37314098963298
43.78475199708557
41.972310884456256
89.36125502098648
38.126352955309684
49.855725840146505
82.23348824010061
69.30383819035595
73.87638407022243
35.726159529558245
102.22197579985323
57.517119670371024
55.07777094301095
144.3270054429249
58.3999870457047
23.638671148811234
54.36635982224914
49.94173072587201
56.635227248189814
63.09450176484558
69.23214546596337
99.55136944658977
53.75505645388489
67.15540703359378
55.16065542117989
61.79734340253898
75.36296306802551
79.25714310184297
40.969000471500266
72.15006067983252
75.90264409099913
66.27861286044751
40.969000471500266
61.501492738053024
166.2062971682595
81.6237318983198
121.88822006124
32.99329747422431
60.44574076222364
73.86563500235924
84.32557697839522
63.75827164187238
75.53172201720142
36.60071641398023
44.84682351455567
21.19242905077815
34.208743007373585
23.909441167729646
45.3860455144685
53.66645729229445
79.08096963815714
41.77850081672587
41.48944858481576
41.48944858481576
46.13929638627478
30.162978928672853
127.3465924241822
83.19898702298238
29.66082529001453
69.81455035771836
81.33170555653773
39.64443502734899
53.26512267954879
49.423456524302
44.898274371114816
34.36519946405232
39.697953609121384
32.53917058993152
28.570593957972388
56.50538218021387
41.183619129687244
57.80911637585569
79.92673084054198
27.95913029618313
63.77322192134027
50.135623101098005
31.97373265788849
42.92832420065753
57.432684463020756
36.55735160901346
134.51834344393478
60.4943567591807
42.3848581015563
39.12628795709807
33.126640998931215
26.056663975820626
34.89190417283987
31.65923064077245
49.826224663168794
31.93942272870886
38.573968749189866
33.35328773867002
72.16404008674004
29.99939600018601
60.351481720212924
24.915465599209472
62.99347011088791
123.958321304107
40.606447837222
95.91780966821464
42.00898755505053
78.13090368318775
84.17714876174665
30.949951132395288
37.09320453605898
33.025799694096285
