5.71983370073111
5.412275972264949
6.536737277434572
6.527815657866277
5.978448610205518
5.055057726354408
6.889689640689741
6.060076978078266
6.375856998872519
5.957105522199724
6.922157356764827
6.843830024065593
6.006110990197121
6.691700165099414
6.715270534618765
5.865104448258782
5.6400682236916735
5.9186716376441
5.670936235707609
6.276470484639913
6.386263500142585
5.630508384846144
5.482487206505484
6.687158673789113
5.548782442990738
5.681660136130174
6.968435867163596
7.727743779181953
6.088351421139756
6.173126830257575
4.365487713456423
6.077012042637927
5.5194346272186285
5.651500826789494
5.773835459106861
5.681961217291866
5.497292909246336
5.090536153995246
5.2379365767958666
4.830902279220054
6.392686635042296
6.735009453908382
5.700098136533552
5.762004451861642
5.880031086990764
4.8622860701246955
5.845125608838894
6.8620847407914045
6.378837746487653
6.120181787047961
5.025538866025801
6.8914169647961625
5.830710962081514
5.504628126236233
4.385956975623237
5.047794469723124
5.0884330490536955
6.786324926673319
5.376868594600986
6.7314479237454625
5.605494282133481
5.670474485992833
5.385691348965728
5.06483289055969
6.185235880565151
