3.459895563460843
3.58184881343304
2.9540130009379086
2.9229873825612467
2.760172327183016
2.8182868576404307
2.681400987403454
3.3304540108803407
3.259071232730692
3.396600222936517
3.2995592769797657
3.3043673978401267
3.437599882048528
3.3020840862229925
3.343103549669877
3.1294810990128235
3.5942355637894696
3.1387949582139543
2.87599165774378
3.2934915759237064
3.4692491858686187
3.305489529303532
3.0066783358693265
2.7039456872395533
2.9982869096673346
3.1496510538372724
3.3821057366769613
3.3047817762374647
3.3331771205354417
3.332954853787545
3.1608205866155688
3.415647504781615
3.3866736658391945
3.2959940487457646
3.329164780071857
3.1674466039584814
3.105193837408228
2.6595117840340547
3.340984052057628
3.0641145944639616
2.9403973781484063
3.084701975117307
3.1396237036926373
3.238972752052852
3.1084976101817885
3.06297073459706
3.175165522747893
3.556560709101813
3.2353029780698463
3.1190349840445006
2.981723760723612
3.2290498336837943
3.0069536687376246
3.3476363742784283
2.859326273157037
2.8490517453343065
2.7256236733645482
3.2899009439001734
3.15246700538718
3.5639142498054825
3.2234670150781333
3.2672931686167663
2.76682180437859
3.001492969346828
2.784766597551197
2.5208127651623085
3.2942333896721028
3.1192569358148976
2.8396357442297018
2.8151027696951765
2.8291446282288844
2.7427644823307062
2.9757978705655015
2.864410229774625
3.1754057680008225
3.1456529048351047
3.4550875227373408
3.651068678498423
3.195241073031128
3.2284397265063616
3.1115445473891468
3.0854719983040617
2.6668784420844407
2.5783452278831183
2.9479089401789462
3.1315655867755963
2.6819298409622445
3.2706930956659734
3.2619067776872552
3.310247755730814
3.6325375101537754
3.2566960920738595
2.9143747351698015
3.091218931332937
3.285082675000512
3.1422127532426285
3.203891820044506
2.911614053409008
3.0124684239503816
2.8829905910945075
2.7902674236470753
2.950583942347333
3.0024329386274675
3.0089243382771227
3.0842489920665783
3.226775872414392
2.8078839128790234
2.651141671218918
3.10442595345712
3.2817438329332966
3.1658127481934724
3.0295906350487383
3.3925336374870962
3.4680931954383256
2.753973838909671
3.5236598432403814
3.384410151276
3.0181642874995647
3.2880470061142835
3.4044431560707538
3.0522611713972316
3.1885884539151776
3.5350928134213966
3.71813041186302
3.43816677231186
3.4208324158426637
3.1635822205667936
3.9279872125737976
3.927270589872634
3.827438063568327
3.616907866889715
3.2889967040290866
3.2378604916465865
3.4171190466038635
