4.0474020650455955
3.8145432193190536
3.981387290675921
3.910312765380507
3.580221597564347
3.6271299515867366
3.919145134991972
3.938869853127057
4.204665061265195
4.138339619134471
3.792544146128644
3.789153783664978
3.9125857487008666
3.9436473648415733
4.121119302774254
4.149331980264089
4.150880473390338
3.8237781815267886
4.001668291260292
4.0979594747089525
4.102108995620207
4.08942456775905
3.931167119109134
3.921040719280693
4.0043049387583975
4.0618139209744495
4.436770144209501
4.255238714588005
4.075437649351363
4.005579393074064
3.7262037928168987
4.136356904894881
4.148260528536606
4.202409404971985
4.192001063154774
4.132526842990563
4.030070350032738
3.604284647964
4.147437569936528
3.948668456034307
4.053490285073266
4.114601965226965
4.109310263858087
4.056730796000015
3.9326290451498265
3.851402454709772
3.8774342863939815
4.037979463224822
3.874537617615559
3.9100968207903177
3.768971594007638
3.866553604666813
3.957008453050957
3.8492774132166865
4.192297204669108
3.8597146698482576
3.6065453003102297
3.9584213636832803
3.813350210312417
3.83838580474789
3.6461492245030587
3.6912966619440652
4.0811535589875385
3.9299391845723495
4.046550389934804
3.3365911429274546
3.9321914934701017
4.142542797874447
3.9467936903459866
3.8564392570041726
3.899719852866064
3.4831376882822993
3.8038643899655016
3.697319694237823
3.946538666328248
3.7835094151317703
3.923756304076126
4.215454418356747
3.9784062094032056
3.91513633410232
3.779187369565668
3.779187369565668
3.7492879512314237
3.754547990987266
4.015421746400855
3.865430549806101
3.6310237733968163
4.028917059588463
3.989518260518917
3.8662346494223034
4.077288650746239
3.849967368106946
3.8847665304830774
3.7665831409313135
3.898997614718235
3.7195063919697082
3.7933155289298455
3.995652482311442
3.822577763384847
3.9859830575123514
3.9915804037949028
3.779885936412224
3.912426810788598
3.8246166140733453
3.6567071133942557
3.8648198981289896
3.83166277235897
3.7964509869496403
4.121285760295547
3.964305908502894
3.830219648329604
3.8660490161343257
3.9068311330346486
3.8080881383368608
3.675193192039808
3.817694663888086
3.9312087174881216
3.7671834787380734
3.993348600131995
3.853940921459311
3.9702443940986964
3.636976340670522
4.015474383120013
3.9522578665823382
3.910475621970075
4.184238092891632
3.6936194122188217
4.0829339670854505
3.6620253858785987
3.8018795858449033
3.822939442339448
3.804124921965785
3.851761064804102
3.938288884437808
