0.3373333333333333
0.40165631469979296
0.1182950712653683
0.3122765196662693
0.18733509234828494
0.3903162055335969
0.43031123139377536
0.4315391879131256
0.3714055361461973
0.32593076420640105
0.403858120721842
0.4351351351351351
0.2906574394463668
0.2616632860040568
0.3548348203520617
0.27375886524822696
0.24628879892037786
0.26409666283084005
0.456896551724138
0.3965166908563135
0.3034649247372905
0.17517475111205252
0.3182718271827183
0.3504909253198453
0.4640883977900552
0.4159113796576032
0.3997958489282069
0.1673583758492162
0.17872648335745298
0.17101038715769595
0.30745341614906835
0.3130008904719501
0.2930872103974383
0.2316461468308253
0.2683997299122215
0.3017560073937153
0.3042394014962593
0.4432855280312907
0.2639357013222712
0.2743362831858407
0.45
0.4110898661567878
0.2870667522464698
0.21701561980724493
0.23345858519849694
0.3925501432664757
0.4717085288434998
0.3839662447257384
0.2771336553945249
0.2798900595510765
0.3533632286995516
0.2485857104373073
0.24261874197689345
0.22381477398015434
0.2880098887515451
0.3115438108484005
0.4370161857846587
0.3279262086513995
0.5826612903225806
0.4497941083306937
0.39732142857142855
0.3286962148172113
0.35018050541516244
0.3526586620926244
0.3933649289099526
