4.642157682905044
4.608526307919172
5.797258312625523
4.293381219664398
4.331602966624671
3.9779168746936295
2.8936474604335323
3.6289967508796175
4.359963165951618
5.170217497251183
4.688884682125397
4.814131241330811
4.763522765529929
6.571960805247254
5.6195367007080215
5.947291775521399
5.918122693759663
4.031401845392166
4.847988555073467
5.727912141281108
6.046420121678772
5.891523822246419
5.2035552529134055
5.033825798387044
4.8276088946865015
5.5345124570982565
5.8600120985900235
6.007176267557774
5.540789319555403
4.863940032151323
5.193265937398811
6.003913506008791
4.501608224985644
6.161523117827652
6.430298478349202
6.284745207565802
4.785656548182017
3.4024783564023844
6.067686080716309
5.830945175816519
5.798451383193617
6.171723660195387
5.698043974748526
3.0271691184406158
5.043245607129814
4.3446805109895585
4.564722013367693
5.409941243734334
5.419908142721024
5.30478473306797
4.88461916544279
5.2110695919656544
5.632258353376577
4.898734740718626
4.825240798145222
5.397589679588371
3.9102329406731786
5.53199821078867
5.477058447376992
5.880382545485669
4.85195927123142
4.9430936988716905
5.663881886877696
5.203575806983366
5.8306159208927095
3.8524213252895914
4.970455784825703
4.957073177133017
5.153053256708117
4.986744739455987
5.281218394603796
4.326370130156172
4.522020164833696
3.5341591278514173
3.673269689515103
4.5433068055297126
4.143892585265457
5.130983491390206
5.265433954202697
4.779097739238504
4.900799307016097
5.1480919441796535
4.662678882547318
3.881022847062464
5.620751525094015
5.6429681674427234
4.977719969293416
5.0614587529491954
5.0899900751257245
4.280234279205246
4.5304486628326135
4.89014302756863
4.1685509678187875
4.110577243331635
5.481583481350384
4.8665427521648255
4.931232272631736
5.986559274269004
4.670421723855398
5.290546740908997
5.373725323595611
3.7409532604048334
4.400963451192808
4.7050212786917305
3.871895669408958
4.856821436926102
4.909002208446582
3.3240311980021318
5.763758846767923
5.109303282806933
4.80487881942807
4.9698365020455375
4.626629167387813
3.3082708345352563
4.884829508503249
4.982007950621876
5.110983579982621
4.4703177378389105
5.136963250417101
5.173681194622659
5.325740830170875
4.806428491188684
5.267588628264342
5.064466123018118
5.087528242071434
5.800414951094543
4.874981078046597
5.155703702683417
4.3517246333858015
5.013012657876977
4.65519623370456
4.369077162622683
4.725596080169503
4.856468051217262
