0.006372074546741449
0.005907971416209018
0.0026609291582109125
0.011831540780938395
0.017133368337433254
0.03991694811688047
0.032919895391174105
0.015215411079347946
0.007627337154668289
0.003837314128635542
0.003766972850554904
0.0026294904790519127
0.0034976047826082075
0.0023502212174601076
0.0067935998303609866
0.004114389919734889
0.00487059262805574
0.01096479682358014
0.012561480834470465
0.015240580516146716
0.00996290747835624
0.008040370176400987
0.008951055377133253
0.009657344867428991
0.009682701347903487
0.006603187878963877
0.002498914141381141
0.002483093877250708
0.007009875776184517
0.0045686829538774155
0.011219233423773749
0.0020860779075774615
0.006203163505835104
0.005805025298049956
0.004734917883639842
0.015808914862189244
0.010648372191592887
0.015530982553967346
0.0016712801703048054
0.007523908440171914
0.010471443838237535
0.0016148821487724444
0.009679652524960593
0.04944449674067812
0.006081397394293229
0.00649384721428191
0.016663257860407354
0.003904841666743913
0.010124713522654209
0.006595119234529516
0.00790450447355988
0.004141116565428019
0.005410534149343443
0.004043015850268596
0.007974385226290513
0.005012396733759886
0.022296760945228644
0.004113140826685827
0.006701962874545075
0.005701308666353295
0.006271100179404059
0.007281165203055025
0.002792340997625778
0.012195707194555363
0.0026419713511003843
0.019585365782780258
0.013675763928804206
0.004930926599550629
0.0030048675042087104
0.0028677868995991827
0.010553742392549158
0.01497810117041559
0.012384212360270036
0.030982202703688358
0.03353759433959158
0.014247820528781424
0.01820357274133789
0.0030449411012952315
0.005150294507829289
0.015373680413316215
0.00941830564752734
0.004363027309354339
0.012349997417437116
0.009844959866905709
0.002254425007283543
0.004201253943153939
0.015391234739165106
0.007534189287535648
0.007358999036333555
0.0054348070848971395
0.0079618636600691
0.00939542890062914
0.006906502718435396
0.02544524471483044
0.013641735882793502
0.005497430373088193
0.00977488516828255
0.005923536702977032
0.008306959758471512
0.012768530407153936
0.008212451518103587
0.019814986682502145
0.01078882526817976
0.012912113318451235
0.01681457973707183
0.006405949608181912
0.005428099394455906
0.0215109359252699
0.0038249731353981096
0.013496747048629243
0.006701551773759474
0.011810571151096363
0.01849608669202743
0.020357815069268176
0.010851017291751005
0.011514538105967998
0.003161342124055992
0.009911446875420924
0.008800720697065478
0.010325250259540758
0.004493633444335612
0.007419625725675599
0.005101171354976434
0.008070956757476258
0.0071489319117221985
0.001260466586680757
0.017382609064037068
0.002242592921789831
0.005184368052225603
0.004673282725764271
0.007650182862681865
0.02276889591097568
0.007085266730215751
0.008913123591464955
