-2.5751203112376673
-3.303838281464777
0.8396912219715997
-2.3820217591786386
-1.967623312768652
-3.3657212232246465
-2.0869259691527096
-3.7099121646085007
-2.0061258912348303
-2.3340679024859297
-1.8192745492216627
-2.594196826102288
-2.164096353275524
-0.5203365853610362
0.09502564729290292
-1.9755345264990374
-1.8732296221506801
-2.115420435214547
-1.8368344892789612
-2.9448612141594555
-2.421046110276154
-2.5630697741619524
-2.1964757891897917
-2.2387861572342307
-0.9655670801419616
-1.7543302959997396
-2.9564886189866457
-0.618202125060068
-2.9732915213004922
-2.108224502507403
-2.5935606534859557
-1.1704574253534659
-2.1436088249245047
-3.685863012740703
-1.1450744335401564
-1.8434567692573496
-1.237484728962247
-1.9363337994539906
-1.4043696953226612
-2.2316853453780388
-2.228443907574476
-0.2329216796969477
-2.90483442611234
-4.492752310949319
-1.3892590644639966
-0.8282316631914878
-1.1529534533290262
-2.0073554674874354
-0.9498714041892211
-0.9387024308605056
-1.6742471765413651
-1.0894031458574442
-1.6485735893870008
-1.8140397928597136
-2.426388806966221
-0.8786326111917016
-2.314169803272768
-1.023164977748506
-1.2671567268292023
-2.4055299942711637
-2.320031203041386
-0.9315490847114841
0.06385044236079433
-0.6712698831587198
-0.052606212228996405
-1.8715049333160851
-1.5351863164669102
-1.3851954148496333
-1.0324840063906122
-0.6901217272855397
-1.3448679403735235
-2.962064638606882
-1.9586150578924912
-3.273658868646413
-3.1777552050651496
-2.654971932087921
-2.6113045699119555
-2.6056547247104844
-1.1596969871213498
-2.1944702531184532
-0.8131100950705974
-1.8111587294898064
-0.5308207711387714
-2.0750821924259535
0.42955954378458333
-0.5226722870488764
-2.439810310508675
-0.6281395237471622
-1.246427165277077
-1.5734327917143525
-1.2256099201382282
-1.4107972633851356
-0.7795366118414234
-2.34192575051725
-1.4004236180277863
-1.769963930175693
-2.641602227586057
-1.2459445606443664
-1.0615965901762883
-1.7645579851549273
-0.4053327226841943
-2.783461667672452
-1.2847043410733008
-1.6183514802513987
-1.7561446799441527
-1.25146075980838
-0.579542460678992
-2.299593460395149
0.4370882416768401
-2.308633980544664
-2.0412961415294406
-3.1931030029886256
-2.9211053746759004
-2.832252138061156
-2.72094592371033
-2.4427593058031905
-1.3985191925799372
-2.528834594821217
-2.187221119188751
-3.3644467906401974
-0.7960796070926185
-2.1734871169411267
-1.7407413451561817
-3.544651947330936
-0.8202394809701391
-0.11286111398524769
-1.195951406387807
-0.9789074512624094
-2.2376242886728535
-0.5826789388403952
-1.1942117291139982
-2.609292616712177
-3.2126579847420382
-2.094964508467851
