1.430923581871314
1.387013792441419
0.9180531169230882
2.1256665174836114
1.873225598990575
0.659433302631862
1.9196814038917847
1.2379508992512158
1.0774042834412736
2.1840648609465982
2.295382438724826
2.244334069112017
1.305516278081225
2.139098630927893
1.6359915020231135
1.7031769170300584
1.1107872232981928
1.5082791848807282
1.9131214284606062
1.6105812030404258
0.8804030046364807
1.0126962322260002
1.0650067375595327
1.6432659768645619
1.5680248791457967
2.0699144021471163
1.6051498210308541
1.1705653520338901
1.551593459663825
1.0430357369620562
1.1698825854377575
1.6630360066242773
1.2944688627859198
1.3721135970075333
1.36281210286008
1.5860539745836622
1.9911893102790061
0.9745581754696312
0.44580249558090845
1.4286745570900499
2.2070069700747177
1.455861211025124
1.2287322937879055
1.1890218515860627
1.247675647307285
0.6854195017189288
1.2845119426436715
2.2319947829135005
1.4556008112902887
1.9017374301181105
1.0912522501065145
1.2965277258849168
1.5743932165351802
1.4005672374813296
0.884720914111465
1.6816295542057802
1.775758952309003
1.6448429971803213
1.7487516523371576
1.6468119192921113
1.6544570814827821
1.0994408374313291
1.6579826963100897
1.1063236283732423
2.2077370970764254
