0.2028791028584774
0.14419329889901294
0.823461301005438
0.46761631651374247
0.17457600950446914
-0.29586952460061167
-0.9578595273857887
-0.37601237054251274
0.01790208014174761
1.1233028135737586
0.11809503493135223
-0.04639258656858512
0.33318648630147624
2.552520623390148
0.9380163654686287
2.16580837930588
2.1040555226642423
0.5345876231799542
0.5810729970300655
1.4202740788910917
1.8370558598010385
1.4456900540203326
0.6727283845808876
0.656250381905672
0.5375188753559186
1.0990156969487375
1.216947405281767
1.452289668827142
0.9647553952934506
0.6416656161062603
0.5103955963776594
1.2698918095382945
0.3730054639605807
1.7056349870484637
1.714935924013553
1.5783820283533763
0.391025015351352
-0.4744452693455932
1.3375420042220578
1.2370085105284787
1.3917682771897602
1.3690024896102455
1.4726473054890143
-0.40494511657060783
0.7685277675387735
0.6807457136042409
0.5686327959765568
0.7468199892245055
0.7753328728208606
0.5394111184683021
0.2597326467954968
0.5270020568441894
1.53060053091303
0.6256753292619693
0.3413146544655955
0.6797398250008309
-0.7589890669004639
0.9747815033682219
0.5096698804534608
1.2431593716325788
0.9322664383412316
0.8988218927784266
0.8744042151585235
0.70112357796672
1.0401183544572707
-0.5616573543787684
0.2137018856705094
0.3929308456609007
0.4360060798143542
0.35419982498811886
0.4045297545561466
-0.04586856557354567
-0.29515410758394384
0.37195236999922826
0.3612955603437364
0.2094787388372203
0.12481957793319445
1.163179791545956
0.7533343441803985
0.660452438310224
0.38744577883447506
0.7774396829477411
-0.14068885512189458
-0.17949411099739604
1.066286421033437
1.0583173825135606
1.3555174155665446
0.5325835267587161
0.6231544496262712
-0.5833765557231237
-0.20049239489610107
0.3379108313283114
-0.17294642040552222
-1.3477183546721494
1.0475730544641886
1.028506847240906
0.7649775505397172
1.7185117698078292
0.22045472287784962
0.263136498602136
0.363390865966269
-0.14053213078161292
0.25892230043545233
0.11506690512772556
-0.27397337047170583
0.5231201403548326
0.7148395140495352
-0.7248409945243791
1.1671734230307957
1.2878388200748156
0.8293462624580356
1.114077039300435
0.2912670966863658
-0.613902591854027
0.37578824515469605
0.7381736517135972
0.5592740133535106
0.20169500283110492
0.8399121640996186
0.7185475751143059
0.9427570053887827
0.7980707932813201
0.7595906610530057
1.4388043365980012
0.8994436262756805
1.0797044169840744
0.45533933294750634
0.23105765422542063
-0.15365890499730156
-0.03464430590156811
-0.459630763132386
0.603955068766939
0.8410459342286446
0.5442305339357256
