34.93594516656956
31.54002135160823
33.31604299981497
33.770071572179816
32.278256486940776
21.013198289876488
20.441612824914788
32.59130100555312
31.79082401938443
37.69503018365217
40.87869817110557
42.33361391302782
43.78099523579289
59.36636251513174
29.334720880448398
49.17283638350353
39.30550042231986
26.41804865613068
44.52370362750732
53.30131348064254
48.310470933646094
41.12214276800546
31.89917202292676
39.00114262171781
34.412262921135714
42.1617253261086
59.44959946846023
48.31116603171294
49.82969254510324
42.238002030234604
41.3355985276567
41.58453346725033
37.90074441034784
38.77341586419461
41.989825737375575
31.312858769140085
26.144228065808807
29.083368982451216
60.6940049399407
60.15237968584193
58.43140642321322
63.25019040178646
43.55591743435543
40.324693735420865
34.17632530106919
26.82052613898059
31.762053726531892
41.420349249164616
35.59074308969403
31.33290849574605
37.51115448948372
34.046508233321354
36.07285600241462
33.534829300548445
35.04134896971943
32.876985235479346
34.9233790613579
40.30433555454794
33.89722405102109
44.22000107706138
39.800161375658455
41.208415892541545
46.434188220380975
46.24599886631418
42.72198150459501
35.53375446560662
37.43073278632144
41.33764311142304
39.64539114110094
40.56105502551196
41.655184874209816
37.912893466651404
28.804984841694626
39.303195499483095
38.64022727908189
36.96090701606375
33.363426022464395
36.737027188746055
49.6774345888692
43.251903981535165
37.48009960374371
38.722495843301616
29.373124080542578
19.381828168619567
56.915041455995045
39.67568482885791
49.948475324737565
36.830759078593054
40.16040868415382
27.380261485388786
23.067630814581925
32.78832290734842
25.607586246919645
22.36894320823325
43.990232990197974
57.52329832986169
59.004048502844505
41.350645335288526
30.097235188998127
33.25298119368559
30.847042250278875
25.00244212494494
32.86645139606886
33.269883089874305
31.39862337561936
30.143130704088808
32.88147784280995
30.754058072262396
43.41726380461808
39.8235020880019
42.87974053088345
40.77718408455284
29.9593775713372
27.013464656116824
39.578614511105684
40.464917030570895
35.36629847398053
36.06300648111574
39.110437667195356
38.632260272243094
41.21399002493399
43.624210683235894
45.71979700796047
63.80175770082111
54.109034827220526
39.05909922078546
30.157371569490838
28.8868907813976
24.96344386120963
26.303488098713625
29.047255388382826
34.9099833755516
34.69022332304736
37.4521335410634
