36.30467517446094
35.22576439030288
40.27898422098185
46.1988703479853
35.47234015489194
33.099413863510456
57.81717008361663
41.64868450769592
53.362375744080296
39.41960968336213
57.7123454408766
48.38634034010427
34.69145055519465
47.77176951280649
52.177487828974684
34.016170338255556
38.99113012446017
33.8300877024218
42.40120850571719
40.47816921155405
32.468434230100335
31.691768337931947
36.86678384332337
51.42326122284651
41.38989602537148
38.04339195738442
43.88674697897675
50.31970598557537
39.01665123163022
32.24525998834075
17.591486389679172
34.66499242385605
43.18895680213979
33.70527293609146
42.16547805270542
32.96272647744566
41.346953661244385
41.52269993298899
32.68500174829153
29.364096297550244
45.0254729129157
49.94747687602777
50.125965374216776
42.44884362634215
45.93344149491638
29.36754659852758
45.4431785088807
49.41489033899036
41.010237929535
39.65083943269176
28.04027269106792
45.94748510563662
28.62378306107928
25.870204872621123
30.796057927654985
36.159368324919924
40.26887647739152
48.45960623981529
39.84910394300552
53.95448776515401
33.571407710158
38.09514660617686
28.403495478292747
38.631947994745964
48.392732299830506
