-0.01848627727756253
-0.022573260332357778
-0.014678330416976616
-0.020760439081035618
-0.02548572211172995
-0.028326226494175953
-0.018281512920978488
-0.030451127120482594
-0.009270309029994738
-0.01767625649336476
-0.01797187675695299
-0.01715482695358882
-0.021550905121065448
-0.016371075927073965
-0.0045042244535130425
-0.008954700726248557
-0.02141479623624745
-0.029774193878151084
-0.015109926334887693
-0.017286992761094053
-0.020127288556239673
-0.020691807557906068
-0.026390163107846306
-0.016479710982423273
-0.018166330144310527
-0.02028090845003472
-0.005404679949741825
-0.008795179161071682
-0.0165864734936293
-0.024266117204580773
-0.027050035261397334
-0.015750777331324618
-0.022888029910703295
-0.016524719148557503
-0.006092733064198314
-0.016656160395043203
-0.016678700614162312
-0.02051895572847795
-0.007231256993469533
-0.020715661574374673
-0.018172226627294945
-0.015175480300534906
-0.016002924562894896
-0.02791328418440235
-0.0047340525889200645
-0.016476266429933897
-0.018152664439805063
-0.011147224865414671
-0.01384616535266515
-0.014865006042648907
-0.021663187328354646
-0.019578991931423834
-0.019802771371537853
-0.01982116662532261
-0.006887003090055161
-0.013465701988278496
-0.008491982870281805
-0.014833187810091748
-0.017715673761258387
-0.012154705245607767
-0.020989486579187748
-0.024224180486452113
-0.003920572092304776
-0.009432745878432475
-0.009407697264782973
-0.0333960544082486
-0.012514039535358951
-0.013577814067530045
-0.011139746449370666
-0.016761182332121337
-0.01216309867821662
-0.0172349460426119
-0.016211340612648575
-0.029622031999779648
-0.020909650039482596
-0.023521723814329123
-0.01963323783744446
-0.013323688424677316
-0.021631196097667685
-0.01752749654795286
-0.022019825575819045
-0.022019825575819045
-0.02062334232188931
-0.027899907471452854
-0.007264633642727225
-0.019836854510161168
-0.017755120263801324
-0.015228014771300702
-0.016630756920822144
-0.018419613999741218
-0.018925537831464844
-0.013584493987921938
-0.011197169214621529
-0.026216069507847668
-0.020677119791730248
-0.020794314827444108
-0.02031908454441717
-0.014537571712495149
-0.01810783491791499
-0.006083330323588085
-0.004044654702257987
-0.0296846029585296
-0.017143870706933725
-0.006501943109959071
-0.019117873809540577
-0.02091627324369785
-0.020343608484779403
-0.009256161217368577
-0.009429767562152969
-0.014716998862325418
-0.02698030904490534
-0.027161289996113232
-0.017235847032889547
-0.023642525910545907
-0.023719441420049645
-0.024917743814559416
-0.01460003129125812
-0.01757078712592444
-0.01561205937209225
-0.023301747320601158
-0.012681229913821875
-0.013124234623305529
-0.008659866657056588
-0.01948405549965685
-0.016814212101981772
-0.009306570305843686
-0.019735383970161675
-0.010538760747898144
-0.027533787761052912
-0.013870842758730947
-0.014354220230693854
-0.02441943526479233
-0.023505210311347464
-0.022970708404219532
