946.7876114172336
802.4084727014799
2969.048641881317
459.8049556350152
493.6983953513244
1825.2053985507248
4537.074202181248
4238.791841359773
1450.3539320495734
1102.1287832749038
1139.3443987402056
2403.044487049549
1732.6213695373574
2408.354334291188
2012.5244187230396
1364.2975717100078
6242.79122225971
3876.6610248050124
2233.913194444445
1456.59708068358
5868.361203453879
2736.248006575291
4824.6462229347935
5356.8304007570505
9029.452171705549
6125.489869083584
5097.380675588825
4393.594694714919
1869.010203302257
6168.77009331399
982.9959454796413
6264.021798134956
5091.03950984701
5471.31999639003
4580.4835178933145
1621.1161186530987
760.853991410363
1541.640355280313
3271.1873291706274
5706.827180125369
2188.448794699872
333.6685755258126
4131.66358338682
2492.9214802061488
2804.4704064730504
768.1989578370985
1040.0100165655554
911.7241537740273
1885.90493684684
907.5558706163793
835.5291872273572
6635.547020583683
2574.3395974183427
1268.3141461472494
991.7721350089273
270.20123328098043
1505.8556106571177
1112.3032473301557
2815.5234285394267
1239.48555310626
538.8783974776135
6855.94188774685
881.4719634977937
1835.8680302077373
1540.4001419606811
