2.4803805904518987
2.659492970537129
3.9953609536083405
2.409287618860074
2.6119407136514994
2.611869267917138
2.4939792796756906
2.517092841165633
3.03880058377791
2.82435495017023
2.9829854835352916
2.503331669677752
3.2392737977695902
2.169580212411666
3.4092966497212345
2.388296490875437
2.2652196928383836
2.369621657009184
1.0903763455981794
3.1658937402109664
3.1111317801073928
3.20592127857922
3.074404222098655
2.798317770461874
2.25116407954466
1.9985177674086705
2.632087416530935
3.9606135681436667
3.3484597810792804
3.8425895880160863
1.6412897600855183
2.5746860954429867
3.0176121051577276
3.050863379444402
2.607090229313865
2.8242384618199274
1.8968527989508155
2.572074903002509
2.8955421336044815
1.8734748942013713
2.350831432260207
2.371082101380718
3.2099810563946516
3.2903953217987403
3.2726706164931345
2.758251415904434
3.131175292346434
2.2820681883601264
3.281477667793768
2.974018699435673
2.5326110063073206
3.915948286749449
2.428167468941799
2.222361098487358
2.0968444044854975
2.341277104538568
2.4841823910994316
3.379563974955237
1.6576154835175072
2.8614202117312573
2.7805026615636472
3.065604847947586
2.2796312687939086
2.884792614045239
2.3920357919123467
