0.6048254999666364
0.6225434546588456
0.4564785687504005
0.6289336442957254
0.6587528396906518
0.5695423067116157
0.6069135907246933
0.5703712444692177
0.6921226443068815
0.6360779197226316
0.5881603475394422
0.6134763630045464
0.642195016272012
0.6399709058629518
0.6005153759604251
0.4896483884091369
0.6932049712737777
0.6266752149517623
0.5770805361753064
0.6879817253275929
0.6876241301485765
0.668672635268813
0.6160555015326424
0.7448996802672174
0.6511658705807558
0.6728353148011992
0.6491855244607849
0.7334066559787854
0.8184319821708982
0.7408608986297718
0.5874974966096385
0.8048810569741874
0.5926365112916018
0.7591505166448084
0.6031733686837097
0.6719073208794897
0.6966350391911675
0.6949996476699163
0.6610578692055145
0.6395555244855012
0.49222948212135714
0.6284989589621638
0.7387554989483079
0.6829684799118194
0.6999506730785642
0.6632656114949519
0.6343827515875919
0.510070694818631
0.6170287978312469
0.7160525914471326
0.6936294852341043
0.5579406707831893
0.5683887070254185
0.8017829626309431
0.5878085670731644
0.6171679027989708
0.6256771603965772
0.5640619678778173
0.5679971596867374
0.4639537598384106
0.6427759214861269
0.6424788775047536
0.6029807332595607
0.768955632784365
0.622192416314503
