37.862338851865786
26.968225429964694
12.955627260007176
13.990464225833499
9.405133993558506
10.568858083251708
10.581398121437921
40.494733156541926
27.74025716560061
27.247756557686554
21.15606964634555
17.7678822277808
23.3540209075022
22.58284060088936
21.852275779389483
19.964933709103846
34.892550840627734
23.13816724025897
16.224112807709492
12.521160963350365
14.312173608742327
16.679026939251386
15.498014725726733
9.442816203676982
12.823687688399904
16.611003258606974
30.93490861624506
22.99541575837382
21.25007242049834
27.683259043822307
14.180334759813066
21.05257086268334
27.33498742012009
21.520525498495072
21.388501078048773
17.775257918275727
14.93266219678491
7.110058554503045
18.165318287482872
17.59567153970987
13.37069276128615
12.72339319493026
13.129535363541233
42.51585323855976
17.00317966014702
16.711073538219267
20.33311757736196
26.406901513669396
18.782763727457933
18.962512755210465
12.889329593319
20.467360300500907
17.60178459554406
15.082539718055342
11.421052554182069
9.42656286119053
10.707963322866288
21.125485638829485
19.928371784456214
26.12275511678489
15.879860458055001
22.14209610189405
13.141549493175994
17.771886474162216
11.464270017131515
6.038482959621028
23.33536885366334
20.401546941252167
13.156500666246414
12.51948174976377
15.080193499153529
9.86858033545843
10.40762348993808
12.619478842707913
17.226733375838837
12.594348471971314
26.259924217798105
30.031594200764502
22.015425877573854
13.641585447275993
20.53930632640793
20.53930632640793
6.342632046434535
9.2752534199784
10.71552243417083
12.772812626462136
7.688442761539656
18.107431289995013
21.582934077499317
21.394537276366204
37.58003222184042
17.833640490130954
14.149882437163885
20.067100534200733
23.17759838525628
17.07159379903375
20.706789594327947
10.826358822535855
14.132628451432359
12.246111937288733
10.408698522247171
21.53252240849589
16.212170864815473
15.559203397160358
14.606319273111062
16.891405710722857
11.269419804827105
8.680195421229776
14.095239204796572
19.78376382619285
14.4301883087464
17.751613662650307
25.99482349821526
26.23591224606251
9.694993813414184
23.220747051290026
21.027685517410752
14.751877583925483
26.228734270790486
21.86042979122344
19.49183327832708
12.74979068401252
27.881176913341108
44.98697534853738
24.215646543459464
29.02467214344595
17.162388035987775
53.882453129536685
57.11821702304308
40.912400445169226
33.88771286838447
16.53492968014576
20.760819466949712
23.83055287108387
