18.354259318615004
30.38687735365146
125.5582095090017
42.149783809640425
17.86397701047418
7.212497005088832
4.771387096714824
15.454695322542669
17.743231728764922
81.82338413482273
27.28362045558021
35.83172723889506
60.476335037461126
514.04902225223
73.41653617627722
370.4047257035825
188.50096403978185
19.369606875936192
37.50256396264146
107.67224941170807
195.1556856746638
141.10244097852905
99.85157234336843
44.510733819255655
30.28151159247773
194.7256889461668
176.7917027274466
357.78048565475234
116.2822048589818
65.36315245397074
80.10857072558656
250.86045237842131
29.935938663380064
186.63289997868083
215.01349097108496
178.06910661919372
27.76946919519788
7.4703554930865135
262.97926242568644
194.6955548436571
146.0888723317151
576.6918197592494
66.94780620885858
7.9561147504713885
43.78584501151861
20.000428257207325
23.720731505285283
76.93890124167686
176.9640445610292
84.10689140367401
31.457577323358844
85.06720353405359
296.77555629622213
77.64557118611404
28.48348293557823
65.90818147945716
11.195463200086825
138.41987559582458
64.70373960116038
109.1971725373196
52.81858186315479
44.18108830549407
216.9326993979481
73.08957681124839
230.21167384718086
12.492508538265051
46.67097018558618
61.880779039054076
54.057070642768316
81.61710452433124
73.22171899909317
10.182208704844776
18.961956345831226
17.055576624373394
16.720423242095677
26.781082471934127
13.705487158708616
92.679597499295
73.7064521265383
108.98639825154335
29.226086378213395
57.545766968232215
28.78628260252693
40.27312332696648
163.3778815088014
254.5516165001146
54.53698729408671
33.96201852602064
64.07694334342703
15.277532910301844
35.13073702180432
37.07509182834645
20.01783410362799
2.502735652575512
44.072373699843894
69.72879358598382
47.16915336091501
224.73250461930002
38.028448663013506
55.60056335422029
61.634899509591996
9.001042895491354
25.044621750501147
65.29331306294658
7.9228939553277735
36.14069267111852
47.46329661622065
7.863170788217904
334.538522666869
92.78312188334722
70.67551786764759
92.18881441519554
17.060798156902244
5.211956688675325
39.60070785914599
37.71310328362755
48.690822132536795
17.964110794245386
64.89966187207649
29.54424666262453
63.07578238995889
38.83183593778905
34.525152870609304
104.51542687678221
25.66082814938573
268.10181526231514
23.53026121948213
89.00198796902237
11.913097947948367
23.72672071806984
15.715805585309507
22.812955211998734
36.04123493912041
27.30574661979244
