1.8022950284019594
1.7834416706200134
2.017525734920619
1.74672088522116
1.7693366243947717
1.7623656650966932
1.820389937868931
1.67380774674646
1.8394801236135683
1.8320643502753673
1.8607041276023526
1.8476091200357316
1.846991592078138
1.9157784499154793
1.9493049801902516
1.8650056095829228
1.846991592078138
1.7233750967524308
1.8287486665494899
1.7891224245542678
1.8214296297820511
1.8684182448606985
1.7834416706200134
1.8726398990999753
1.890193628132059
1.890193628132059
2.032844934704557
2.0248664850408313
1.8970807149602806
1.8287486665494899
1.8291734612522943
1.9459807724907745
1.828013137810392
1.8762796648800337
1.9263644584594872
1.8916813307940186
1.9465021016654025
1.7991132777508614
1.9875714018073964
1.8983839466389532
1.8939731525902495
2.0024010587126564
1.904167263264674
1.6872190972640917
1.8700698893293248
1.86207938039072
1.8937108421485378
1.9082040848121349
1.9254208611619203
1.9904577530847714
1.893430312248909
1.9325686833365587
1.8916813307940186
1.8914349834168582
1.9505706871068365
1.9422596363308768
1.8090425429259356
1.9302136820893814
1.949812087400721
1.9286331495338989
1.8374676708041449
1.9127055038687815
2.0332001325211446
1.9613007894479237
1.9980345008578775
1.7926378836826735
1.8898469771775979
1.9053936599083525
1.9459617926764021
1.9161051964056586
1.9493049801902516
1.790422391616515
1.8458858551659634
1.6620278389874177
1.7991132777508614
1.7070986688246226
1.8533269575876996
1.8773137808746359
1.922652580291264
1.8458858551659634
1.8374676708041449
1.8374676708041449
1.8646571037905302
1.7214215848133196
2.0166230346376146
1.949013154325766
1.7497957094956733
1.9340771570729671
1.9492598141352384
1.820389937868931
1.8832093750208756
1.852112011446565
1.852112011446565
1.8043330686360082
1.8150179248057223
1.783668822944684
1.7581215880515506
1.8741553889454259
1.8394801236135683
1.9057709301434276
1.9559303688612704
1.7327721416965518
1.889241609929381
1.8585487842151076
1.7754586586632022
1.8409282963317477
1.9008872741420406
1.8012240221371034
2.0271680735260555
1.9131024812205557
1.8463558609327344
1.7956206660547165
1.7915013466577998
1.7319561069477944
1.7891224245542678
1.7494166964518938
1.8457204000616898
1.7751741638265615
1.8088918062684234
1.7956206660547165
1.9363053912654067
1.7688391289233218
1.901862379082299
1.7097553533968197
1.9175891284442814
2.0160812043125405
1.8153880983255504
1.9800811511598164
1.824510713591743
1.9553515311226461
1.9646359996854428
1.766722809592766
1.8126226948793178
1.7834416706200134
