18.71586269527349
16.203321488996462
19.877540973791962
13.498000843597204
12.520206952577016
16.424485821363582
20.240313309992228
16.62452553406675
14.809876546274047
20.53996198018923
17.640518719219518
20.444715320608353
14.249793524453878
17.6595184191438
16.13316651304575
13.451858005875199
19.50505382284841
19.808725313416904
15.517948513179471
17.08311078080156
20.762428934113537
20.046514349925413
24.984628420819213
21.91455242826328
25.19760541215138
22.83408803960531
21.92320568592421
23.865572119804067
20.66319835834541
23.572522495225748
17.72359879343522
22.39880935764608
23.54210828693992
22.509404731616748
21.562050964340923
15.09781073063066
9.009074244141088
17.013024007660174
21.561379914942222
20.869021260581878
18.19316490930731
12.731991327951148
22.594272102357962
20.330593106369232
21.983048745066572
12.398702122367792
18.260405384689218
15.913719435882099
16.862479003331885
15.763399924962792
11.868441470514359
26.201687391850438
22.371442760942045
19.36874558503268
14.709830380969292
12.051347742663426
17.04619409719774
17.078989014030984
20.49330743266817
17.904813671998564
12.450207526508427
24.88458794736192
14.984966427165002
19.718130235168005
18.828183341641076
