0.7139507018971489
0.7210460705165027
0.5272977158073031
0.6939172458225084
0.851609950870062
0.3935145599152933
0.6562502934575775
0.7173632564307824
0.7648766322814811
0.7686045802398832
0.612099407726676
0.5303536597069894
0.777258816612402
0.7465395493889482
0.7913023295944572
0.8456939841368066
0.7319532969124298
0.7870127347541355
0.7650095088157601
0.4883017268610527
0.880890978101162
0.5059097332212197
0.7589462061361846
0.6171752734111314
0.8273578928863599
0.8307933789157059
0.4946569711872423
0.706173824222208
0.7238418456419294
0.8022372862903274
0.7749227859873239
0.5111908209465171
0.7003844085851386
0.5819702044379272
0.470991649230314
0.6280355338560137
0.5315171562775345
0.8347888111729731
0.7883107491036568
0.8251715930808191
0.5762921682359033
0.6482333321584635
0.5660574025197246
0.5034996133666872
0.5979775012250508
0.7713087345963091
0.6862963582804356
0.8205477882800001
0.8259811473441592
0.4768256907229488
0.5108662479447348
0.7894025403871996
0.8835535377600596
0.7133897247146763
0.4884091684823526
0.7683406403372062
0.5427249325505821
0.8276602535835063
0.5071697385298113
0.3757065731494572
0.7123661415093389
0.7995498758090088
0.4995026082577018
0.532712874775175
0.6901948004385791
0.4014051973269246
0.5782060586115972
0.6450560204576539
0.5964456713916673
0.8243672484998705
0.4108745157239433
0.2464410694430529
0.6692410629567517
0.4401084621258337
0.05883473856132864
0.6676851872673092
0.6932608709501477
0.5011190298252843
0.6049297011359331
0.6844738838639886
0.8249603982942839
0.8215916393118711
0.6429415633211929
0.5094349838606458
0.5812603786348938
0.7151790252571636
0.4574291487656153
0.8107737031032798
0.5947534032950912
0.7556366186440129
0.6828978369047095
0.6481236941253775
0.7079293636038445
0.6035746571396552
0.7310835403193806
0.676314039087916
0.6283560239607197
0.7181202517337217
0.8243253762341229
0.6930112145133759
0.7359526432141703
0.5953994345160363
0.4349504209589568
0.7313846270252373
0.7688000704999368
0.664089559303974
0.7112066834389441
0.8408296232134914
0.7305534632528683
0.4440512420737856
0.5468518527077434
0.7504228037759683
0.6174779910721814
0.7902444410580224
0.6577667151236177
0.6604835268562569
0.6970693535551916
0.7649597923354569
0.8204382337143498
0.7941759187934958
0.5784303818631298
0.7956669910032528
0.5453971525851936
0.7979324050933952
0.3873646388414429
0.6163539022246057
0.7768829500043289
0.4725529869903528
0.8005578065571465
0.5158733214533406
0.3461915818960161
0.8353748749852313
0.6276929167766401
0.5505762688114482
