3.4579795584638933
3.51684239716777
4.840945831839485
5.137422969661838
4.160586120571892
3.1980060033042674
5.13159709917984
3.771007002991302
4.650195136404521
3.664090803232001
5.019697104383247
4.5869784906008055
4.069684686671994
4.434848199211463
5.913822589512246
4.283396290518099
3.768270524148309
3.184101006558884
3.7625039428792593
4.252245128092055
3.5279353205626687
3.85991101711226
3.7145637009778825
4.843657396882293
4.054663629152361
3.790801781787129
4.2755519354235965
5.451658210930446
4.504823427445192
3.745762419294874
1.9178679314990943
3.8916503417677233
4.7146275765072785
3.942088575539474
4.681642816603824
3.747068471087883
4.391122315109914
3.7858700856379306
3.259339251616276
2.9545068867239284
4.5195556171389635
5.48692922918651
4.458233182910787
4.455115902820734
4.688549878589873
2.7229004287324057
4.138205859908116
5.086371147165801
3.820868880285001
4.438798390195004
2.9716212131779276
5.14365701600096
3.377048800150771
3.1024336859890735
2.9588502442094455
3.401605356169091
3.6206893020982878
4.953910799986435
3.524362658450174
4.467512954914633
3.7778836224835803
3.9144403256552325
2.9498445200127823
4.000286253818017
4.735328854345893
