2998.585239085239
5516.354081632652
7304.949341903886
1811.9412844036694
2330.98128342246
2099.137546468401
3301.947004608295
1730.2574257425742
3595.766753698869
4230.805066854328
3417.3464439655168
4238.138775510204
5739.474013286441
5354.123068866195
6829.4783300198815
15232.834818368745
4714.596621957277
3102.0517241379307
3117.748066298342
3341.6677852348994
2949.241847826087
2619.455291970803
2542.332797427653
6565.818984547463
3797.1984944532487
3701.7977766013755
14849.752144270948
12097.075377737536
6350.826393789696
2025.3583690987125
1905.7675753228118
4266.097155361051
1722.6801736613604
6747.981171548116
5333.776464361326
4690.662747979427
7898.463122426057
2838.172121212121
6664.786109623283
3997.747252747253
3364.603411513859
7762.575917028903
4791.011522633745
2237.3085714285708
3990.9493589743593
5326.433021806854
3985.803128371089
8541.584457636265
3544.4828362408552
4938.407185628744
3664.826254826255
3201.178603807797
4943.850367401469
2626.5598393574296
19292.888736263736
5335.393926788685
1385.8107255520504
5841.4799210006595
4617.267538644471
3864.930708661417
1909.7024647887326
2975.688929001203
28150.459415584413
3826.3606664488734
18742.003268307628
647.9556650246305
2680.537061994609
2365.5832835820897
5863.493384401115
4689.078202995009
4627.705407085145
861.8047337278108
4910.2700270027
1558.2196531791906
4133.795888399412
1479.6216216216214
3535.6659772492244
7003.5587280986365
3490.3405154203638
1998.7821612349915
4637.730832420592
2548.011527377522
4950.1941594317295
1105.9772727272727
7415.096249339673
4459.65337159254
1093.282392026578
4114.6663671758015
6842.523930180179
3422.404630650496
3840.202972596377
3699.774015748032
6468.09562109026
2985.983568075117
2500.227220299885
2866.7787021630616
2653.298368298368
7456.696783625731
3940.066777963272
9476.442861473173
15157.360309128026
1505.8838383838386
4510.019607843137
4725.783263094521
2632.834879406308
2820.8510838831294
3811.250247279921
3688.7962962962956
8648.885016111708
3473.4349477682813
2260.555555555556
2717.3522727272725
2938.169811320755
2289.793956043956
2406.3013435700573
1563.9774590163934
2714.8840579710145
2533.187082405345
2792.707746478873
1154.8978328173375
7121.050277505713
1904.8941908713693
3928.932275541796
2024.9456193353476
3669.850712250712
7842.776255707762
1866.6102062975028
3697.040654843111
2254.2802197802202
3218.2648456057013
2904.274984481688
1540.695145631068
5025.9445876288655
2086.1180722891568
