-5.3702459486222125
-4.660449509145827
-6.385383401702386
-5.699315377759783
-4.649486353000937
-4.2073655102427425
-5.846574640261423
-5.044694886623645
-6.766911501852391
-6.392114330127606
-5.467537601640679
-5.509582394953636
-5.955956237297391
-5.948755938074751
-6.828127724025367
-6.217553625663193
-6.146756074937469
-4.948700792261506
-5.97957760947642
-6.005245163854573
-5.946680733017048
-5.969114490113891
-5.719906518702774
-5.864225559244354
-6.132372854425486
-6.321799454082322
-7.761633479235304
-7.225691508905243
-6.120114977156423
-5.833102087847069
-5.114505643162189
-6.571030113215995
-6.137928686806181
-6.660042109190251
-6.820382474799998
-6.419573660746951
-6.385642296274787
-4.791829275809994
-6.666611277245885
-5.770045502100043
-6.232016377331529
-6.664597484888224
-6.243274277429742
-4.8624291852824735
-5.787583684451348
-5.687643696232707
-5.75221706997286
-6.054248878054088
-5.840487756528621
-5.937993141071426
-5.5634284959330325
-5.784254897450841
-6.029449285787954
-5.47259982222126
-6.762659047428809
-5.973080767070862
-4.666038176266969
-6.191838880351823
-5.560678324969951
-5.4826725973782615
-5.01082973653677
-4.9481033424201355
-6.599945559620239
-6.01824549657613
-6.450652838074023
-4.134073889458703
-5.769875647013451
-6.681943919595245
-6.147614851192054
-5.760904824267128
-5.893989556165765
-4.051850092977653
-5.5147880386840855
-4.609595771844602
-5.026440164387524
-5.061196101059573
-5.747127241400449
-6.776234739010525
-6.095341727017561
-5.642710908985955
-5.352408365587322
-5.352408365587322
-5.333579557125354
-5.045486559502015
-6.492424635082297
-5.635258592691366
-4.831899809655902
-6.484770878629838
-6.184979173863517
-5.77919664254663
-6.409882767086041
-5.766696415455403
-5.963363468127715
-4.8463288600821
-5.811874834848901
-4.98216065826454
-5.066461561009088
-6.160340956381077
-5.518031537543851
-6.0676203156794415
-6.4351555714503075
-5.0872039923737455
-5.897291381304648
-5.079233184125358
-4.892482809716111
-5.657489789372137
-5.7420419355465455
-5.087575085254349
-6.907073727944612
-5.593846539907112
-5.334673016027571
-5.098658037621474
-5.610245973963517
-5.059680574477916
-4.47562999670543
-4.8527539873546655
-5.77619739138793
-5.080861686289377
-5.708614857589808
-5.436038954771205
-6.247589268054596
-4.860834581192392
-6.25627967734516
-5.248374385331128
-5.908288350792978
-7.056434839359552
-5.300227282710103
-6.571304846280316
-4.764428810745373
-5.539490942615802
-5.688295120681936
-5.218557004484863
-4.914101165782504
-5.6876775285076135
