2.1949069691911833
2.305957816817615
3.928245935362877
2.4766861895048478
2.704911352780089
2.8077051972139655
2.5088093826722417
2.760579301443004
3.0292805909933125
2.6340276290736244
2.8613482075125347
2.480774997997003
3.2588915163622834
1.9710509925772235
3.464250318311141
2.447787603672941
2.4135404230833997
2.475234527072942
1.119557828300634
3.1670972677627285
3.0260088344015337
3.2813763982605497
3.132405179808721
2.882464392470436
2.276504884736028
1.8274122769416408
2.699070604022105
4.004411978125615
3.229009931134701
3.8293913776193964
1.643106731155057
2.5986631219948784
2.959553497340956
2.8712362640690188
2.738806133394736
2.751251633022131
1.9997613164526713
2.4236310855867242
2.927728730700376
1.939569863992062
2.4702773654029593
2.158949695766129
3.0508512654472666
3.192427274470429
3.236273919808977
2.818993776363901
3.0779709186069146
2.227419452522205
3.2395828311090153
2.934010244762358
2.3126834776690277
3.8875777608029973
2.445239691031544
2.091822253719836
2.2115784912449192
2.2229691800477345
2.6145602941272528
3.390181588990907
1.6061451502280746
2.841076910146541
2.8535318037213457
3.1390409588432435
2.327366166103136
2.7957708739215286
2.154177980236489
