83.07543008546097
120.65553131994258
24.383900291054964
19.586692582936557
18.373166602622284
21.03562644010555
22.928666318295182
78.34416360845898
53.74887012968375
52.914345627847155
33.10467856358082
41.624111448691394
33.502433285109106
54.750434236312344
41.33773813667384
80.80701047737368
80.69205496166333
27.966272033219045
33.087529328912076
38.88013620103399
45.33637620536626
38.43757211369906
19.85807628678304
17.1407370958253
20.62474061394442
28.897378079897965
83.3206920108528
53.73758893665676
65.42185514682154
30.20199288438418
30.72952866233047
53.522706428162095
30.874383936810798
58.64717580749331
34.86943945446208
26.53012532036773
28.440130958301378
16.06197407119992
56.91731194098604
23.066665774873954
16.244345337261848
30.443529716911765
34.04843225596018
46.972300880508634
44.55972513722081
39.70523501761652
41.15097729341222
106.07785631918972
30.081393891578962
33.83176358960045
24.031397393416054
27.651245309691628
23.811304081402373
29.183546465522586
19.06785283652717
21.87545148269716
14.825337028138364
35.955046670239156
34.31924541059536
102.1176872079617
42.3763226107651
26.809680679524966
24.73026219321322
16.83305761618122
21.94854018736416
8.18092013184452
28.779406147587647
23.801352508937978
22.07506723453121
15.64951677782783
23.308099729829998
16.28503293331699
36.15266288671496
16.702043227623832
45.254676115308676
20.850415838815234
73.06057047498658
67.53038207352623
32.3728078446661
26.09658237387257
23.51163772535039
38.85297590134749
10.20480094903226
9.181460858073166
30.454851399158482
26.58893184256896
14.030597785760822
26.605334022906327
32.55688990494833
48.230092197330116
55.413392450069864
37.235804693877924
23.828101366448173
40.31942769987232
42.78377021547721
46.717728245687894
49.382086636314796
29.398027760094642
19.999066585152725
121.64006546283606
36.29536605766524
16.549212028522927
25.709057969622545
21.40278246859517
32.05452921446233
34.15074801605587
16.711797551916053
18.18653399911805
27.871313356138927
38.00305644135357
21.42003125422931
18.411196078477012
61.60075286736209
46.97943490615033
21.28294387314639
55.598731129974645
42.112148590546106
49.059775329087095
58.72616554934996
45.503130604729975
39.7957254199791
42.95170209950776
96.97803152123112
122.54575652310065
44.89992067827439
64.44734275498912
23.31494032792987
157.73770718625167
83.9056281573354
87.2035122843835
61.64295683635619
32.88507842894947
43.02490733585519
31.720968487406623
