3.6717021915714048
3.4555079065609915
2.9936206991663123
3.0247746670825117
2.765303988625704
2.8087286209873192
2.8313764760292055
3.6163621799130494
3.4848997221471434
3.4789450214273683
3.3053062749004787
3.1887417456760256
3.384806081830689
3.3644925828368057
3.335544090775877
3.2702917993292884
3.651861060825041
3.353379948261931
3.1135128534152154
2.9593433382481886
3.02926196136226
3.141248904473117
3.0913851675174304
2.7746082058694443
2.9806625185943334
3.154272974550117
3.4554831929039533
3.3687052457040387
3.29910099320769
3.4779547627934213
3.0264878496435474
3.3143332615759964
3.4656854379358353
3.3222058402735497
3.320602548039377
3.1978196095935547
3.0850019850635464
2.5842980548032854
3.2077839973569526
3.1709316128802185
2.9673241393520153
2.9756540224622743
2.9862682384895005
3.4737109656716805
3.1512409528912886
3.1415293234662682
3.2895224289222873
3.4568445670353225
3.1994306210846313
3.18831102298374
2.974588262115267
3.276516253402457
3.18126177075258
3.0856031124238865
2.8813269510689654
2.7784058811994603
2.7770492253601198
3.314239698268904
3.2436542120684084
3.3635696289317085
3.0549653682987814
3.345565663114026
2.9847390891272383
3.192972834864172
2.9057997978610857
2.4606570138474972
3.3109611315694885
3.281433307515797
2.979021721239456
2.9585351784516223
3.048147286644128
2.7451489801096995
2.81861364103114
2.879707629957655
3.1490969003213847
2.9388662110890067
3.4381279960366364
3.552991292518413
3.326254422778885
3.0122346025576694
3.2343252146290498
3.2343252146290498
2.5234348048429256
2.7315665811147696
2.8571730357852547
2.978626951352297
2.618613637766196
3.204885568718567
3.3063699229372423
3.2971408629770047
3.687582091284232
3.1901059519182158
3.0475122546584363
3.1674806913104714
3.3433729541189185
3.134844577310161
3.2660455186023967
2.862013601135156
3.0430384289265215
2.9436295228792515
2.82992830415945
3.2630560269398527
3.132944961961653
3.0163006526562643
3.0265906244377265
3.152408088887168
2.8995703719158774
2.7263706826842844
3.0365761319400284
3.2531872667780264
3.0289921744802166
3.1547514016045333
3.427035328665097
3.426093335775138
2.781423864150995
3.3066219279875613
3.306666607999569
3.058927010245481
3.4260382908123765
3.2974709565204554
3.238149876313472
2.955869550386496
3.486877490532692
3.760786446131002
3.4082846198510413
3.51674942913644
3.1687328722284747
3.9210190954102213
3.9058901330794717
3.74525761903361
3.6230467795938974
3.1277970379774964
3.271660179260115
3.3758770396604203
