7.399328775651095
6.734419586704313
8.379516979762249
6.6299786515486465
6.803544231865614
7.319186117138367
7.568995219853608
7.2464999655469855
7.041698062256532
8.053646786950056
7.457414948509593
7.399851320373372
7.0921636739050875
7.1661699814706505
7.607637874282007
7.202556522470938
7.325763440312892
7.4767959558513075
6.231211031045708
7.016674833816754
8.227342081391999
7.474888363425203
7.856160401315718
7.6675772175734105
7.9753664260663255
7.361499950867753
7.76942129921769
8.386149059371574
7.521575474085559
8.032156457077345
6.5947201865509495
7.418584444640512
7.9444312668232495
7.474579690401638
7.743969044321952
7.116063072960553
6.299861339253897
7.447134567828704
7.6531274452494955
7.489492216235125
7.559797826459201
6.377296022343397
7.988978556704294
7.602452286251959
7.658286368790524
7.008276832970762
7.419394039464367
7.050868519598165
7.623630572359558
6.953288252601657
6.767327882456683
8.432761772629982
7.415419733379009
7.214714042483318
6.837319994947716
6.623235727395184
7.110956023800251
7.4121068212175425
6.784599058858425
7.595490770343082
6.8733461406239496
8.10882936951098
6.594590388950592
7.637942988799679
7.109378757832084
