4.2713402565780205
4.4177854865497395
4.910069583955219
4.554122112946774
4.480103623977663
4.66076747024144
4.675160899131607
4.511414417610207
4.785324723316688
4.706540273267349
4.778228133952597
4.449646926902064
4.819814065239104
4.330677445570194
4.955465620648273
4.616043441428084
4.629812489178394
4.385321531199447
4.177120078680359
4.590243632135708
4.944322366989029
5.043291872778829
4.856986055630338
4.727215607631747
4.405365745487815
4.430315155839044
4.760315663789785
5.380056855106517
4.831447751480724
5.182118304099695
3.7786854407219383
4.482830707817495
5.338192125959672
4.923916309040385
4.832987343940327
4.660161209435835
4.489152753318931
4.865202970017887
4.976376226906197
4.4345349704804695
4.566698050905133
4.602823116855852
5.149102493076188
4.9201235094980325
5.067789516533263
4.749196909852867
5.033098353614876
4.6358135490984855
4.672012714681142
4.670837094529568
4.508321890263093
5.2412465578502285
4.340276154212576
4.204647461596756
4.561556924099677
4.293287983654561
4.434167095806282
4.717458974125926
4.167587605489057
4.678107570178318
4.467430740966972
4.9017296117349005
4.288197546211288
4.798089643816708
4.565273146080765
