0.10278837388876624
0.2741624402203082
28.953306660256782
0.8024681072010545
3.708196937631348
1.4354777242753154
2.3212224098988483
0.05016862780072728
0.0976707018696302
0.08430156116235897
0.5769736764165257
0.29782720364935045
0.2858312997361929
0.8910492377617573
0.5942294611278675
0.3774123661268173
0.06072460813140278
0.20236114212394887
0.8642013153010997
0.5583753729348163
0.5598557807604321
0.6639083511498104
0.4742703877982625
2.7125865810915797
4.48681603056576
1.3705225693760714
0.15193027194028275
0.2922408500581091
0.24293943704079085
0.08210671209428654
0.6520718007214218
0.3510026401389949
0.050519758357881424
0.2995129649327715
0.5350827620090275
1.3661889020445368
3.466839290059581
8.318437829316899
2.4802937015475823
1.1133951377281155
0.9628893504009975
13.262898333829467
0.4879452577528037
0.08072215424602536
0.3155734756119549
1.4050288562486213
0.30935464958299536
0.4849634311502191
0.4187366888969194
0.7469264392764272
1.3171718655832707
0.31444289237485235
0.21754938295758555
1.1147717131073391
1.724959418527163
9.803418200659
1.055261281861151
0.5925784746528436
0.4466966518081709
0.3398580546901096
0.5631567314760207
0.3326550967281967
27.80713135129491
1.5417488028453334
16.740933544793197
2.9018213419627115
0.4936350978712259
0.19761494402554647
2.988614229933043
2.2276162134269657
1.5079392343808486
0.7076474490800045
4.121245310348086
0.4562843823600411
0.3393254820798469
0.5524529844936279
0.25842142781568084
0.05003342054137935
0.3231928137247088
0.5320561477765183
1.3924132621497378
1.3924132621497378
14.402706462217331
1.2685540053450266
23.909724384827808
4.437724527770596
1.3280952762553655
1.4654014530653616
0.6381153461276806
0.35536299994237736
0.07741234687908405
0.9699522330447249
1.1223965535051499
0.2107244300624853
0.2669935010818083
0.4389993697314384
0.2236772734289445
4.213786337373685
2.073289082799372
5.211418721963605
17.931781456924647
0.1321253821611318
0.7770941727939242
4.177854057857217
0.8484663707299358
0.3865372505508033
15.261690439329858
4.447065791851958
10.481683289405952
0.35047235161853785
0.4713213929962419
0.15247348738012714
0.1441344287406668
0.12165986623379435
4.113616616462629
0.18940358971877927
0.4156367031164199
0.7596951414739973
0.2204541567010912
0.23841589167385216
0.9896918521807764
1.191108788128695
0.15460537255867254
0.049756189619667816
0.1471443043554092
0.1999143712962311
0.8482936530306834
0.02754751369100749
0.055955286714014944
0.06386083315775616
0.05826637298126906
0.4283854183698124
0.5383610959727978
0.20520615930483224
