5.0878973449836185
5.44061386056047
4.334467741668009
4.154061564987345
4.082386807600849
4.137375229331879
4.2651642786735104
4.913843907709845
4.875211067168014
4.878685550107121
4.5481596513337434
4.702133468811243
4.519514948675762
4.840511189544178
4.72602863591539
5.064902971592801
5.157225352746446
4.4046241267581285
4.479603452484792
4.639420989144711
4.728989113122153
4.612030800232512
4.16012581807827
4.045580392409518
4.212259386669008
4.453886520141784
5.139131430845682
4.892136885305028
5.015587525051422
4.456509518981547
4.415699636174468
4.900198225653769
4.458669434142923
4.920600685260363
4.5948843243359665
4.392438415198376
4.449929466202288
3.992080630072176
4.897643468204556
4.262611054532024
4.026638279944296
4.498513868493703
4.559535366708242
4.560393980757686
4.741245349744196
4.6767481338445815
4.696414897469602
5.290760370429789
4.45725338171312
4.54417623006246
4.313585436282252
4.418446050922804
4.304735078866279
4.4487054980923775
4.087559339150512
4.2488673653666345
3.8868905640928237
4.605965118612343
4.506316420118339
5.168427335966974
4.6333603236577074
4.3916520016950855
4.318528459525
4.0580965497461365
4.260143242580684
3.4657001943782126
4.3887079540805045
4.294807409257754
4.244822370360281
4.0045075055358925
4.24702954597126
3.818142124137221
4.576116019312394
3.9116166979971516
4.704800760708074
4.1378658511405915
5.029346977658474
5.048545529338226
4.536641430691562
4.341348437644362
4.260640367750901
4.627321573939873
3.7055501493135155
3.5650348534374268
4.499275578555499
4.400106928942278
3.693113868376338
4.362788274138347
4.499705284336104
4.7874551174387046
4.898029199539144
4.605945914032448
4.289704133852658
4.630008889948337
4.6756030432267455
4.6493648086721935
4.75182285374276
4.456496591435856
4.184292559453909
5.176667709566988
4.435187190133936
3.983974692989872
4.325326528219301
4.226635344276878
4.433884126262909
4.569432930563203
4.063033369317811
4.044549079424504
4.430995644755055
4.629542930334893
4.188383895195627
4.035467934502049
4.945637018181197
4.6893869047320695
4.168706500463921
4.809007793409318
4.694194121024202
4.6075603257909545
4.866428146227145
4.341766889890781
4.6728802303862365
4.569064017738169
5.234008588683404
5.286227582356274
4.763220198645813
4.985318901024759
4.2687815112910785
5.5781845008472875
5.1404401400224105
5.195972426167828
4.936728378496981
4.464646365474116
4.620741896851219
4.484828803276382
