5.985270781305483
5.886208392699591
7.400331089433651
6.063214941009033
6.185754670035183
5.849698751894598
6.4510542948905005
6.115351650425674
6.637995768336156
6.326056301103803
6.74296469927215
6.376971390786988
6.395635022557747
5.925519599054622
6.955264102434662
5.827243748786177
5.800672628016648
5.8029911288038925
4.850534387012953
6.682981065741206
6.483843358178969
6.340619420169444
6.385370613333793
6.443832218784356
6.062646459690554
5.6053234247729335
6.285461404523602
7.223067314363606
6.5681064060768035
6.837911204994985
4.194388488997383
6.08223932893461
6.503340316587584
6.397038624750505
6.3217882916868255
6.053946809460782
5.500169099751552
5.7480090360270815
5.8735338480124435
5.267749556812076
6.401480189396454
5.714238920997063
6.635249204628654
6.541227418700442
6.467963765667763
5.563314529414773
6.174423574910594
6.4876417374102315
6.768384964354931
6.238133758517826
5.571761234101393
7.143225024206227
5.7041317415535335
5.513450390137462
5.181362595168922
5.2467962913484225
5.817804772500964
6.789244015195651
5.346965817330297
6.603715697442524
6.188008560475034
6.767069865840753
5.6122116883747415
6.284899162067275
6.156909083116921
