22.246914690593478
17.80666365835855
24.146400382505863
18.647126405378607
19.75810689472489
21.410570284279128
22.387898916352366
22.539311723329735
21.577012898548556
24.63231768117143
21.225321548606384
21.891776469530836
21.86145904419418
16.4516226505702
20.842665070679136
19.454021418369532
17.945199172904243
19.416518307114195
14.981431900359915
23.668175433294305
21.521366726628422
23.894788491083975
25.506660550856218
22.930382555960794
22.09469767646605
21.104561860506458
21.474339587009577
26.12104720708348
20.521206902941895
27.30433605216484
17.345441005469855
19.650447345483702
20.41203213637463
21.34744078074804
20.83937511782337
22.066369551805366
15.339662882091613
20.705245311665074
19.34898020486741
22.485806819724797
25.804670972961784
18.00998462507368
22.042261656758022
22.331717709132814
22.47441159962303
19.965083539287896
23.160337101097447
24.13080031860468
24.035455027308423
23.298856808946677
18.079445114135716
26.149611169600107
22.340877869113925
20.023596784887747
18.392945266635934
17.035016644071256
25.463727143306023
24.359115489454357
22.743197014446746
23.956485591610456
19.80293253918346
30.121178135813736
17.72666732939036
22.95606020469109
22.689303816213567
