2.803010204081633
1.6273382246017585
6.099859528218364
1.0153939948178632
1.4125915326992675
34.102089116143176
1.2709646583520458
10.88886794231313
11.96962718909791
8.327236534436803
3.4112937513490893
0.7322085022151003
4.194140924118136
1.2691425382850765
2.0494236752361896
2.7280646383032443
6.462895519395902
6.856472875975863
0.6989619377162629
2.9491164061678905
44.851585103108654
45.167828334247005
21.23104987493263
2.500929075333837
1.5817674458084434
2.164147544835147
4.473381509466533
11.136947548279075
2.0007699489246438
26.602584524231037
1.610969387755102
10.775649713010203
61.73496968368764
16.807400566246272
9.171175390266301
4.154597132970835
3.0477069867651583
12.080054679823997
35.12413811874002
16.456198060941826
3.424930555555556
21.899375000000006
17.371097690745014
6.176425777779942
6.542283769698448
14.678612396661524
117.06364310430052
0.419069115283335
37.47597119121737
1.6314775510204083
7.19
23.671954726854572
3.506872972531448
5.739210284664831
17.14317019722425
2.0909913988229967
1.7708047887513754
2.497393593920324
2.5066174207448446
4.5912362961713615
3.41959872528616
11.905659362754724
5.206648199445983
6.68634051138108
0.6287673469387755
