3.2757187383892585
3.3570576377078303
4.640892970775762
2.8177737804821317
3.3924499326511426
2.9355009091267683
3.162576458048355
2.8613882874483236
3.596050952068274
3.2632097021757636
3.528685021928017
3.464755721383846
3.6665028586494577
4.306721855661557
4.215720719177052
3.680833846987257
3.583559794735046
3.1141082776791174
3.333959517977442
3.2342986531334477
3.387117248191612
3.1494647956269026
3.159687096767225
3.2048335398973014
3.769767938313326
3.5912744183380605
4.046558448606651
4.584589496662756
3.9325991759897136
3.6661354499110708
3.724100425821029
4.117465150183338
3.4044878985533127
3.6596176998435874
3.986312226068052
3.918991041268957
3.86193729155167
3.3861733099878415
4.497116146327348
3.7459174563659032
3.5625495487407353
4.522975011986957
3.247625071144131
2.4492884179950583
3.3674539567002113
3.7289134350731437
3.607656769329513
3.8613864091349894
4.1677004469523915
4.179983351436631
3.589350964465397
4.309161258695779
3.9463678132770874
3.7791762553201895
3.6822226217765404
4.12259920459586
3.0558250378195693
4.234532000916381
3.668083815568173
3.532832023618362
3.4231348161695303
3.525012652752553
4.654560682088799
3.909495401842327
4.524556924138344
3.322995943074947
3.7470936080777846
3.8413868857685305
4.196659131055845
3.8472796544971306
3.7087016684001513
3.094490614732858
3.6470845930796094
2.8032152240447883
2.6195391633446863
3.054652227861007
3.0052036327234033
3.209308804813815
3.429783084196842
3.4661579802167806
3.9836689910146545
3.3272925269477476
3.4266615245952843
3.214423888346776
4.438856391436462
4.083182887729335
2.50772481721188
4.1540341877456495
3.988748611186256
3.379750819891626
3.5369333346106826
3.6134319513874478
3.583413348465564
3.27042924360809
3.4555873394873653
3.142593883603635
2.9869649952119155
3.829357495389863
3.5120098390897336
3.9426752625932817
4.013764523135769
2.1106680680323042
3.2877621510100297
3.542769722943873
2.991456596182511
3.1009475211761792
3.747952355683906
2.8439681880965733
4.6746339460270265
3.510804081168699
3.3583079138080234
3.4324386995363745
3.367250743445816
2.899548640434583
3.0863376158970897
3.4247026607756434
3.6959353017115415
3.3385503321477232
3.4198489425916123
3.242781591497087
3.9961411225303323
3.358756571960058
3.1636867685555323
2.5332159969259362
3.489047844624996
4.506212172832535
2.995475071871124
3.9569851167182297
3.5952971334709303
3.861301307744193
3.591658445718747
3.384302874970481
3.228034363101774
3.3654037471023392
