5.60606724638414
5.339452324909302
5.673507666468235
5.495284791231685
5.5018274424069675
4.99525692010341
5.967513119099857
5.254543168198348
5.260248252889462
5.693819247972039
5.9987279272122915
6.390720440717956
5.2654854594502805
6.068242141466933
5.458784776796859
5.2536019036565245
4.997794479381718
5.282447242787598
5.619667709191144
5.844645730455856
4.7778993340069
4.724721552576788
5.342263605116622
5.761947614289489
5.770659671660113
5.503330017344119
5.518943767506968
5.062388589200108
5.334147781358885
4.828831017543907
4.348128135411957
5.273042733377788
4.9718071248595574
5.247814174355829
5.134178371921915
5.49587934768476
5.147939570812922
5.474341252805316
4.747376345006324
4.87314230027925
6.532825605973877
4.054058232496166
5.263813128881048
5.89456942570855
5.728318186578335
5.206899398683528
4.937944740379573
6.435548471660039
5.418510438252837
5.689186282947256
4.773177785890628
5.1883972688636
5.029842602561723
4.623921533259275
4.836229188264217
5.434735387203936
6.093252791254463
6.031846146821281
5.861569900965591
5.910454453654903
5.7883260527745914
5.6272615570326865
5.199913105643413
5.109754362869897
6.5282910381591295
