8115.683168339527
4207.562000249065
21506.75635393221
2045.4095412284707
1715.537833854651
5350.919875096864
10807.731070561464
4692.164624344866
2827.7701521944396
18346.68396811354
7430.488188171686
11027.259298983832
2421.487486060231
8587.873918858104
6647.664472941215
4166.721420861272
9036.854764656331
11632.75289391064
5758.437837672842
2895.9400342841504
24106.186944435518
5946.837952663567
15236.091607727478
13066.23636790455
32429.970040408087
17194.249571055818
16294.81206308414
23164.469191956294
14603.552728086786
13058.934495300478
6205.85057837467
13555.863698879175
22310.045810881373
10265.970602815783
14074.85593174786
3049.5406393819867
1013.3734852848552
7439.642895241652
15650.191625836516
11956.604986028762
13349.681350843091
1491.7167376483465
20601.119998944283
9409.42836050855
11422.780213545957
2267.330675319129
6288.493340336942
5318.175106141474
5891.865539677454
2927.571650838292
2068.481024366104
30469.377586963128
10506.781987597631
9153.18360902795
3376.6203621671257
2021.988644480372
3598.84966513976
4193.291501721834
12848.993867107494
9717.736956055463
1812.1374099983207
16808.151945742087
3057.905425938633
11123.518041846943
6764.810551553336
