0.4923628846865507
0.4981554838662468
0.4742466855752969
0.4288797455866551
0.5022542012735011
0.5059812356117047
0.4480016430294562
0.4794385475948277
0.4893881574978707
0.4527347999370514
0.4829652990596277
0.4728748915296614
0.4374810754947571
0.3859967853546013
0.4699023314587073
0.4144254719443599
0.3654977751116973
0.5030213737847613
0.5015029253019838
0.3715962215876746
0.3491068855239081
0.31684209334613345
0.4936214012572248
0.4752252653733518
0.487510151258567
0.4630555469508769
0.3917761815027327
0.4045303158373393
0.4345755626789353
0.4670022159399588
0.4630699232301969
0.4141300858724888
0.488927596743621
0.3658543701056739
0.34745204048101225
0.3615243884405779
0.4879211979636906
0.4896032785765788
0.4103802155154425
0.369448959292808
0.3604620231840078
0.3911573965751622
0.3661618104955218
0.5056838292138341
0.4831446674024213
0.4700833097866199
0.4929070284407625
0.4469731770884869
0.4819229292583311
0.4782021177006762
0.4783533172308472
0.4728732165694894
0.4448798994013164
0.4635107308257987
0.4793285626990658
0.4727195915058199
0.4767081290510901
0.4596979810338296
0.4693029179754223
0.4072640495270423
0.42072404152068305
0.4245520411359336
0.4766239464624744
0.4766839640430601
0.4772667277736106
0.4973794508138674
0.4973562790024083
0.48595391396952203
0.4954948685679978
0.4793549460006391
0.4811610153562724
0.5086106954347371
0.4682386579468002
0.4743878694189414
0.44511206138543263
0.4959544453461627
0.4469519497495458
0.4924693687682046
0.4380449672396681
0.4883284089786178
0.4944714125557471
0.4744184483614627
0.497592364350706
0.4995048212865486
0.482670614879987
0.4769910919703594
0.3942642772444988
0.4827296159431601
0.48655590680543
0.4965064769002146
0.4980295457387519
0.4717310763532548
0.4756168524971836
0.4213473060434302
0.4635356794880062
0.4863072943439937
0.4789721047410848
0.4516482272411347
0.4952384048328416
0.4855396788068075
0.4922417889542195
0.4974165533705527
0.5063171269843122
0.4962180960713858
0.5083138302338518
0.4755850485468616
0.4851426500994906
0.4779587280082087
0.44733026771148576
0.4185473411277734
0.4559308175696707
0.4116342804780667
0.4853636925648536
0.5034511384046191
0.4929327391976174
0.4547678687566568
0.4951960253504706
0.4570328088931055
0.4069367723522092
0.4933420379652924
0.4891999641896938
0.4892056633166941
0.469311724527791
0.3969102552611641
0.4320251705395354
0.4312615219499084
0.4991851399783896
0.47274414477249704
0.4852232103164847
0.4621435570725956
0.4821489709974834
0.4952318486099119
0.4944552867379461
0.4946575505319855
