1.9726133193957438
1.9898965871192524
2.311790805902378
1.923069240459417
1.9418853030580416
1.7743465361278314
1.9736119014115596
1.7709599511877112
2.0098732984407985
2.009189994410769
2.0360034455463567
2.0146461530068174
2.065087768940391
2.125958868829475
2.176772801396097
2.0332668196413652
2.043677197616478
1.8902605515733673
1.981549151505008
1.9048570759567838
1.9723706834193278
1.9636906968959573
1.9349566906159121
1.9985075904040654
2.0718060488492154
2.024581577713317
2.1981283722643705
2.3049326287468475
2.071065338215822
2.015411519024327
1.987198992854735
2.174688204186749
1.9883177387297952
1.9982178409441196
2.1328521089675476
2.097081837082393
2.1176377857246944
1.9483392738448089
2.2407059096238937
2.0774512687496096
2.0597613643080446
2.262013067606984
2.033396710121748
1.720921419386991
2.0707131772997966
2.077278306936365
2.0488516164778643
2.110967571743735
2.152901636442218
2.156157470226017
2.0279084994127374
2.1130188476198675
2.0899831943198715
2.051031850961028
2.0605881006664615
2.131659563622623
1.9431963191295822
2.146677162035037
2.1374762690449427
2.0651489196871986
2.0168981612546504
2.1191135994470267
2.279105943950177
2.1352706881002628
2.285999243669517
1.8435054962049118
2.1012032539875
2.083863187579804
2.1374781894257655
2.130858795433562
2.085628510530266
1.7730672290317224
2.010494417090317
1.7313492555631274
1.9906733513846593
1.8064024588177576
1.936749419922106
1.9957508354528195
2.126438391804225
1.9609168833074633
2.1237261857999536
1.9788602013707606
2.0543244456501064
1.8460284265494729
2.256957972981125
2.1830768151838447
1.8393464650427371
2.153216553469099
2.2024140171452973
1.9790882441355742
2.0493713958200157
2.0229690225380943
2.0440782703157137
1.9032760157699753
1.973691761180134
1.910808202715111
1.8720393980040795
2.106572838590929
2.0221125168929857
2.119912117526838
2.1970681542483375
1.7488872833718043
2.0090016828766677
2.0194001246152533
1.9367742867658555
2.0055731627329565
2.116621015943738
1.8909691102409087
2.299699269574237
2.0140429428463045
1.967049293326515
1.9022456316822778
1.9293035486155847
1.8618574604335543
1.8611702930250063
1.8811481822790013
2.0155110047886047
1.9254372769787012
1.970022627530635
1.8919810339711707
2.083286962982971
1.911632328061824
2.108459399371756
1.8167256456476826
2.002496814729961
2.299188583377038
2.003589063916119
2.1630962135173193
1.9594442628186173
2.1240423074988364
2.051377082228777
1.8845243777374203
1.9161780222492608
1.9381850260387636
