0.9074773333333334
0.7521743416963509
0.9761129695487564
0.8306756013814051
1.2927820051378092
0.6390351356840444
0.4949367142690601
0.5322916750261485
0.7035614521356991
1.1457255474813788
0.8584061098592847
0.5979894083272461
0.8733849238182281
0.5360030281959605
0.6968622789365662
0.7586519792766964
0.4972417548594834
0.3585050075414382
0.41765755053507736
0.887383199816313
0.4704773347983669
0.7419667970531555
0.5725186235995336
0.5528238795622044
0.36148672710438223
0.4436878897499009
0.43274516507305577
1.1203293886308825
0.8852272394084792
0.9420176623589699
0.454187724239034
0.4777726941494487
0.4252852736485143
0.5363594191109672
0.523842632380169
1.1668010564402882
1.1892836487335277
0.6086158333744129
0.5244908916099534
0.6365612029133056
0.6164671687144933
0.6534956074127424
0.605976998093405
0.9144691769380018
0.7634725514892033
1.0964363182568289
0.8905199697488879
1.0445947052644695
0.8996952087563304
0.9818455146995406
1.0978817189165275
0.6103926462935603
0.5661631300455967
0.6673514463641237
0.6174969174047833
1.1333582223804115
0.8221465392194394
1.0813577621091752
0.5318515868886576
0.8785344000776991
1.068877551020408
0.7157563190783274
0.5356688257807782
0.6518433959322014
0.7245918904686677
