40.52538568311997
38.00750417398065
145.64863094756305
29.568680808680412
32.53917058993152
26.09870865356731
35.82789182524701
19.83252635350575
38.00750417398065
37.928239223122475
53.18449233770804
41.21021104217528
48.317194978251855
53.64519684151638
72.55014524333569
43.0178873871545
45.50408732741464
27.382606599172387
35.59210056572475
46.46623349382365
34.27275832933464
44.387873799655026
34.67395766932441
31.6002645747058
47.5213793375216
46.360720510470934
71.65578365049402
126.61891254580506
53.253750234725246
47.9085438795645
40.18147994494984
89.24636859077586
40.547832546797906
36.514605382641065
78.34045914508351
55.23168144510817
65.35373635150893
31.568502871298094
97.08903900101507
51.11741854315049
44.301632687898504
110.83520839701687
42.41016344581776
24.790657941882184
47.04535710354425
51.22994141098207
49.80703257346711
53.18449233770804
69.31089215352927
87.38399117723165
51.639468033796355
60.5151410033011
49.58131588376437
59.49757906051725
68.67406150973717
67.36137849769965
32.53917058993152
70.15111263640782
68.67406150973717
44.950754982927215
39.6650527070115
57.01125626097097
138.07363673995718
81.09566509359583
112.64034648495183
22.7076602194414
55.48533106597613
57.81480200231085
79.330105414023
71.1842011314495
69.2187010616362
15.420996860288868
42.17579427444922
23.95427193978225
31.6002645747058
23.95427193978225
36.51014213222985
52.40742919905446
75.92473137650687
46.360720510470934
55.417604198508435
35.65429254185471
42.6913495987935
35.38307383569862
99.16263176752874
77.63498239017419
25.03592663914528
69.41384223727012
74.47508734639996
34.67395766932441
45.017092701038635
43.22719312215086
38.46074071907815
33.545736036790125
37.29759851656054
33.86199431240689
30.637145082619504
57.24599992528988
41.43151425587962
62.19537199410703
75.11028766494209
24.872367374527837
49.744734749055674
42.6913495987935
33.06040650862637
39.01644961364503
56.756194595832454
28.645599549235417
121.58751405810179
58.694041252205714
47.9085438795645
30.637145082619504
30.94845947967425
27.615840722554086
33.86199431240689
27.18083189824521
40.18147994494984
27.642842188225945
33.545736036790125
27.642842188225945
71.02513902510262
29.748789530258627
59.327160131943685
21.692780393287677
37.484723654394045
115.31048042989264
40.447026022471654
79.330105414023
39.6650527070115
77.73227698173794
46.360720510470934
26.626875117362623
35.1934187198602
41.59667463216383
