7.645745713429446
7.7288938069402775
8.350474853873745
7.602657863686907
7.718911047332739
7.236737383570979
7.442177125601081
7.392124943734901
7.737394444621282
7.829725040736688
8.096760445901214
8.037943736475944
8.14046751626587
8.430134838593293
8.10178580633789
7.936451665275532
7.9355862750293795
7.3914335735722725
7.774491603679735
7.908907935253193
7.917244576392154
7.874018421847613
7.703741805821367
7.783259036606031
8.0183370668926
7.9727311851131875
8.330686208577825
8.468847950425076
8.116327025125837
7.810540798397324
7.950066676673686
8.150962927701478
7.6508474091004715
8.014445884733588
8.307975922585388
8.141898922493834
8.02750839243962
7.749121869122539
8.458882071785103
8.09263467316617
8.098470863253874
8.506175464635968
7.860382360779101
7.218705098095766
7.846899435243591
7.878723168102211
7.880347181991994
8.13714548908413
8.091593125407242
8.110067697169333
7.866764456848319
8.128758721439524
7.968156515831785
7.739900750535702
7.853957399252735
7.965907783106239
7.559495041405051
8.120380129337693
7.899308901232878
7.949057483756488
7.7037691413363785
7.8168321343444225
8.450770647728607
8.107558321921415
8.355618945081607
7.61568394096087
7.934328675725361
7.962668295597873
8.125352092088145
8.010808017618675
7.949999193174352
7.676818365953659
7.745264412407168
7.3406878380434115
7.2474724394016
7.530145667537578
7.4824696554409735
7.650155832236726
7.858317943180778
7.7630515978620585
8.129836622639884
7.781380456073759
7.812266338602568
7.427317298867255
8.378844676536302
8.014735860364263
7.516921182709338
8.017788839758474
8.022928620532419
7.644736049136608
7.725956957841047
7.864961039337479
7.757841888890216
7.369460089980887
7.842859273763452
7.734481976543903
7.719734836266423
8.096312904612493
7.748475901262141
8.09435501287066
8.160319589505873
7.1924694191743805
7.670956475488936
7.840590781752861
7.528175988446912
7.514787888523244
8.022273389178471
7.553548511105711
8.397960421205816
7.883420295280776
7.686156662615331
7.72666380632149
7.6774408921154205
7.310908300853437
7.656240256790961
7.768407441300105
7.915632046299486
7.6600813046548275
7.746567244245253
7.636918402389056
8.166658833239936
7.7988817956890015
7.969568788381795
7.570661662452837
8.08623237960342
8.396875040154711
7.585061235908393
7.959166832625401
7.529772261942724
7.856945552229897
7.8179107032228385
7.709841001894965
7.6885317933334285
7.817528113484812
