2.80681046667636
2.796624662396009
3.225045090633282
2.9767661919753157
2.805829334321994
2.396213174977344
1.8863743647287086
2.522815094114518
2.6382448834380923
3.383436839361446
2.735121386076606
2.5861042761144217
2.886986764584369
4.594075066146364
3.272502762292807
4.214948244033125
4.181743817171818
2.967198561145445
3.017108717311148
3.6833895710716673
3.951832123209121
3.7125286703876905
3.1718001789500936
3.12367309292729
3.033108366801294
3.47419748614884
3.5446091656427816
3.713829201611707
3.3319863248699595
3.1225303248625997
3.021057544549635
3.552933334780881
2.9002494552214597
3.890516663399117
3.9125249981955
3.7869016534819107
2.8667984493110756
2.2471483762047373
3.6107351725451764
3.572147122416022
3.6941909723869215
3.6317443731097074
3.7206463489189407
2.4243797355471655
3.1124112170417084
3.0753386509723017
2.986439430703839
3.1978842522956787
3.134815755056664
2.9851754749134023
2.814255371898341
3.0131223697342464
3.647125510601403
2.9983741613598993
2.8686414717058146
3.0471259754188194
1.944872593445043
3.3038645204581454
2.9943999871309455
3.496755879076934
3.262732896189073
3.274157724712893
3.277356531513166
3.1591619144972305
3.378934619284289
2.222409035927162
2.8219949630300416
2.9284726998695456
2.9247476758317394
2.8896417107301824
3.0107713349813015
2.6606810001689145
2.346982109643797
2.8844840693925877
2.8904326074628863
2.7795406597203267
2.726823324339565
3.550323368397458
3.1401531719313476
3.1521932137098703
2.9077575204773107
3.22147950628228
2.540010358128459
2.5004077673797354
3.3829749242651364
3.419307118899213
3.620329742253271
2.998110751364966
3.037613581449577
2.135993764413486
2.456625711446762
2.826728194006366
2.4603763696986554
1.6325397273385374
3.4559193748966788
3.4746411892453373
3.3247719271374354
3.8491285366791295
2.7447308498249043
2.915570250943419
2.9051384075516826
2.5489802660896603
2.7730898916026128
2.7738166814265903
2.4735984513370006
2.976248343735454
3.1082227024601337
2.0306847646192385
3.473595826354045
3.584467586075991
3.2145627072257827
3.408183089245476
2.775617485088371
2.2535631444573823
2.9154828589745923
3.2205979763672135
3.025502033695445
2.841505121813564
3.282686910579427
3.1169704959065516
3.349463253332133
3.2693259936575982
3.122834272845663
3.7259268030734596
3.305629824778548
3.3933365428631
2.9757044962344557
2.7729744774443317
2.4020688134747687
2.5640070441723237
2.3277361585137526
3.0792727723400533
3.2615823240194706
3.0804495711105586
