0.6384907742792253
0.6146057929559665
0.5873913914086398
0.5011951775033114
0.6163076189629867
0.6900063822008027
0.6689359732401652
0.6863219336450783
0.66923707018953
0.5644454862242885
0.5813843129335091
0.5801389675630744
0.5152367165573355
0.4923071930873811
0.5978920618930135
0.541269975437408
0.458557299210865
0.6486700413893222
0.6340554343375099
0.4573155361711481
0.43927549761630025
0.4064898048353937
0.6020837910164452
0.6073550320493475
0.6091455343276079
0.5462865638726234
0.4780920099716041
0.4880004738497461
0.5291547467675675
0.5695275837588796
0.5792570447194305
0.5069953178179328
0.5858602653149622
0.44231484369310703
0.42923238451313506
0.4471978858629587
0.5913729910163298
0.6896367866218026
0.5000644923331181
0.4515205889260929
0.44621101884869663
0.475511269980689
0.4591754576857318
0.6012071360468123
0.6559056577907424
0.6663532530288934
0.6257190107925812
0.5434270794594125
0.6161059379630698
0.6407593205324728
0.6025817104717709
0.5815153979622649
0.5443613442133539
0.6048218044947002
0.6663002822783544
0.6477681880507287
0.6807103584934507
0.5704151287089013
0.6138670750595381
0.5134032885632316
0.5359834843704785
0.5193803133180025
0.6021238545540955
0.5699476873021759
0.6048051233920576
0.6849579208296535
0.6004839753138893
0.5859511126430544
0.6143409302862223
0.5857176256198728
0.6111181884832395
0.6688120135384676
0.7155369622711027
0.6027152211252553
0.5360615491686797
0.632530927034465
0.7392321825042991
0.5965481386935078
0.5280129591481193
0.6481209855007835
0.6125107618708638
0.5903940705422308
0.6658053785512835
0.6784646109276499
0.6167463485771688
0.5822623415696542
0.4703168476466617
0.587902207059559
0.5969258616157077
0.7075364363081926
0.6607865956596708
0.6497484920730396
0.6857071113986083
0.7756404735749375
0.5633657597289076
0.597950578264173
0.5745480336712641
0.5713291235993446
0.6274949513387381
0.6520824929737319
0.6518416515324925
0.6148471952946726
0.6386394173078046
0.657522955809834
0.6965988938484676
0.5934729120261806
0.5773974109811608
0.718916055920729
0.5394876720459479
0.5011680787881143
0.5490365956609611
0.5119174998631871
0.6536207936568422
0.7153173357458213
0.6200826361926596
0.55634979142272
0.6142416955473922
0.5974875634306784
0.5078487192750575
0.6259039163190967
0.6119979754715144
0.6043502520501006
0.6272758093074491
0.4726656684340253
0.5162522626337446
0.5298310019221917
0.6464637114701923
0.6403572497275363
0.6926314247487539
0.6838476257335061
0.6815972154087221
0.605046576473759
0.6117189209412398
0.6078421186190869
