1.5095060970389618
1.4951147637273738
3.752881491972873
0.6960757073634899
1.9782532469902847
1.2792909100607146
2.6577999807959434
0.763932432474851
2.098447135662383
0.8148864406649171
1.8673497864339106
0.9152569140758969
1.4498561172009916
2.1588619010297236
3.3420740760162215
0.9639262011706519
1.3889466858703783
0.7094310403695459
1.2853290320634523
0.4567322591139769
0.9395633462580816
0.2967135079737286
0.468672515070727
1.1222844641103555
2.313952441245919
0.8055875892776775
1.9286112855420592
2.93556617298414
1.4789331869768811
0.5450027542495116
1.5564177275845972
1.3659137078258463
0.7540611255030902
1.2556849930525986
2.5063323520245526
2.517634137308563
2.7819630810847853
2.4757010114112044
1.9547549421308295
0.6111351653256908
0.7758020352937409
1.7580575386144635
0.8872964539172309
-0.0981677972409591
1.66943599062728
1.960402699026692
2.793298202970786
2.4301836324024624
1.9460954747579022
2.5368752391436438
1.5217846933532868
2.435383374985211
0.9058922165677838
1.3625182171416783
2.101785601871472
2.155319583809243
1.2238026033361369
2.2387038849623866
2.0908468593008
1.5270899606145183
0.8975584841558647
1.2178840938051108
3.205287963962094
2.2553434076455274
2.586666754854454
1.4672169079659771
2.175923444627077
1.496081295219597
2.3734260885760876
1.1630821302221677
1.522245098631015
1.751304633534267
2.7357175267457556
0.653818428015906
0.02103038148067852
0.9269873825390199
1.4914390209007833
0.2048350009641434
0.901795487490341
0.674705929114909
3.084824809918568
0.861472006272875
2.1976925047712097
1.287294920686942
2.6830162255023744
1.2988882700950424
0.30035688078288186
2.8238118632475415
2.1800533595506755
1.8850159271547446
2.4665753669909707
1.7918095480610599
2.3806118654678303
2.1645172948681592
1.3472391810896691
-0.3460020857973589
0.09962892296258091
1.5767153316864277
1.566774467186601
2.7640049741787225
3.3124481558803174
0.7917005034287261
1.4056212478965684
1.3301088652996322
1.6861301148285106
1.1807306437001768
2.164287555742388
1.7915513947927972
2.8439166175192594
0.8532008559233093
0.48473375741069724
0.18156703741235283
1.725105173350524
1.293706729100681
0.5224386819375293
0.8683568120367529
1.7574005079415762
1.7133145616709906
1.2770424375613012
1.254311428917047
2.4201745541755644
0.8947622127196917
2.3923732235616346
-0.6343867673618172
2.466117547910029
2.8872154772819005
1.9002499500699679
2.47941424568565
1.4686871847211471
3.1307471630536514
2.9449875429658317
1.6589351027753734
1.20608262055879
1.7639246326346365
