10515.053321678322
4284.812072892939
17390.554015636106
3872.111111111111
4671.091945830363
6944.491648822271
10799.14453524004
8147.363006923838
6421.115411931818
13152.664450775565
6825.728272071453
10891.551251489871
6804.574892649659
6232.576292559898
6420.985437477434
4761.678092399405
9158.15303430079
10088.848817080208
2953.9005524861877
9864.835198064711
11762.894849457436
17127.960088691794
24893.542464323007
16651.128727487452
17270.46117198666
13026.926208651399
13182.174049529123
26787.073749543633
10205.978927203065
29322.0039417829
5724.212871287129
12473.356798457087
14906.813925570226
16037.127032520328
13407.492473821987
7532.548076923077
1937.6357308584686
7064.280961182994
11850.059198301034
16401.638228941683
13977.510422535212
4131.249541284405
14791.665374449341
12994.059580102135
15736.88968267154
4302.1674540682425
9475.417940876656
8913.36511375948
10426.529229082938
8075.672093023256
3023.8895631067962
32138.315097039063
17824.907076923082
9900.116796440489
5332.694545454546
2680.6145092460883
13847.516677567037
10694.683720930232
9325.099762470307
9953.793977812995
4047.003203416978
34165.780846592614
4147.346534653465
12371.545058139534
9837.778958554727
