35.278109117555545
37.5183060787081
146.81359488711104
32.12653154217965
32.91826912242807
26.407846255839768
31.074028470111948
24.379858853163924
40.70051950034122
40.22323305980268
42.88265967276693
44.83953476078311
44.551483376207656
87.56041484694408
67.2074399235613
40.85837601850006
46.32242666262274
25.58239628404245
36.738094347610705
34.47832703888619
30.586835475323877
34.47832703888619
36.62109375
37.546891458914935
53.24057181265502
41.250374532213065
124.72695092231251
117.41615875401413
64.3198195315434
40.70051950034122
47.98341607663828
70.34301095825958
34.07139653206936
43.10724307488915
81.40103900068245
73.5637472431038
60.3970550627587
32.91826912242807
97.26606621699626
48.49495710130914
50.40424961157789
115.98195830166544
54.02076830445051
15.081489464336428
49.2414149823387
54.19921875
50.59545714600746
63.00531201447237
75.86137134506279
82.08354917649551
49.890780368925
77.56759157152574
52.284868059301026
44.83953476078311
49.132353021235616
65.01662408546527
35.671276353181405
73.5637472431038
64.51967444983957
63.4126781891993
36.738094347610705
45.99702676203393
148.0652005169546
61.81918314260507
111.73215132143486
39.08690643787012
64.8679389418492
58.31844503142886
71.91174438652487
68.28434777816405
66.87136060847652
39.442125052254674
50.446802805827815
17.820593350483065
21.628158779638767
27.63861659782208
25.58239628404245
34.818938449232554
42.70716719857398
36.03039221557278
61.5931524657089
33.81854408383358
53.4617800514492
44.551483376207656
123.06431238051692
67.95359475435471
28.8912347509512
66.50132497743847
64.20295019768885
41.638682822905935
60.112161705126546
39.982453312371625
44.28579040380168
28.138729559031077
41.27637540118761
25.58239628404245
26.407846255839768
60.3970550627587
40.00927817504199
63.107400083607466
73.60748745938152
24.90234375
35.21723226612688
46.32242666262274
31.68941550700772
35.761393405469825
58.59375
36.62109375
115.83385677813992
38.45040453634772
33.403576907201305
36.970984758175675
33.04838136526898
22.928431409909955
25.287123781687605
37.5183060787081
51.1647925680849
29.62463146897952
34.47832703888619
26.890956666043678
58.88598996750522
31.992670411877278
52.815692511679536
20.402912515406424
58.04183424655943
115.38841167953892
40.00927817504199
66.19408317008791
43.10724307488915
59.484200696036
83.59882660183754
33.467752906628505
32.52480953785329
37.66101601225324
