0.9099571800388888
0.8630846389113012
0.9285693773508684
0.8888061243334062
0.9024971215113088
0.9195786070270384
0.9181726363438384
0.9046798592091498
0.9227236091587366
0.9385919866822436
0.9047600560989449
0.9040856134716272
0.8999826662616589
0.8987580716346832
0.9127588049520337
0.8915140174220113
0.8878718708149342
0.919016188732522
0.8644299116832131
0.9110512432077408
0.9243700486378508
0.91308581112461
0.9216144620090776
0.9030267763292656
0.9097292729099544
0.8792036085363638
0.916911979420358
0.9591466646998787
0.9461490562958924
0.9467953276068072
0.8831343986573548
0.9184309671440372
0.911725994575749
0.92511099903285
0.9161120203214728
0.9140680680616629
0.8747591863344089
0.9056956875225238
0.9078492594961868
0.9206255352982048
0.894713074946268
0.8782636385207166
0.9383505863448844
0.9258768925604498
0.9281072523423882
0.9074635408314212
0.8952718667691287
0.8955052183517146
0.9265602797286928
0.9291218000872076
0.8810573655297402
0.9340813382506092
0.9197409266904552
0.924270702303907
0.8774477059285013
0.9163314727008048
0.9154654449003362
0.916998354756044
0.8500194258797319
0.9048749963679902
0.9016285896030374
0.9287394625694141
0.8659921030007249
0.9427246243977838
0.8995620382150259
