4.396907637748298
4.230719227155314
4.8095264494216075
4.812317599363965
4.449562581746374
4.073004309527208
5.062143357531938
4.552604255668977
4.755540539999532
4.637384461744305
5.086308584240197
4.950693406558138
4.28975043188506
4.869434248279594
4.967622060823826
4.357906366759498
4.3194691613033624
4.37718843370608
4.421291104312347
4.657123660408634
4.636920400353674
4.194417801342183
4.272751485218398
4.923024060480158
4.40668339694484
4.436091610184771
5.034401277404208
5.4615469160871415
4.537460716789849
4.578000773684672
3.431635902235982
4.449561963065305
4.422353548082768
4.257178408146619
4.513099635733604
4.207652100251203
4.361928647587205
4.15326766319066
4.044628652004374
3.874865462179721
4.6832248057852
4.988531387423808
4.505052316078165
4.447426908346632
4.5704909848292194
3.9804502167970477
4.587956317346583
4.957081498987953
4.718000432878715
4.461693602251592
3.9931094219483825
5.0115824728715666
4.294106259763859
4.0598331996931165
3.72749595620612
4.030386359572699
4.151697539865612
4.87402012819644
4.170185725824492
4.923679094954401
4.274587357914384
4.358144251274063
4.04418082912113
4.253162577002195
4.590047055782534
