141.98218798530678
173.318215203004
57.504552785369654
63.19696345432826
63.08726955632947
70.55975188518016
69.07661236718741
111.05004543876301
71.85398894960113
97.19064605379076
105.23937761629091
125.45108221044529
122.63232431913109
70.24892789527995
52.074693218045155
73.5714447414821
89.439402952276
35.34553416271184
54.547348780685844
127.21831411894115
157.3509603113925
130.51276578598265
56.51729513330906
42.575523204717996
59.470792269925404
80.03286247685764
195.2382954944968
121.8016022689486
127.29319912393407
75.4264388931593
76.3460342928277
108.95119123302479
79.94772053853724
193.75040812471784
129.2026295113692
103.21853466910413
99.43454397899453
59.59014203062208
197.3630348258881
93.1591510617466
63.00153424125203
102.54703056211972
111.87714535235563
163.62813868991836
53.88801672531154
48.59715310399869
53.902374972728786
151.7784824315535
65.34479123772368
65.30531774770154
46.337675790218846
58.21811483210535
47.20233209546259
63.85297902304878
43.25201438061347
45.88103745988838
38.57065324909448
49.36290927817225
50.175021694911884
139.88316279426348
62.508783997586185
40.880689510023025
54.68202369259672
43.672768804831655
43.40006415218899
21.530777227676886
84.793667721039
68.23409013045233
55.28550073297382
43.4488060126245
59.37369389002832
44.08655596619175
68.98980874301782
41.04943142433046
90.21233460267092
51.67170694682989
115.15738858608059
100.30579444319962
62.25849738413263
57.7556523396116
61.307477096275406
84.7298972898121
25.25144222858168
24.173161274989425
47.1384624423115
46.80284124656289
49.673619421227635
49.49417775025054
58.097471268255674
48.273159834602104
65.6097419918208
48.82828193149291
28.94843402210575
46.9032807285937
49.58760696117111
54.815462383316756
50.88979490749325
73.49988298059849
39.3830295886825
181.36236462205449
62.68050302311133
32.22522009299841
46.33441737845583
60.84431908357492
43.33227758522536
41.72645619006667
53.70314733832665
59.154627071885976
60.795200908820064
82.20270926174058
54.06393552973936
52.991264521303336
80.25097068911006
76.10130845578672
71.15144651663056
96.30423797019468
77.93930783610794
81.58689727627906
96.09727981192148
93.56362781876258
57.95881812545834
69.01497817257825
103.90295495008026
118.72329354260702
45.299040667231814
82.6176310433709
34.98946644152033
97.70328712119422
57.486598152568824
56.82995607397334
45.15163492406808
77.82746275799396
101.11693526774135
72.70872526025207
