4.214500004018574
4.381156625470294
4.17290944264066
4.040271194208493
4.043361810047683
4.050761082493742
4.045386140343045
4.032201118586073
4.109286697569341
4.284659608200981
4.236249388823567
4.320803283062896
4.380865557120868
4.144310368066705
4.161231539793441
4.255457144412413
4.274643088471288
3.9646110064109084
3.971782757358305
4.27355177887621
4.296127075612384
4.271557480962931
4.090949075096117
4.199321788076757
4.111340380753035
4.228136401420961
4.614522365566198
4.496261975414441
4.418342862334951
4.1115119144689265
4.052048738265878
4.288190806456679
4.04865308884905
4.489663027291852
4.382195124187489
4.332980042756355
4.42657966537695
4.060926257136237
4.464325499822858
4.244992682447582
4.122649412052045
4.379866340922061
4.347499244236198
4.229454491079301
4.0451264090454995
4.041306431444622
4.042969188689276
4.430350464496897
4.125175988450394
4.128271145993974
4.073431839832877
4.0762196948763165
4.162867993783356
4.13584784138883
4.461541459240342
4.066017699356961
3.8082264846032583
4.164440559807879
4.020421090080393
4.210219051337283
3.994632021252785
3.9607103011372975
4.216697863225224
4.010497869055231
4.213385515278519
3.520365982505194
4.142962162365451
4.08575379808435
4.1096197257391065
4.0121868146456325
4.079844490230637
3.8045848950922743
4.085560393106763
3.8843294710983214
4.248823110215318
3.909290199014857
4.202833461805815
4.388852257029476
4.1229169504229635
4.040007275150878
4.1169427737143005
4.065966709495944
3.8699587846449885
3.80573164066275
4.081527766102197
4.083746922094648
3.783838055442132
4.044622405167601
4.228624712654206
3.981036265980822
4.119891335664679
3.991037620997178
3.8186987765265723
3.9722926582756823
3.917977697194961
3.9045955673959627
3.97253366114204
4.273367736775637
3.9639003269696835
4.228785795064192
4.0543471561191655
3.8501981905848366
4.036902856563989
4.1677093265640615
3.8416315957706053
3.932381702913483
4.069842586423858
4.059302199707625
4.296315560123161
4.2088330252945605
4.0448973037043405
4.089029225261747
4.138430484654257
4.091270798964977
4.078115174182605
4.037573707347102
4.075955066101364
3.960599151771939
4.106005925731352
4.0086421303897355
4.088156925515492
3.926070728780786
4.159334591507935
4.1405785366655525
4.017651800705578
4.276746913555778
3.832195986692108
4.157265506731375
4.056065719468459
4.024130235554474
4.002679174344377
4.0110886535262225
4.2736971888326964
4.08717621854974
