21.473118279569885
24.49275362318841
52.49760074001272
29.1320197044335
16.973214285714285
14.676145339652448
7.53953488372093
17.294753086419753
24.82287188306105
51.16994535519126
33.779116465863446
65.24492557510149
40.888925510876724
132.99161979106876
30.115332151139
59.20875521143538
70.51219512195122
24.13872832369942
31.19086711133915
41.208255159474675
54.90675057208239
61.30625832223702
36.12125863392172
41.44648187633262
30.435716089921694
81.22706185567009
73.36350886140508
69.16163573657414
44.08555085799552
49.87796123474516
24.414718019257226
79.0798467884502
38.31774580335731
69.52020202020202
80.4654551688668
46.46037632193379
23.631791805873046
12.119572478289912
138.19631419939577
59.919735599622285
70.25275779376499
150.48283659716884
54.524193548387096
14.473988439306359
30.241532671912424
25.130361648444072
16.450188788846937
35.3540068764877
23.166817223727797
24.256780765130877
26.74807593637763
41.49427185468056
46.98564102564102
40.00065338124796
21.939954560207724
38.29400417939238
13.318037974683545
32.87281722933644
19.902452316076293
31.20244012652508
31.777235772357727
34.99751552795031
62.590901422707084
35.08261287223823
66.50570008769365
22.480733944954128
17.290006752194465
34.689701442468966
56.64856367014435
59.35353260869565
25.03363074811256
18.12293314162473
19.342280390417038
12.731764705882355
19.570895522388057
25.58425720620843
11.281493001555212
48.4825
43.74897360703814
19.360723089564498
26.67751519243755
54.130742049469966
20.21673003802281
19.970394736842106
64.76303422347543
56.98582151793161
33.58801498127341
25.348005502063273
32.32288880397402
16.84504132231405
17.868951612903224
17.721344673957066
22.28467577784239
9.660759493670886
30.633540372670808
66.31343283582089
42.08219178082192
48.98736726473819
31.684188393608075
18.474470734744703
22.94121086137456
13.023102310231025
17.74361088211047
27.90250105977109
15.462877030162414
31.826111423747893
38.413894324853224
14.282417582417585
53.9800448989773
44.006417736289386
52.23535457348407
46.341648590021684
13.47769028871391
9.35483870967742
42.80845323741007
33.09155429382541
44.500338753387524
23.63735558408216
30.15035587188612
19.56073619631902
47.47768431469569
40.662936142198824
23.45718901453958
56.546428571428564
21.397601066192802
70.5026235741445
13.877089478859393
19.47384855581577
21.361764705882358
15.275302768166089
11.792658445655293
21.76208178438661
31.26260869565217
26.448275862068964
