10.591397849462368
16.489795918367346
4156.519840724976
56.352201257861644
153.09649122807016
49.18018018018018
230.5673076923077
4.7
34.15375982042649
18.45049504950495
85.5396449704142
36.33859397417503
48.388833499501494
121.57904085257549
170.04460093896714
86.19182389937107
14.904453441295544
19.98611111111111
76.17857142857143
57.726726726726724
49.264761904761905
47.841487279843435
46.350828729281766
246.72916666666663
521.6468682505399
169.1024555461473
92.60936329588014
107.85250769907611
33.895348837209305
12.111954459203035
44.46015424164524
82.08034360788277
10.845945945945944
84.75701943844494
141.7003610108303
331.55852644087935
553.2182716049383
325.9843137254902
394.11519434628974
80.95696202531646
128.37701149425288
1860.9369406867843
67.82411067193677
5.31
38.28923988153998
143.7407407407407
37.038687973086624
75.52943532238686
68.65391969407266
122.30533199195169
150.48785425101215
56.84866666666667
43.280657395701645
129.74545454545455
575.8728682170542
1134.439600363306
69.01818181818182
103.72759493670885
51.581896551724135
31.44589308996089
25.02877697841727
31.79947916666667
5075.8366461366195
188.53797468354432
3356.1588128091644
73.26
48.048101265822794
43.9135039717564
386.0936599423631
200.09512485136744
144.3464566929134
24.615384615384613
251.26570048309182
28.6875
30.37804878048781
38.49659863945578
31.78782894736842
22.093888396811337
49.31575037147103
72.04240282685512
84.15097402597402
84.15097402597402
917.548387096774
59.07051282051282
3739.132112128782
485.49897470950106
71.32173913043478
303.8076685219542
114.95012224938877
52.846153846153854
20.57375145180023
115.62710084033613
178.05549132947976
19.051063829787235
38.991596638655466
32.854938271604944
13.493927125506072
558.3186721991701
163.19858156028369
583.8716707021791
3398.11209439528
14.051643192488262
106.03809523809522
262.2610619469026
58.99628252788104
48.738983050847466
1075.7334558823532
220.81496062992127
2214.6927636113023
55.21015761821366
48.20284697508897
12.957528957528956
18.3208722741433
16.62735849056604
124.81304347826088
13.46984126984127
60.342794759825324
42.34065934065934
29.82525951557093
24.06970509383378
156.09924109748982
62.32283464566929
32.18599175985874
6.453744493392072
28.06496710526316
71.10503472222223
77.11747430249633
13.057399937946013
4.420841683366733
12.253883235136582
14.454336147352267
31.732142857142854
31.972477064220186
22.58575197889182
