-0.9944275080970285
-0.8659553052662453
-1.0407893079951662
-0.7211411511491672
-1.1288681765632678
-1.2548075389498035
-1.3681626625460912
-1.0850623533487296
-1.0573349947674973
-0.9294649114311783
-1.1244632847716018
-1.1278052668139873
-0.9514060129710104
-0.7754750065836022
-1.0382925345043565
-0.8728782432205745
-0.6795310024682221
-1.0496826813286086
-1.1844342930583789
-0.8235117553350901
-0.9170825487162898
-0.7312759194869893
-1.2130605679960793
-1.2093970373292815
-1.3541984270887375
-1.0694381284894467
-0.8612976477473839
-0.9004082976199517
-0.8919692417136384
-0.9485318051756885
-0.9641487493774409
-0.8462772025934439
-0.9129256807303328
-0.7464578776485861
-0.7817944084758774
-0.8291393043984328
-1.22013898842677
-1.423842954802521
-1.0224075459196131
-0.8544698084148488
-0.8236050189994535
-0.997009809861635
-0.8567061471632477
-0.9954255842276302
-1.152174711252368
-1.1913973396124946
-1.0274903704558256
-0.7748328021120917
-1.0939258535990228
-1.16714721412262
-1.0097132406991511
-1.0299128292336825
-0.936295841025586
-0.9585825778784136
-1.265830602775899
-1.1979218726694074
-1.1957251757310274
-0.90899911270027
-1.0511586165198772
-0.7527461004351427
-0.8753276940666143
-0.6494407546137284
-1.2206413542927843
-1.0654662845714489
-1.2360355317965441
-1.3415390951801829
-1.0183843308905802
-1.0121380588000932
-1.150770970433599
-1.0436739760446792
-1.0478440286599162
-1.2559800717668677
-1.4986059255932913
-1.1574449322505092
-0.8443119426642312
-1.1736671055037515
-1.0190812021384408
-0.7271950415871088
-0.7548705464206449
-1.1327361001726826
-1.1452312124546684
-1.0630858487506283
-1.1268115120404
-1.1573130899892161
-1.1266903875752547
-1.0163657952220242
-0.6717926163065048
-1.107565688880274
-1.106882698838526
-1.083598711016849
-0.9339181524251401
-1.0484635316542272
-1.157021692080803
-1.38004108306284
-0.8640376709132045
-0.9585580690716043
-0.7981622519894291
-1.125658358623323
-1.1311639432342988
-1.2211751133449658
-1.2479796203523699
-0.848640338330627
-1.087430994899796
-1.2908290939259899
-1.1886917194558564
-0.8940270159496941
-0.9792504722858741
-1.2663597970950136
-1.075004559499727
-0.8647635287242954
-0.9841518019667875
-0.9289400703146272
-0.9922519206478017
-1.1002975956445815
-1.1877959011072048
-0.8150275006958615
-0.9392169769442535
-0.8046477824654915
-0.737821998666669
-1.1228831461095294
-1.1337702636663394
-0.9751098083739469
-0.9012522448108242
-0.4758577929072313
-0.6279818760899188
-0.8229817488411983
-0.8741437197855628
-0.9244965266355842
-0.9953472102543678
-0.991867096427408
-0.9016569839881753
-1.0066730557164827
-1.0828313164993817
-1.032213835721978
