24.355742843848983
23.914396787364648
5.00133902135973
3.6278424642025318
6.939747253889643
9.131542182408449
9.314535449693402
26.147825742906726
21.537865371228705
15.87218107330467
20.153394331008652
19.042353424858717
15.05829501367339
11.401929147379434
18.86274565296384
24.76757840271072
17.395762048938902
18.86274565296384
12.24258138931301
12.349758503621752
8.21055284364308
4.605120462971375
7.775449575636132
13.622200587335543
9.348120586785784
7.090125752952597
20.37958760931708
16.010724470756657
18.827438474891938
14.822851329823102
18.96713490401711
14.74052294454655
12.844510566750866
11.039805458089448
10.1370380855912
9.308629185481859
6.6793850538105355
8.08592580855982
16.164117547527226
16.406658239071483
17.928545809564593
17.87163607755722
19.902514560798114
21.442539177727873
10.684716067285095
11.560222118468728
11.065347317152632
17.90210299930533
20.065271124073696
18.8337128568686
18.610701821322678
16.676225066653213
17.311012537057195
16.05722910300301
18.297227292192595
14.55573429655321
17.924571116854004
15.320263678016516
13.495653138008107
19.92101406178528
18.41359943649151
10.988160725878357
8.416048721452148
5.646219378241195
8.995186180803382
7.934551182679662
16.84078981255627
16.26824523655507
16.26824523655507
14.147591731962441
15.23242291415227
15.6449034972512
13.437118349837608
14.398407198137253
13.437118349837608
10.337088663408926
26.310651951754224
19.516655100234253
14.956251521737313
18.039418745868666
9.789162158998193
10.311534692118935
5.775839722139777
3.2695809853460545
11.160842071534464
13.954556862872428
7.075448820531741
9.612809358704416
12.88820131574123
18.733182536050325
17.15770459948721
15.234081002701577
13.275376495628223
18.52952591037274
4.283691820124038
-1.276364031518912
10.142124510982526
8.284192636122366
1.1963252078794313
12.671884077566729
10.432725208902992
7.1364327936856515
9.005003186777762
6.202096122003932
20.65527045666382
11.291853983430371
3.5502484947745563
9.903999261792395
11.841130182988165
12.488969476832201
12.028522304103905
15.76402593298131
20.042939839985387
22.749860345203224
14.944308775241561
17.731499278443554
14.089393383990418
15.214922589951552
12.901294045057321
10.790349704407413
8.702827224594047
14.890922898554589
22.77943376781216
20.668549155352327
14.796049466730297
20.48333630419152
4.935264582337377
22.143804101493835
23.927944395074302
21.21383792242306
24.252311833250452
12.207263199087626
15.306852098719407
12.496317873471785
