-7.05354869214242
-7.047939354930886
-10.962352141167209
-6.281452556207275
-7.056359708013184
-7.5270898928746535
-7.720102111737957
-7.536156803802862
-8.453862602473054
-8.110103306892377
-8.229213304338321
-7.104361122809214
-8.498758694080006
-6.416857906002187
-9.436510395386506
-6.989160766173125
-7.058191580160372
-7.1706665900581745
-4.521345265235818
-8.283767645591862
-8.97732383996686
-8.380441990620133
-8.813674777317177
-8.22224258515463
-7.532165237678488
-6.4053312685792525
-8.004995157224645
-10.567268490267251
-8.805865704484745
-9.777079797740683
-4.1511127600624915
-7.633372311608495
-8.509856108133652
-8.380697760000986
-7.9194968992113495
-7.597707087812112
-5.232963175771261
-7.139028449311398
-8.15758713427124
-6.309704398734028
-7.373202952950194
-4.836124890192757
-8.985373896832513
-8.990598138741532
-8.934668454655574
-7.324457438673555
-8.333242944886573
-6.8383980364557955
-9.136823224853904
-7.672463806647291
-6.620227977063706
-10.491637999119314
-6.983990496208634
-6.164524452804319
-6.251258905204501
-6.0285337854698104
-6.968019525500025
-9.16068715028078
-5.573924071985854
-8.161119122388001
-6.917841633421341
-8.956487648595157
-6.146836509536699
-7.831668705109939
-6.955816774662846
