114215561.0
58587147.0
745447283.0
22078741.0
23314310.0
13229032.0
62976361.0
34035106.0
197394541.0
107004435.0
138370664.0
116723401.0
94677011.0
140137732.0
725889419.0
289293702.0
130602950.0
32825691.0
144047663.0
111922455.0
114932910.0
79896170.0
35983062.0
132089619.0
181045936.0
150513026.0
766789411.0
1648225981.0
193609328.0
77710248.0
84630336.0
298038961.0
44000862.0
95909295.0
370181558.0
167390895.0
280055883.0
42366280.0
1176523832.0
213696739.0
163874984.0
2105036661.0
190066685.0
26249159.0
81005253.0
99879118.0
126099088.0
383154291.0
271295100.0
266475991.0
74182256.0
127494793.0
64203790.0
103106708.0
171759081.0
185088952.0
30792828.0
206092446.0
109926615.0
111258077.0
39830702.0
63404364.0
1624153863.0
192787814.0
782112856.0
17221548.0
140703591.0
209989692.0
322586934.0
131058609.0
167786353.0
17405613.0
92532697.0
9731180.0
32166428.0
17166361.0
160365227.0
132142807.0
133819866.0
41796045.0
59056567.0
59056567.0
53129915.0
13802633.0
596241075.0
213283306.0
11769301.0
188951728.0
242072113.0
85981811.0
184991118.0
122600257.0
108793424.0
45951185.0
28153754.0
15833805.0
16008009.0
194046060.0
55494073.0
244501514.0
532602496.0
11771654.0
76300798.0
117025156.0
51064856.0
60266447.0
97701663.0
44448179.0
1231193246.0
68615269.0
38256663.0
35995402.0
44425366.0
30454635.0
64535060.0
39193496.0
100550205.0
39817327.0
44734392.0
33838912.0
143013507.0
31387532.0
251605663.0
17018056.0
100464232.0
1603654415.0
24395584.0
319582984.0
35765868.0
144729199.0
121418889.0
30754417.0
42717884.0
35310346.0
