-1.6249327320018754
-1.5106587329896692
-1.191843464637531
-1.9402851525414198
-1.4753896502948467
-1.4149009974169597
-1.625152725110729
-1.7328231545357666
-1.6592327415285972
-1.2764540346336088
-1.4244041866272574
-1.8181434764176059
-1.2345819373308455
-1.6097459656182311
-1.4931315700011145
-1.39727559588318
-1.442163431309601
-1.4615916846909158
-1.8235946557406049
-1.4646903860167908
-1.1113502674224476
-0.9444783344568367
-1.4246873668437074
-1.6892671334012757
-1.7197076321912976
-1.7221740448501346
-1.3985403198339257
-1.034326971945882
-1.2088295989659488
-0.8033823235173609
-1.1112284302366477
-1.40612044487333
-0.9258628401673681
-1.1172461204387116
-1.3544900811500369
-1.2415533290997205
-1.8148134394192694
-1.3945361142881343
-1.0818825332225606
-1.2932780751853243
-1.642227054957544
-1.9698372739453254
-1.2758952713919944
-1.5393097106720612
-1.2121102321738275
-1.4783855228004823
-1.5726656497811133
-1.6970830362349887
-1.2542299027609178
-1.52109896239726
-0.9718261890309371
-0.9733723860602229
-1.3911915983171872
-1.064850400309834
-1.4031988894928755
-1.845480516131114
-1.4642994340452105
-1.6869658115649957
-2.1256342993722788
-1.6469873150627259
-1.4464500208908329
-1.1862051051782871
-1.2444548970549014
-1.1234641258261688
-1.8191748920114128
