32.25862573925903
30.8709194852457
130.97657819274232
25.733210047309623
33.65496035788715
33.01869101246733
34.54864953765697
41.91653531469533
39.486768221689466
36.71267368519835
40.344574849251366
27.813103040789837
41.18695457610528
35.928729818142706
66.31580210353496
28.410743771223842
42.21436813761493
47.85726513169324
19.983442342499828
43.929035269182556
90.74909503902158
56.61392639546871
58.13810183113822
60.91273240892503
65.47467481322333
33.743822722103936
45.900663746271846
149.4361612673424
75.39540978304832
93.83315724327022
31.92183534912817
48.276070781948725
70.56986594209098
55.23726585446905
69.87636137407266
37.22826685040081
22.20092846670068
33.639648510224745
61.90928713532539
36.09774519846399
31.06339482080014
33.136282367954
63.56342561535496
59.435660739506645
64.90228197030976
32.881452907765976
43.94154790889054
32.308064519328646
49.8734284186905
32.48998953458413
28.302501018361177
110.00729145038271
57.68175483568721
43.13183056279306
28.360941220127387
25.627048086388143
28.466953776983253
61.3882803680451
20.78425380814016
58.701526387796854
31.95546339693405
83.01983468002834
31.51487609779536
79.75882121467019
33.53136926269382
