1151.9336927024451
594.3389521669433
780.2876817682802
658.1458466041968
297.55664574423884
331.3805355824985
684.2330119779102
813.8959156958565
1656.5309030402905
1391.9518510045957
478.1970931544158
481.356873152437
634.3105344510973
761.160550850038
1183.1371433745235
1338.1360073364933
1351.4654508875735
499.21650000232466
915.3282947143505
1214.8050304272224
1313.8005616176124
1248.955645413555
682.1455226751851
663.8430961548104
864.4737174875346
1019.076835392842
3848.398649013611
1888.1150991623047
1150.5983475774067
911.8353724478244
410.53978354770965
1292.7737057700979
1417.022706918659
1486.3242924231365
1498.0344132355935
1169.0591384331985
905.1681857397297
305.4128203818669
1385.1973483253516
789.8756142118332
990.0155769202589
1187.3626157620752
1158.1594016572285
1251.1964413790215
731.5827011224693
551.7264748987121
618.8247851103687
1009.2070295897477
551.2015198013405
623.6900239565605
411.67684839718135
552.6459126669229
687.9214741739772
539.832366882734
1456.8520978159033
550.6448546908181
291.538790996927
748.2435728984289
518.6326285058183
602.0790765184407
369.6919777758801
382.64019412540006
1026.9452236988975
684.3260466732942
898.3483853065663
148.02482089112792
743.0410429768059
1350.931508158302
768.9001939807791
572.4753939803422
666.9382786901914
290.4115962284835
498.552027495085
409.5570461190434
757.452755936431
476.2009692407207
737.9368021468916
1594.4804655609134
800.5317568791902
686.9722007865428
509.5756411947619
509.5756411947619
402.7278051264296
422.54311040120916
841.702891198216
547.6960681079298
302.22855902658193
911.2231567131764
822.7848892010063
587.8103955918201
1086.2657963564316
570.4659298035623
593.3706594468969
429.9829204102832
666.0729079350405
434.205811615323
532.417670046407
845.6920635140268
519.1969912875222
795.5640836333004
779.3771347151877
446.85152307035827
643.6194766668436
609.0580439751967
362.9994574800245
564.624703697932
521.236434726446
531.0941147412757
1176.4945990789674
719.0674164022864
488.1620199489574
582.264279151408
739.5934925257429
500.88050932993116
375.30288289467387
603.7179601844333
755.3619808332968
505.48569153439735
886.7300029169153
566.2626211240927
794.3641817320465
344.45395662728384
916.1005939876993
843.0284633975405
637.4619060338372
1489.1324549073406
374.10022721011717
1116.9066119453428
373.52577515627314
493.40869447234076
517.7590393224797
523.5860619637593
610.3576814219709
759.749334593555
