0.9560121235710732
0.9160599296590366
1.2412386691103878
1.1011527405029902
0.9262475947583612
0.6824504748885752
0.5482704204174608
0.6759085680278895
0.8901311380931378
1.4546218872628782
0.7748918392430699
0.8345031492964696
1.0306625928489312
2.4061189727678056
1.1702118169326927
2.1231297778265987
2.31618777331914
1.0910769014504649
1.0028683444363926
1.7186748461531232
2.5471283820161785
1.8427291783991069
1.2766032227426036
1.0170698670567742
0.9987950932135304
1.5004932593737732
1.7651049591666117
1.6818579671844769
1.3829062291679637
1.2639655467083686
1.1270822009224981
1.7599055049089254
1.2094142689945988
2.3958562059961066
2.464869867989161
2.2237166960060297
0.8666936826885242
0.6302577761257493
1.6718181189754195
1.8498995678772396
1.975426476398069
1.769406102979859
1.6023263719513612
0.7276052333985865
1.0177457175842592
0.9071409921888012
0.9803184129777984
1.1748862500231114
1.0096496072623364
0.9106811251170234
1.0050928745896608
1.070933052917887
1.9599273549900451
1.1367880844708664
0.9159353576024843
1.0247761635038404
0.6308710931255709
1.308031815356761
1.0048958731561128
1.6814465406874437
1.3263189697668936
1.3697548541744309
1.2021446743144688
1.3340099588372352
1.1844527503837037
0.7255512112803426
1.034838976253181
1.0779374066880398
1.132024065572488
1.055624617623068
1.0251045698880843
0.6926030541619935
0.6629786024205298
0.9816577382920428
0.99073081049742
1.0300765316926788
0.986272244340166
1.229549764013545
1.3964760341514084
1.0079097466207882
0.9381636112142554
1.2652759863142462
0.8266392941608637
0.8163190656878516
1.2845908507180452
1.4007096169637794
2.6087992653382392
1.1103336599794784
1.1857973966610744
0.6974951983998854
0.7424510254970306
0.8631655701019848
0.7255861055889935
0.4553921304399914
1.4157948147749666
1.5218019654349106
1.3146993357797392
1.5232606573550482
0.9499836856748544
0.842479983121255
0.8020872255015841
0.8923456480110243
0.9954068810766968
0.9434346113897316
0.7480275066991259
0.9751783343215508
1.107217728618699
0.6419130668416375
1.3785966046629363
1.6253270843705798
1.5178595026973905
1.5117639208038658
0.8615356895612603
0.6982009878184529
1.0496622782364062
1.0902229393935217
1.2702510940791092
0.9240298142734608
1.1589552448355682
1.4909370221306697
1.0655565016062094
1.1856770912709085
1.1664611340106217
2.40610839693308
1.2781355007197333
1.5128582256922547
1.2842843692921635
0.934032849671955
0.7864845505441076
0.8298430416507299
0.6681812096513018
1.0475566037554938
1.0827614613955376
1.169191761985674
