0.9662564102564104
0.9707490577055796
0.9552279403764552
0.9695608324928944
0.9635859635859636
0.9672984020810108
0.9604729044043028
0.965372248330448
0.959486166007905
0.9670726206585476
0.9736051072113596
0.9731604561632892
0.9727120501105988
0.95483276413509
0.9559846066383872
0.9477465708687132
0.9664927480733332
0.9587334791290292
0.9545719277810132
0.9746671597633136
0.9775987525987524
0.9807692307692308
0.9692791485244314
0.9583567284297212
0.9609617602697188
0.9684084880636604
0.9668937285437356
0.9650190646097876
0.9700611888111887
0.9742612570356474
0.9717948717948716
0.9701442167075393
0.9738648775159929
0.9758839950372208
0.9742596898479986
0.9729243289772282
0.968160486728126
0.9620294599018004
0.972838097953946
0.9700799416193984
0.966625142738503
0.9660535037095072
0.9736213153934672
0.9784482758620692
0.9545729860690488
0.9493913943664324
0.9549625990845148
0.9638769534963306
0.9639165127156952
0.9597033185502368
0.9609766637856526
0.9645811013499036
0.9604758250191864
0.9704429407613434
0.9545593848382692
0.951314095775015
0.9566610925306576
0.9565602714117568
0.950655711441192
0.9606530670066582
0.9595630955147568
0.9585939749260606
0.9421973780799022
0.9580596682622732
0.9461974286336896
0.9648829431438126
0.9699979450647304
0.969328140214216
0.955779010968312
0.9558385071380968
0.9548641770113748
0.970960766141489
0.952189677235888
0.9657495788882651
0.9686118479221928
0.9662382505275272
0.9655500952763014
0.9703937531151356
0.9641411220358588
0.9663036078965282
0.9600459972597376
0.9615384615384616
0.949281813865147
0.97131931166348
0.9492692700557868
0.9578725190085908
0.9632513235752104
0.9580361479663572
0.9602126349389868
0.953846153846154
0.9626743667593792
0.9555404662592556
0.9395688089519012
0.9541143787719132
0.9520431977302888
0.9500811424862058
0.9548641121674828
0.9573392790784097
0.9572218894252792
0.9438838977194196
0.9399646656463164
0.9640084685956244
0.9554465870461178
0.9624799246829484
0.947637116246982
0.9588644497165144
0.9591968262606876
0.958199635764461
0.9580490747541544
0.9712649353214178
0.9680264608599778
0.9693475405050358
0.9638267910579122
0.9673076923076924
0.9665303793857564
0.9713276987268642
0.9636471636471634
0.9540123741804412
0.9628647214854109
0.9819769602378297
0.9480818164024272
0.9567141719040452
0.9595042735042736
0.9677419354838708
0.9576277381155428
0.9583014031657109
0.9594289638932496
0.9613767015902248
0.9687123947051745
0.9570610032251424
0.9563266921757488
0.9707346814348136
0.9643942155790496
0.9725320247275508
