-2.5397947573486737
-2.3718360589308025
-3.4359110555538894
-2.433195001682693
-2.512182539268404
-2.7546896122220272
-2.7802577541472355
-2.705929275832331
-2.8550056840134177
-2.843975251379086
-2.816280596963632
-2.7007787429229952
-2.932439881678762
-2.2332588325867495
-3.1788946742682627
-2.5379173255613097
-2.6780288115431596
-2.6306398238444473
-1.7052918002228472
-2.7984507743735554
-3.1007631183896427
-2.9975321344253874
-3.040550764429441
-2.8716214262343893
-2.738669564488128
-2.430860613805736
-2.794495114407539
-3.5133522518537297
-3.03909079084441
-3.365772784009196
-2.281540107412194
-2.686264890133178
-2.9096803246141296
-2.7312139510162114
-2.8215252470553773
-2.6300450371867377
-2.0640344158385364
-2.585935967937801
-2.957216881116493
-2.3234341182357503
-2.51404315345184
-2.2193281419333446
-3.0033477029716873
-3.018560039534316
-3.0145355014194624
-2.6816590667458495
-2.9331584927853673
-2.4178419722268547
-2.9796704952128534
-2.719147200228725
-2.415069451181043
-3.4935025951247547
-2.640923250260367
-2.415648511388814
-2.3282009848362426
-2.2680066245647605
-2.5357952912114525
-3.034442898994356
-2.255566044185535
-2.809629141236872
-2.5989793008458246
-3.03989969791409
-2.3067571764228565
-2.873578044624998
-2.392451816674765
