1.1710256005508954
1.1858338627654534
1.1823779408645971
1.0686666718860178
1.1332585174346852
1.2955467957034004
1.1147832851441155
1.1608142854828252
1.1637325157892449
1.2370840446843117
1.1627770486638191
1.0831008003923286
1.2050329936685549
1.0891528817589613
1.1201620657481557
1.1343756791917297
1.2019153200732726
1.1846006816081665
1.1004765281304087
1.1367185471925416
1.2817098744055306
1.2940978321721297
1.2521233553190465
1.129217864880696
1.1321620432191302
1.1610239410087464
1.1689211184213255
1.2513266560724583
1.1815980447321477
1.352877265508943
1.2179463021041441
1.154725363900116
1.3161774614708701
1.2525164972891143
1.1855355709407784
1.194249679418813
1.1070118104623106
1.2445820237580751
1.3121966364388429
1.2407937703592178
1.1148233081201284
1.0450981380627593
1.3074915225740869
1.1931923148919577
1.2124815798154716
1.3317097912388194
1.2708278968453708
1.1002544608279283
1.2236153139450188
1.1468067069870302
1.276721205922135
1.2478937496181677
1.1594670319125422
1.171955638611709
1.257325479242939
1.1433024090110029
1.1437856863194846
1.1154101373206633
1.1126872772040337
1.1562493960548539
1.1681535686072593
1.2778210818065159
1.2281967558767601
1.2386286265425133
1.0894087937559185
