270.998446771097
133.6415381289018
122.54700270194999
89.01361845341845
51.42633049085095
53.82579375263471
119.5208278687772
200.5239256832681
373.84290458936465
246.7007660261326
144.6904064611459
132.83864817521513
161.53864708179006
183.08535474872954
230.03400261146047
242.4295571118153
260.8672165574314
91.3840587555953
115.29577165837013
131.73141295986295
124.39378824584931
123.89156574107454
91.34981805109508
82.84271926959846
114.46690083544232
118.82265780842815
723.0238321135757
284.08510149257154
202.75724974854745
148.89249543588198
66.52973500919741
193.3894422059974
216.91049366809185
206.18891361618432
221.60028751802798
151.79652834657563
142.1024434857895
54.07529452371158
170.08304951626462
100.56984116293312
115.96406070054398
126.83791756816484
115.37184683367512
171.40228448129253
174.6758785788749
132.53633170960916
141.05336772234787
262.30459801629706
133.56727428982262
143.46112977918492
88.94350283968132
131.14646699745293
138.73783152054847
112.59781632155115
257.19307190503156
110.07711225858502
72.62202776773736
172.19783869836078
140.41681286677988
205.3413372052668
98.16617567010599
117.68865088578396
168.5890942177995
111.67009325806264
130.84694927850146
20.183645661018904
127.1592206669894
196.8296804114083
136.9223893005115
97.09638758487176
122.63674455984685
79.52497559661859
86.64911781606541
82.0651281494079
111.88039862522119
80.52444247169575
178.21960760978337
344.3654601885356
142.12204270113668
143.27453977095033
117.58932864439764
117.58932864439764
54.43362342736177
39.26137423105232
130.08430049047578
86.04334310910191
63.80708006445234
188.2874623007915
169.66346540033032
172.52048532934845
278.5148872104207
156.34910270878225
142.46441138845424
95.28461296573386
175.0117828890775
111.24398312230957
142.55693513232418
134.48120858646834
90.46362054150343
202.1547385594144
205.9314969128661
96.68454903203462
128.69419508605205
135.2606209828853
105.49230474961452
131.6496207898307
74.41711983284728
106.71721156894131
179.63718851082837
109.92553410046577
69.05333656161963
85.1822304939688
214.0952168091033
146.68804504097528
61.847938806241075
143.23318446625782
189.98060734282046
109.20636783096657
184.0827158946951
103.45725032717304
201.57735377215823
106.82247358394044
299.860965731833
248.9885321848314
193.26118813218085
321.14376816090856
109.24120958905365
584.965977476635
188.54270993778184
250.44082675379292
268.83363697532917
103.26194323773622
109.55429382818613
139.48559504013727
