-1.050216678091575
-0.021237444445828552
2.233047963652069
1.8125424530591
1.0028627651929762
0.17329368275807422
0.08683125207327101
-0.7710693024809956
0.06578107239725219
38.080775527122505
2.5251360013779163
0.771101738911721
-0.4760484547124462
880.5715154158219
22.941003896657172
800.6750491402906
257.61937484666174
2.8485390928415435
2.8866350983957423
59.339837585425215
99.33526867598324
54.212184160381405
10.916262172129734
1.9845610081715916
3.210779999392205
5.469215192300265
13.484552116028535
15.891288491567495
16.547656224625626
3.943371476063686
5.430721233014057
15.689314012003177
1.6250483529373676
13.891798841512662
0.93922241548803
11.765625206616006
1.0357204186223314
0.2833458100498436
27.873389460462995
11.313379801355794
16.065684961033035
12.143827263463507
-21.638783785574798
-1.1658934215660612
16.224708983423586
4.871771099624102
11.320412447976697
3.1625775336498654
40.34856732892063
5.400938251583984
-0.532824870970338
1.880362675198748
101.10341185926262
10.377921498819923
-1.20949583487748
20.363657045815987
-0.09814158528213976
28.143603758166574
8.017691367439241
17.376064914085358
15.835959211712833
5.566201163384021
12.10665659985667
2.7197529728003573
51.33287202169715
-0.27619133026703724
2.1106543199710988
-0.05177313451716743
1.9736735978026096
-0.048000102160139765
7.191789331508303
-1.313105126625638
-0.8390170622112686
5.315401646992304
1.3130031352829858
0.10522151405130653
1.1644936650833286
52.181449953764655
-1.1232655425957416
43.624994408218114
3.512577621796252
-5.273876928561275
1.5287732331741803
0.31788842812178064
28.418103446408683
28.561176522615696
-2.8540813845869644
2.6922481592480776
2.545790860887422
0.5825707846284645
2.1589986428550394
10.525722652631806
1.5036835688213983
-0.06970398929195183
-4.865923071568688
-4.936819224436107
-0.7808523819247858
334.3292349143384
4.340956168011006
10.495310786237585
2.039203631344207
-0.13327124655062594
1.6095943935843875
0.2908861745600744
-0.36276000265579655
3.954511982077271
7.0527012411236205
0.19327238486124396
0.8377057728018601
3.5630357304858618
-3.467655539853785
-12.546378482222474
4.992147286022998
-0.5377010998236869
-1.1734303730327291
-3.606785866358322
-1.130203399783769
-3.5941621435329463
5.307286840033025
6.098755638075067
3.5718311957835263
-2.0519484617891153
11.60564695198686
-11.583400634539613
9.457525705922494
15.273889294668374
1.3527016595143109
6.663295804894793
-3.4991117076028373
3.3826345912107416
0.5798270633901239
0.004341607086862743
11.53276081651832
-1.0822820759154137
