-1.8426729602652359
-1.0728284271909367
1.638018481105355
-0.8510680995861544
-0.6203337325290332
-1.2135308840199974
-1.9767496226672787
-1.3178466440470453
-0.7489575140471734
-2.3095197599533765
-1.1394849891232735
-1.578945623656102
0.001335494749182714
-0.9755707651272008
0.24046164633648795
-0.6708318360754222
-0.024944503715365343
-0.4356199373244066
-2.5842666050102996
-0.8033337684629968
-0.19851600126865884
0.472288607519121
-0.7825361045297567
-0.5457110248219299
-1.8388589586251836
-1.9268977796126554
-1.0509326421663026
0.6216620678028899
-0.33453959079216866
0.5207180429289545
-1.5470838520686447
-0.9092722334236979
0.03247606033270976
-0.5760159016750804
-0.16711888231684663
-0.9502791780427564
-0.4830604134384611
-1.3157146510429467
0.16341234740653302
-1.7161124811173207
-1.627853458502286
-1.0614141607024612
-0.390878652261236
0.21186121827798804
0.005826412006576899
-0.7151829244880715
-0.886934337388307
-2.408543015333888
-0.5552447009336389
-1.4653407671910301
-0.8935981078425843
0.8573242952590109
-1.041838646470357
-1.5679908671680567
-0.9454392075157401
-1.2703014077187402
-1.9683977410818287
-0.4976487731410673
-3.425704529850604
-1.4883515340402353
-0.6468254127905597
-1.1650909348180734
-0.7911737463836964
-1.463461022444445
-2.4013662596688308
