0.9928134149587436
0.9936192839418648
0.9895282718464268
0.9933795712484236
0.9936276741010468
0.9912315663610999
0.9965949543414332
0.9916387959866221
0.9933536718239266
0.9939996065315756
0.9960958109106256
0.9970485150341268
0.9906497996385638
0.9957479706223424
0.992151465555721
0.9924953095684804
0.9922669922669924
0.9905437352245864
0.9983277591973244
0.9941471571906354
0.9879924953095685
0.9841931065966676
0.9916387959866221
0.9941176470588236
0.9934785830739586
0.9957479706223424
0.9937425828028916
0.9874915483434752
0.9919307338909178
0.9846340288675172
0.986425339366516
0.991221544413034
0.9836886005560704
0.9872664648784052
0.9907529722589168
0.9931113662456946
0.9965034965034966
0.9946153846153846
0.9915622183992792
0.9889617109348052
0.9933867037939436
0.9836333878887072
0.9904254161679904
0.9926990245896852
0.9926789028665706
0.9920038381576844
0.9895643924420904
0.9966113181972214
0.9899200360400946
0.9939948527309124
0.9881656804733728
0.9885635470245108
0.9913696060037522
0.98995148995149
0.9920030464584921
0.9977375565610859
0.996153846153846
0.9946368372663194
0.9955190440627336
0.994786543379894
0.9922912907987536
0.9909339007354642
0.9917448405253284
0.9924761370016844
0.9990262901655306
