0.16384628008452484
0.13750244143161444
0.17652621646964417
0.12145575434089949
0.18973550031248465
0.20783304121963866
0.24429533579726972
0.17704743830164565
0.18211382237199505
0.15846168256302434
0.1922874877283372
0.19283416370311732
0.1608909404773733
0.13884515269353603
0.172313713040962
0.15274697197992396
0.11590061146934866
0.17652871380588675
0.20002648752502278
0.14408113338069048
0.14952889865801486
0.12018023452108505
0.19905999387709555
0.20614631662731608
0.21718839758824535
0.17338101040431933
0.14554857933894977
0.15541735489124017
0.1587530032975605
0.16174044801922927
0.17712868781524038
0.14516816532654955
0.15280842896735994
0.12146695783924821
0.1269582909547731
0.13583784179308178
0.1984979172831863
0.2406052284572954
0.17038089384600644
0.1418417041100362
0.14503941814408744
0.16105182332056847
0.1373273066894581
0.15989774866100326
0.21119742325031124
0.20427507941394601
0.1910281607338932
0.1294453767969152
0.18910051221470445
0.2081245343296957
0.17875132292402543
0.17901824436364264
0.16170122907922907
0.17801557843823185
0.22375496125231853
0.219787961000684
0.2200872376923824
0.15286444030387542
0.17548424831076936
0.12892430726455992
0.14122497073202042
0.11222128063037068
0.2144512793926232
0.18012141667760292
0.21453123285755332
0.2211331811021369
0.18282834440422402
0.17621318738106428
0.2008419949967195
0.18174287594296024
0.18192413856163836
0.22875526380404512
0.250256446477304
0.1883295372182419
0.14445702930885027
0.20190480516298853
0.1649094384296203
0.12362141253290578
0.13113561673274388
0.20006137539114335
0.19654416719987694
0.18524105044174433
0.20596499215637362
0.2172076138027661
0.19959800672727
0.18269166902824427
0.11623900843239685
0.18149183597926644
0.182664840614455
0.17472952515263773
0.15347769874069025
0.1913168206392041
0.19849838983331844
0.23559067834732053
0.14940175756796717
0.1717511658717362
0.14761514624103236
0.19555001821602955
0.18546311511270805
0.21349847396311056
0.21492200304627748
0.14316544844944248
0.18321077295588806
0.21737513968714078
0.20921928005001902
0.16215771707640925
0.1688265222469143
0.22995434691652614
0.17710408563327068
0.14077039987536955
0.16323015794128748
0.15903432329331685
0.15763267043311124
0.19268607977688845
0.2087390475669478
0.14036894958246415
0.17035148426904237
0.14853845323325265
0.13283764917624824
0.1822484659931197
0.18995109699572296
0.168517710677
0.15015416676041596
0.07619809586764816
0.10811344625736836
0.14072058458586467
0.15117313022885343
0.15541974263350863
0.16968076939786184
0.17647265927377812
0.15430565189459744
0.17132121347381574
0.18238631737496336
0.17512420749581104
