323.0
330.0
97.0
99.0
209.0
236.0
82.0
154.0
107.0
101.0
22.0
89.0
153.0
406.0
51.0
120.0
784.0
765.0
400.0
102.0
256.0
313.0
155.0
231.0
343.0
384.0
198.0
207.0
297.0
160.0
326.0
620.0
497.0
383.0
467.0
277.0
305.0
313.0
513.0
460.0
87.0
139.0
310.0
226.0
235.0
231.0
130.0
42.0
47.0
70.0
329.0
193.0
332.0
452.0
264.0
258.0
69.0
109.0
104.0
58.0
39.0
332.0
572.0
416.0
118.0
