0.21574346461824173
0.19345785802093932
0.2202866307237796
0.17352327532100167
0.2688321459801765
0.3391683300105406
0.35341513479998105
0.2711333234887254
0.2562641270660705
0.2126126742519248
0.2663628914472745
0.2640104091566401
0.2076474364818645
0.15857770061014714
0.2209801823258974
0.18777724258274014
0.1412767937554737
0.2561716178269237
0.2893985848358609
0.20801055192025095
0.1938483423792948
0.17107220596674555
0.30338316169941204
0.30546115919375944
0.3093768965625597
0.2442475737977015
0.18217155483906616
0.1890151573047295
0.20316815236852484
0.21560816302442776
0.2298877684163079
0.17864040088473074
0.22503817296130976
0.17350188003366135
0.16350529121300642
0.1782064074326167
0.2823430207921097
0.3867377459060198
0.23226730789444205
0.1927320535230425
0.19485269601165067
0.21097323392294
0.19729941147229166
0.2824180137486326
0.2862904762511561
0.2776540609253089
0.24897399568480666
0.16318275491820636
0.2538471448184932
0.27641569541036803
0.24095790548606336
0.22391241561500536
0.2012917177559704
0.2517852288330196
0.31207912625547496
0.3027951670805684
0.3197163236468808
0.1938828744468573
0.23407254715579115
0.16322634053753107
0.1810517182426967
0.15696681774584678
0.2787372535380345
0.24349737704529226
0.28317475583066604
0.3446928565326187
0.2598796312998522
0.2513421087677743
0.2741487069521106
0.2569216705841176
0.27831451560801923
0.3468053901388029
0.3896874265145411
0.27645110611061224
0.2090307355999217
0.3014356114027921
0.27577307181733784
0.17852486938007345
0.18707956419367186
0.29947221852822625
0.27288760079608704
0.2580286562353615
0.2902877347416838
0.321650424496713
0.24995378443716196
0.22478090849840576
0.15480857397451508
0.24424735281056534
0.2509215990318661
0.2422997247329735
0.2134121868107617
0.26034045556793184
0.2817948422294683
0.38450770016748825
0.1926505720977469
0.22180431374569268
0.20176146742758014
0.2617257049623605
0.26265506633195074
0.28657209333569506
0.28769880921174323
0.25338292270879026
0.26196684597777115
0.3290349945939245
0.30450301137081304
0.21408579836482414
0.21542026130362746
0.3532958488299852
0.2270044895297157
0.19300088739583848
0.2350185027218572
0.20998527195648126
0.2267972073082795
0.3143128628763052
0.3076463606225176
0.18604300262970794
0.22431715255791984
0.2194528937160584
0.15941726251078414
0.2679072841887043
0.24234353351433666
0.2333565351159313
0.21101756461170926
0.11731337736038315
0.14150247201543195
0.16811354086497834
0.2291228229894866
0.17298865416936168
0.21653484559263114
0.21260807946411311
0.19740712190002008
0.2335391629782512
0.2401571930774935
0.2310728117343669
