-0.24781627215013008
-0.3164665577245145
-0.36696891877140075
-0.3327512323874253
-0.1769872548640126
-0.397227617398096
-0.2807123511931888
-0.33777227433808854
-0.14736164964985213
-0.20647110084347303
-0.3029385837989802
-0.3550964362804041
-0.16552438969707545
-0.21597586082562809
-0.2057918901473495
-0.2178845382590407
-0.20543373224992054
-0.17046828244154358
-0.17800938227944058
-0.4112095518746017
-0.21620091996141838
-0.3935446058102768
-0.2819153093079193
-0.3608608320703733
-0.27692960668286365
-0.22405430478120777
-0.43193800085471484
-0.2738355257605979
-0.32403258147600855
-0.16324487710497718
-0.32783637732053655
-0.34406715318526127
-0.2573108817611183
-0.3000079356841377
-0.38237362843450273
-0.3104120667625117
-0.3567635060669162
-0.18092173898459443
-0.19505319903805204
-0.24508529597525677
-0.364438891968701
-0.34425205428625205
-0.3556361262263365
-0.3982597380462004
-0.40874193698004097
-0.1521081761629196
-0.35903064295716974
-0.165341854308213
-0.0846783715840011
-0.40214478501536527
-0.3046892851112381
-0.14659064303929625
-0.2741201329028749
-0.2588724413547627
-0.43170271475309235
-0.23739315855260607
-0.36993321032072973
-0.13353607154780028
-0.40356155656362513
-0.43619697589017165
-0.2668608594670428
-0.25481909463136626
-0.3905939239418417
-0.34886361153001244
-0.28386485886981855
-0.3770401502372363
-0.3569549602273185
-0.38280232450357216
-0.3731259771278468
-0.17926107900727553
-0.39279657108578037
-0.4582816251485394
-0.24834808657295201
-0.225793184569525
-0.3899424822814424
-0.1256334207631108
-0.3557597190319936
-0.3502543463730213
-0.343383779824849
-0.20928813800096874
-0.21521151264216473
-0.21521151264216473
-0.29578876924489134
-0.3423059971115583
-0.34183209413726645
-0.27294425897337127
-0.40600600948579424
-0.162694385025385
-0.23844578892158483
-0.1636000402145061
-0.293888130682455
-0.12457932009467479
-0.08420124722513884
-0.3777342700048025
-0.18726922030686344
-0.21434997967370625
-0.21612125571970214
-0.20630579883088088
-0.2011567554082442
-0.20060518073385789
-0.1792392845748165
-0.27370760381330833
-0.46000013844383236
-0.26475646099242733
-0.09914554017060861
-0.2805393456611892
-0.26497067596608886
-0.2455337577796403
-0.2217936486419061
-0.3932789514373964
-0.24578266493019602
-0.246068201217334
-0.32522997976200657
-0.22776262644690926
-0.28958581883341356
-0.23464973972724001
-0.26818626934554324
-0.23161179734962137
-0.20596301928613645
-0.20464189501751714
-0.32769162289155856
-0.17825501397184493
-0.3637815322597139
-0.21790820907643968
-0.43306484922967287
-0.3200398230068148
-0.15272600429006947
-0.4210997857281364
-0.1979965381738362
-0.36458959601682045
-0.44865156404940204
-0.152907627095085
-0.3310240826193117
-0.14582899260711737
