5.684680905078584
6.743505930141026
7.2616050968283155
6.686370538362946
5.874189793897369
4.609075164739527
4.694006959379139
5.250834856108042
6.579638901385933
7.001781801106805
5.76109400480661
6.485894508151057
6.85810524122384
8.906120169797793
6.9789441996519175
7.534053893408741
8.112285616992425
6.1523424477993345
5.5024679457831125
7.243259369534735
6.226204517727514
7.1297679762352395
5.518775732274667
6.075248618723116
5.974370079482536
6.128545428642643
8.06414344420383
7.76268247430676
7.033320459883632
7.389188097030951
7.639480541332272
7.850336840260804
5.553355376349607
7.3346209930963315
7.501977205512095
6.899867806465275
5.5023262140978275
5.541586760538355
7.265839263344908
7.693080325994471
7.453891152780068
7.583834562230742
6.342217843227339
4.457800467556246
5.817981900817045
6.569577880370427
5.812386141073298
8.640143033899287
6.697722280750545
6.379250170300273
6.414745881005156
6.7453115966335915
7.150107094947725
6.138763119941899
5.571776362088963
6.429962587953813
5.3429767938158195
7.078023923211738
6.189861957454124
7.513988290662772
6.5421262950974
7.575120422307272
7.522302856851381
6.310756771971216
6.631743167545665
5.138100999553849
5.982747922492614
6.003698958031687
5.950796915631531
6.877878683947302
5.928907913977227
5.254045357759913
5.062123499236314
4.8892430887565705
6.082152158663791
5.515867109391929
5.322959013803533
7.49161614498047
7.1967556590268895
6.183406130252435
6.246317448540313
5.678089412867639
5.464682767720525
5.522797191519781
7.741994194565631
7.477243503352661
6.264315738460816
5.840654084577465
5.95854992579616
5.7652867863116155
6.185407195797295
6.628757185215115
5.664282129291124
4.119804954113968
6.902276995540701
7.152603371861161
7.6027104552998095
6.878854285473791
5.950476562975714
6.15162572725529
6.565758186433575
5.414365589475835
5.502071524933246
6.019959493973686
5.314442640803424
6.418955071404255
7.32147213803951
4.780137879406746
6.697380645362303
7.399708265045763
6.525184574248233
6.585033815124411
6.211650732856534
4.868819855442336
6.114792229497606
6.736308544458667
6.779976460911984
7.0303804148075235
6.9477371745655185
5.1591388310658965
6.963420672175549
6.541679170702647
6.633456474064599
7.627050045586054
8.74017276674533
8.077569545708396
6.661459585740378
7.527712789172707
7.4409816418544334
7.85651542921279
6.608239469409952
6.371852458489994
5.509086703638362
6.622378158931268
