974.1502580294496
731.9310742010307
24769.66908150016
775.0214487482135
670.3550225881753
293.58995102563125
1033.0292994656704
277.50016704381454
1899.8841773254287
1632.3247701495816
2008.2832473371168
1615.3474890543796
2272.487014334988
5263.433893225039
11211.850472346892
2488.570991741652
2433.158619052805
426.79295297453115
1413.6593658162421
928.7773047091343
1315.7123811280178
1146.0879172359305
822.7932051366232
1350.374228706559
2957.733498668349
3049.613529287773
5988.3931047013375
22412.773900510736
1658.1417220342637
969.9751500295116
838.070547052795
4603.6943628693625
667.7676909693433
2086.8048913975103
7901.152070078266
4463.028308678031
6290.385284370371
940.2559825304469
11759.6187787969
1845.6237139208374
1167.946481396202
16115.99992800342
1339.1687392350368
160.93300808312745
2316.603268935486
3028.0115560589306
2662.3615020986103
5463.125027146325
3910.681726420563
5119.388463718991
1266.593578014147
3216.378618948932
1790.9095499250964
1879.1419243037008
2018.5322463867533
3870.250025468993
411.7054760095226
4609.135226058277
2707.8486708471023
1695.6400077771555
639.7732242686058
2358.1930516576035
25597.115154585703
4085.3319075115387
14225.302745728522
300.3750225651986
1684.9372984611537
2485.0618436865784
3795.105385629698
2255.375597658053
2347.152529275366
248.76036184980632
1366.479802663058
185.1198582395141
581.531810427752
339.50117286689226
1329.7194423603673
2201.6147658279706
3048.517553468111
722.599043579914
1401.4724658147156
1401.4724658147156
1569.8876380252066
422.02451503100053
13390.017798126672
4280.440547042256
347.33010382425016
4134.525947548385
4785.144718415372
1516.6242008723289
3290.8379226777497
2287.928750363406
2242.5797760522355
521.4964457869116
1302.444388784142
741.6933890173387
481.1579599301479
3953.492403940831
1646.1820639630673
4020.590616534176
10440.550204922496
384.599850044273
2099.558229315985
1827.4949810313683
646.0839873575028
1390.4971406914044
3807.9287441713427
802.4514025092067
23776.301803099883
1295.4572756495731
716.7237452568077
538.1984433124672
617.0724409445528
390.3422933914817
599.0107201606688
590.0078921360354
2159.0202688053164
665.3280410326316
1251.0489362433211
798.0608925719196
4658.01211739109
625.3984320974872
3512.980156572116
367.300921944804
2585.109178071597
20623.289443961905
1505.9595357295282
5705.440087018829
722.3719721647229
3367.453643723148
2337.6715338022345
624.036190288843
758.3156304019466
743.8143192782278
