6.352580786682682
6.10170778605012
6.239760816016068
5.806645256530119
5.348703478779918
5.173782394170535
5.803978537755836
5.645734636800787
6.452377963180183
6.2721636116149195
6.083579043715893
6.1495246425925165
6.070812630274568
6.410053075443899
6.454224721969534
6.865191754798416
6.488117643783093
5.645632620083637
6.159040005655824
6.023714372561969
6.023750518081162
6.07344973137186
5.619502081512594
5.9248715446574804
6.067196726952145
6.085651646074853
6.785843057056974
6.77486422330245
6.296449065338107
5.985705793808987
5.614155906871011
6.436166118005652
5.863716830589128
6.221364121452089
6.433893969305401
6.292954943695625
6.185706872451947
5.714257908792057
6.421588814397099
6.050037734384143
5.754747339841237
6.348984400671935
6.136647078215691
5.40372350509126
6.392452921404384
6.248924890297508
6.2621467699077975
6.818676838155639
6.349101338067182
6.417913658749592
5.759454798464367
6.0500770766443965
6.056679174880746
5.875238486003603
5.8632118098878845
5.902282314456032
5.445767675261804
6.35116436844308
6.30093652583721
6.501613532326535
5.980326911490638
5.989819598372936
6.391637450412069
6.1250037242850315
6.176847327525933
5.093639842617327
6.05221477665163
6.215715395825008
6.272763691074482
5.9706314211202445
6.140983269800923
5.310667523077557
5.893836198319643
5.015111376837545
6.113877358772607
5.349199815711253
6.309929050491244
6.23251844300161
6.120071026440002
5.849318715024365
6.062417483838397
6.062417483838397
5.32810646860024
5.367021973721947
6.162174027276671
5.882443404544791
5.457830051956169
6.1092435392631534
6.2223400675641765
6.083896263870777
6.408266480405077
6.144823630502493
6.077302661638974
5.894531835899666
6.093189281559737
6.0815632124776045
5.971504712504097
6.102477159466447
5.993225217128017
6.623096035178786
6.36658670239566
5.398308003155212
6.124166237120393
6.034723960806708
5.931224452627947
6.001592523258507
5.9014072648484115
5.938999158382472
6.24989833768826
5.907388887145612
5.7250198125257805
5.911029987970848
6.019312747109646
5.664899091333887
5.383807947320843
5.770910729857987
6.333348568150773
5.9870915577435895
6.42062443986371
5.950400627994406
6.490135707718957
5.724583825885347
6.7268562448442015
5.961245763453376
6.315260599047284
6.695438707413698
5.8531527195012485
6.84463941490667
5.861447824935527
6.500483794407791
6.287195473145211
5.7645842620076975
6.068177790361067
5.926443275361957
