104742480.81006084
89678933.99368489
374288053.7992162
5032751.81608729
3613553.167738248
859504.3753638758
3018645.7103990205
27995166.20109245
77083968.99958345
24510614.828498267
70417688.04444237
45594513.15599913
31053379.7929357
35529656.04389533
280467015.86382204
184134481.39879996
48076226.53915483
15150174.175266014
6091941.747161516
4968457.245356277
6944981.84567411
9712715.566306744
2676907.540235448
4767129.034535768
8902873.832909811
11872329.615051337
489089759.7633266
644713825.9525131
92347355.98758437
17987422.432257246
43895284.31806679
106658110.8481402
8353000.362696276
9163318.637957433
24636197.56677642
10527932.96360924
34511252.15087267
2879552.556192752
397865867.2577349
46550252.35119404
42270781.15374219
617785681.6443785
83947143.15113506
8323326.690226266
10075168.371418534
14845203.758694354
12212421.007821912
147576077.47144234
314416685.1326348
274331335.06464744
62690954.59995913
78407885.57827881
64074242.31274127
34447171.7594447
87260970.1130506
48843708.65520563
16455686.070966935
88881524.3664499
36460407.77063592
163168125.30108795
39530948.06387679
16116728.62611702
202805543.80259892
48002333.97378003
88616191.41539872
1136088.9023155156
54966547.99912501
47753729.35580628
97940014.18652664
36868685.24443532
44195566.84847625
1918466.342503106
10198510.50497081
1271464.3183754017
5096277.835979968
861401.3045029656
139680805.85213464
57275547.44615877
51808471.48590802
27935132.966609117
15084818.12305022
5746315.4185406575
9328187.753762126
2835051.9098262936
96772318.34237675
56680746.88382314
1579117.654137111
33805042.63248206
54175566.33683579
36615526.88711331
58437313.54994601
20058592.887098774
9952200.843362847
14364873.127964545
11712313.055647925
11649805.58773118
3208249.3594861464
18570126.39352113
17592106.61552405
85058774.28789741
48917630.74371316
1045655.6717388664
6227419.397464513
11192013.969429612
35308783.77621677
5748572.266139908
31089714.87228847
1476495.0184610114
184728803.3256759
12841831.366419636
4732476.492771462
7260953.699920053
25190214.56068329
27582631.27211245
4850932.20736054
12536055.730800662
18168090.394268464
8465799.776110882
9229481.871049222
1894041.4549929397
23617439.23559739
8176743.598527024
246475446.41453654
21380714.35579869
24885110.31980349
1683893617.6752033
8422740.919088528
704301971.7049267
104189837.54154643
364162146.43453485
377227729.79462016
3202656.762385952
12885756.266813984
4737769.051085402
