20305.42906574394
33722.89861751152
48397.7616794796
51684.97950819672
28754.48224852071
19863.255613126083
88091.42857142858
23799.179841897232
25766.32719546742
61053.989769820975
89453.88888888889
49686.79376498801
18598.307456588358
31798.105527638192
71344.0256286267
20824.704268292684
24047.367724867723
12259.144208037827
14732.608695652172
44881.26570048308
13136.065243902442
27065.5853115727
25255.42566619916
73130.0905882353
33890.04431599229
23454.55276381909
33648.708274894816
108785.50552174893
48130.382848392044
21976.272066249243
2906.9803921568628
21986.046421663446
53591.82008032128
33901.221166892814
42624.76882430647
28819.44989339019
20548.06363636364
19138.715
12719.27369542066
12448.681614349776
34680.895927601814
3332.198581560284
55097.71499292787
57549.644646924826
49517.33243967829
11333.713097713098
62477.01233299075
53860.25550660793
35488.39311859444
31348.650557620822
8836.350961538461
71859.25812476654
11183.168292682927
5843.0
7260.965346534655
12803.364705882354
37212.042105263165
64982.28353253652
26026.165048543688
112226.67774936062
36332.29424307036
29245.165965123266
11037.560975609756
29986.471532846714
47783.19409282701
