2.5533716301003424
2.445562376027898
2.2184904459072468
2.280953038949981
2.117254246717475
2.186081105205826
2.166552958778144
2.511975897443819
2.4141463092352247
2.4652010735046845
2.1986015315902856
2.126492516780307
2.2460617800742253
2.346131494931996
2.341324198691547
2.2990116998676617
2.51417830988421
2.352545822593517
2.418786384076742
2.439221394929228
2.4742077517500363
2.5482671128142913
2.374826087536401
2.174214646038516
2.312420648616948
2.417831945444069
2.6511342432426397
2.4500295704131805
2.444423276079911
2.524598273139247
2.2588519441351607
2.431278448535119
2.5370530281014707
2.4405141389557805
2.451556069174382
2.36249233393488
2.299240493655982
1.9281281463629796
2.502804597553196
2.4638617845877397
2.355245461592509
2.35786257380612
2.3691089575933018
2.6470731489387234
2.195392650345163
2.1711902356370527
2.269389045669461
2.3618795832031965
2.1624444933750895
2.1688538332530714
1.9913234223129084
2.2130556624534203
2.1496789227985613
2.2377323952343793
2.1342660933848365
2.001754774104567
2.123741126341411
2.2231038383126775
2.1793346989031233
2.382764450748459
2.0799700181894667
2.2345768108667157
2.271982211774412
2.374494908938686
2.1790099554936595
1.835679619522551
2.502209160395805
2.4315262395656316
2.2712565809806424
2.214938678699243
2.3049333102902057
2.0781109644057003
2.098074400281531
2.171319492739237
2.335744062281325
2.1810556443514844
2.365434444216362
2.423370444911392
2.4078094652267596
2.2161237214578304
2.3360128235820894
2.3360128235820894
2.0440625265668535
2.2024907939449796
2.140110938469739
2.2230898471568725
1.8080836799198783
2.2791241100006254
2.364696249998541
2.224760481323904
2.448604934709078
2.172976373388678
2.054583034268272
2.1769952585964667
2.2592228064971285
2.128950695077363
2.218355825370424
2.1621331352347974
2.212008345474308
2.0616924142283715
2.001884882797508
2.277913866456993
2.180302924767819
2.4807978263715307
2.092520230605571
2.168899535953672
2.202416387088752
2.1082436366501103
2.2739786471456425
2.412528199264307
2.261489658389061
2.3426098670666997
2.2908001490175844
2.2770075910893737
2.2254344015257694
2.354569102302969
2.340628681377626
2.1692602340169977
2.427495703257441
2.367679242519234
2.2750856026797566
2.059125099685842
2.278752290180129
2.431495398628118
2.1936055330896207
2.406214075932702
2.0835202025989235
2.3791184912274916
2.3279387696091463
2.2408806876917122
2.1418223957909777
2.2590966549083533
2.370897085040049
2.441311748821241
