-4.374721253282004
-4.891217276801297
-4.175940193714052
-4.3601834932069385
-3.9950377334992377
-3.2523681075825728
-2.625395603910672
-3.794126398010591
-3.5307179408479032
-4.093434861897928
-4.067921407057956
-3.797008304862476
-4.610615213292801
-4.8429282045865145
-4.407743611727264
-4.31282844627212
-4.951209077784552
-3.7326125322071295
-3.7191716591904953
-4.263218536526048
-4.068600813892687
-4.228960343399721
-3.9257472816055463
-3.8817387768049807
-4.369787081029301
-4.435585674371957
-5.036626218207798
-5.5221723153459195
-4.306312017110139
-3.9694541245023895
-4.042486092259707
-4.704563552123947
-3.9617649494405023
-5.6074930224671204
-5.91217519997224
-5.654188570796039
-4.419217256826912
-3.1206398992996367
-4.714757520273867
-4.839857273618667
-4.495718036880192
-4.906839207562369
-4.466216603521339
-3.5839068342483604
-2.97514849659647
-4.155218202643368
-3.2164355910429547
-4.781562586364634
-3.8535310290918607
-3.753327957399976
-4.225242391208982
-4.061944521819208
-4.444507817516689
-3.2932314079509584
-3.1076917393848014
-3.214640728781553
-3.017448930994759
-4.644935107070141
-4.288337019387091
-5.0655080871655205
-4.448320811802711
-4.966890823903003
-3.722093886053333
-4.0726722535591975
-3.980200623375713
-3.2009654772895098
-3.748631195591417
-3.7648789040024804
-3.7943673365680786
-3.7359293491432397
-3.59342125532035
-2.995738607763306
-2.993852159032471
-3.4986818483471365
-3.75191084912965
-3.222573382917694
-3.8643129661449525
-5.037274897310009
-4.604838911654516
-3.324391949966362
-4.064667614237811
-4.120558664087167
-3.313255636143558
-2.635401820487687
-3.8106847703778053
-4.051103379436021
-4.296261669602783
-4.341231856399431
-4.353092142190556
-3.9781845834525287
-4.745328709737548
-3.8555062672579954
-3.50605866377449
-2.684737020984433
-4.4961105709303295
-3.854333388982349
-3.7816697444511402
-3.9785679904994034
-3.723728341881404
-3.540606483365683
-3.839937123166193
-3.640645228688134
-3.4499636650774557
-3.4599102025433344
-3.346680875035855
-3.7043515483585745
-3.8846951150390883
-2.455740654831775
-4.924299295169579
-5.005940220008696
-4.061554985321232
-4.149909612184317
-4.365489938583896
-3.0913887866616507
-3.3311158016049425
-4.463639304632039
-3.6614561687336717
-3.789578396414534
-4.179168787106243
-4.183065875410633
-4.230457262677403
-4.139356424069869
-4.592831740072511
-4.491852428237434
-4.780664232367429
-4.947172263709401
-4.000205507366647
-4.280807745658859
-3.7879054347240273
-3.6829004539821266
-4.233546995698027
-4.108174750801562
-3.8000020250551567
-3.9480629420762647
