337.6032651895812
325.2952070114527
152.09195272095096
171.43945720020614
199.492739189558
220.94425160850096
222.3976610870539
339.7211642706062
272.34517485862443
234.00091368383892
342.3490841559302
326.3831958865673
268.0957253021556
150.90550506450649
214.1246409298233
279.93578856900467
196.34370540812202
212.90019830328308
206.35603185075092
283.20511050365
239.4104061388468
205.21458024141944
217.84593444230225
278.1467573299008
234.9343504462637
212.80311849542832
341.1754690622545
271.5095098967795
294.64179266500616
240.15168447228942
297.50430710344017
239.2468983821793
217.41963146423697
249.68046111237928
236.847806275458
224.56403167804834
236.7811739366996
251.81332160187682
307.3815002827841
305.008492801968
328.3732272632254
327.7530384674488
363.2896280586686
390.9094281729245
168.38472296023494
171.97997306439203
172.14742896841477
228.03678089024865
272.66480876530863
253.75305214718708
249.86980992131157
225.9215131048069
232.46590124521447
246.9039798855505
273.847582370478
227.85003308488803
271.3981612990805
192.77834611043045
179.17301846115342
257.2877086244271
227.71737841240207
155.91389362480396
191.51353340420127
169.14421472892968
193.75492804966703
184.00211820276851
266.60520653798415
255.74909672310392
256.2834696223257
227.84575956220647
246.51610236216868
264.7189462088569
240.2067559046895
247.34224493884355
234.11116861873688
205.69181969217757
335.19364015679736
235.63157353148662
203.9477245725227
240.74116751090432
195.74819152353058
202.5191249660424
159.88283470508438
147.53617050106237
153.48759369999954
178.88772107734638
172.5604863735898
178.1689865549649
205.13587847841552
206.0630971328928
192.76086632686244
195.58378678836516
178.051361998498
224.16203999416626
119.94941428332426
110.28502773165607
150.7443909760379
218.7249995835733
155.8589590521242
232.63140463308446
190.6480278825222
157.18676438899863
176.94222734705627
189.3888421985732
246.35770049245116
152.8099756447869
158.61133436818986
216.66418146754987
203.70699569230962
212.8211505120277
205.10718148950002
242.06263009404307
247.9567578747224
282.21896261084737
292.03670587317595
231.5498276189717
192.07164043115543
207.50625903575923
182.90670510589626
202.42546191833242
148.87608465238782
206.49308076800853
235.36593400254185
219.1190389395829
153.21278687319392
240.62882642795674
123.48482462742257
202.7175016468895
210.79128612363425
188.47294578662465
213.36990565231758
203.22054317358644
239.0410657641129
201.6807401837381
