207.65021717648372
329.821190273235
989.97937367672
1159.0267905678206
677.7593406331223
152.13443059254666
1080.147353900984
183.25837741489315
219.6492613147448
623.4530540505559
981.786711938092
862.9811398044096
335.6415584781022
455.8625856941311
1702.708934403182
466.39037121291517
254.89642728070717
146.13007998950403
142.82611283643894
682.9642689364463
197.15969724810932
344.25252953128137
249.55671876804746
747.1225196956952
391.58001978700935
299.18853692258574
366.10811688973746
2380.5601470622532
1420.4296495878068
503.6560529450537
86.1096854241449
315.2310165065784
471.09518228954767
346.00321371387565
583.012162286209
423.919760611474
384.1442446265498
132.42011342502735
113.97511184944088
103.54818298216304
576.162981093479
43.88372531531101
549.4810217725528
538.2007576428865
524.8443015301467
94.01226494691744
390.3123163471592
984.7594865371716
313.86118841790534
590.7792249184353
97.06881114657386
1090.7901464592314
228.5045113184105
113.28157064545313
69.6183734782072
144.89959378945508
308.65925967491205
1010.2682582208952
185.26974909925872
765.0032699410768
380.86896259557096
309.27741089795154
129.11791392636601
309.0739832573924
882.8834602735457
