21.223062381852554
14.503937007874017
659.556411950378
10.70509977827051
160.55844155844156
183.27388535031844
339.55238095238093
65.82291666666667
214.86506024096386
39.82857142857143
279.71614301191767
278.81804733727813
58.898426323319036
55.290013397918166
148.6155466610491
35.22066420664207
8.767968307866441
63.55272727272728
137.492600422833
17.516265912305514
30.95333333333333
9.341325811001411
150.17708333333334
148.10791366906474
598.6641304347827
86.31428571428572
20.925861569649577
52.812821878884755
70.70278450363196
53.490467937608315
73.47363184079602
29.24761904761905
29.497560975609755
9.299944659656887
10.316974054391995
12.867590454195534
324.50329538645894
926.02
74.40452725592857
14.838652482269506
15.951627088830257
40.128540023276855
10.937106918238996
14.526315789473687
449.00835322195707
242.89046199701937
291.51206896551724
21.18923611111111
378.5370277078086
750.328738512949
49.70288858321871
272.39793882978717
37.984826589595386
182.28093158660843
619.8393351800554
1210.7187279151944
209.69162995594715
35.97714658831211
59.73139880952381
9.69424743892829
11.08498023715415
8.11212814645309
3552.5869980879547
307.3241671073506
2152.1125941136206
363.3846153846154
208.4016620498615
167.1590038314176
609.0532241555783
118.21130221130221
110.86708203530634
241.45454545454547
2005.18016194332
29.68888888888889
14.64179104477612
192.27555555555557
32.012048192771076
8.804314329738059
12.059574468085106
138.26060606060605
916.4195227765725
92.92831541218638
479.4386363636364
399.7072599531616
1978.1657565049788
263.5369685767098
6.378151260504201
134.2171270718232
182.49939686369117
117.52222222222224
32.278317152103554
111.95113636363637
420.6750861079219
545.0232558139535
31.178217821782173
49.67987804878049
32.96273291925465
486.14223669924
256.95118343195264
1581.8651443343383
1346.9587563451776
12.624060150375938
200.3863134657837
979.4726688102893
156.48496240601503
30.77431906614786
188.0333179083757
324.8157894736842
109.13687021128395
16.980549199084667
18.16434540389972
19.508083140877602
23.8903345724907
72.44117647058823
316.70428015564204
17.405329593267883
202.36356821589212
20.84320557491289
16.7311320754717
52.420875420875426
329.7945397269864
65.6566037735849
26.447891805887032
3.694174757281553
10.750290360046456
37.194889212356465
33.48825503355705
41.589634664401025
61.22543352601157
191.82608695652172
29.871559633027523
58.47238095238095
72.27201565557729
140.40883977900552
