2.088360672601287
2.069511925359589
2.5533450504022204
2.007452579207675
2.1051183121436345
2.215369934453935
2.1973477205018086
2.1438590718334662
2.248482509372989
2.256843458069578
2.2378024131328442
2.1761413261292932
2.258955797857313
2.130822307235357
2.3269803944665637
2.137187511365974
2.160902157285176
2.2089198232648064
1.6956751222238289
2.193738991896402
2.384902613702512
2.403692716745538
2.443291495847265
2.2458543571949483
2.170280706160623
2.147781390717998
2.307617465708451
2.5803137969291554
2.3764866245454073
2.531544628992428
1.948206540372508
2.215945126762179
2.3527909606437696
2.354428548094745
2.273012003113371
2.1592413173845926
1.968768017599451
2.1128027050254947
2.332671536893044
2.170207935676179
2.180732285383402
1.9252907661301277
2.3968150816128846
2.4229830414185054
2.4120506423861414
2.1827109392077286
2.2301226936283336
2.0724851387547862
2.3272354327419995
2.1956760136536237
2.1171818969246448
2.6086692939334086
2.189570463386997
2.1675922690659917
2.0465093213767473
2.0196399938380276
2.146941200169431
2.320265556410722
1.916279946260916
2.144114675706326
2.193525166726775
2.3515953131621306
2.1839800505434397
2.2296969120990044
2.0603158951990883
