10.272007500141976
9.72446460369122
10.071273447665973
10.72888090011898
9.739471342511067
9.357861885723972
11.265838351177441
10.33503021688885
10.717205549748199
10.12362617666015
11.466982134003425
11.374509721827817
9.339571450616658
11.408586811778138
10.253840704505121
9.35682645025993
9.884257797221876
9.90371251465697
10.600686233858257
10.477886139794462
9.46302434158207
8.936592333128123
9.731622830660372
10.626168686820968
10.264193302392044
10.041786425030898
10.35954543569855
10.004349477472049
9.600997076537592
9.207591256904967
7.814811640965649
9.766622966739737
9.337674939160305
9.506145051237723
9.805479933569965
9.548485314385378
9.952842123141364
9.984619157776985
9.290036615915966
9.349248796279298
10.751201487117378
10.570184401534064
10.002374426769412
10.014345671500209
9.912299232145447
9.292086682046357
9.800872052108131
11.337289984879245
10.579615303262349
10.01079436813159
9.141751024083138
9.679237402944123
9.19577461315621
8.986164002591913
9.15483257658455
9.982761611978994
10.43545297502139
10.63224487441959
10.519451351863383
11.01783549924128
10.014730293760012
10.050070998518361
9.448941788886698
9.654400398970612
10.79367471696936
