69.34574028122415
82.31186258722491
67.30352084176447
53.94581280788177
75.74872448979592
109.27172195892577
142.00465116279068
117.56790123456791
87.07394668959587
43.994535519125684
101.28174235403152
99.55570590888588
72.68885959129861
48.21099758925497
76.82867275951439
46.87909469922573
32.03263483339059
56.01734104046242
72.23447922011287
34.491557223264536
23.78146453089245
26.462050599201064
51.24405218726017
70.54285714285714
77.9830765344784
44.42319587628865
38.54940711462451
44.654393168007886
50.22457100223826
42.21033740129217
64.81086657496562
39.373305833824396
35.30935251798561
23.943434343434344
24.330361734956284
30.88435654443071
97.81730262001057
124.17434869739479
45.27540785498489
27.378659112370162
32.315107913669074
45.24476504907061
41.29133064516129
97.10404624277456
76.10092370851866
83.42220353238015
77.67673540516991
65.70245966675483
95.51912074676302
102.3101977969916
76.47665469471524
74.28682010527402
43.42324786324787
68.54982032015681
93.99318403115872
94.89487220704065
109.06329113924049
62.63998835855646
83.96348773841963
39.732037957523715
50.32520325203253
39.10434782608696
76.83293032671652
47.67127761767532
83.0079341879985
100.9908256880734
67.15530047265361
59.48171754444817
66.02415320851793
64.7766304347826
59.744680851063826
109.9000718907261
140.64818101153506
61.46117647058824
48.365671641791046
65.84478935698448
61.951788491446344
49.73166666666667
37.42111436950147
79.80197206244864
81.72896691424712
55.30624263839811
95.79657794676807
75.9592105263158
62.310886271908
53.72060050041701
13.823970037453186
67.5678915307526
56.05005731753917
129.74070247933884
125.22849462365593
103.2924260834346
123.74265774934574
156.47848101265822
42.98531902879729
27.695522388059697
47.034246575342465
70.77041376785058
79.87804878048779
114.16950325169505
119.7509419254255
43.396039603960396
65.878812860676
79.9215769393811
95.61484918793505
70.92796848621272
66.67240704500979
108.02637362637364
56.959804725082854
37.55775962660444
37.34737923946557
40.44251626898048
86.95800524934383
88.70674486803519
62.976618705035975
65.66713981547197
56.922764227642276
83.0770218228498
58.326512455516024
29.74355828220859
77.75903018307768
54.96050032916392
61.07495961227786
16.8
48.651710350955135
54.369429657794676
42.37659783677483
112.5656518345043
94.02549019607844
106.78114186851212
130.38055635216517
64.19826517967782
65.39536231884058
53.659928656361465
