-6.620911165208984
-6.655238029848655
-8.446651110787752
-5.176125132250691
-5.437061504285679
-7.96959404641866
-9.470116782028999
-9.274691229891761
-6.935124366954603
-5.9113706687431185
-7.006481724214466
-7.776914162134981
-8.669428934143095
-8.142467010226369
-8.421417480624424
-7.267281791463368
-9.45310467739829
-9.23925400600531
-6.23855602811017
-8.346640552133207
-10.076175904427622
-9.389501618822296
-9.492529720268644
-9.719630346217366
-9.66810806988524
-8.434091424610774
-9.435323116667853
-9.188189855310878
-7.948364664507784
-10.96052971242581
-6.021227364406209
-9.963138030916065
-9.986270592883947
-10.735943760733912
-9.452065143533684
-8.090678944060231
-6.299256430063291
-7.9545588068714626
-8.798062321694681
-8.62097782326543
-7.391188695018213
-5.75788929765391
-10.146403049465805
-8.962245349516456
-9.215416543364835
-6.8848479988878335
-7.069626470217021
-5.9618755266590195
-7.508182663722827
-7.132360939120964
-6.991224285095772
-10.561662424386043
-8.736028177843018
-6.543308777939315
-6.106799929851186
-4.7439387359858
-7.529270845645619
-7.552109668536468
-6.940707109206035
-6.372895123007
-5.827707870556979
-10.812100799646966
-5.565617130455424
-8.093239027272402
-6.273112415837508
