1.07764657716084
1.022697553528882
1.6548442254672329
1.3092530551417274
1.0565626477496675
0.6851839742241987
0.019996659237781256
0.5812508815927115
0.8847821223587666
1.9399027475493775
1.085509703681981
0.799150354028318
1.1848276500920762
3.341728097846735
1.8138670821699217
2.95214818454633
2.890786304931441
1.3939087196087292
1.487082776078671
2.202703054690681
2.5633843423627622
2.208116296758047
1.431136062136594
1.5657082172913892
1.4540975261699487
1.8869126847157385
1.9437284326626931
2.258649060969446
1.7634324700941129
1.428026078542298
1.2797370647020743
1.999362252817483
1.1040282179431251
2.4184408388259078
2.4151432114391254
2.290590003032464
1.3377952993167461
0.5305647174332973
2.125894906301795
1.9519519293865872
2.105935509018428
2.1145963361155102
2.304810453005659
0.46909432674430257
1.677585642262844
1.638381060573373
1.4880754570662411
1.6019751513757747
1.6333110733959009
1.419402584147867
1.0722712032109447
1.389000241328323
2.150705621404311
1.3800224644975716
1.248946148006437
1.5279317592671267
0.09457227649417972
1.795912246039614
1.3739481604713804
2.0155179665171166
1.7340810201247283
1.7152446236603591
1.7219470026637231
1.4766472829663437
1.8809060118190508
0.27194108776087067
1.0078417897530514
1.2249275153098573
1.222921507981262
1.1652881477116999
1.2153518009962274
0.9639418985435091
0.6898144209126637
1.2665806664999737
1.2526577200332583
1.0037918543026692
0.9353777446069192
2.0508353408399493
1.5048361369582512
1.450994776908279
1.3052886390069662
1.6082186692617433
0.7170128470917797
0.6903832843619903
1.9188905870388067
1.8556763767426563
1.8502095669045766
1.3735436857009051
1.4392469871895142
0.2418564447961418
0.7254664538170302
1.238462881493098
0.7832301724435131
-0.3483378932890944
1.87202351256624
1.8370902743312707
1.5663021401997943
2.5409445912017072
1.0912301538013107
1.1901809857568988
1.3372834101861584
0.6906531815494246
1.1160755069436346
0.9507638313643573
0.6313840347338624
1.4369366444370129
1.601136813090926
0.187887147337355
2.0116721854191386
2.0921528412468993
1.541466047123635
1.9126662661824951
1.2192543577398218
0.25192099687629876
1.2197690504109795
1.6343394578595984
1.3052090277985633
1.0972423390008097
1.7301153245309366
1.4114750159598923
1.8635603620523318
1.6694906347447507
1.6142759759834355
2.0455419342164607
1.753492388778648
1.837027822472106
1.1555454219419816
1.0031423682446676
0.6710962928932377
0.8195345205839992
0.46241969956265894
1.5051703301774995
1.7513198146107618
1.3689222654021538
