27.32171426653805
29.16395716860455
100.81305772126669
23.12189869889726
27.11097871762497
30.06311322837612
30.477782663700552
30.757573456376143
36.7002889381051
32.965070007627055
33.934452089453345
27.1136028343457
37.77772197050043
28.35739093188661
44.562165684862926
24.68885370799321
35.859467354468215
32.671795686034926
14.200182040155644
34.70718937634009
51.142469478641594
46.984971283363855
49.57898536191411
47.83197758452837
36.97271163824613
30.626997328077604
44.96342472731228
86.19943471855369
47.32728213867279
89.01035654389234
18.431485003730668
41.59714008986513
47.640837621517036
46.16767089342783
39.542576086564004
30.41068825759112
16.600385875706188
24.19631855982467
45.636397001619166
25.99395911943936
28.133214637909315
18.777114375405333
56.88701799836813
50.348205063381904
62.074080818543166
27.81547054474377
34.937912021342925
22.175750216444158
42.657764684454385
31.661823958872557
24.42027349764519
94.89500165734192
30.764887730413054
26.381091882959982
19.82232178683504
20.858614740661547
26.557632629462987
39.101102140700114
17.389727605643852
30.02805340324884
29.840942476223955
52.68820183327007
25.577915890800327
35.336538997874506
23.074536590795578
