14.696868244967819
14.550463669028016
20.41878283274501
16.312985076446786
16.267661053551834
14.238275797567981
16.728765413001117
15.81559381565002
17.26731229955508
14.33381810766126
16.91256048743311
16.74948272485837
18.257604578712744
16.127585328541162
19.33634937815933
16.42217570060091
15.453832409007195
15.852725744567453
12.691558089595773
17.137293831641607
17.967460403629314
17.345059673370745
16.423430376281573
17.253252334812064
15.166705758859282
14.097162476736976
16.83082434178919
19.834651426332925
17.970534802132786
18.82810883471594
11.847085178160722
16.89111905854174
17.000494700378944
17.10720622998776
16.44546910983595
16.469496555207957
13.996262973983692
14.275802882721504
15.903871025939546
13.371909266721486
16.93751484316317
15.636553184283526
16.748844942519128
17.325605496907702
17.231021520614284
13.106249860859556
14.989111697356313
17.049825619347622
17.302414559173165
17.39377581796118
13.725345913576474
20.47419330592395
16.009028543908304
15.113436890243808
12.663780657438187
13.57574784938514
14.299811724469976
19.076942771048586
13.82755360097662
17.124204533539007
15.665143316565798
17.059488861047427
14.522181947525596
14.739195214545543
16.608236353085598
