0.8987362966887792
0.8866846918297223
0.8166483369894793
0.8615921281305928
0.8264072156277604
0.8401608216105505
0.8179245421806924
0.923121632712262
0.8728774134416066
0.8866707695199959
0.8648952768789487
0.8624717823946416
0.8688065802532848
0.8630145321526317
0.8524706133989243
0.8546379003096625
0.8885092278437182
0.8784384243227142
0.8453604625395378
0.8401975943337537
0.851156635758501
0.8654979945753897
0.8623076225502323
0.8238513681917787
0.8263139737701037
0.8538060639209646
0.8635337287905066
0.8582296031863821
0.8721125426319976
0.897316735725635
0.8653105319091505
0.8624828608640642
0.8924532640629554
0.8672350520703754
0.8598979240376121
0.8474310625049127
0.833446561176992
0.7918618091087235
0.8424871760816982
0.8621458303101883
0.8420480590525485
0.814239556305805
0.8439659420262831
0.9245051020301396
0.8628547566006561
0.8425266038444504
0.8669152854731739
0.8713770658322555
0.8544305080581286
0.8504258089181597
0.8468797639809067
0.8718202516612924
0.8634239296905751
0.8520666395075855
0.8192446470471714
0.8032370253868207
0.8377815769600162
0.8649509523519934
0.8626644016163383
0.8685016369829912
0.8718724212878097
0.879344148291376
0.8062537715294391
0.8511933501168569
0.8061854038829057
0.8194088662769393
0.8715650157568392
0.8668884254674201
0.8344902970482397
0.8378941465344598
0.8401493032593675
0.8643779947977409
0.8136181794925028
0.8680498572718309
0.8536778173143814
0.8538219745265558
0.8766194732916391
0.8869213933084913
0.8700995815488018
0.8489951513027452
0.8555579254530782
0.8555579254530782
0.7845939139727558
0.8439740804437899
0.8050246313303032
0.8312048824680214
0.818511648436396
0.8506776155266096
0.8601531324935892
0.8605727501151251
0.8901132687881801
0.8538013821590043
0.8468345608888618
0.8748296994953993
0.869779005120506
0.8651726918678921
0.8806449771583345
0.8077522290028624
0.8394659846536824
0.8172723756531491
0.7884029424963048
0.9026013267579762
0.8563485632365795
0.8314362873133216
0.8520557581335543
0.8575568271251872
0.8139540019149754
0.8020445976912286
0.8206832450173991
0.8612157650337393
0.8611143917760321
0.8810695852180319
0.8894255307349292
0.8932557880295532
0.8117495091759885
0.890457844920332
0.8651260557701342
0.849149733696249
0.8763072992445683
0.8674135039013967
0.8446551959353108
0.8430016036034448
0.8737683473990449
0.9139492860957072
0.8766606167171888
0.8710963866128159
0.8663937220060981
0.9025964513316268
0.9277429843909606
0.9010695104572544
0.8975502303019128
0.8681854947763896
0.8669985715074903
0.8840000701318709
