144.80787388606214
109.46530234531171
38.25845330701642
59.31626990072626
40.60626543242064
156.10069711206714
286.89592742503123
188.13792628871533
119.96264795327852
357.20167830826006
191.3845039945982
178.9369571442723
63.764729588063936
32.596184689500944
129.27152899414963
56.14822594077338
27.413203098876124
31.795014726878943
73.46712860650706
175.5786439308081
86.22208041299245
34.09156794978534
181.76872971372418
97.53357876928615
235.09841618609315
151.6633105962911
115.76351348929742
97.63695779322826
74.86236246897309
83.69501976823108
30.70593165566557
70.37551375248034
76.48713749895302
52.99440115827186
46.746782337001584
69.48494000411576
15.309259175226336
147.80011496444953
59.55147591738818
42.010150735220094
204.0386104894801
35.57610842400161
78.12158967620957
61.167545664742356
73.45226526633255
65.86333645248709
287.0898662296213
161.26210256963023
116.92645863141944
127.76373888713108
46.10839272642715
111.20917349536636
56.9887928247494
36.48343720263256
47.969981996839145
54.30818075997586
161.02683299577615
180.1088343389278
497.69506927949334
257.182222537762
92.44871249741222
304.26991489320994
47.643388507997635
128.9382562431858
178.22996643822248
