3245.3326666666667
6532.707384403037
5279.409123055163
2066.8843861740165
2404.863226863227
2197.584541062802
2943.902374670185
1848.5273311897104
3414.7855731225295
4642.461885430762
3618.1023446222553
4870.429650613786
6159.718355280837
4239.355884425652
5149.556566230813
9069.377531025473
5133.709707529558
2886.939431396786
2365.804309842749
3983.5424679487182
3722.964189189189
3176.3781690140845
2739.365828092243
5438.249391727494
3493.1600922722027
4158.8813793103445
15927.999859214417
12043.687165494805
7385.855587121212
2410.9573170731705
2196.3627450980393
4902.503363556595
1931.8052738336717
8364.322076612903
6238.3338745940555
5405.5498474059
8309.241379310344
2586.340425531915
7756.412851405623
4191.324277705909
3367.905533063428
7624.521111270502
5674.390678941312
2812.711206896552
3429.668948990072
3743.9437812025176
3327.845863570392
8531.42527599275
3435.7506387327544
3945.1834706049412
3387.7573033707868
3202.7749303621167
4345.597851112817
3075.662709120345
14413.220572256429
4058.795805973311
1519.2318840579708
4731.777497749775
2950.8592680749766
3707.3968692449357
1993.2638469285
2582.2657366451176
8250.518200322504
3029.4909551374817
7982.791029272899
812.8850931677017
3077.817008014248
2764.664556962025
4384.7524957619125
3149.586867305061
3439.047265361243
956.3815261044176
3473.8253234750464
1584.4306569343066
4655.4588122605355
1671.561097256858
3722.6551499348107
7486.9183585313185
3498.651283380866
2381.1924778761068
3615.981711195929
2657.493103448276
2684.787037037037
1255.8623326959846
4753.64862104188
3954.715982028241
1154.7570850202428
3133.7160186108335
5617.6623100800525
2765.3873925501434
3508.9817830527186
2550.2946616225304
2401.704112718964
2691.3138231631383
2080.7917906008333
1742.0590717299579
2110.1735330836455
6392.665861513688
2599.572148419606
5046.952729785764
4544.56122574306
1691.403669724771
3283.2612436448962
4223.3340532757375
1856.8484304932736
2423.636696288552
3237.7084341835784
2752.0552423900785
7280.875183333832
4108.227856225931
2635.629547960309
3335.218216318785
3234.096109839817
2610.8196428571428
2645.5265760197776
1823.8261474269816
2881.2853281853277
2226.654261704682
2546.066854327938
1445.2512077294687
4135.266380407124
1742.0563866513235
3743.8597777777777
2358.6431451612907
2867.137789040228
6591.922821481736
1742.2602040816328
3760.512779035911
2447.377858002407
2866.063113291704
2610.9766723842195
1764.8058124174372
4633.834913112164
2372.7903893951952
