4.742600589093197
3.9673392364639284
5.964854076365148
0.6581196581196582
1.6002135991456037
17.966940049354047
1.4774204081632654
4.182681661907814
4.8825330812854455
14.039412639070314
3.7121217130639854
0.6165384429283398
10.358852704332637
0.8366477272727273
2.182593990387008
2.764775
9.160613451836012
7.908241357767596
1.0572562358276645
2.379737749689256
37.58582069539924
35.63444111079565
17.928383491814532
2.7604810534802477
1.8555519948726165
3.6535238751147836
6.569494459833795
47.9496378674111
7.0022999802078845
125.33668386211173
4.3953287197231825
3.1987687637038285
71.43704095627292
19.61263922929457
5.4717851777846445
6.178888888888888
1.1201289975812954
16.232177734375
65.16881619795471
9.336260330578511
1.7058882164471345
0.3846624159315224
37.977029038365046
9.659071328211727
16.601606788548757
44.0144355070382
28.839858601392628
1.215025843869058
11.162078860665321
2.863074426254507
13.774827495851165
27.75797112539537
3.23352830529001
5.034006979952926
12.563327032136106
2.706666666666666
3.669242845067021
1.7709292678657056
1.1331555555555557
3.3974579833176453
2.6103323203607487
17.180075164442805
6.6379123263888875
9.663010782544312
0.9039478434453908
