1168.4476102213687
604.5253090757278
806.3778896870527
673.378154607233
305.6674305622531
340.0365713341368
703.9443301020785
826.1347204218074
1697.4156598933685
1419.7279680465488
492.6477057569135
495.86163876899866
653.6893281527473
779.7570166310705
1219.2705157528874
1377.6561987655175
1381.648456932059
511.251097335235
934.8906190341572
1240.2430306109218
1338.3053600579433
1269.1110193428633
696.226727265969
682.9469131748757
887.0525173861564
1041.9849943962402
3940.6699365874438
1939.202130877923
1174.1702776683173
928.3986371706987
419.4298114703485
1324.2710196002272
1442.366662503838
1523.8588756537936
1535.7787095326353
1203.7125549109094
932.2597397885817
315.65798503384997
1417.5047215560962
804.7789050996864
1013.9147559777807
1221.4204927975106
1186.260962153885
1259.944898158798
750.9822135759886
569.5317158676878
634.8597471531158
1033.5793608737986
569.7960825386057
644.5323633755203
426.11380596982406
567.9463667241338
710.1715935897853
554.2207216973055
1507.9611103752932
571.4122112498706
300.4824720272865
771.0238917002772
533.5219485354216
615.3786796209221
378.54408974581725
392.1369537259214
1064.4898623631661
701.681299213373
933.4143703693317
153.2562569165246
758.1930749966352
1381.0090822700038
789.6685720117601
588.8127190437989
684.0074790732075
295.7841447729532
514.8096940387484
419.5825038171732
777.058498398497
486.7760416134951
753.7377339887468
1634.6458649913354
818.5370802722973
704.0953005102185
522.0464870940798
522.0464870940798
416.96040827158964
433.46266606493964
872.0401403839568
564.5017290431941
313.6202995416993
938.3052964755844
845.3316261870746
604.5923014149096
1112.4741468925256
587.1596571598378
612.785810127399
441.9936026902506
683.9645353473197
446.8861849037422
545.0290233431814
873.3832925650513
534.1421890267649
823.7612515040729
814.5356213676438
455.5848723457827
663.2531383918247
621.6452629358929
371.9018830887874
580.9568251232115
537.5514004678114
545.5970643964151
1215.0478235269122
736.8634314847443
500.4969952404151
593.1682680338016
754.2086847630537
512.6778877294416
384.6993802787777
614.7621935338493
772.2941351244519
519.2942978839803
906.8366664047553
579.8383742505449
818.4130810232213
353.7922164702043
940.9760992853287
860.2690684002333
656.2755779057381
1530.2255833422116
385.2357912306903
1146.81998378025
380.02494294563826
507.22210226154283
533.4172829400927
534.6460475855151
624.0270109313714
773.1040158979332
