8.396213830866111
8.394793652198404
8.474443016997864
7.755431923648424
7.429478620136362
6.556856665658665
5.790006047469995
7.075120046116263
7.845283569248588
8.614019531079219
7.593032783961566
7.355721372676305
8.080720428668362
10.959741031849918
8.620866125325001
9.572382848853797
9.966210943216444
7.725218703357947
7.191020610782852
8.054970993793495
8.977080929306746
8.197717330516916
7.3679845826527774
7.383036101271862
7.336294306936018
8.092126472735849
8.805747080581963
9.264107535893633
8.380857354325416
7.908427187235688
7.641265543866258
9.11953486350767
7.520752316024161
9.507497038391
9.821210925275386
9.418619340877866
7.632990708469527
6.2974702193014345
8.550580837429196
8.351712867380817
8.61757436685113
8.71589598510561
8.465263485948496
5.360438514350354
8.264273010649152
8.270816686935238
8.136351052896456
8.957803534400137
8.011676623454676
7.954229614121956
7.690386761478017
8.27981614314489
8.993662091544804
7.7749033698440835
7.539918338988497
7.789266358643537
5.647891799486235
8.971225471412527
8.295217003598678
9.280581997389591
8.606586155184088
8.875748938808004
7.952015019786224
7.8814874091293605
7.920795261342596
6.076394363607558
7.409361617766538
7.648891371144577
7.7346755445020285
7.576077198624813
7.330451636948325
6.67735399773052
6.140985067410089
6.967849194399255
6.7987420463310855
7.195715801620703
7.836270483851119
9.008375646540088
8.239980494254795
7.17919683971465
7.613012629612869
8.135509195856867
7.136492975591742
6.950880661408718
8.439219237542842
8.362734857574639
7.341448845873074
7.751421289599874
7.906334019580271
7.342744313097858
7.9737600531043675
7.94826869643767
7.692858290945808
6.2207315486661665
8.734505044725703
8.255784782683165
7.982118924020454
8.230301499670508
7.212715170517166
7.4294027616349245
7.668989168432223
6.559868787397572
7.504717631941028
6.774543556867952
7.0298549724642685
8.106898529169015
8.428896151992323
6.217499374925794
8.561811260948597
8.586290950336544
7.769163313139084
8.012573697796402
8.209638540699782
6.8555874041388485
7.098268966368165
8.230725921189105
8.286154503276915
7.558483428365732
8.481102819970529
7.819585577636375
8.619801753265001
8.259287041569895
8.661317045144331
7.896785169693147
8.980537058772315
9.596428819685055
8.355733922173217
8.315811030540925
7.358675743269122
7.9766396822026016
7.596124137517773
8.022615385034811
8.259484824981975
8.084194682400604
