57.86906133333334
43.361625375488
118.6214195740368
36.159219571514406
38.24914195807604
70.32821898092456
100.4070603807988
98.02634462821928
71.10180855030764
60.05594291031293
57.13978862699709
75.055507669832
51.29515254313952
71.14620097182049
80.35338365932147
68.74259141894271
98.17659689554002
102.892343487018
78.50668846611178
44.46996159849681
129.94249410019376
62.62609464954457
102.78541300034594
101.66851420033123
155.09105338664875
102.80658669092509
113.72305519013635
117.23760531150377
60.001414061501904
85.73453027737429
52.39032058948343
96.596391011546
113.6569718998232
82.17707005813175
113.99870791903385
45.05866882373642
32.590580904347604
58.84992580177429
97.23812893789369
101.98156668494009
95.35402298850576
25.51064786549141
90.48024410430409
69.14954582359049
77.69611025445275
38.334351934713176
48.831286512573506
61.018276985525816
67.40963761633229
34.05815352842069
33.58129059502504
139.07090351757148
77.00915478683874
57.81693042840871
56.90046922676136
29.38555519662025
60.624715920486956
52.42770459423499
92.16468847554633
76.46207647123923
35.67564458819242
103.61991907083328
48.51272516113711
68.01635027906168
63.11361679507048
