-3.812301922038575
-3.7892056458625816
-5.296586940795883
-3.642414149329933
-3.797625744640611
-3.1805987348313516
-3.8570601659999193
-2.92144673546999
-4.009141046555827
-4.110404161880908
-4.250350871539448
-4.090604798841266
-4.409344740305975
-4.635697134840207
-4.9488864060896836
-4.196857332351934
-4.288063677173911
-3.6441414693009504
-3.9394713388906193
-3.8366146816618314
-3.9873763705178744
-3.903710696097681
-3.7296642152213835
-4.0050670957401895
-4.467557151606448
-4.274466322612695
-4.57495012190958
-5.189548751543673
-4.064705216918281
-3.9058622530315263
-3.7307931926592315
-4.635227551846514
-3.7819663731082898
-4.013295746624244
-4.744079269936002
-4.431775677380162
-4.7503479159114805
-3.8971458658758125
-4.979781991905742
-4.171195886108846
-3.9599607239976473
-5.094557814359941
-3.991675758174211
-2.8303966826293885
-4.217664317898986
-4.416660543799191
-4.295407766421094
-4.528453827355061
-4.6218027979978835
-4.665621267488882
-4.04422365146561
-4.372021877010102
-4.220636961635597
-4.089049141167207
-4.266541963238032
-4.4767275312870884
-3.3701163802651943
-4.559417564603955
-4.312368596352839
-4.025454692541815
-3.6666423202846437
-4.299334347855967
-5.2916667756803575
-4.595716859330156
-5.1015195980218415
-3.1247275856800263
-4.250101435463209
-4.227863213884436
-4.544196873126664
-4.466501744039447
-4.244718346270018
-2.9107645572847978
-4.068562141058735
-3.0066400636950927
-3.6953329483854658
-3.258389768376016
-3.898517822310662
-4.145157420551819
-4.400685336871249
-3.7079446210307996
-4.642179522636554
-3.9606522100426367
-4.259401119950357
-3.4397976624285365
-5.056952789546562
-4.62696598335535
-3.2521646459530107
-4.6181701877862364
-4.611834451300328
-3.9889246908608493
-4.401849056779031
-4.1226437603011865
-4.218091064083627
-3.5708333768487575
-3.9575764404652625
-3.7371830727971673
-3.5261055043601823
-4.579572176439676
-4.17010249886958
-4.46355677626979
-4.964027668649484
-3.1345684538513163
-4.186832574453718
-4.2575486878882085
-3.7050552268802304
-4.072361723175058
-4.573068583043576
-3.6232718483990487
-5.282853451833463
-3.962875763405288
-3.7067371123562625
-3.410707394334356
-3.5958416420779837
-3.4058795431178917
-3.55072341223824
-3.578695376503624
-4.221024413431906
-3.526216681254703
-3.83936232534184
-3.177047142688292
-4.545926308270072
-3.6373925152831674
-4.396250752001367
-3.252328187409096
-4.327707312495953
-5.159910938728355
-3.9750242659670882
-4.546314674253634
-3.6602689654047555
-4.502973191806344
-4.27123358319474
-3.5805280632806635
-3.8051646414238367
-3.904320240066239
