0.9432252382480912
0.8355122131349026
0.7914710757900839
0.8936114229828893
0.8974344012982964
0.6497787934323296
0.8098693836192814
0.9060511705479192
0.8847978604078234
0.8358080109780105
0.6985394417920746
0.6478757520921206
0.9199556028657064
0.8488908732433934
0.8622206705291929
0.900699598897897
0.8074092064808612
0.8693546780769931
0.8552514349339738
0.6181069829920364
0.9647211752354112
0.588654686299332
0.7394273021095021
0.8377326278404867
0.8989285285506791
0.8249274988802404
0.7895271488922783
0.9723881488751632
0.6168771205427632
0.9463504397389736
0.6175033369869499
0.7130966906417953
0.8000875575663887
0.8651626099654302
0.7757622946463482
0.7023068005521859
0.6596359966489468
0.906712348690876
0.6396271016380203
0.8426489877870885
0.9151481817112848
0.832220770586557
0.6375136495232612
0.6822001925488441
0.9243863865371432
0.8228658267286215
0.7261612344200171
0.8271069757876309
0.9248260883935866
0.7552194657858528
0.5855056329433734
0.8575728592042579
0.923249109507066
0.9359078938594368
0.5793039201421032
0.8362219332616306
0.7304148414970791
0.8615571243254645
0.6976460995260958
0.5876528365129077
0.9081479125534
0.7710574437139053
0.5825014987037538
0.5443431836522009
0.8958739915168891
0.8799408881788521
0.8690458041315309
0.7844363978021459
0.8323250447624548
0.9299337118401542
0.6537730984714633
0.5647994976626135
0.7045876129799277
0.930781118536527
0.7184639312087975
0.9912755335443364
0.8276044960705892
0.9199484334712298
0.924112217859102
0.8992072990616208
0.8555296473931102
0.7877282942495691
0.7385284214121329
0.6446344147672312
0.7521500409504468
0.8978043438776782
0.6843278158668266
0.8531855273050619
0.7847811051916845
0.9566152965761752
0.6398036929777162
0.9321736530623076
0.9628444045947224
0.8955146638458275
0.8382515417245715
0.8782240981783306
0.8214905737907873
0.8768371769834129
0.7939480405872997
0.8677391300274392
0.8699606813686335
0.8131261405938336
0.7051634082522379
0.8557475830219211
0.8932017014852418
0.8668986470781239
0.890234875442203
0.7306900406097295
0.8775594483315209
0.6268310428559198
0.7546619402829047
0.9075808518614088
0.9361494266321172
0.9053814125810226
0.6204307873406163
0.8259283757188048
0.8673051903125291
0.7102031894342834
0.8152595395985501
0.91747083295234
0.683311566943883
0.9579785063515166
0.827160026673917
0.8975445878058104
0.6529485514294535
0.907397693549695
0.9345704833806768
0.7844646010093841
0.8747075507280124
0.6022257447459641
0.4634678799763288
0.9005294727057624
0.7494368063049189
0.9015551084209724
