16.637650300488946
15.988044323486125
28.57247617534565
9.902718744081266
15.510164053237062
15.301939684021981
16.933356010196544
14.359204839234081
20.07957268475884
14.578185442124989
16.984052507819822
16.124494647147664
14.912187514231464
17.948441962376332
25.166432976987153
15.503681293369477
12.968475038303671
15.175521337208457
17.33647357927681
10.01257765239171
8.9233061497109
6.833374306958099
15.088398440604621
14.801602417252209
20.40227602323669
16.349567741043977
14.422098073472576
19.27729264716988
14.895977384797437
14.121801974702434
16.183787211147187
16.51365148199943
13.675083751164257
8.982247477642659
12.7598618064999
12.3847165164926
20.737574788345082
18.119939220943262
19.257677450290522
10.296248968870822
9.722037264878162
18.927146019399736
7.724433216446823
8.285310859919807
21.312442147001335
22.837549219813447
19.923718430705488
18.457884792062142
21.066803026452792
22.464084369946328
15.569165549441685
21.594972243325003
16.5138397137539
15.385682772321008
20.1950464526535
21.913072932965562
15.161412596054952
20.818340824151836
19.7563448938048
13.144731281011277
14.179590599380013
11.916444267496692
28.24349462408103
19.21466672763139
26.035538152747854
17.43963838295792
16.917368390306706
16.887228294575262
20.752060104419154
17.934561523356408
16.87857229243417
16.16157349145491
22.204199367692514
11.52940594158546
8.741311060796596
14.010083060215315
16.165192344949816
12.998842901112965
12.451505301070732
15.511937100913899
21.856061477421246
14.468866903304717
19.511606354648563
17.773860524579263
26.127277944430638
19.598794814582043
6.401824944650478
21.0817882594307
20.224344349298352
20.319655654612692
21.621436814332835
17.721926053145935
21.196284446920636
18.860608765702956
14.818454125559269
12.067946627623911
10.715644058610629
19.24979330300532
19.139378099652593
23.847696063617533
25.230953102396917
9.83400084865531
17.303151829683863
19.007235305242638
17.10154585319442
15.118526462460547
19.46377660762196
17.07289815647662
23.653577995866623
12.096086518628658
11.924268332855284
12.119061222176136
17.500530949680243
14.482203329980651
14.384497523194081
12.891179613284976
17.769096728370407
12.887799601463374
12.908330953901185
14.458368728918977
23.42203566636921
15.262861877825001
18.296440782382998
5.932820821012022
14.253761966980443
23.673282153953522
15.382612281527035
22.17743358027594
17.201545245203107
21.964183495775476
19.42780455984238
15.725491666845025
17.120345627514148
17.120458718202908
