2.0409708046715362
2.017150434476415
2.36019768955476
1.9947995303795467
2.0093791759431263
2.067304843854405
2.0725975854399747
2.106326399703424
2.105751764315079
2.0823444428131115
2.1067554730511517
1.998688917927172
2.124786102872552
2.0071155522306947
2.181331669864162
2.019243726256645
2.1005958035711805
2.143098605471273
1.7741686369750884
2.1439176557258834
2.2141831881149145
2.1957549832064136
2.21184292739853
2.188167755478154
2.1882345123575835
2.0700786536270117
2.1511165235737897
2.363597700424406
2.1838709590278014
2.3156901797285414
2.0031395506628558
2.132867465846954
2.1838709590278014
2.1775488288321014
2.1439176557258834
2.049859176905588
1.8582700948499513
1.9855024149682254
2.189560481372272
2.0093791759431263
2.0364025691500434
2.062394297086061
2.2103579502853514
2.205370418636726
2.2280871389865973
2.065486954426849
2.1439176557258834
1.976325523398655
2.1605120416976202
2.0621852520965147
2.0058038559988116
2.3277958910941225
2.037175774751975
2.0250399257343075
1.9378432335116935
1.9855024149682254
2.017150434476415
2.1435089080548213
1.9038408545579508
2.1936901347093603
2.0725975854399747
2.186416455555711
2.028668842478982
2.2496243235535984
1.9843410468763063
