0.04763447560834934
0.06245813303442111
0.049604802617342916
0.0908011164611112
0.08797331354132945
0.04478684683504318
0.034340773954276496
0.03952060528013214
0.058672929831566176
0.039894519391014516
0.04250857849353735
0.051420783814084006
0.06276946293673727
0.07865914315897476
0.04365522496362772
0.052440619805418136
0.07741052201751125
0.07256283372989397
0.05391334076611982
0.05449514945994593
0.045957505303314584
0.0909334826816268
0.047067347508197764
0.050121914954389266
0.03078677984442438
0.04792694185592684
0.04172430067081272
0.0472272373549075
0.09875546798017083
0.06488334745145402
0.1068062380578523
0.06926933829585022
0.05528467461552153
0.07699423564425573
0.0551683677512058
0.06291480837054134
0.08902543780225118
0.04988128610504065
0.06384906410694244
0.061545469367121984
0.032659812786637835
0.1058007926550987
0.05860017275595807
0.0787945659457252
0.07133401777546798
0.05687550620865199
0.0437810593067488
0.036571562188599686
0.04707407714505928
0.0783199012576868
0.06691093406471325
0.04064786175077496
0.07443090821104291
0.10091051260560964
0.06607853630059922
0.08476964078785859
0.04670536023855172
0.04466964439032613
0.03331047459124924
0.03311582839049538
0.06236627397516788
0.03605899338677855
0.07643856826742157
0.05810135427440748
0.04967570811294875
