17.270362930070036
15.202167031831221
14.47570166200866
6.933131422390481
15.435204938085738
22.711071083613962
25.201806013761907
23.65805771238924
22.286643779398023
13.800955540388248
12.967196385671771
13.106531060686198
8.91343485170022
13.637002263847158
15.426070407687096
15.096605763972152
8.479879144807523
15.68850127047233
14.399102020147396
6.867031738206602
4.669421080040398
4.391310236176946
13.557159434653414
17.956071654872147
14.624505596953542
9.130276833951076
7.434771142577416
8.710733365878417
9.869428090582572
11.328847613146666
13.611318090561275
9.242583582968505
10.039016394698244
5.300274991466488
5.3505763851551755
6.076357851920244
13.01606133546735
24.669773141849326
9.189467040120816
6.14208233732758
7.0628188627269255
7.8166698465389235
5.2404279629316015
8.510468700180677
16.60883013239706
22.031373107816247
14.013584489162168
11.742754660533304
15.798826233826187
20.10803905136931
13.193345365357027
11.991657426321114
11.424524099564366
15.741828763993569
23.08796952752814
22.741990964633665
23.62258518117902
11.967283991094995
15.4736622991716
9.09280126786
6.795512343220144
8.705404245944786
17.306530418609906
11.436566222222224
16.037276435665635
19.767467192981037
13.09100833232701
11.813093285382221
14.829298537219668
10.929735015287523
12.159520193168984
16.535658925028347
26.238350376829747
8.326754667008416
8.605395899856541
14.980845039813097
26.972325642343982
13.981656514737802
8.28117752329286
15.271373889711056
16.477806374609205
13.675692997917002
21.802754766600923
19.148257350174692
18.089772805212625
13.079441319884452
4.30858074896956
12.042160849877904
13.246284138404373
23.521083357125555
19.658511281391533
20.76676097475762
23.4585816338894
34.740165712163375
11.403533636777054
15.806308174571495
12.836497959183676
15.644793167136376
15.277892905279007
22.02152711934313
19.46690837515849
8.354840563056593
15.339466947817115
21.153843152591413
17.139775999931558
12.430586996714561
12.380237258461387
23.20980059900988
10.278470081587834
7.182028797713356
7.255055090082626
7.844757753589662
15.469837326543846
18.59716892473961
16.367942540148935
11.17755876703558
16.69339764162411
15.440996761187124
9.22450576010083
14.837497968268499
14.511799641238092
14.309444435677314
15.809333222011741
4.631052637388108
8.404430460831572
11.659850741190779
13.141778745049436
19.145627301111
20.42107618947205
27.198787897575787
21.22147578657292
11.092232888888885
12.556153068827895
12.840294330091146
