18.34022676170683
15.441216193809135
8.740380444346378
9.185103492823645
6.72554647602609
7.567783322299437
8.86878272759691
16.294886531234983
14.140800190371987
13.31211599823024
10.425105923635325
10.489955061334188
10.33439889370457
12.751909427948744
10.970167039726434
15.687790769781124
14.78009077540206
10.455530958589744
10.148023419573494
10.497666924119462
11.187871623993532
12.71370110610594
8.817271126642733
7.846638289320659
8.963798808901963
9.881571736591509
15.293718335748839
13.89173537117884
14.572717314097671
12.260059366436565
8.439840301718801
12.455791282693012
11.625291904351055
11.347908212376563
11.1437671680841
10.452290122942092
9.942766712533436
7.8110977143892
10.638318377896882
9.983552148016598
7.704006079791446
9.432050674661957
9.704277932290244
14.539380635539555
12.41603892182296
10.676924321721568
11.42692087575284
17.02404743927338
10.077828187307448
11.347172075485954
8.107787243944339
9.94037581478202
9.61350360924458
8.29565523689299
7.092963754476003
7.206940042901829
6.789289649901433
10.720604043783887
10.747231789031424
14.786106169682098
10.323129737692526
10.413783389553947
9.215576361223487
8.86361598721991
8.770897280573474
4.978788931900739
10.818228001951212
10.985359459238165
8.829185545311258
8.145882406801835
9.591107410931873
7.499835011556254
9.08327849234438
9.535103562935372
11.825722718721645
8.479726536643712
13.828038762182915
13.109056048960914
9.882027340011476
8.245830985182616
12.305442677742784
12.305442677742784
5.588490626542522
7.048694326767257
8.202109467601941
8.018666502118874
8.148908532688331
9.056448216969816
10.41128004008354
11.02428862129057
13.476707234521664
10.233842069235095
9.103464987420164
10.964498190691316
11.933037151254634
12.178058593768592
14.655169063744776
8.66628565446994
8.814115524492124
14.392534628670075
8.836350240814086
9.431753339714936
10.201590941185053
8.44529004808105
9.545232107337217
10.555248319546733
7.87783433474082
9.809788613871598
8.813802899414512
10.648630003500518
8.80554345707326
9.613717796329285
14.684440480315072
11.987461044240707
7.627448952923241
13.155792773356376
11.677771041120234
11.663916224789245
15.356308343493733
10.585462191971649
11.550554373607971
9.919023133823694
15.52833707027658
15.588349396521025
12.440842632700784
13.220149407299953
9.448300073543107
19.927028039951153
15.646249586011011
15.727736237827878
13.641152720121243
10.080305368648263
11.822389818210352
11.143535747112258
