4.728100903666034
4.911750685084326
6.906478605781412
4.236429078102784
4.810841436299411
4.383310507770576
4.647424384859355
4.272699390809762
5.28076464514859
4.802285630606153
5.269699315496012
5.123458366880168
5.2172256428427755
5.948622986884157
6.221112228913598
5.041156834108003
4.904575153437832
4.295893510047839
4.985701030692177
4.503625320247128
4.285430185186961
4.272158639072388
4.699686130714049
4.696639029973459
5.481599261294006
5.187819042224771
5.5522361207740305
6.351733124123399
5.286724045315248
4.7872572523547845
5.176013345548317
5.689753804217381
4.641465958627588
4.794042620101154
5.742767466248755
5.4708219874923465
5.8064662967373355
4.918765065983724
6.2429755527579225
4.8229042562317925
4.646111694543703
6.243469627232217
4.299195080296352
3.193084458842605
5.251409411686293
5.504157772422122
5.356405847589562
5.724346235504424
5.864512619870433
5.941540119996976
5.037304736584339
5.935208485557914
5.27084178384104
5.088696751765346
5.367707365813535
5.779698860787414
4.603810157871669
5.810952839987317
5.437184571187076
4.876261667784587
4.500293939511563
4.617846032455895
6.868150676282666
5.699474269370254
6.556415515360324
4.84345909536318
5.352415440250676
5.308245391076518
5.889567470562445
5.450631353697736
5.352992612600742
4.735559729355691
5.521770210261777
3.6603804879867625
3.3519614305801717
4.422769154067108
4.40898920146185
4.493853199224975
4.66010735446527
4.734718534022166
5.9927982225044225
4.85868905700111
5.4096547879714745
5.067732894221772
6.562943443612051
5.688703452637966
3.5538748432382423
5.778074166957452
5.684272895317022
5.269914228716099
5.628265438386755
5.084203336828797
5.41827844318711
4.733810895742787
4.807630671560159
4.235695000284593
4.046244966771374
5.708102846145966
5.1928005805221655
6.079997992998017
6.211534755944649
3.707482563246406
4.906259474752597
5.37052469986136
4.64564052016243
4.690055443608834
5.668166635879075
4.697247433056061
6.4871998327311315
4.640406230366804
4.376331930976252
4.426731100550013
4.775517229786148
4.194604768115594
4.619525674470246
4.645174197394945
5.3239959899170755
4.682517694030761
4.732570124576158
4.410174435172349
5.869434019089157
4.597191693693639
5.236253544607706
3.3279510247058623
4.999225716403073
6.561985765578927
4.719076365426073
5.852588180824554
4.980631365404708
5.741250842047997
5.5065268571930694
4.675525017570235
4.769495919124094
4.955660403899066
