8.793090858099951
8.284154414971246
9.111261110669998
8.909139904786473
8.598392841814206
7.927520125686678
9.779132258091614
8.418045503240986
8.320492941204764
10.049968463472851
10.614928793557718
10.43567381449717
8.336348558659047
9.711789634695874
8.867852360875972
8.216994268991959
7.869163636348394
8.418474627290578
8.761888581712684
9.210051896051501
7.673689091689707
7.880360979288193
8.539905053107702
9.305948306079605
9.337631753685004
9.356283457848246
8.978863121794513
8.37783228064348
8.401747575952433
7.999326589562353
6.053810762688747
8.295457339618235
7.99636911113123
8.321844459903335
8.360179689659153
8.700537440442718
8.318074766672998
8.47198917884909
7.605934775380407
7.919316518238226
10.27236092355077
7.269473988825162
8.523739756385805
9.162987603335234
9.074978070176083
8.149508986600047
7.971559558586368
10.058463016063245
9.103626781160369
9.109910587903158
7.366804740574712
8.546631841822713
8.042254812712775
7.3384138431882135
7.589611979776615
8.67592489510374
9.715501578945513
9.618626568980835
9.216637194478446
9.502116141727909
9.102711007302394
9.055056169342
8.313752179635804
8.215295174082886
10.288622692915588
