3.712391100355643
3.381458142492314
3.9545107982536427
4.298383514011702
3.951492126669647
3.1573050515930645
4.518886663138403
3.2847546683554705
3.4371286649477324
4.051475146394564
4.486834565143787
4.880780850628991
3.7573135515530582
3.8615225643706177
4.353592121071328
3.8927814065254447
3.3468839043965954
3.3616134691280357
3.048590658794901
3.94239382318248
3.3182500633799337
3.3752118255284604
3.4478626004975768
4.0919565903273485
4.016084041602915
3.918799785704708
3.7392573335710764
4.1045230330565134
4.3376949805895215
3.6009775833362387
3.068211273696212
3.4734757856454426
2.9213630586280512
3.1702520692357767
3.615765397418468
3.772322917114259
3.5319513330162056
3.1619975912019083
3.0893645236762977
3.0577712367572376
4.0102281444654215
2.7369537320648885
3.3143699871244103
3.8877910880408764
3.6877995550856095
3.0273807865913187
2.955220960840213
4.5450161020997255
3.417381843040701
4.309866719043455
3.085348107118163
3.786657569719721
3.684856608032042
3.3677554695517946
2.8104833723271727
3.3945076782526136
3.8145620067682797
4.308086535520055
3.7995940135212884
3.6905478578712154
3.8355809247605537
3.5600578832257783
3.347636516771668
3.4886354846061427
4.529773690035365
