3.832953318950977
3.7235614322315604
3.6332201490754974
3.943597308745123
3.696598276444402
3.6257371551197104
4.058114438900506
3.847016230781501
3.9245093821356583
3.818958990445391
4.049919301055858
4.029683769380842
3.57574955866446
4.070421620365257
3.7815045248921053
3.647298225024781
3.78822172011642
3.760514269113615
3.935485357742766
3.7918014689551636
3.5611111862397715
3.4645151357511086
3.6583873971562917
3.9276935706194074
3.8562074849569363
3.8589512549495906
3.8181008553150826
3.7814769766123355
3.666059567378453
3.4951364395922098
3.2913742449887935
3.735837070288761
3.4176317372524814
3.5292198832425496
3.676718835696729
3.64224779384101
3.761852960681018
3.7006038759463524
3.5794068224081705
3.6287972291519948
3.8820986296620017
3.916336946611923
3.675145046645868
3.76876115723054
3.7161312616842412
3.6118094120014166
3.731019131979029
3.9800840105167783
3.8002842078364187
3.7189650956483993
3.5113324767399647
3.6243001944506417
3.572840321461565
3.5287673094053833
3.5570277135106814
3.7639429800882853
3.804577723057416
3.875397019231587
3.9018918969932415
3.9268025718262813
3.6017296521900297
3.639742886903459
3.6778295796277636
3.6724540527212794
3.9135232035973346
