0.6710828579689031
0.6132156731174513
-0.946264212418762
1.1475689177594621
0.79957131637107
-0.0401411376970213
-0.49580418988927427
0.4724403355465689
0.5259239821730829
1.6107914473667369
-0.3387021552929784
0.6916845341402466
0.4470613501797469
0.7033602617180055
-0.29445492366286485
1.7874123421675285
1.7397146269061554
0.9488993225139689
0.06540092056677373
0.9167757737101491
0.9242531694330195
1.2138213763830936
-0.28124539925358805
0.9379340070780245
-0.9765271817945612
-0.17605907314530397
0.41918350861195514
-0.2830804701675018
0.8281879827975773
0.9328467655834427
0.47060530699381853
-0.019786802423188317
0.06693560674854636
0.7183179210254987
-0.4364151216773114
-0.2570390056066477
-1.4431996693636922
-0.10227081686953912
-0.406467765560152
1.2992280214326273
1.432791372342919
-0.4551842337173537
0.6685676295102823
1.127219571446735
0.21414501314316728
0.07213510106418915
-0.05305588931197585
0.46714968036103793
1.7235860360133572
-0.0405577693609345
0.7635049216464457
-0.08485002979825759
2.142280926191461
0.7014829697010765
-0.5216252381494579
0.22664224974557942
1.0970472479372004
1.4224675519627321
0.993526338158311
1.2190899555929953
1.2247462951970038
1.4348995855201103
-0.7057555698758199
0.6956901205849002
-0.11795263417781579
-0.6189560891503155
0.7488918791638662
0.031443647627532524
-1.256876107897502
0.413480486928957
-0.12211964963145248
0.3071362055313295
0.03175898060309555
1.28362977333896
1.950076784628222
0.4608636405327625
1.2648251338023306
1.9016658782606841
0.8299819012535159
2.322820437452703
-0.6371247851491847
-0.09179787738859665
0.4815964537781157
0.7297310398498575
0.07469140542081752
1.0360908546121141
1.476544595181708
-0.5126793080840086
0.22698008880478618
-0.15111927895101424
0.06765732765000697
1.3786410463440955
-0.010907408290101969
-0.9065771715989939
0.7559878238706699
1.3287057796752764
1.7121642104491899
1.4482062158367173
0.20319497051866764
-0.14988894520610455
0.056112428828427124
0.9748091243167939
-0.13774087062120544
0.05247885457159564
0.1835967135737584
0.6580832863844112
0.13109250750124787
-0.3783926398594433
-0.29764348932088486
0.9845755867131647
0.5082522972765219
1.3245695580988637
1.3596820795539064
0.4773724479957233
0.9542834962776943
0.8582791657424578
0.02905857299415353
0.9145779777657435
0.9219374787873289
0.516726283509428
-0.09647072868872765
0.8228576669114543
0.5401261980343851
1.9494881158485406
2.3679645894692043
1.0443241350816903
0.9905154140076291
1.166148486207466
0.8215110031814845
0.7228707266399457
0.6466018476783284
0.6284551689200867
0.5000180971033366
0.5001067317721044
