0.35336637700530765
0.30437285688300153
0.4769549212157828
0.25437990458009635
0.35446025524843344
0.2541079039065016
0.018375784313517853
0.1807217080611925
0.2923457835701617
0.6103955807113988
0.4208048479198659
0.2919474368393649
0.39252269937634604
0.8242560072405941
0.5320773299203672
0.6614491139263575
0.615476288531333
0.5482333179986868
0.4333100984622033
0.24456696288353705
0.47796828037210703
0.3963824384909301
0.3970514058073894
0.4227026420643973
0.5543728104007161
0.33968404142159064
0.4712816189791731
0.5807024092500621
0.4128507704888512
0.24145057428296246
0.2222148485819583
0.3478719026287438
0.049516327245109584
0.5983691449990851
0.5433555253169561
0.5176495997267191
0.4459141478260552
0.3718800273172908
0.4829658959431821
0.22987274775167316
0.3519406915102121
0.4622536127677383
0.4422864943605528
0.3194887023274416
0.6170994777385944
0.6702913737762889
0.5293442481848035
0.3187949707178425
0.2527199387471554
0.4559230544244116
0.28268137851572683
0.38240813711415095
0.3857826309573272
0.16345984335618688
0.3283970195086133
0.34102606121843404
0.1376078110457301
0.4420759606250848
0.4095607356080063
0.4650242346380325
0.31229504438545586
0.3609283443585489
0.461170955874211
0.3234288989601693
0.4948027507557215
0.1960678455929233
0.26459493222235114
0.29801659776345146
0.3849579454559033
0.2791019909158177
0.3108945206918996
0.43810889568244255
0.28032434599415423
0.3814992808130361
0.3139522872058658
0.2348661185528664
0.3352698818843604
0.499386423374679
0.22698239008824664
0.2688795072414881
0.3947041485343154
0.2731435251610046
0.3663514040530531
0.21773116007692225
0.5149222296444387
0.4564498852653968
0.25938143043796164
0.2848426419445111
0.3690381775225055
0.13532692267538665
0.28965629087653844
0.4638859977536129
0.4069597843020929
0.13830607709768225
0.4761454689638737
0.4157748285368754
0.4064608691610777
0.6720844159477968
0.3473422968407752
0.3832559845631864
0.575500508665584
0.14783531208190204
0.25050116989341464
0.33458523845162674
0.3920749288869436
0.2808385452969322
0.4535015337690909
0.11970782724909515
0.5538872526221597
0.5121890900390286
0.32941970104851503
0.2134718625922779
0.5121534500308214
0.1826433972450291
0.1941183520253036
0.35006074462437586
0.4313700490863963
0.3037303687191493
0.15128327782324594
0.4172083672540952
0.6224479583669716
0.4757175681522393
0.4698917896800667
0.18887339686349727
0.5638731429583124
0.4005987666764568
0.5110987388195787
0.20839983226169945
0.20137535880266744
0.2343962436330981
0.2355433284250501
0.4278073576225434
0.45030866120025337
0.4257408291165759
