54.45800098244106
54.01051266378979
62.07451247384921
73.79508759653464
53.73914912923544
48.42073031529778
94.09336053496405
63.41824218756855
85.74473062251033
58.92069698223449
94.83064747731459
77.73196295094439
52.20751095278931
75.80038264737864
84.5418199734929
50.657194180363085
57.25578251170097
46.71389003962842
65.52689568897902
62.97254563576559
47.67411132917214
47.22582974857305
56.379269625534825
83.05373002656843
64.77175590209916
58.64141283920792
68.27165142471277
80.30975206243235
59.306026798712075
46.13143973118102
19.385002820796068
51.29226782827236
67.1643086165385
51.35308957885352
65.6124855122007
49.636054217568244
63.72039017225758
65.77639197175031
47.64516209755802
42.790379771141055
72.10638925712067
77.8422511662029
79.74192061085888
67.05880416918716
73.33477493901557
42.90327323856001
71.28945375901942
80.13322375745024
63.470656337133946
61.78292986510917
39.51953818707853
71.84334627480564
38.510224756342105
34.32457604525753
45.1072833425682
55.701362115357
63.2406791154458
77.7553049575237
61.9786020220176
86.81806851262806
50.37201450518097
58.84288109250734
40.13107104176966
59.24441721957853
79.07007491397832
