3101.0656782582914
1485.9117619707465
4019.5072679033833
935.3983678210279
852.4892896349062
1816.308735807536
3424.4144581003998
1957.6911462603493
1339.6719511737044
3771.9222430201316
2112.177216225201
3408.1275148956897
1351.98499144753
1949.8776384150478
1606.5552560987833
920.6940045939692
3106.682303398572
3335.5529296309514
1041.8302230381794
2409.7335337034
3673.257896508236
4358.279272759286
8456.223861403987
4999.67859725641
6873.549440489776
4713.2683275981735
4564.625470656437
7660.128873816007
3457.3364226048025
7526.942448096418
2057.945178045842
4869.55290120555
5918.081561692893
5566.754875712683
4605.515407681089
1702.8163202070175
320.99049991980706
1955.039387862336
4527.4610484791165
4842.035701995299
3003.879253940083
834.1533046883687
5165.538013568435
3726.156219850106
5095.532884269306
882.4912731428427
2829.199015312456
1873.1501801297384
2175.926403771184
1754.9617708978806
680.2352966730774
10682.015407522436
5642.440592335726
3029.0959815871493
1254.7788343691811
582.944579769327
2681.042151789677
2384.935539919467
3274.440018288865
2669.9772161728283
740.9700112982921
10237.91787226869
1302.7546283023685
3556.139646516658
2996.1980320833422
