5.254071882098173
5.044626554374747
5.455519554036021
5.059800349316042
4.87181147647399
4.830737634617395
5.333349869383125
5.034674582484141
5.661245209327055
5.4056349208207
5.276983530723911
5.2427339556885
5.340331272451995
5.345919211035989
5.59768023784885
5.632009520109403
5.513426981669836
5.118616726363374
5.210110729759388
5.313753138296886
5.254268398444124
5.125100299479304
5.123098612617738
5.239003831973189
5.349390584510722
5.296198147477769
5.954781377971414
5.695621090276721
5.34944492692368
5.166558466882821
4.927460067538579
5.490754100249436
5.351902651242323
5.542287530038568
5.554914470671388
5.535461505221709
5.44159046647003
5.09754409881553
5.469652380676098
5.069876874072178
5.34750630107391
5.49192499527696
5.358402891841319
4.939892665917809
5.32994474685659
5.308639006096614
5.244495447391421
5.461105657763295
5.359628711159468
5.404249079350198
5.223781829915429
5.301566245604779
5.398835557513059
5.24053942519978
5.8001038418427475
5.417097451121003
5.00682467739218
5.396324030947944
5.251060109608537
5.21239230896342
4.9013638684
5.0587000096376755
5.608141196837114
5.204130784542756
5.6155045467969655
4.645102352902774
5.166628903939798
5.464065872531244
5.360629954132666
5.216337212864664
5.263179563999469
4.716922414950454
5.189403708071745
4.901698911024384
5.276449270708797
5.00821328592865
5.25082584481985
5.645584181870748
5.275844938999421
5.307708676722313
5.051053229394282
5.051053229394282
5.2121072233741375
4.865576170870115
5.544271235475813
5.24970925878527
5.111488456736735
5.472689676137732
5.384545691823005
5.356273112359249
5.4655552741870945
5.256729436441205
5.387576712938687
5.121023017909655
5.324979774963131
5.099930230587284
5.106175081422308
5.478209272545125
5.15807150797866
5.53781622244919
5.706270127613332
4.971458137796255
5.324097666933218
5.072933696847456
5.065191842674882
5.257619303733608
5.175501830096377
5.176422811920337
5.619026811087565
5.293914514910412
5.117413334183173
4.999601342462988
5.249140649824186
5.1615569321417345
4.9276008309197
5.041606816790557
5.304828840382035
5.109725231649805
5.342486429865163
5.172872618970306
5.464376274990289
5.014966471604005
5.491452640117824
5.225184910652149
5.376655198818084
5.6634067822896395
5.10297451706993
5.669735171420712
4.955957769537142
5.301725516883529
5.411827500538363
5.024536593592501
5.045867288253049
5.094389359095384
