-3.8526108904619325
-3.7672804910384925
-4.955366910424795
-3.8172986700087677
-3.963898674033505
-4.125601218189812
-4.165226429574127
-3.99912518959194
-4.2641872078878436
-4.0438614322671835
-4.3173304167149125
-4.070646656280489
-4.3029963005844944
-3.7242627693337615
-4.683166892824467
-3.9170661185033673
-4.007964762846536
-3.9416757462701635
-2.9600949291706784
-4.344186562969689
-4.311716694755493
-4.393559886577228
-4.417688073588285
-4.320085071174546
-4.082276531747564
-3.7102789646779626
-4.236962319658433
-5.3484939675574505
-4.501957058148445
-4.7706882504702035
-3.233543657181969
-4.108557956681051
-4.430826313882612
-4.2466961856747805
-4.286951769487419
-4.101902245184984
-3.4400379362241407
-3.9880346385367367
-4.2601192573282844
-3.5768727416564197
-4.056696752697911
-3.899165286698746
-4.535438150951248
-4.384660476624111
-4.544730167504956
-3.9461233239974574
-4.397626857243429
-3.768899326819841
-4.419094268781162
-4.09019433585949
-3.6240481331752616
-5.042735421101242
-3.9168989912411436
-3.67436984760798
-3.2697661112601417
-3.530120737068366
-4.017977124809077
-4.570063387016372
-3.3499054561558985
-4.3449506037726096
-4.057914770704297
-4.438772902712404
-3.652790661242089
-4.194560121398978
-3.794094810529961
