0.09851441733795184
0.12293800016170955
0.1462674754893925
0.12433622460173675
0.15418144377843598
0.15453376695574486
0.15079097011338685
0.0956505068282608
0.1247353702061505
0.10720174861987848
0.14726637552348193
0.16213246363919784
0.14075083973080466
0.12764794962554835
0.13124276822426878
0.13815546039646742
0.10336103739670367
0.12625318447027986
0.11601894409238987
0.11741469088928302
0.10569445980946797
0.09902684160927937
0.1164430546627371
0.1464314881657732
0.12775490977001247
0.1133424956652221
0.12385407101104452
0.11914660855707496
0.1221301665949364
0.09821208315721944
0.13868902103946526
0.11634811399589096
0.10445784589017228
0.1145686987926439
0.11705577832404193
0.12659118523749996
0.132579971951846
0.1863121662804213
0.11217363993205008
0.10960101646367457
0.12583975567844746
0.1301110265632296
0.12969440334979826
0.06096528747949394
0.14516728035496052
0.14895281882719608
0.13636668803479252
0.1290955155772472
0.1515967039446822
0.1543354986061973
0.17740985699867154
0.14615095581759302
0.1548888028166542
0.1431009511978951
0.17071772819718514
0.17559805338926673
0.1790208834185643
0.14374975318276456
0.14894934551019856
0.15686262813187268
0.16619216590194424
0.13779875798089436
0.15129764262607434
0.12713083760138758
0.15611683282653238
0.1971080983601612
0.11198549554297353
0.11590180956203194
0.14723306000395875
0.14697072031784086
0.13890805717398466
0.1728424732012677
0.16549642467206135
0.14723291656947282
0.13305904106805858
0.1402623735525735
0.1237809260942583
0.11711127032173688
0.11857785705219755
0.14771256464286706
0.1385729560803863
0.1385729560803863
0.16946452131543152
0.14073675549882236
0.15597536945649124
0.14213516218470962
0.19375112398155367
0.14059389107101974
0.13468210136528155
0.149270967353487
0.11513287496519845
0.1532071112564272
0.16680071391220502
0.15013122357384892
0.1395524754052298
0.15673640131960942
0.1481803168558801
0.154177828392155
0.1459191877097366
0.17543240851621086
0.1932562270190055
0.12394810656318997
0.15112341217132874
0.13140213147434415
0.1603674715218434
0.1478587540125394
0.14414160487986985
0.16831686464135412
0.1401608432751032
0.11744099066350068
0.13425171881468898
0.12119306630492233
0.13546401142199838
0.13117071773473624
0.14545386507865288
0.12332426659893275
0.12875767012878112
0.15295743211600565
0.11920855792984113
0.12944450349924824
0.1448247344601221
0.16410368769624029
0.146244187334682
0.11298942721117468
0.14614266074817014
0.1232625128724481
0.15923605540100086
0.1355755626974391
0.11965463769288835
0.14750509988945187
0.15744970767864427
0.12660049324399106
0.12147402555753975
0.112114847710106
