6.3909378737305875
6.559235501325374
7.354646320757986
6.635007003563398
6.579052487803753
5.443978497627245
5.443978497627245
5.688894775626833
6.751445127103895
7.091447039368419
6.207221135621628
6.669463649515632
7.071497893596285
8.022130811332705
7.06324362569733
7.517592707312503
7.725742179864319
6.210402399771569
6.16097092520133
6.786958479065464
6.538841021881406
6.890457588360523
5.7337633246309565
6.439192513953037
5.948538690149934
6.335971673364601
7.406773181246413
7.628357422890028
7.3430350278888765
7.051991838150209
7.140150562099476
7.140150562099476
5.906937458692519
6.966981814404638
7.230210367498382
6.966981814404638
6.016683870939138
5.87931278431918
7.427719462590713
7.4403641461659085
7.53843638212037
7.452920214388305
6.40783698256352
5.31930289337364
6.318917184057551
6.615922989835898
6.359012258308604
7.866921580688107
7.86344285492872
7.13752082040172
6.679436033919117
7.0690375766710085
7.907750257080988
6.52387200034397
6.0412642492144
6.800240194598742
6.366901041700282
7.804626665586491
7.198463694108184
7.6567152943046
6.681301130090813
7.173405785740158
7.443928440508899
7.1250490131570245
7.237825876389238
5.40028926327715
6.902141501111001
6.60518802692829
6.1775490403806765
7.012294522666407
6.1775490403806765
6.009274398584459
6.281449249734662
5.854404903378813
6.249751575721193
5.854404903378813
6.178692197161689
7.437207102630189
6.662444538278439
7.576016615026855
6.58651038198464
6.0142522183311655
6.512163083089547
6.444520939875148
7.808947884418479
7.840181801850253
6.2318951456749145
6.490145005453203
6.865060181818252
6.22370127328334
6.755594437094384
7.181394493845053
6.255179098445447
4.999566333437245
6.692061143183032
6.558523464627459
6.785823538648132
7.468255783123205
6.405992495752652
6.749851337174867
7.173199463913287
5.633373049103589
5.93355684205837
6.306675797735547
5.710538599768714
6.463334836686475
6.996908393849493
5.429283514579136
7.971914746947088
7.250515924016346
6.14300227402815
6.849694382827543
6.771807779029972
5.559648402381333
6.348403854103563
6.768717352336901
6.671186825409247
6.567789448723394
6.919965272317287
5.923626654282807
7.113270688312153
6.460229174971902
6.776457118099694
6.703051309823517
8.138170669315127
8.429551551089085
6.595901517515737
7.968436845732122
7.0486786974764035
7.515985651744129
7.092690200054943
6.508933645056507
6.253526763707044
6.508933645056507
