-5.0434127802470865
-5.114887291686272
-5.943288250031895
-4.453533014096822
-4.157920292488818
-3.310464604526734
-3.6025156015917608
-4.167058377069305
-4.93802883938338
-5.489213671752823
-5.571231479366723
-5.811084678375761
-5.593602234612801
-6.037971059467482
-5.15819016495733
-5.526661691276463
-5.312875657314896
-4.582332406077687
-4.425770147561601
-4.285881449886154
-4.7245720554337245
-4.919399861890612
-4.791974810050523
-4.730492756164902
-4.793790189480395
-5.0489723008530545
-5.976791332692384
-6.014468771868446
-5.041998395890424
-5.358510654281709
-4.489412600504289
-6.220494176222553
-5.048268549340593
-5.095515943829056
-5.346593859632938
-4.346783798523254
-4.6782099922897915
-4.304263375195623
-6.392051682041716
-4.933394820268918
-4.560786269465095
-6.41068086645686
-5.085263972127707
-3.5991498689390298
-5.157231728091767
-5.103817342643522
-4.163639714149883
-5.547071129440281
-4.876745435248827
-5.1786923012497486
-5.289075499128314
-5.571998925188361
-5.257771764367079
-5.535493437914233
-4.987199798157489
-5.367177808942449
-3.909300560677868
-5.4907137849448855
-5.132334799520232
-5.366798618325584
-5.454734904694654
-4.847725913425621
-5.967024238446529
-4.483465119294957
-6.008124348449723
-4.042040139597784
-4.477066915113954
-5.331249071188494
-5.82438247233291
-5.824267980588005
-4.658193820542063
-4.404095960095316
-4.607330808274236
-3.6085969141481087
-3.5414090052554177
-4.3423781474471514
-4.084671910212409
-5.665307773813507
-5.27427952470937
-4.318981751157921
-4.791170511130217
-5.362647795051318
-4.513178659761848
-4.737411317227165
-6.10683296056752
-5.569277934918677
-4.18262879469563
-5.019801179978902
-5.120199161676425
-5.223597759696668
-4.907040139886087
-4.764145418744631
-5.066251402557469
-4.143267571410993
-4.464229250561474
-5.070450134490127
-4.55119121351183
-5.221635564600879
-4.858998306484381
-4.610391869165344
-4.983450513408472
-3.9970875325496236
-4.588536921501326
-4.69754423216157
-4.1768329031284415
-5.103551862919106
-5.227313851378675
-3.920701005790703
-5.698580308671857
-4.380546907715684
-5.022702572787763
-4.616878117761436
-4.169549185802871
-3.939561096422396
-4.768910212554327
-4.466632021754613
-5.689452518730898
-4.652831313237067
-4.837135059911914
-4.622175230436985
-5.442800048556968
-4.86497317216943
-5.356056284346658
-4.668071623990163
-5.046604116106049
-6.61758877585799
-4.182987304313586
-6.0646776605740955
-5.181609745248478
-5.354673577394339
-4.91808345061732
-4.019894599404391
-5.014473938101369
-4.793948433281212
