6.264297168154752
6.268818481285001
6.47472423153996
5.346014847842993
4.660216280692292
3.443912692509284
2.6800652571998933
4.968469131799447
5.4363486513243515
7.004432700399346
5.9548580562591145
7.068142130779044
6.535493100917488
8.927921981637132
5.804615932049014
7.873837617753306
7.803190090098122
5.66331343582626
4.526745657580657
5.352348863360913
6.002490203779307
6.1563776840545135
5.2381565027740535
4.745463284306521
4.405079548338443
6.511141453758528
7.134770767716875
7.076049948121907
6.164191537186233
6.59328619712757
5.347535075869436
7.6896961265257895
6.186955512716072
7.1617479462219515
7.442357673894028
6.384077623290644
4.499600018172591
3.6026693130094416
7.017375335723439
5.916878420810704
6.149921387840242
7.1548498084186845
5.590522646781998
3.010285482002183
5.885207983593235
5.642221532675131
5.086932758031416
6.659310927189084
5.221219454131367
5.202614334287353
5.3413574678213935
5.9224008856154855
6.88144166335457
6.05397599649272
5.093317677287868
5.578737865440694
3.568828257750465
6.675915767594022
5.732290867813725
6.803725646809094
6.287913195598356
6.798786130133245
6.010771626713462
5.092167894607299
5.961920180485079
3.506702268385592
4.6265728767739045
5.795903798153002
6.147736226569781
6.464700756901206
5.061577064082902
3.7876639407380535
3.430376421351287
3.9558774982374665
4.042300693992076
4.513343825852364
5.173494677770297
8.108849851154536
6.403122201515736
5.045183038767966
4.760965979013833
6.529383677908668
4.517825910987086
4.884872204723429
6.6088636440814685
6.499313407164309
6.552541678150491
5.0476550064070045
5.241711135344233
5.64218866230865
5.3979269306902955
5.548371947966752
5.088227858963143
3.4148955450292084
6.12638048018677
7.303116061250692
6.455700640969568
6.011801068050418
4.922461746739634
4.686167172836938
4.805988745682465
4.747944965042348
5.072973692957056
4.207929328870539
4.43610396139328
5.849531878045756
6.037604628111493
3.7313333640258777
5.962805904926844
5.877540019146568
5.944778799309242
5.7645224417896905
5.536928704773636
4.862538934821821
5.027333237620234
5.763475780866678
6.758808311184658
5.304571978471945
6.051153921057404
5.70723758014734
6.0351713728565715
5.971406821757554
6.33180189907103
8.257493407365612
6.4322184270328995
8.10483323934347
5.721510424960011
7.356454034981897
7.211401105511203
6.534011821153844
5.81767159030127
4.836635068803045
5.749536323027876
5.654185622548414
