-20.103460256506697
-23.142691030714406
-12.820895125243858
-26.763398963673772
-24.031042777653816
-18.721182020559255
-28.099305724678786
-19.588776347521556
-20.5967746567656
-25.53886129843736
-30.489157574669214
-26.10366960154596
-14.985950582120658
-25.916530795844377
-21.513515635763962
-22.919361901740746
-19.515748982873443
-17.74592034925233
-13.627689887208398
-26.354971575359862
-11.866304971177094
-17.93278368075023
-16.561825621866628
-28.19522004209041
-24.221591166058854
-20.369344718433155
-24.87387351615161
-16.214972634712787
-20.74154047963469
-10.013802740791183
-9.319901387033962
-21.675296647905128
-21.874518772492166
-22.79801252971729
-23.964132933228328
-24.98079868382019
-20.66036982182239
-21.330112965385492
-13.520389407899623
-18.283940973943874
-28.467262266829664
-11.2759956359173
-22.786599219377067
-23.45180510764157
-21.82599157802223
-15.856144992265067
-21.63949871226978
-27.302428158824924
-20.345841651293785
-23.63959459385438
-15.187870796924546
-14.354167396570103
-16.549641670680693
-14.715402766617043
-16.171812538260887
-19.357422216271516
-28.3091517946506
-27.742851789757484
-17.308458287297796
-33.108642698209735
-26.7335558551228
-18.523998609451635
-19.45795580859122
-20.993982037180203
-29.25932406243601
