0.2800665128486061
0.05357331888410388
34.57544798083361
1.1104629728751174
3.933197784862572
1.3976985464920293
5.50162232062224
0.30472161439171513
0.3926494558812068
0.13651762361390116
0.5508949180473933
0.21385917687014164
0.3869997440860534
1.6027330008927527
0.8575046704526114
0.2584185295425724
0.06522532337882275
0.21224776861059866
2.105527204984276
0.2483451540214888
0.2277153735468265
0.15581330047298675
0.7889591290074012
2.042323812150633
6.015743032421233
0.8133245292096458
0.19075273569581214
0.8366239071730709
0.07955108269918194
0.2442554628278062
0.35390615773865186
0.2097621093922129
0.1818673814220536
0.12735149888397854
0.5425030482426975
0.6570054704390162
2.227078977218018
7.159464004516479
0.36489935288417336
1.2883509483234803
1.7923665316427129
8.483529231769213
0.24803866119972445
0.21009394812872156
0.5959448681706454
1.6150097358717677
0.7349008922388979
0.14956183234177545
0.852508105245755
1.2593999602657495
0.6873731693921017
0.328313441919953
1.1565741108949184
0.15593242414409494
1.0310676371836451
5.858313875190519
1.3709047255760307
0.4349490238939194
1.4637357340768034
0.1851003157576568
0.39004371988077374
0.5993825377570438
65.93406295887435
7.586289821178363
31.467468693130197
0.7729098966964829
0.6268856172980236
0.680016238130254
5.970023505422713
8.602835627658218
5.773645890239331
0.4716755978063328
2.165803124296107
0.5149648004370699
0.13573167245498688
0.30173565319897266
0.19409670209735586
0.04175861306882856
0.5658509653292915
0.2678826678276427
4.240131446436726
1.2266355577733263
12.008118066812484
0.4938916522733125
9.226931485613717
1.4766973589332368
1.028386448696373
1.4855582201899362
0.2973343283446726
0.2829498249252061
0.12475545821309122
0.3675413447755091
4.708572835653938
0.4201374875628154
0.6671923073739944
1.317041585951928
0.5012883929320172
4.58192390481572
2.2155632049245275
12.463345817586278
44.150206833580945
0.4305431222202141
1.9486436941426
2.426250969056051
1.204643929136875
0.3572123597370004
20.98428898100575
4.164867995731979
7.926608615635373
0.12670699709404792
0.26126431869313105
0.20185833588358068
0.13370557731142158
0.12697961735680813
2.2013040069241794
0.3487452523667245
0.8429795831938354
1.2192363428562596
0.6208000568387267
0.07006074103742606
3.151532930527408
0.9790572152431304
0.13739762756839866
0.05240797590736893
0.18264504684737096
0.5716572196994869
0.43025756490478695
0.032237268484472316
0.021732101621342502
0.06571130024598335
0.07003487436770797
0.5017706505613533
0.4832113797821948
0.15746460131468235
