41.76648423349698
47.67211139626134
49.65531097657397
52.761977656051386
45.066940268707924
38.812090953100956
65.66784236086947
41.833948895991476
43.76785096042727
57.742145831178
65.56633747278495
56.68756035602004
38.352400744559745
48.87103830195563
57.74323549834818
40.41576053167389
42.362014501780585
35.81533176921352
40.58784913405089
51.51063311584098
33.73063235618871
39.56851838400699
42.37337524244169
58.59585455932744
48.10101485594415
44.79088088510652
48.007436782165385
60.28722805534569
51.20971136994691
38.251429342040105
21.81238288028345
40.829315558902096
46.85337074489927
43.254978175856515
49.01734578323631
44.98986627194793
44.00677759704758
40.54620705175754
34.937901035987565
33.72041743766658
51.445278129576074
23.897433462761754
52.448755977912036
52.87103852963598
51.5387543981184
33.98268701464088
53.499779555337504
55.1801943119161
46.02114601403603
45.87897438401328
30.713381813624217
54.874502202668424
34.74337027294653
28.21809430785457
30.678576944463842
39.05864815716341
49.94099993310194
57.864961941213735
45.17672910208039
67.30560439342777
47.37559539823367
44.4251944610615
34.61514693768904
45.228613900741344
58.00305620541275
