1.0356195555555556
0.908144928488794
1.4048065592732082
0.7657904793293567
1.1216541535951856
1.0017269947956775
1.1324778440695902
1.2601606683140167
1.182923495133497
1.029814922985118
0.7162349312026133
0.7793248392081542
0.8129414457381101
1.4927880704880558
1.3530826277657246
1.636273385094718
0.9311362973673438
1.3160657070258726
1.3865280186588669
0.7777135724852072
0.6513130021913807
0.5415492957746479
0.8337091096080063
1.2084850314644124
1.197699048409648
0.9494739595719384
1.0298880281889882
1.057784576073616
0.9480565599173556
0.7884420545806068
0.8543790849673203
0.8797401373755611
0.7512435763981751
0.6723749674817899
0.7876803489064441
0.7831683895811709
0.9095897575064068
1.1019646899049342
0.7962944670963028
0.949818707079024
1.0310919518249584
1.0199782364185992
0.7436546643695848
0.6170481569560047
1.4416969703504623
1.5879045905973814
1.438112407076999
1.1320752196665356
1.0619240253771538
1.2272036624332392
1.1851799015275848
1.0789785926552402
1.1926365097605207
0.8999889038035491
1.355338843499926
1.582160335763343
1.4658028775467342
1.340402828761724
1.590572187174922
1.2011275262931194
1.1323068123389406
1.3724990654363576
1.952759491489688
1.2859579752911636
1.7155983382687712
1.0297056440723735
0.8278479045363321
0.969265742669444
1.425871568414958
1.4987849454249509
1.5134385082984516
0.8998241963839293
1.4501599010526818
0.9661143374713624
0.8933808957590169
1.234445059421272
1.0347533270212428
0.8726926001427446
1.1100177199545402
1.0399600595191478
1.3296011142836794
1.2367816091954025
1.6723673744474932
0.8397281458273164
1.5479842890694369
1.3182578921002372
1.22068875084004
1.2957957853480655
1.2700092330134425
1.3943839541547278
1.1073253965430323
1.3396987547443375
2.053763727770047
1.4035877290794638
1.5339358141045902
1.738265591340419
1.4293119867331878
1.2904954608042194
1.3612017570494863
1.920469804074775
2.029266068309371
0.9102488567180091
1.37225364160955
1.1577881544854385
1.7177952502563896
1.1938072488864124
1.2658892974992304
1.2201980505078365
1.291867921370765
0.7909897320714979
1.0134407262392588
0.9322108962333784
1.0124784650911929
1.063214285714286
1.1141805491679666
0.8489886084250069
1.172283657071302
1.6003654763225816
1.1606687859448177
0.4567434479217718
1.7287340805055391
1.3179838471531236
1.1896472098765432
1.1272112382934445
1.326056731806247
1.3059055476732015
1.5097469153477718
1.1847121724805874
0.9796498788666024
1.4387225548108011
1.3926158245780242
0.9428303687817272
1.0971726201617715
0.7791116306494358
