2.7217154623441653
3.323029317030803
4.412147533376123
3.68880105391262
4.833754925819976
3.2654158636718296
3.2196149240355982
2.9608108407941205
4.320827397493438
5.196186819070915
3.1977201630686403
6.995436646823298
4.072124657228399
2.039959167971564
4.3854513322282855
5.248927652635973
3.683118256726487
2.8675649828604786
3.854001856067669
4.181452495479856
2.3857544565209428
3.2506908155877268
2.632180195540663
4.61827719109372
2.244400028754093
3.1484826178410095
3.5379993313338804
3.25547838959534
4.620179424307984
4.577482538475515
4.114727638723315
3.5427222623077315
3.1673225528157816
2.5218775860584546
2.6852009058084274
2.589719982426229
2.829858868389228
4.3829404549158975
4.6734676286035235
6.470033070154438
5.100824302400401
3.9406098065642716
2.564333783071413
2.242386705883705
3.30659955493612
2.914637240853287
2.9759614049749303
3.9209901545019608
34.302225852122696
4.6699260618399485
4.282518461773911
3.940681753911545
16.25736885631235
8.530386228264915
3.612474425524092
9.460529870527976
12.178395841552131
11.98174692459077
6.563270775761108
3.2427041360279354
3.7206549394497617
3.7465408540805822
5.798078013872058
8.275174737836537
11.638393471982932
3.41652148705792
7.607763923756451
3.8557699803448284
3.124857701325796
5.1428807785101975
3.842016632756237
3.263471419384656
8.357495679408903
4.186603522988566
3.3223254609108217
3.8899994812408663
5.273227262958836
4.6597555837290034
3.6158445803857777
41.91798367376218
3.9057617647938256
2.8198231889470287
7.122506779615245
9.336229390048118
6.696972567704737
9.168036798164717
2.358109423291811
3.44052027386042
5.169740841799494
4.11961246168043
4.284348731787132
7.026854046627221
4.373369492910974
2.8235959667694197
2.792422950953375
3.576424506042185
3.295609961546152
11.889903053566178
4.858131187765007
6.835260643475602
5.689855563160075
2.9194470735671874
3.3530586786019074
5.939973272805423
3.0222366201083792
3.4991263981999667
3.793898531324051
3.578988187510695
4.282976664449227
3.0292574034712945
2.9344842841778536
5.5826634348793425
4.507925978237144
3.307689731970948
6.514223984163902
2.8760688998272594
3.0959124243557263
3.454581004263183
3.495481063219936
2.848167612046409
2.8608525938551788
2.9646415447989
3.5236549548148166
2.2204645578368263
7.516811801078781
11.649077579642686
2.9457136191265647
8.926075147954503
4.381936417480563
6.760893292248403
4.143803404860397
2.8328093032682236
2.873166723934007
2.984733044979825
