8.788893147844894
10.275382797601283
0.2596597108879536
4.9597750719028495
4.154523938986748
10.790820470306173
4.4438735438430275
24.667192337398127
4.324610101869663
4.759633077409232
3.1687379710165797
5.9747958249482345
4.084399906216124
1.2558064675682006
0.5000694414390506
3.169212263117699
2.8014677124014287
3.2875950735582324
5.9663463038138564
7.2107628119199685
5.5385309895770245
5.988721731628924
3.5927575402491336
3.5527790149653216
1.6282801795629294
2.8773099709708294
10.976542780859118
1.35043352504999
7.799614369939622
3.954067750018604
7.4649542269878575
1.9255823287025684
4.435922918249718
12.174498725049775
1.6602281405369634
2.9214535826959835
1.6525093591051578
3.973202733705748
5.7331847185723825
4.597502247239343
3.9962026323465545
0.7129855903953963
6.1368685583035285
28.51425830826807
2.7245557495646486
1.3554982879109536
2.015379583437053
5.1557900619875845
2.376567820008102
3.3375576978390025
2.5372793376914307
1.633602570879204
2.284631338335708
2.724674529645574
3.539310159056525
1.4469893344087854
5.954936506668898
1.560833864656606
3.3325183239943064
10.061408405755126
6.33180095026758
1.5049742036271838
1.8579813211333247
1.7204955842897858
0.8146804442799186
3.498534550699812
3.2133660406679114
2.302399480779736
2.7098952464793435
1.2453990157073007
2.9195753665106703
10.181176629978212
4.918531480740647
8.848256951432482
8.09793200582387
6.17694280190059
8.864950210797108
4.871199909709058
1.8899772285635847
3.887600278914017
2.187949556479983
4.085706387909499
0.8389473498492256
3.3960567169630607
0.44941538932204106
1.0212892950866916
8.97104218080327
1.4503509364840614
2.2701321238711096
2.8036293595093107
2.137879797444928
2.8319077608007883
1.6755823997837007
5.748997651283887
2.962300235717656
4.985384633227377
7.466163150850117
1.9053823729834656
1.590971972621825
14.140441127505259
4.239170371853221
5.960668912139735
1.9538973313178525
2.5368821843072746
4.44017446823966
1.9329096876290899
1.2838928639414389
5.7370787300661314
0.3843483942784548
4.230860150566905
3.3698948777301503
6.8475706881522465
7.777213783523866
7.804145090368684
7.1942400597135086
7.288208935281383
2.8005636944001164
10.657932518940699
5.95776755542506
14.796876572347614
1.8263336917187682
8.241062856455219
8.339426270824651
17.315567547776748
1.3538776283002063
1.1935189174020564
2.0331218623480725
2.4025830186461685
4.026344673173651
1.3524609261826572
2.803808320569483
7.5985891314146246
12.220799664434892
4.187410601501899
