3791.3988791990473
3518.1026858554565
48220.266414279446
2358.4285492323097
3029.902078365272
1514.7214657101197
3833.16202725544
1112.8742732758287
4247.106506573191
4327.542058752127
5531.090557893817
4850.5023600914565
6217.020349690786
10651.577700705871
16384.870864411118
5400.568514241275
5852.828995024747
2138.188670989888
4191.287897867712
3729.8267148540144
3428.746932879957
4938.7144451908
2844.2515906752424
4167.176030275145
6969.034276792702
5685.027550924742
19117.381294287705
45697.11858908098
6986.126150082577
5244.689803420736
3951.6466759708014
18578.225960170534
4046.1202835666218
4962.766824331444
14114.34554198504
8277.446344507825
12209.41833914675
3194.088463250095
29407.79471737888
7592.733442694843
5384.387500153687
33801.043552233146
6083.731469089281
978.7083089784444
5726.9835198692845
7769.352608585587
6703.6660217018925
10462.371196325741
13978.663043667326
18453.51225787596
6428.025190973382
10238.70243098968
7704.239320982227
7090.7616155761025
9159.478257400284
11930.688713337571
2825.512324972743
13974.296625508005
10295.6994447798
8379.047931651632
4183.536173437585
9140.955687712483
53813.37423622912
13581.417265410886
34464.839513210325
1961.1776995772336
7615.843625744042
8768.143208024565
14651.507401838724
12866.64782632965
10341.150424537886
1130.9470056186667
4633.507732720986
1215.1815131266178
3455.853545086152
1397.085239870681
3445.9718085312156
5281.836045383529
12008.489759463862
3946.00220088098
9542.945444275285
3740.948500437929
5533.758938730631
2389.024352192589
32910.86180910826
14800.623149808018
2015.915180731022
13504.229125868027
15413.204656151336
3810.047876235113
6599.25669261345
4970.20872126008
4782.299497926363
2416.279931084695
3960.140958938566
2929.811394083808
2158.5143544341863
8819.029878509886
4465.7567336091415
10992.298254440591
19213.693954831768
1185.3008670276693
5505.097293907172
5368.885879457172
2799.2993902176304
4556.37470672549
8671.681847438198
2359.7006799539317
48831.089124543614
6474.734574175333
4297.8110818993
2684.519348548524
2487.2256646438104
1799.5087096363784
2297.824253359524
2100.0836480140515
4948.949027911736
2240.4315493091385
3480.6698443191963
2106.423932206892
10807.413694090994
2338.634069982119
8511.577390047436
1473.476487856757
6352.410714256509
40678.16718468938
4798.840221490485
16346.816572042746
3601.9212979383947
12729.507101996176
9623.665455148603
2034.3860310370349
3008.4540895338982
3141.210917359537
