33.545736036790125
30.81097866426836
122.11802698725029
26.330902116144824
36.51014213222985
40.06233241482109
38.6259228247365
41.72654439857546
41.59667463216383
45.63767766528729
41.59667463216383
36.69173395267797
52.298287305633046
37.8722442530889
73.27501306081426
33.06040650862637
53.416443219761454
56.60887593473947
20.840639994746443
53.337738109528274
99.16263176752874
71.30858508370942
66.12081301725274
74.86367860007384
65.4806225483638
39.6650527070115
59.49757906051725
139.04154078579148
80.77811898928006
104.91764355589241
32.10330144239026
52.19741730713461
73.02028426445969
60.70680691858204
74.61710212358349
41.36557572550562
22.475377491463608
42.95714616044693
63.13700574259621
41.36557572550562
39.6650527070115
23.769528361236468
74.4757320126058
67.72398862481379
74.59519703312108
36.51014213222985
50.318604055185205
30.84199372057773
47.9085438795645
40.06233241482109
29.748789530258627
132.15267368690525
59.636988300342225
41.463581329404676
31.6002645747058
26.626875117362623
34.585065046102834
68.67406150973717
22.7076602194414
61.24569114009197
35.65429254185471
91.98957707615256
37.237543673199994
82.6205455139073
35.1934187198602
