30.56889157187652
32.446022039071714
59.085207061198645
71.54486073553272
40.334210546125185
14.860652100138354
16.454087095862008
16.06292583823575
20.151814536082412
101.38872795669909
49.70322806482844
48.10537256639723
87.55982675862919
646.8505954720953
59.025520922591156
207.67548181460663
377.3065423173088
34.87110244606031
29.50144388424836
147.87625114013287
211.6745434406956
256.30121971780386
42.877640592441026
60.00527066590518
54.161013921018814
54.877706766452214
171.84432406616622
183.68012665907852
96.48573019707236
48.32637617393362
45.37246645240009
94.36387180879271
26.6943332784418
274.5683149479747
267.0718884396563
232.40754662549315
44.98331181599689
20.199002267573697
131.57494939541357
151.65653264758302
234.44146385630842
163.17736042586884
160.05606348702756
38.350302901477306
41.80475078062921
46.99302129146546
40.55820357576263
68.40993552833389
56.98629155603488
43.34838698007349
39.27112002651956
53.10843231659522
125.50659717844697
35.933648962167595
22.48837664060096
34.45749617356156
19.66713223363981
72.97241659707744
42.667130069566454
112.90887870642145
67.77916612232697
84.7002313952121
56.96121629824656
56.37423066666666
67.89904534890199
13.752169159379962
40.030881609980064
38.146644774352005
34.582230861366504
40.43291295691092
31.61972645123371
25.733563965950967
14.719153727655597
37.0742983467897
75.78504326900827
24.24411858809893
14.198591974776381
69.24799035890894
60.16658257027984
49.67212236936177
38.34081426900096
38.86502646455524
24.00946704470743
16.63699005643644
50.980394513031555
63.99995259775626
91.43909387467212
35.265623971315655
40.82028671918325
10.213788938167722
19.418225838528304
52.05905340204385
21.39063924838664
5.1946877192338885
69.23267930569118
57.62493417879185
69.45158163265305
156.14439797389016
29.51778904711032
33.01290449262875
44.71128385687311
23.86681987934502
21.726068768493015
25.38146833068941
15.104778261748347
36.27325738186553
55.2018053173986
9.833193311214586
103.60646501301731
127.28438259130743
54.08618130540729
84.2221897549533
33.30954065982528
10.24466970788629
31.0778934875168
60.94517128805523
42.229331910705135
41.33920021151431
66.63729020117587
36.18175787067904
66.18224277799962
52.00101342554603
44.10015548953461
84.46092206487788
145.2727189003543
111.77323738568208
35.94162224963704
28.41493448541547
13.767318140132609
19.538672529505547
19.708444197269376
45.86101822222222
38.95374904306464
42.01852518999792
