-4.18492067042837
-4.73151251414957
-4.311310050359262
-3.533077954116846
-3.6333631360524685
-3.350461666147045
-3.3554683685714726
-3.004165489769639
-4.266984569460391
-4.5092563882074534
-3.9621830800725375
-4.391700019242679
-4.494374848179412
-4.485686338518481
-4.641959073489388
-4.759311329140993
-4.720156309990198
-4.093080283966576
-3.76664260585172
-3.8541355154557584
-4.053364364604484
-4.079106794593938
-3.8189130168460617
-4.334568934149318
-3.955379912759632
-4.221943916747439
-5.385640162292435
-5.121505172428727
-4.863178158611194
-3.847686371317805
-3.6858376285141006
-4.441480857917641
-3.6439983228023975
-4.491963312258284
-4.347907706794852
-4.333707575205729
-4.663340106878991
-3.628778230883942
-4.630667451340937
-4.043675850045444
-3.8515026216221506
-4.418972988530593
-4.09923112038023
-3.6201204842786128
-4.303407526419739
-4.188500056426233
-4.15212130455961
-5.179241756395679
-4.283477467539637
-4.319750492383708
-4.140684380172354
-4.2055359677083235
-4.335040660448494
-4.209208727505642
-5.178988015787488
-4.044897162965117
-3.4555553496174065
-4.642425042887255
-4.212158438103164
-4.450126899023181
-3.929554266081817
-4.055199149964373
-4.488082503682198
-3.7921532610914235
-4.525271457009137
-3.019257873192681
-3.848421176002335
-3.945790057329782
-4.0918529275996365
-3.8823122970170454
-3.921976723884601
-3.0182834530308296
-3.987369102224525
-3.3692313008565975
-4.168048904333318
-3.516153614293354
-4.361036590367883
-4.997879120120004
-4.195710361957408
-3.7602664836875093
-3.975577362262048
-3.606449423313473
-3.7085445381603757
-3.4426437820825324
-4.330301616714328
-4.230972207809874
-2.815521533110896
-4.286593163462683
-4.735439170305765
-4.346669489353268
-4.479540063684595
-4.170641970110538
-3.7335413030820885
-4.0761677405786205
-3.803125022921103
-3.867830087662942
-3.9531470967263695
-4.411831146946971
-4.0337101408506095
-4.11957155051287
-4.145646591453673
-3.652410847110212
-4.04981120011943
-4.046263690023477
-3.657868604906005
-3.8605635452867038
-3.6402365550129847
-3.709070866191569
-4.7105907853030855
-4.387198983382934
-3.9397066053447194
-4.0101956196529995
-4.164497318174661
-3.876311852660119
-3.5262619049237034
-3.4610504981268897
-3.922923585799677
-3.347291397008118
-3.8991416232351384
-3.6590665605242254
-4.272664407554865
-3.6743679334899935
-4.395997982403026
-4.209306030243763
-4.430521871414227
-4.887442652222004
-3.5803867346090548
-4.916080035109996
-4.642074263597149
-4.638519685678589
-4.648699865183874
-3.2290180815475327
-4.3897963068712205
-3.8497350715262324
