432.5016341300607
248.79012051733898
231.223051777588
187.10739047840786
163.03038275018008
415.7459398101526
655.1546637580384
482.9310138073776
326.7985805729101
819.8733118663914
468.32415747424966
466.44482142938523
257.65754419729683
108.70832388562378
349.20156408879205
199.8117906232283
111.54576576803913
130.84106176885072
151.0333253197199
500.484282955511
301.7138070953017
214.21359050722432
591.5502474948498
352.05884700782394
539.7848269754852
375.9233938364255
340.71043487681237
387.0171893588237
219.30725228572445
387.52630980419326
113.05776112968086
225.36225658915257
250.34890417351863
216.0316034276833
187.20289381790798
276.9779668972925
62.45569015472886
370.2426891711447
197.3283350242582
203.07548465659562
620.8016471383908
119.02262594445322
261.8997352754722
233.35316175795043
281.51772884338664
221.99673254097408
681.6582786216136
500.93069559152167
407.7610065670431
398.8231100764428
161.08062213413956
478.68712111191735
240.72288751095903
155.59718392390386
166.52542488298303
142.9518437742883
559.1258720868319
542.4125384353264
911.492969076332
645.7416694337821
251.38533954368177
1031.7576639427969
151.75172275741943
380.11000462392474
507.0378125800184
