0.009615092489760769
0.004323447023107518
0.004096899092676932
0.006550936486194972
0.010348604431219741
0.01669883282301528
0.02225854356297657
0.015055898227991018
0.0043851311721191215
0.004953720599777192
0.011558370362481337
0.005573840607643419
0.004423168746859456
0.002738250603050027
0.0037519317998145037
0.008161548241704801
0.0050999118326590966
0.009495687717869166
0.011412341372023366
0.004115063721692299
0.010444332815350992
0.005985974802251965
0.011542573058722066
0.009159279560529624
0.00702106377099392
0.0054135793599013726
0.0017086086184389256
0.00237320663958652
0.0044725725068531326
0.002561446376988101
0.0019414265049158528
0.0018752444538547434
0.011476088118060685
0.006870562244608611
0.0035320450747917476
0.00880814083081853
0.009611190857788294
0.00928969310602428
0.0027561604792072122
0.002067436883853196
0.003928257432147046
0.001927013493834589
0.009376894719383484
0.03218373593009489
0.010141951362663257
0.00425682398637182
0.009076423940225668
0.0010006858770785156
0.00463448003039815
0.005826789234899683
0.00555099350703736
0.004244128894288914
0.00830424717032361
0.008234955020786309
0.00839255222344701
0.00494790170488445
0.013871466391762515
0.0037103298618436868
0.0096894308471657
0.0034922839520991344
0.0077315520980951015
0.0032545346584621354
0.001863899177703286
0.007179987487508859
0.004970071141788485
0.010301440623167141
0.007406696854930575
0.0076600487395062904
0.006426631715125543
0.003014309807894277
0.006518104572819274
0.011319068666793093
0.011940044879073287
0.014754818909038141
0.01193496676557387
0.009011769084590185
0.023440507863229536
0.00495158993538569
0.003651370026588367
0.014878571233715696
0.005349552930842801
0.010277514855607215
0.015577503568733256
0.010125816955178986
0.0014859287410951651
0.0025263558542106784
0.013042136809577522
0.009029406806558293
0.00860025825468284
0.007486036876171756
0.006949758762791055
0.010233432903447994
0.01271173288473278
0.02390091417532995
0.004369124780154955
0.0065344100551311315
0.0033263607192186104
0.0068397853107502755
0.006238097405691557
0.007783192383522065
0.005674851501345766
0.019201245420327053
0.010621349603092713
0.005648177484062447
0.010820511812774864
0.006945960802501387
0.002480443496047657
0.014928265414971257
0.004615474942335418
0.002961257582794737
0.004912674457308524
0.00754263857167035
0.0073097952816370965
0.019855807504861968
0.0074596527746361935
0.004645732253007828
0.003827618845353644
0.0034458363337672103
0.0042067549193091506
0.024739344128478728
0.0028395277213566035
0.005665305985348519
0.0057811424638113396
0.006195193617501176
0.0015491704025019349
0.0019201597155057198
0.006042555955776041
0.002739545730943809
0.0027706383722741913
0.00178324024837183
0.0053787110491445855
0.0060888902146823826
0.011360457224005265
0.0040874041966090435
