0.007033298381467113
0.008583723094556203
0.00020623125882507013
0.006077061639023685
0.007344483013618414
0.01721493513619514
0.005607364987409146
0.019605905055608875
0.0032235670489309197
0.0035831097516833116
0.002517791230170325
0.003415436936767754
0.00224337624099973
0.0011282387164349885
0.0004766724552954459
0.0032663279100495803
0.0024905405724729066
0.012064830827856523
0.0036982050125241328
0.006607666625548159
0.004781269572064246
0.00549950007353831
0.00599811432459785
0.003913504552328593
0.0017360262682335874
0.001757542462626591
0.001141921801297743
0.0002754749780482118
0.0038561644505098244
0.005545407468945973
0.00605799960422439
0.0012308522627012214
0.00788232674594818
0.002750059011517465
0.0007185781892166539
0.0012553019850867287
0.0008422760874180255
0.005704826165447226
0.00046903272188540234
0.0029202235443292137
0.004055525685850474
0.00034005134922449217
0.004243926912029824
0.029546169112396763
0.002785003544065643
0.00188391172089987
0.0021561771304999373
0.0012920979910518086
0.0013152101606385947
0.001014272331557318
0.00386637289465478
0.0017191971772289349
0.002975391049774623
0.002743223229907012
0.00239325811239643
0.001273376966016136
0.012265696171029766
0.0011991533592287233
0.0020726169868830182
0.004356050944674643
0.00933874079782169
0.002246385992204666
0.00020655374180294267
0.001209312879724468
0.000357033636921875
0.015070743337117713
0.003054542781644179
0.00213297242760781
0.0014781051663215606
0.002411888628925204
0.0023267237475114357
0.022553935064995492
0.0039741566553742735
0.02951992771969666
0.010774462337490515
0.014752990254838384
0.00448475906074837
0.00260514243896946
0.0016639965357663912
0.007313048162364152
0.003715506543311168
0.003715506543311168
0.002749312953167847
0.011462627063037564
0.0003700911305918918
0.0011283942121572358
0.014965864574375697
0.0012748506361606516
0.0011341955204093813
0.0036573320144941655
0.0016705210388286667
0.00243901848567001
0.002396958159411049
0.00991025826648591
0.004404249635944637
0.008528260585105819
0.01409553048343025
0.001391875667390063
0.0030855730250287533
0.0017997077713988586
0.0005184186137228035
0.012706003646437312
0.002637593632430435
0.0028199405317801225
0.00826104171595638
0.0037412541388986654
0.001239441547320323
0.00771857437291677
0.00021068654212699048
0.004030493335435949
0.006625905780496065
0.009740393948815243
0.01004428329659461
0.01346642073759835
0.008394405663572958
0.010832319966519828
0.002640574913084213
0.009459876258514915
0.00479881856152748
0.006343495273593237
0.0012240624031238008
0.009022107251495114
0.002021717961479284
0.013862374106406708
0.002242122755261279
0.0002796335053452426
0.003380012601919189
0.001199975273636134
0.00732797429937562
0.0017984262894972054
0.0024345513355503536
0.008557177470189598
0.007788996912908734
0.007510651858531316
