62754160.47627968
20428546.445792507
378029197.9273107
7418046.800684158
4262868.488348593
900129.0690081578
3201541.617981336
23446285.24455696
108848067.21672168
23554256.515137866
78356046.75941832
69544745.50701839
26866628.58770589
32742573.464807976
242242626.5587408
189642374.8109053
42398208.02262464
14182864.105411438
8088159.270763994
4351912.1203740835
5613369.5364625035
8287066.275335141
5273015.631879881
6327037.445197339
11146314.41062379
18411905.3509212
596615734.7237186
619518979.5670519
113327778.78761536
27419756.90910553
36201954.2679262
71741936.2226102
11157461.787782256
9874643.507669998
41806266.43004649
21488023.75485097
40303194.79984219
5719690.447189365
321546113.1926757
74454313.89008908
68543992.09863372
761461584.7655151
82568280.73283777
7412685.780156173
14043851.962342538
14056788.803226508
16158544.716140812
211930918.0880344
277641595.1616562
189264739.7089836
57925454.18276113
60033146.05477922
24362234.95689558
19804099.04221817
70827032.40056545
19700816.086746328
10764951.186226323
84986142.02953295
38271303.84847143
95448572.91106412
28780848.44576242
17366400.526234467
221981167.76926145
41704758.35554805
111186830.53260092
676855.7888657275
63063337.91237581
93936229.61490466
130763740.76847295
25272880.559280656
51614647.52626047
1498718.5440470956
5656141.738965631
497907.3783342728
2719832.076884604
851828.0074873432
126786594.8475595
56362109.74005094
33019146.07334287
14232804.380586958
6555693.994825716
6555693.994825716
11256581.21547525
2512790.8611192955
75858308.81363784
28955680.94962614
1506381.0869843415
28349891.507266946
41238681.2150628
29746185.91967433
74071337.14630151
19661229.007611603
12040540.33256724
18033647.33057144
12076671.745762086
7196794.941737488
2959009.1107766675
22617185.53281745
17337983.02625765
43735126.85504992
42787062.9087221
1533677.7029467889
8913286.16259355
10912166.427928567
15544320.157043194
6430772.799495042
39617321.71167409
3645948.318711543
151604847.67986852
11049802.910203343
4733067.963131587
8498566.48863725
24772890.169119645
18201327.79755355
5162556.480700493
12306073.95186947
18275019.965737026
9766231.783511093
9480106.244327376
3063938.7765293634
26495922.06966912
4014286.2132837763
228009791.9504572
11097394.354993636
44834527.27213318
1844404069.5761142
13525639.924232705
907522476.6196568
89846378.94529583
304754999.37748027
301665334.81060815
2789317.586891428
5530022.0516973715
3796050.617003787
