39.97307455332353
34.976440234158055
35.2327810828328
28.691253158934302
25.104846514067518
17.932033224333942
14.345626579467151
21.719466360416217
30.407252904582702
36.58444873592971
28.542538487032342
24.465032988884854
28.542538487032317
188.4672807709394
34.61643932527457
57.69406554212431
107.69558901196535
34.61643932527457
20.32793082855792
32.49920741052063
52.498719663148705
34.99914644209914
23.85710118076025
26.507890200844727
26.50789020084473
29.158679220929194
38.46621658635942
54.493806830675844
31.55000241612139
31.550002416121398
28.04444659210791
42.06666988816187
24.538890768094422
65.5209298486904
59.280841291672274
53.04075273465414
32.18954264816112
17.883079248978408
36.007691887338744
33.43571389538597
38.5796698792915
33.43571389538597
46.295603855149814
13.526135307881274
29.50341659116172
42.14773798737388
29.50341659116171
38.76072067559178
30.214912920662226
30.214912920662226
26.438048805579452
33.99177703574501
41.54550526591056
25.22187179728639
25.22187179728639
28.824996339755874
10.809373627408457
43.43894171424259
34.751153371394075
56.470624228515355
39.09504754281832
43.43894171424259
29.46922984341156
26.522306859070397
29.46922984341156
14.73461492170578
23.350205958038487
26.685949666329694
26.6859496663297
23.350205958038487
20.014462249747275
21.456034088290465
15.325738634493186
21.456034088290465
24.5211818151891
21.456034088290465
37.693586595646636
61.25207821792578
27.90690399684891
20.93017799763668
27.094465076863585
33.868081346079485
22.48650222493136
22.48650222493136
35.113145135036895
31.92104103185171
53.42625023045231
29.01688201343623
29.016882013436227
20.28022799672163
25.350284995902033
27.38022952623303
27.38022952623303
13.690114763116519
48.52466852456328
52.257335334145075
37.32666809581792
26.894796247890447
20.255722617480085
21.79739197589376
29.063189301191677
23.613841307218234
25.43029063854272
17.122795518496567
24.460985570811307
32.614647427748395
30.916674461834567
15.458337230917284
41.93383254072865
47.92438004654703
32.948011282001076
32.948011282001076
33.659892067745744
28.049910056454763
23.019525697676713
38.843890011704396
34.95950101053396
31.07511200936352
42.72827901287485
32.742995139111514
43.61516121272419
39.980564444997185
40.14857865819378
84.75811050063135
57.992391395168816
49.137524942296416
41.366034400811635
42.91271477256971
28.608476515046462
35.760595643808095
35.7605956438081
37.7136731931267
41.48504051243937
37.713673193126695
