13.141533047123964
7.837088713274258
0.26429476649476186
4.193131691831889
2.708697082956667
5.996449065131649
3.9499628684690418
15.665736390217896
6.388943693014423
5.307501922289021
1.9076404953101018
2.5102840692739217
1.5404414188062792
1.8215191837320497
2.4566569402809524
9.370496821220284
3.5448596032382755
6.004600842375124
6.046313671394344
9.446213471164961
6.169588263702309
8.832303445731014
3.8553472365949535
3.547897072085358
1.9271152184408584
2.0087013844117743
10.513936870534202
1.0691748060675412
6.598176981689366
5.027948701158362
3.0750049883720822
2.349681497512135
6.639253085715084
4.114224710985232
4.161892557335487
1.6196394048622962
0.9864500447674954
2.430307537369855
2.003762881806644
3.8350132434466313
4.117291708816643
0.5671243490501601
5.731879812217317
41.77599842248974
8.06408164079523
1.7650555752727108
2.02319140445177
3.355616454175286
1.3689970756963292
1.1133945383195765
1.3683235834720893
1.1038647981684044
1.9531454506484165
2.399329263212439
4.656359968470482
1.0507019274164957
10.594605197778387
1.2302161000596756
1.9948768583406464
6.62842255849177
4.615187733625247
1.3521743131359008
2.7170959252641533
4.303097742841153
0.8945840617341009
2.0217328044350737
6.8775031905343065
3.6126986500129874
3.2573038128910325
2.321831097601395
3.907688719975724
15.669017193816927
2.9392100861647683
9.984635393140882
8.381309988945397
7.356015431118527
5.076326019599975
3.65220049477872
1.7612750751383972
6.454965264408133
3.1020492648116047
3.1020492648116047
1.1871616678716093
4.411584197866082
0.8836803827590078
0.8296709997734085
5.551763221978591
1.5319109758272036
1.5007374782217575
2.8788676359644736
2.3602529998520496
3.8417602741018615
2.6314551255056027
4.737151762604603
2.9675644735551923
5.211697944496313
8.891409753287821
1.6689187960436382
2.6990430335124236
6.628975945665008
2.859091080942462
4.932212610392496
2.282102406618504
21.09227579391609
5.377203232394301
2.562928037280611
0.9864729318007329
14.202944484720268
0.5466180245552443
3.6537353734941984
3.562387584768166
5.556767758945293
8.857499555602926
7.853777041691608
5.540319067199747
7.781177971956175
3.969967064028462
8.419887571241858
6.761760345518082
5.25990607177774
2.006634184774553
8.301428344728643
6.518009329140557
13.800943789822776
1.8428146422616172
0.946980140231392
2.2154103097262547
3.4356819243788355
3.9284611608003344
2.265529804274712
2.854182616046673
5.6714940224699175
6.047180685718657
6.241622559755075
