6.6207930428042925
6.145294497434149
7.581038906670368
5.806316841716543
6.026410060722972
6.879830785460508
7.431984632959488
7.269387115829688
6.610550910760339
6.820079631839013
6.582038511367493
6.902616043528018
6.509194457072808
6.6923930043217
7.022633575434847
6.7277068029283775
7.117157815685927
7.271469789957805
6.213357021728151
6.296998369765072
7.676472942372775
6.7058387775939385
7.521206311915482
7.4496952115350625
7.969264692276127
7.242419679935812
7.614902989013326
7.753667113076858
6.508286604584872
7.251511680656681
5.77388183220466
7.224578777004969
7.615573191274523
7.100588157483784
7.470335436696009
6.2095155605617585
5.5250741028648935
6.5961017695853394
7.215543797564452
7.294922742041164
7.179618820479875
5.1057102722330105
7.226209846073223
6.716909334493778
6.876143263683157
6.031498578901265
6.376457746876112
6.566985246906366
6.942887005852513
5.842463996084706
5.713669851113767
7.950736365902015
6.89922656924945
6.395711069179933
6.428452797705871
5.3608498761183085
6.477286009956057
6.541767288495157
6.802666558006451
6.824698795744548
5.897800726054706
7.585365298378585
6.134035459158385
6.78596709365409
6.664144516516466
