143.50660720215637
69.77177579659778
367.2126665827648
565.5176019210511
157.08624176041556
44.87341346815057
499.83839101435416
115.8540926532392
185.19334635736482
120.77793585204293
704.3786584313814
841.4107727843449
94.14595785343205
779.0690453011753
363.00999911914016
106.58555494697569
72.42268329642606
95.58674689447248
143.30610686155174
340.6044878914128
91.65260725066538
57.56540260973895
83.32919048805284
223.808235428829
150.35095463212411
117.61662017503664
151.34527978371815
178.33955311129847
120.70974904480387
89.98349310147253
10.292715494562666
126.74334016498872
82.76010379614414
105.68501520323684
133.1233318973294
92.05508069656786
137.55735576799526
63.927573845565846
31.91811289191956
43.51195237811657
381.5572770465136
335.7659858507428
90.02056335756767
125.85617445988844
116.529556073184
34.42042743334379
52.890826724936026
1148.0199004646522
254.59994423462226
183.9399290450278
44.16054795060572
161.18575153819575
84.94263172472766
68.02941845586922
26.853297655407108
81.42975542833209
144.38203206902025
312.4907505905363
135.7228427584842
243.54231427469762
211.08597617650003
153.20389562244102
66.95642542817554
75.78456836625831
319.6319169246148
