23.347858925777864
19.062951105861607
3.5188825336262006
0.6563520777703971
3.636892187514567
7.263185365089726
10.110858248959044
25.669196813293954
22.774980822377906
16.164865660102226
20.991460235363576
21.454415320930792
15.878779683360461
9.295668304638182
18.086388709320893
23.900309672230623
16.56976620131769
20.338238754939912
13.033118538721732
12.078852393479593
8.50673922604267
5.654966861548008
4.05221701848799
13.199106689955522
7.696198822032533
5.396578207846114
21.47129490137183
15.467016397110429
19.942814104967383
16.467144115649813
18.539487863013832
13.547600001380935
14.337084809852787
10.372588102909607
10.37435067134835
7.876187308972488
5.148979442531928
4.47983503890429
16.179360410736066
18.04248576056196
19.709487607877293
18.376671156482143
19.8000519448136
21.94495578397635
9.072405597743588
8.231138470565229
12.801211101505062
20.11900302797477
20.467426847748794
17.421880955727364
18.687944223762944
15.177031640089726
14.07047453865963
13.517335577311938
17.430506783533517
11.24208253044426
16.473522436343785
14.776504147815338
13.71865976887512
18.720312965970507
18.500835506336077
9.648293736693997
9.237650420811738
6.524392419952822
7.565805409662621
8.8047039942278
17.600197180520986
17.64332673497821
17.156923746655952
13.594342928281879
15.582623538657769
13.821745781283528
12.464352155574474
10.79250691726365
10.830739962300148
10.084577229781447
26.06130258560506
18.77518769919234
13.107152500722009
15.432577019529317
9.848815050836386
9.848815050836386
2.7743784285590674
3.7089195215646185
10.705297215050015
12.271010313964235
6.221642122706647
9.355425023177046
10.692780439905059
17.74092680275871
18.034640502324493
14.265498004049405
13.095988108979082
20.519223647336457
3.2593200265161864
2.901073200689663
9.3547217089621
5.816609877354032
-0.06769525131014967
12.831154158268717
10.55016745684824
6.844926693320408
7.929889764604868
8.286329665298043
18.725851418306185
12.323116676885729
-0.2604308745428506
9.65765343500426
11.044463875822316
11.945406454527493
12.16047547227685
14.743528575462951
20.941368976940847
22.034090943012515
15.06893030935865
18.001317782897505
14.004162602636246
16.219413309055305
11.242972903300576
9.825812256819846
7.90797306840045
13.503562802447448
23.244689243240668
19.29134264187032
17.12976949187121
21.40289600639851
1.9528249522861254
24.363396941457935
23.720809304584677
21.482618090185404
23.72541776204329
12.38735114146142
13.611670517864168
12.174781690612907
