9.604
8.730848861283642
17.932325100641933
13.383790226460073
17.923832923832922
14.357487922705314
18.333773087071236
9.868167202572348
11.289525691699605
10.296346414073072
10.540007443245257
10.69688385269122
10.89142703574308
12.827202255109231
12.043348493462195
14.233180927498367
8.508400746733043
11.924598269468481
15.060570762958651
10.89102564102564
8.768918918918919
8.549295774647888
11.622641509433961
17.128953771289538
15.744175317185698
12.52
12.110798254258766
12.977612201350265
9.705492424242424
8.955792682926827
9.962745098039218
10.120210587891195
8.592292089249494
10.77016129032258
11.655258556082938
12.224313326551373
14.617795997106342
19.62836879432624
11.829657089898054
13.61233290211298
14.619433198380566
16.17764070195572
12.080552359033373
9.560344827586208
12.709688462855187
14.901454308660734
12.2899854862119
10.153072993903443
11.848577755067279
13.755183186594715
13.492134831460676
11.058495821727018
13.5663852647736
9.38963842417701
16.987685621151755
18.05570853632705
14.69927536231884
11.796039603960395
14.52930675394228
11.096685082872927
11.034239677744207
11.038108200068052
24.886277723439694
16.21454413892909
22.055240793201133
11.490683229813664
10.601959038290293
11.036392405063289
18.07025805236391
17.832193342453262
18.684672518568537
8.614457831325304
17.75138632162662
11.481751824817517
10.534482758620689
10.860349127182047
10.212516297262061
7.977105831533477
11.918848846253564
10.272123893805311
14.848282442748092
13.370114942528733
20.67361111111111
9.776290630975145
17.272114402451482
13.960526315789476
13.34817813765182
12.969092721834494
12.104067962751186
10.630945558739256
8.316036433894563
11.225304749894915
16.436405178979438
11.689912826899128
11.74598453301606
13.351054852320676
11.594257178526842
18.33526570048309
15.519468621163535
21.5705597788528
23.256448047162856
10.49235474006116
14.654282362143135
14.786177105831534
14.976681614349776
11.023000522739153
18.930739154719788
18.93461104847801
15.540213714867251
9.682926829268293
10.755237045203971
11.07969639468691
8.958810068649884
8.485714285714286
16.443757725587144
8.6105702364395
10.986872586872584
14.65906362545018
11.505277973258266
4.768115942028985
15.805979643765905
12.565017261219792
9.118666666666666
6.794354838709677
9.284447260057016
11.847436925073474
10.8609693877551
6.85571012617276
5.0746089049338154
7.502676181980375
8.040137221269296
10.0224570673712
11.843601895734595
8.093620546810273
