708567 981948 525
929926 214966 525
78869 109593 354
173665 271856 443
355406 630669 509
822196 608976 509
712130 497203 509
706782 720364 411
73776 919408 525
138889 770101 509
418755 7275 449
790415 319007 509
485 758026 509
337906 890797 525
746433 300465 509
67747 551900 470
362522 664444 509
65694 506342 449
886952 258145 525
283510 920667 525
884277 798327 525
972862 853439 507
409748 221988 443
79407 967201 525
303490 49783 443
601113 438124 470
781812 648232 504
933132 522079 525
525832 852119 525
594615 688999 509
632945 489670 509
415469 49437 449
859154 369891 525
824609 732858 468
324488 494665 449
771299 985974 525
78051 781914 509
43866 657135 509
225190 234590 443
330923 24366 443
185774 54414 383
948138 153860 525
515726 136701 470
899149 736456 525
943503 496368 525
658409 51011 509
562796 412977 470
290458 718417 509
564400 41519 470
262780 831354 509
980084 170203 525
927991 509974 525
780781 862381 525
388142 762121 509
488241 358505 449
613482 860144 525
294084 104492 443
624573 875074 525
840002 416157 525
953993 43478 525
304629 864115 525
583851 149965 470
740913 550981 509
889152 864467 445
564182 99655 470
743526 464381 509
213198 55992 383
540951 30375 470
27900 457491 449
75940 454270 449
282971 441154 449
374851 857737 525
182337 972027 525
92941 531570 470
202876 224924 386
213316 175995 373
55806 880276 525
830804 60935 509
990806 84849 525
919845 445222 525
510223 356150 449
435662 671998 509
637759 357265 509
608065 560067 434
477506 152548 449
385066 761723 509
151201 335747 443
343039 336926 366
818642 881706 525
258631 303780 407
480273 553777 470
855357 931761 476
350344 219657 443
846782 699233 525
209551 158264 373
938856 143086 525
208516 452028 449
184622 196825 360
459641 753479 509
8110 888517 525
730070 495189 509
162840 54421 383
39032 374544 443
238771 722280 509
125304 541471 470
588470 564337 434
94153 134259 354
136003 41789 354
426536 758688 509
455979 860269 525
591891 205937 470
649943 20901 509
236542 696535 509
92839 213751 383
660107 891548 525
218851 89918 386
989748 756083 525
672773 125845 509
79780 758535 509
990456 375419 525
34723 557834 470
322423 513235 470
748017 199800 509
799903 535651 509
761536 698959 504
433624 833767 509
335842 547562 470
152163 197644 383
673913 613800 509
865081 2077 525
196830 642077 509
107670 474660 449
454300 406235 449
510765 843705 525
159863 634503 509
715884 597338 509
912077 830970 525
390194 161820 443
494275 114989 449
546142 106103 470
609851 10522 470
754602 803015 468
710976 854112 525
268865 349307 441
256066 888146 525
883269 160607 525
836452 894529 525
724987 739118 424
840819 485092 525
272852 270812 345
26633 216904 386
969758 109507 525
17010 444693 449
281749 22067 443
848698 744678 525
258826 122837 443
91439 641406 509
980918 160187 525
114549 636355 509
772936 859981 525
418962 113598 449
922436 520011 525
981460 436553 525
322065 329783 384
137670 488462 449
570008 723131 509
644939 155285 509
6191 321370 443
856611 94549 525
884213 255601 525
797870 333882 509
730018 65052 509
591411 996794 525
709515 821727 468
903298 590340 525
159409 383721 443
303654 213989 443
707442 154370 509
327590 626387 509
545411 393189 470
394611 79034 443
155814 972794 525
136852 223092 386
657628 986932 525
685660 662231 442
363544 360776 366
461774 533334 470
813980 274198 509
69853 689692 509
461466 956744 525
690773 621490 509
749437 868917 525
424788 269532 449
503566 759467 509
667028 340120 509
637513 46973 509
937737 23289 525
499234 329317 449
336442 245997 407
778619 436832 509
573910 833276 509
610016 64869 470
446226 446424 263
185755 310061 443
875510 489710 525
559269 277861 470
855416 69632 525
418046 91227 449
529612 646635 509
282888 92087 443
647480 991668 525
947243 161246 525
303909 925714 525
168269 602836 470
968981 268597 525
298343 65170 443
414637 842309 525
392452 436693 449
78193 510202 449
31511 976732 525
46554 459326 449
231046 89206 443
432156 431632 343
813697 75729 509
777732 964774 525
604592 147804 470
177627 652716 509
861044 824817 525
159096 566945 470
765647 778302 468
175558 55264 383
331731 998961 525
87811 966441 525
622081 391005 470
389217 870032 525
156216 866278 525
633552 541032 509
946629 350948 525
232243 370202 441
305804 54724 443
673332 397175 509
412542 884022 525
307690 807906 509
20394 639132 509
35765 847740 525
161375 676011 509
847964 790943 525
572201 655070 509
855862 884358 432
510092 973816 525
870342 46781 525
393388 996351 525
571412 51560 470
62127 266465 443
605751 881497 525
610366 821832 509
359904 359377 317
