828150 537870
398518 839339
981864 891544
270831 346103
9625 413655
898641 857623
9443 31579
627118 358255
837586 859457
964263 5114
836713 96953
376515 274649
407996 166768
97384 708700
813544 311279
631937 729726
13810 992786
934005 3256
139505 778425
285690 361314
652604 973569
695680 956205
131891 678554
207914 524066
11848 844806
912360 911243
137193 154437
984951 227737
998375 371439
728977 885743
113931 323547
378978 46476
548547 334277
168195 207724
879993 787824
251755 428820
196994 970236
383615 625440
898883 94553
794416 708884
17698 538019
74962 227463
490984 357233
432720 192885
319108 606088
214294 421905
73182 705756
222097 360440
574998 661612
744528 255387
178043 489998
453950 147667
100864 145662
387990 252294
23708 687239
151016 558759
216629 868353
221238 803522
81325 154755
756410 114737
102541 883627
809784 226927
213857 337879
747690 175746
357409 140477
454222 604445
973235 934100
954820 57117
383332 507203
594469 791955
827937 900760
262679 597371
72607 537643
259762 842306
190118 423362
859566 889237
118044 668787
983569 119061
897089 382758
808065 765362
274875 967560
578127 569667
240011 513246
244036 39953
840245 825627
581597 78586
588271 493060
990805 957832
380562 857309
934741 564254
367629 502484
985102 823809
469518 472103
576227 407814
937304 357492
970831 145115
396427 413930
863394 90689
485925 145184
520613 850418
189369 726277
229236 150885
304633 567922
462050 46813
980095 932685
315629 956040
383362 165301
457233 227375
389743 611774
769445 890579
392620 320365
67085 688712
994982 41565
854980 188227
82162 157983
872345 396328
876239 444502
311933 222644
202865 751887
280589 555570
350157 906679
919890 842884
692190 38501
213189 645222
860194 159939
114549 841547
360608 231641
25199 498847
726230 725091
632153 7361
332886 296522
975945 880502
341487 899675
952550 958072
81741 586322
539082 614045
154443 348323
84622 500746
987028 184101
108612 849668
934561 713171
1301 676944
165791 624700
404697 845607
750022 757727
324512 35980
672036 367807
767416 242811
694141 472653
288867 368418
208978 146002
109649 359965
7485 8239
764834 474731
953148 61985
579384 785342
596259 84524
839301 985880
341850 638583
888879 63736
432868 293436
147801 283267
892407 460893
705165 351128
232542 829826
111401 208988
933183 463377
163681 646928
126114 481522
597599 951787
197695 524069
589864 649264
838627 878912
721533 733370
781428 893413
932679 693023
978038 98782
419846 329610
557238 357822
681194 660966
543357 501634
405139 54453
600789 975994
408086 998331
95455 828492
988315 970654
490151 692881
240963 47125
531503 774068
819747 458515
435752 402491
685007 151878
272624 189864
259265 552014
237610 182484
66098 480263
894496 863840
114354 995714
309741 246980
181319 767212
963920 952932
37244 854365
69234 496079
458621 719884
556659 896150
650280 870554
17154 138626
288908 377340
277087 815749
494527 151942
38304 693646
884962 72648
113666 737618
4602 526427
