385766 997066
275920 614689
773104 367431
176339 701921
341270 890971
566109 74714
407427 991147
680103 430975
168241 645939
176551 723949
893710 834002
279211 586046
838189 12594
358230 34846
418906 950381
480846 924373
821026 716804
818399 747227
13185 194187
696594 260471
62061 238577
19490 328775
716500 973910
867819 980297
672819 526729
654979 318954
155503 427025
965093 176530
612930 236742
703469 243158
910759 633824
240266 696510
955921 28822
124024 177938
473502 667760
819911 650574
131896 347017
788139 488862
744378 617295
12626 331083
918531 354988
199728 379959
719390 659328
35642 989982
660114 948745
683693 125225
739896 806790
359997 494476
528288 378823
204575 170413
316356 93745
91304 951260
408162 552129
307631 979732
564880 820072
655862 306157
871072 183894
366697 687230
105692 733456
116755 266320
238603 652794
441852 453568
550394 590027
455575 475881
438835 919036
992768 709426
98619 280167
781034 106162
106745 434607
660479 930753
487281 647875
131968 105859
366143 378341
993282 167881
427739 476923
648438 617110
949267 697320
865767 888026
374677 374429
18884 926332
699056 217780
561932 754488
869618 6693
110691 314381
258780 713684
538960 770890
290530 844957
187394 711600
420202 11766
248416 258108
218052 240906
184684 408410
467529 284499
429420 427547
797773 933785
316460 60708
535014 765537
952976 980593
800107 14138
146536 277974
251298 744849
846385 947845
583979 604768
968635 817787
201290 111465
190797 31249
282766 145707
267397 156710
751904 425657
315391 849974
756029 341045
15875 338156
576202 22358
380460 683176
846275 318958
377620 178661
870879 503257
506120 318922
397276 482969
584613 463659
676705 126751
654482 711947
192311 266045
788252 842626
806500 344828
140046 77713
358198 509254
230409 753500
531084 858205
913494 13355
100796 979707
852700 986361
959597 608354
843189 494840
278840 598223
640839 982181
28552 215894
205041 231064
526736 113277
546700 899692
299043 919810
615886 487105
902895 492415
563662 924179
547309 682444
300040 151396
470740 13696
569378 66586
991446 372491
683349 769259
552174 194874
397631 422848
88133 571249
617739 707320
308011 692738
333351 459445
555384 742970
554429 420764
609887 956150
882628 895552
322416 86262
579711 196519
824940 662938
202659 766183
23679 143587
252531 89575
648921 928635
625006 728322
547532 481667
807599 311001
270054 80604
988232 937953
804306 159625
314113 652805
604428 11573
381994 644720
546910 868695
653260 378594
941645 149430
708750 543973
172057 80820
811809 725939
105260 680827
480219 225951
185180 275701
192273 48568
987390 563447
837331 188298
183029 714116
896332 721288
562538 957822
290773 109021
716581 346507
415895 978213
355605 965139
421223 953632
147516 65668
225887 268355
143309 155607
546894 632425
