60416 816780
628039 778108
941393 290122
540622 580747
856000 130547
888293 365995
498167 923978
276013 288116
253102 227102
341482 963862
533820 468331
361348 534055
998521 342568
832399 278209
915363 360064
931853 220835
20047 239412
241310 931402
483247 286501
290270 321743
117373 410620
801163 262706
111234 596805
196733 292167
127018 953592
513695 173900
299224 434957
616683 740986
215893 679230
431189 279894
11656 204754
747905 610216
838843 810090
794599 906527
576248 345060
418589 21457
792257 534409
26381 925344
278209 298575
21996 239845
834332 506008
531335 62803
805349 762772
220624 991777
784635 723669
197111 960545
615717 335345
235016 997581
893335 170981
90769 12243
620292 17163
845475 823275
492630 954060
774004 967400
273124 235441
343423 549636
429534 646688
54680 140816
492215 276983
468281 998259
313464 222523
175954 368279
571021 222044
125522 735188
637228 24155
323616 115552
296990 45334
226319 278681
110676 674970
667713 78207
250487 561233
379500 290354
225864 475898
158925 88150
176854 898901
262614 645658
170335 597826
646111 35536
82253 730856
859492 647667
626219 804123
77374 514607
598981 252285
451644 471331
836437 533624
518336 341107
841304 783082
646461 172362
963933 913310
522269 216202
887687 867734
365206 886009
744307 464677
620000 363414
751327 162935
462226 59347
156811 896592
901299 322035
485474 420434
572329 748430
299682 392852
78467 943947
676931 249412
864066 250336
813839 398896
795322 154729
924512 913769
43926 995645
872522 801748
411644 86050
658177 820651
943759 518716
471216 321081
296257 298857
539930 895844
98310 306891
805073 250803
908251 148806
171685 766754
145583 370049
677634 138881
659081 63445
173643 864970
245109 651306
851056 383977
289534 995503
385039 425470
107008 870424
924103 70412
305215 658978
602569 56568
949576 245868
654410 558940
607294 73795
551065 934795
15727 868752
720024 404493
212966 999677
828121 947669
161003 465000
700924 750441
87362 49950
570683 721782
732906 488793
14548 530579
979055 271104
871514 743559
872375 825531
31168 829998
515110 198267
880180 899030
167845 308709
288393 966975
796330 535036
644802 750494
938586 369063
53015 599729
628679 760807
315708 7548
498048 366770
364013 10803
874930 367664
529894 475473
977346 435993
387733 740924
823565 991023
534828 42826
739999 468486
156341 298181
669072 129822
177206 523961
419162 126856
613244 837606
970241 566524
380753 352777
379691 846843
642734 230988
461115 316747
790310 573781
784437 177905
258258 842572
711441 359633
502264 817459
193621 434422
684176 343546
402603 881060
822027 574028
242965 137255
324694 619736
546383 822538
814256 507072
230569 356049
285078 560585
816942 790115
306488 291344
861395 293480
856022 633146
202715 40222
403414 290992
56454 10463
993755 229580
558753 33019
760298 558514
439591 78202
299939 230252
269212 295091
192928 343877
844129 891618
940878 689764
703963 197331
238431 695400
500192 748807
659495 315110
341177 974998
636523 287954
861658 361721
396038 165285
94046 464168
86540 826405
64405 91484
222472 597802
326040 917288
886727 594179
477817 427181
626684 789639
