356665 213131
579541 912916
857366 65750
939604 414266
280603 198229
571340 646907
1060 878170
113757 885345
848714 837498
151700 338084
473989 36811
819731 306983
528909 689633
285085 337868
233189 418870
872788 587994
47932 221166
101902 272823
903686 207152
449126 281684
522880 465742
341484 383029
838844 153760
866297 153440
721747 462929
760668 209589
82140 847830
908546 255156
777026 835038
707223 769827
90659 494672
323483 549061
457383 211524
519457 451084
671388 340773
284060 869814
217030 459560
346929 584832
501633 835416
940453 137213
778236 383482
345909 859873
546687 822404
594879 738954
964116 821493
897098 213667
150872 99462
387536 254964
231639 37586
565498 902831
772784 295298
269308 918368
703123 459294
315581 153709
827345 927921
35909 937758
308698 171
238555 364768
690848 43568
344513 255019
141109 937497
117183 648334
124026 328679
134982 947622
858961 922220
133738 287111
172306 230685
941764 200450
160648 604533
527775 993511
422647 617344
996862 145301
757186 220081
184795 780675
105993 197409
357839 788817
331030 509244
187337 870578
712541 329053
143129 402645
120310 793188
836791 330059
667230 707963
803778 793255
276704 733912
86798 915005
658180 354020
959540 830095
1749 168994
550674 69147
709936 44022
511384 392203
644313 622551
982058 38453
256436 444841
738151 496334
715606 994948
697397 469489
784970 85435
705357 693811
577749 805557
52639 740480
597161 509487
419358 299475
221363 885805
238955 565564
762986 444530
138397 347685
123944 269593
470010 134881
750470 500424
918166 852045
183317 264192
230022 263539
886645 99455
448596 967296
37521 447943
686851 75183
370442 371645
515374 936189
967473 474220
147511 397659
153272 667490
139038 409640
691950 46551
286490 887941
539318 94446
589392 473843
146942 259587
867887 749434
131963 992439
60068 940569
996843 427966
424406 447814
542838 98726
582197 964707
530166 402312
729186 327734
325962 827888
710501 479059
547261 251491
837358 627981
727376 454311
56797 640623
853420 223844
238471 821882
234702 531636
422843 825624
58542 181819
344767 898890
768492 9455
231259 191425
173799 740527
984411 600357
867068 62635
241474 63972
393545 131758
387176 278045
403283 332065
882582 936208
601241 617843
840694 675289
168393 607560
988978 897262
721512 788775
667850 390746
892654 672369
628144 173691
123342 305025
794589 79995
458240 410252
327725 87772
140881 297997
900580 525180
443936 971652
860067 700203
294519 906031
403201 550373
309825 539039
404870 313205
425801 891076
4464 788492
489624 127808
839496 159810
708369 159976
29360 428782
974980 994001
798898 187820
227135 96267
516425 451865
668299 984403
257102 275262
79343 855061
688486 379963
872531 662414
72620 989908
785885 853982
530748 699677
327246 206159
160377 336675
