22

4
Ja Morant
Luka Doncic
CJ Mccollum
Michael Jordan
3 4 2 1
2 4 3 1
3 1 2 4
4 3 2 1

3
Ja Morant
Luka Doncic
CJ Mccollum
1 3 2
3 2 1
3 2 1
3 1 2

1
Ja Morant
1
1
1
1
1
1

2
Ja Morant
Luka Doncic
2 1
2 1
2 1
1 2
2 1
2 1

1
Ja Morant
1
1
1
1
1
1

4
Ja Morant
Luka Doncic
CJ Mccollum
Michael Jordan
2 3 1 4
2 1 4 3
3 2 1 4
2 4 1 3
4 2 1 3

4
Ja Morant
Luka Doncic
CJ Mccollum
Michael Jordan
4 1 3 2
4 2 3 1
3 1 4 2
3 4 1 2

4
Ja Morant
Luka Doncic
CJ Mccollum
Michael Jordan
1 4 3 2
3 4 1 2
2 1 4 3
2 3 1 4
1 3 4 2
1 3 4 2

1
Ja Morant
1
1
1
1
1
1

1
Ja Morant
1
1
1
1

3
Ja Morant
Luka Doncic
CJ Mccollum
3 1 2
1 3 2
2 1 3
3 2 1

3
Ja Morant
Luka Doncic
CJ Mccollum
2 3 1
2 1 3
2 3 1
3 2 1

2
Ja Morant
Luka Doncic
1 2
2 1
2 1
2 1

2
Ja Morant
Luka Doncic
2 1
2 1
2 1
2 1

2
Ja Morant
Luka Doncic
2 1
1 2
1 2
2 1

4
Ja Morant
Luka Doncic
CJ Mccollum
Michael Jordan
4 2 1 3
2 4 3 1
3 4 2 1
1 3 4 2
2 3 4 1

3
Ja Morant
Luka Doncic
CJ Mccollum
1 3 2
2 1 3
3 2 1
2 1 3

4
Ja Morant
Luka Doncic
CJ Mccollum
Michael Jordan
3 1 4 2
3 1 2 4
1 2 3 4
3 4 1 2

3
Ja Morant
Luka Doncic
CJ Mccollum
1 3 2
2 3 1
3 1 2
2 3 1
1 2 3

3
Ja Morant
Luka Doncic
CJ Mccollum
1 3 2
3 2 1
1 2 3
3 2 1

4
Ja Morant
Luka Doncic
CJ Mccollum
Michael Jordan
2 3 4 1
4 2 3 1
1 2 3 4
3 2 1 4
4 3 2 1

4
Ja Morant
Luka Doncic
CJ Mccollum
Michael Jordan
1 3 2 4
2 3 1 4
3 1 2 4
4 1 2 3
