20

6
Patricia
Danielle
Sean
Brandon
Julie
William
4 5 6 1 3 2
1 5 3 6 2 4

6
Juan
Jeremy
Stephanie
William
Christina
Zachary
1 5 3 4 2 6
6 5 3 4 2 1
5 2 6 4 3 1
5 2 4 1 6 3
2 5 6 3 1 4
4 1 3 6 2 5
5 3 1 2 4 6

6
Christopher
Ashley
Meghan
Brittany
Kimberly
Adam
2 3 6 4 5 1
1 6 3 2 5 4
6 2 5 4 1 3
2 5 4 1 3 6

6
Rachel
Patricia
Crystal
Timothy
Christina
Daniel
3 1 6 2 5 4
1 5 4 6 2 3

7
Amanda
Brian
Amy
Nicole
Richard
Joshua
Kyle
5 3 6 2 1 4 7
2 3 7 5 1 6 4
4 6 7 5 2 1 3
3 2 1 6 5 7 4
5 7 1 6 2 3 4
6 2 7 1 5 4 3
3 6 4 1 5 2 7

1
Amy
1
1
1
1
1
1
1

10
Meghan
Mark
Joseph
Alicia
Cassandra
Eric
Christine
Marcus
Stephanie
Justin
10 9 2 7 1 4 5 6 3 8
4 1 10 6 7 5 8 3 9 2
3 10 8 7 9 5 4 6 1 2

5
Joshua
Meghan
David
Jennifer
Keith
5 4 2 3 1
1 2 5 3 4
4 2 5 3 1

7
Timothy
Emily
Brittany
Nicholas
Patrick
John
Joshua
2 4 3 6 7 5 1

7
Crystal
Mark
Allen
Jason
Alicia
Thomas
Richard
5 2 6 4 1 3 7
5 1 7 6 3 2 4

3
James
Justin
Victoria
3 1 2
2 3 1
1 3 2
3 1 2
3 1 2
2 1 3
1 3 2
3 2 1
1 3 2

3
Jessica
Megan
Nicholas
3 2 1
3 2 1
3 1 2

6
Juan
Charles
David
Keith
Heather
Kyle
3 2 6 4 5 1
3 4 6 5 1 2
6 3 4 5 2 1
6 2 3 1 4 5
6 1 4 3 2 5
5 2 6 1 4 3

7
Anthony
Andrew
Megan
Zachary
Erin
Amber
Kimberly
4 5 3 7 2 6 1
5 3 4 2 6 7 1
7 1 5 3 6 4 2
4 5 6 3 2 1 7
3 7 2 1 5 6 4
7 1 5 3 4 6 2
6 2 7 5 3 4 1
7 2 4 6 5 3 1
2 6 4 3 7 1 5

4
Natalie
Kimberly
Rachel
Steven
3 2 1 4
4 3 1 2
3 2 1 4
3 1 2 4
2 4 3 1

8
Jonathan
Heather
William
Heather
Christina
Ashley
Tiffany
Joel
2 6 5 4 3 1 7 8
6 8 3 7 4 2 1 5
1 6 4 2 8 7 5 3
4 2 3 7 1 6 8 5
5 2 1 8 4 6 7 3
2 5 1 6 7 8 3 4

5
Timothy
Brian
Stephanie
Donald
William
4 5 2 3 1

9
Steven
Sarah
Michael
Jennifer
Adam
David
Amber
Andrew
Thomas
1 7 4 2 8 5 3 9 6
7 6 4 1 9 8 2 3 5
7 3 9 8 1 5 6 2 4
7 4 6 5 8 1 3 9 2
3 4 9 8 7 1 5 2 6

9
Joel
Keith
Erin
Michael
Ashley
Laura
Amy
Zachary
William
1 5 4 9 6 2 3 8 7
3 9 1 4 8 7 5 6 2
1 2 8 9 4 5 6 7 3
6 7 8 4 3 5 9 1 2
6 3 5 9 8 7 1 4 2

2
Laura
Eric
1 2
1 2
1 2
1 2
1 2
1 2
2 1
2 1
1 2
