22

2
Joe 1
Joe 2
2 1
1 2
2 1
1 2
1 2
1 2

7
Joe 1
Joe 2
Joe 3
Joe 4
Joe 5
Joe 6
Joe 7
3 5 1 2 4 7 6
4 1 7 6 2 5 3
5 4 1 7 6 2 3
1 5 6 7 4 2 3
3 1 2 6 5 7 4
6 2 1 3 5 4 7

4
Joe 1
Joe 2
Joe 3
Joe 4
1 4 3 2

2
Joe 1
Joe 2
2 1
2 1
1 2
2 1
2 1
2 1
2 1

3
Joe 1
Joe 2
Joe 3
1 2 3

7
Joe 1
Joe 2
Joe 3
Joe 4
Joe 5
Joe 6
Joe 7
3 6 7 5 1 2 4
3 5 2 6 7 1 4
3 5 2 4 7 6 1
2 5 6 3 1 4 7

6
Joe 1
Joe 2
Joe 3
Joe 4
Joe 5
Joe 6
6 1 4 5 2 3
5 6 4 1 2 3
6 4 5 3 1 2
5 2 4 1 6 3
1 5 4 2 3 6
3 1 4 2 5 6
1 4 5 3 2 6
5 2 1 6 4 3
3 4 5 2 6 1

2
Joe 1
Joe 2
2 1
2 1
2 1

2
Joe 1
Joe 2
1 2
1 2
1 2
2 1
2 1
2 1
1 2

5
Joe 1
Joe 2
Joe 3
Joe 4
Joe 5
5 2 4 1 3
2 1 4 5 3
3 2 4 1 5
2 1 3 4 5
2 3 1 4 5
2 1 3 5 4
5 3 4 1 2
2 5 1 4 3

3
Joe 1
Joe 2
Joe 3
3 1 2
1 2 3
1 3 2
3 1 2
2 3 1
2 1 3

7
Joe 1
Joe 2
Joe 3
Joe 4
Joe 5
Joe 6
Joe 7
1 5 6 7 2 4 3
2 3 6 7 5 4 1
1 7 6 5 4 2 3
3 4 1 7 6 2 5
1 6 4 7 2 5 3
2 7 5 3 1 4 6
6 1 7 4 5 3 2
3 2 4 7 6 1 5
3 5 1 6 4 7 2

3
Joe 1
Joe 2
Joe 3
1 2 3
1 2 3
1 3 2
2 1 3
1 2 3

7
Joe 1
Joe 2
Joe 3
Joe 4
Joe 5
Joe 6
Joe 7
1 4 6 5 2 7 3

3
Joe 1
Joe 2
Joe 3
2 3 1
3 1 2
3 2 1
2 1 3
2 3 1
3 1 2
2 1 3
2 1 3
2 3 1

5
Joe 1
Joe 2
Joe 3
Joe 4
Joe 5
4 2 3 5 1

6
Joe 1
Joe 2
Joe 3
Joe 4
Joe 5
Joe 6
2 3 1 4 5 6
5 1 2 6 3 4
5 2 3 6 4 1

6
Joe 1
Joe 2
Joe 3
Joe 4
Joe 5
Joe 6
3 1 4 5 6 2
5 2 3 1 6 4
3 1 2 6 5 4
5 6 4 1 3 2
5 3 2 1 6 4
4 3 5 2 6 1

2
Joe 1
Joe 2
2 1
1 2
2 1
1 2
2 1
1 2
2 1
2 1

8
Joe 1
Joe 2
Joe 3
Joe 4
Joe 5
Joe 6
Joe 7
Joe 8
7 3 1 4 6 8 2 5

7
Joe 1
Joe 2
Joe 3
Joe 4
Joe 5
Joe 6
Joe 7
6 2 1 7 5 4 3
5 3 1 2 6 7 4
3 6 4 5 1 7 2
3 5 4 6 2 7 1

8
Joe 1
Joe 2
Joe 3
Joe 4
Joe 5
Joe 6
Joe 7
Joe 8
3 6 8 1 2 7 4 5
