20

1
John Doe
1

3
John Doe
Jane Smith
Sirhan Sirhan
1 2 3
2 1 3
2 3 1
1 2 3
3 1 2

4
Blue
Green
Orange
Red
1 2 3 4
1 2 3 4
1 2 3 4
2 1 3 4
2 1 3 4
2 1 3 4
3 4 1 2
3 4 2 1
4 2 1 3

4
Blue
Green
Orange
Red
1 2 3 4
1 2 3 4
2 1 3 4
2 1 3 4
2 1 3 4
3 4 1 2
3 4 1 2
4 1 2 3

2
Trump
Biden
1 2
2 1

3
Trump
Barack
Biden
1 2 3
1 2 3
1 2 3
2 1 3
2 1 3
2 1 3
3 2 1
3 1 2

3
a a a
B B B
candidates candidates candidates
1 2 3
1 2 3
2 3 1
2 3 1
3 2 1
3 2 1

4
1 2 3 4
1 3 2 4
1 4 3 2
1 3 4 2
3 4 1 2
3 4 1 2
3 4 1 2
3 4 1 2
3 4 1 2
3 4 1 2
3 4 1 2
3 4 1 2
3 4 1 2
3 4 1 2

3
5     5
6      6
7       7
1 2 3
1 2 3
1 2 3
1 2 3
1 2 3
1 2 3
2 3 1
2 3 1
2 3 1
3 2 1
3 2 1
3 1 2
3 1 2
3 1 2

15
ASSERT_EQ
B
candidates
Doe
endl
google
hpp
include
Jane
k
l
m
n1
Orange
V1_7_Primer
15 3 2 1 5 6 4 9 7 8 11 12 13 14 10
15 3 2 1 10 11 12 13 14 5 6 4 9 8 7

10
vYcRL
mpIvHLesbqWUNxVvtcxVxRcVvVSs
CZiRws
jEpVzf
UEmphspxPmKZbdeGbVKwCVATQJQopfj y
FlGNhMoQEE
7 BuSyGEekoRYzAcAdQSrE
upOezKRNvRznG
pydcfDISBiZxSRscEvCMomsuwPMx
JUaTGACMmxSysodA
7 3 4 5 6 8 9 1 2 10
3 4 5 6 7 8 9 10 1 2
10 2 1 7 8 9 3 4 5 6
1 2 3 4 5 6 7 8 9 10
7 8 9 10 1 2 3 4 5 6
9 2 4 5 6 7 3 1 8 10
4 5 6 1 2 3 7 8 9 10
1 7 8 9 10 2 3 4 5 6
3 5 6 4 7 8 9 10 1 2
2 1 3 4 5 6 7 8 9 10

4
Inugami Korone
Nekomata Okayu
Akai Haato
Mori Calliope
2 4 3 1
1 3 2 4
2 3 4 1
1 4 2 3
1 4 3 2
2 3 4 1
3 2 1 4
4 2 1 3

6
Inugami Korone
Nekomata Okayu
Akai Haato
Mori Calliope
Summer Color Festival
Gawr Gura
1 2 3 4 5 6
2 3 4 5 6 1
2 4 3 5 6 1
3 2 4 5 6 1
3 4 2 5 6 1
4 5 3 2 1 6
4 3 5 1 2 6
5 1 3 4 6 2
5 2 1 3 6 4
6 1 2 3 4 5

3
January
February
March
1 2 3
2 3 1
3 2 1
2 3 1
1 2 3
1 3 2

2
haruha raharu
ta-kun
1 2
2 1
1 2
2 1
1 2
1 2
2 1

5
1
2
3
4
5
1 2 3 4 5
5 2 3 1 4
5 3 2 1 4
2 3 1 5 4
3 2 4 5 1
1 2 3 5 4
2 1 3 4 5
4 3 2 1 5
4 2 3 1 5
3 4 2 5 1

2
John Madden
John Madden
1 2
2 1

4
Jubeat
Bitmania
Pop'n music
Nostalgia
1 2 3 4
1 2 3 4
2 1 3 4
3 2 1 4
4 1 2 3

3
chunithm
ongeki
maimai
1 2 3
1 2 3
1 2 3
2 1 3
3 1 2

4
Dallas
Houston
Austin
San Antonio
1 2 3 4
2 1 3 4
2 3 1 4
3 1 2 4
3 2 1 4
3 4 2 1
4 3 2 1
4 1 2 3
4 2 1 3
4 3 1 2
