25

3 3
22
0 2
0 0
1 1
2 0
1 2
0 0
0 0
1 2
1 1
1 1
2 0
1 1
2 0
1 2
0 0
0 1
2 1
1 2
2 1
2 2
2 0
2 0
8 3

1 3
14
0 2
0 0
0 2
0 2
0 1
0 1
0 0
0 0
0 0
0 1
0 2
0 1
0 1
0 0
8 1

22 26
22
8 5
3 15
16 11
19 23
4 0
16 1
20 0
8 0
0 3
15 22
15 24
4 21
13 22
18 2
8 1
9 4
21 15
18 7
10 21
3 20
9 15
3 19
6 1

13 8
28
12 7
7 5
11 1
10 1
9 6
8 5
7 7
3 4
6 3
7 5
9 5
5 6
7 7
2 2
4 2
12 7
1 4
7 0
8 6
12 0
12 2
3 6
10 3
12 3
8 7
0 6
11 6
1 2
8 3

12 25
15
2 17
7 12
2 15
1 1
8 17
5 10
0 12
3 12
1 18
6 23
2 1
8 23
6 5
6 17
2 21
8 1

12 29
9
8 5
3 0
7 27
11 3
6 16
5 2
9 15
5 26
3 21
6 3

15 27
11
11 25
1 5
13 3
4 17
11 24
2 3
7 23
0 0
9 14
7 10
3 2
8 2

23 28
12
12 21
15 17
17 5
15 12
5 14
6 7
5 23
9 5
6 3
15 24
16 25
14 6
7 2

20 27
11
9 14
12 2
19 6
11 9
19 14
6 25
19 3
5 12
4 19
19 25
3 3
8 2

7 22
24
0 7
6 21
2 19
0 4
1 15
4 13
6 11
6 7
5 11
5 4
4 8
6 1
0 12
0 1
1 17
0 18
3 2
3 16
4 8
5 7
0 15
3 17
1 19
2 19
9 2

9 8
27
6 5
3 2
2 6
3 4
6 1
6 6
8 2
3 1
7 2
6 5
8 2
0 5
7 3
1 5
0 0
3 7
1 2
2 4
4 6
1 3
0 3
3 1
5 3
8 4
8 3
2 7
7 5
5 3

24 25
25
23 9
12 7
15 1
11 21
15 7
14 15
20 4
19 18
7 5
20 19
4 24
14 14
23 6
23 17
23 18
19 20
2 12
9 3
10 11
8 9
2 11
1 6
10 12
5 7
4 4
5 1

18 15
14
13 12
4 14
12 2
17 1
4 5
7 8
13 13
17 10
4 4
0 5
13 9
9 12
3 10
2 6
5 2

15 9
28
5 2
5 3
0 4
14 6
9 8
13 5
11 3
7 3
5 8
13 8
0 7
6 4
7 0
7 6
5 0
1 3
0 3
6 7
8 7
8 4
13 5
14 1
6 0
6 8
13 7
14 6
1 5
1 3
8 1

8 18
27
0 2
5 2
3 4
7 5
2 17
6 12
4 7
3 6
7 9
7 2
6 7
1 13
3 1
3 0
1 17
6 4
0 13
0 3
7 5
5 14
4 0
3 3
2 9
1 6
2 1
3 6
4 16
5 1

24 19
13
21 17
6 0
17 1
0 8
13 5
3 1
11 12
15 18
7 8
22 14
4 9
3 9
8 9
7 2

9 21
18
0 8
3 0
2 2
8 5
2 18
7 13
4 18
3 15
6 0
2 7
7 1
4 5
0 13
6 15
5 13
2 1
7 18
1 12
7 3

1 20
28
0 9
0 12
0 12
0 7
0 3
0 11
0 2
0 5
0 2
0 2
0 12
0 7
0 11
0 16
0 11
0 5
0 11
0 0
0 14
0 10
0 3
0 5
0 16
0 6
0 7
0 11
0 17
0 0
8 3

27 15
24
23 10
14 9
8 9
8 11
18 1
11 11
16 14
25 14
16 0
6 11
6 7
1 7
2 13
13 8
22 3
26 12
17 8
16 13
15 14
11 1
22 3
6 14
2 13
20 12
8 2

4 29
2
2 9
3 13
8 1

7 23
21
4 1
0 3
1 5
4 2
3 9
3 0
2 15
6 1
3 0
6 18
3 3
2 6
4 16
6 1
2 19
4 0
0 5
5 14
1 16
2 0
6 21
7 1

9 1
19
2 0
7 0
0 0
3 0
7 0
0 0
1 0
4 0
3 0
6 0
6 0
4 0
1 0
6 0
0 0
8 0
7 0
0 0
4 0
5 3

15 9
21
2 3
3 0
4 7
8 0
14 8
14 6
4 7
3 7
4 7
4 0
10 7
7 6
10 6
9 6
3 8
10 1
3 4
12 3
11 2
4 0
10 2
8 3

4 14
15
3 11
2 13
3 0
1 11
3 6
2 2
0 0
0 12
1 6
0 9
3 6
0 5
0 3
3 13
0 6
8 2

25 4
13
22 2
24 2
18 0
18 1
0 0
23 2
3 1
14 0
1 3
5 2
22 0
15 1
11 0
6 3
