20

3 11
15
2 7
2 10
1 4
0 6
2 4
0 2
2 9
1 4
2 0
2 9
1 6
0 8
0 3
2 5
1 1
24 18

1 7
31
0 5
0 4
0 0
0 1
0 4
0 2
0 5
0 4
0 5
0 6
0 2
0 3
0 1
0 4
0 2
0 2
0 4
0 6
0 2
0 6
0 6
0 4
0 4
0 0
0 3
0 5
0 5
0 4
0 1
0 3
0 0
18 6

2 14
38
0 11
0 1
0 10
0 8
1 13
1 12
0 0
1 12
1 13
0 7
1 7
0 13
0 10
0 10
0 10
1 3
1 6
1 6
1 10
1 12
0 7
0 11
1 5
0 6
1 13
0 9
0 1
1 8
1 5
0 2
0 11
1 9
0 12
1 0
1 9
0 1
1 4
0 9
106 5

1 5
8
0 4
0 1
0 0
0 1
0 1
0 4
0 0
0 0
8 5

14 18
3
2 6
2 9
5 1
84 10

13 10
21
11 1
2 6
11 7
7 8
10 9
10 6
3 3
4 8
9 5
5 3
0 1
10 4
2 3
12 0
9 6
11 3
4 5
1 5
1 0
3 8
2 4
60 9

13 6
15
5 1
1 3
6 4
0 0
8 5
8 4
0 4
12 4
5 3
2 4
6 4
2 1
7 4
6 0
3 4
160 12

4 4
25
3 1
1 1
1 1
1 2
3 1
3 0
1 3
0 0
0 1
0 2
0 1
2 2
3 0
0 1
1 2
0 0
0 3
1 0
2 3
3 3
3 3
2 1
0 3
2 0
3 3
190 9

18 16
34
3 7
15 4
5 0
7 13
5 5
12 4
5 7
6 2
7 13
15 2
16 14
8 11
15 9
0 15
4 1
15 9
6 4
9 5
15 0
5 3
0 13
14 8
0 13
14 3
9 10
15 15
8 13
7 6
7 4
1 6
8 13
10 13
4 12
4 12
25 17

10 11
34
3 3
3 9
6 9
0 10
8 8
1 9
5 10
2 5
1 10
9 8
9 5
2 6
2 5
0 4
6 2
7 6
1 4
9 7
4 5
1 3
2 7
4 3
3 5
4 3
8 10
4 6
6 8
8 6
3 3
0 1
8 7
8 6
7 3
9 10
156 5

1 16
19
0 9
0 15
0 6
0 4
0 13
0 15
0 5
0 11
0 9
0 12
0 7
0 6
0 12
0 13
0 13
0 7
0 8
0 15
0 12
26 15

17 19
16
7 6
15 11
0 6
16 15
8 17
8 13
9 17
5 1
6 13
14 1
7 18
14 13
16 12
2 8
3 17
14 18
164 10

8 7
26
0 2
1 0
2 5
1 6
7 3
2 2
7 5
5 3
4 2
5 3
3 6
0 1
2 1
4 3
0 2
2 2
0 6
6 2
2 3
5 6
5 3
3 5
1 6
0 0
2 0
3 4
65 9

16 4
21
9 1
0 1
15 2
9 3
10 3
2 2
11 1
3 1
7 2
14 1
11 0
1 0
6 2
7 3
1 0
5 2
12 0
11 3
5 3
7 3
15 0
25 7

2 6
35
1 5
0 0
1 4
1 5
0 4
1 5
0 1
0 2
0 4
0 4
0 2
1 1
1 2
1 4
0 3
0 4
0 5
1 5
1 5
0 3
0 4
0 3
0 2
1 1
0 3
0 3
1 2
0 5
0 1
0 1
1 3
0 2
1 1
1 2
1 1
146 16

7 6
36
5 4
4 4
3 5
3 1
6 4
1 5
1 4
0 1
3 4
6 4
2 1
6 5
0 0
4 2
0 5
1 5
6 4
3 0
3 3
4 4
4 2
3 0
6 3
0 3
6 4
3 1
2 3
1 3
4 1
2 1
3 1
2 0
2 0
5 2
1 2
0 0
84 5

18 6
35
12 0
12 2
9 5
13 4
17 1
16 2
15 0
13 2
6 5
1 5
7 4
8 4
4 5
2 1
5 5
10 3
8 3
0 4
5 0
8 5
16 3
5 4
12 0
8 4
3 3
15 2
9 0
4 1
7 5
11 3
4 1
4 5
6 0
14 4
10 3
175 11

20 17
15
11 14
11 2
14 14
11 3
8 5
7 8
4 9
2 10
10 9
15 6
13 0
15 13
5 10
16 11
18 10
125 7

3 10
38
2 4
2 0
0 2
0 8
1 0
2 1
2 1
1 7
0 9
1 9
2 1
1 7
0 3
1 4
2 5
0 1
0 7
2 7
1 2
2 7
0 2
0 1
1 1
1 2
1 4
2 4
0 1
0 9
2 6
2 0
2 2
0 9
0 6
1 6
2 7
2 2
2 3
0 4
170 19

5 14
33
3 3
1 0
1 1
1 6
0 11
3 2
4 3
4 13
0 1
1 7
2 1
0 4
3 5
4 10
1 0
4 0
3 4
4 11
3 2
3 1
2 3
3 8
1 2
0 6
0 1
0 8
0 9
3 8
3 11
1 4
4 2
0 9
4 3
73 17
