30

4 4
19
3 0
1 3
2 0
1 3
2 3
3 0
2 2
0 0
1 0
0 1
1 1
0 1
3 1
3 0
2 3
0 3
3 3
3 0
0 0
4 2

7 7
18
1 3
6 4
4 3
2 5
4 1
4 1
4 0
0 3
3 3
0 1
5 3
5 3
0 6
1 2
4 0
6 1
5 2
1 5
1 2

10 1
14
7 0
0 0
6 0
7 0
1 0
6 0
1 0
5 0
0 0
5 0
2 0
8 0
8 0
7 0
4 2

8 7
14
0 1
3 5
4 3
4 0
3 6
1 2
0 4
1 6
5 3
5 4
3 2
4 1
4 2
3 3
4 2

8 10
16
1 6
0 0
0 2
7 7
5 0
6 6
3 1
7 0
5 8
3 1
1 5
7 1
6 5
1 7
4 5
7 8
3 2

8 4
16
6 1
5 3
5 1
1 1
2 1
5 2
2 3
4 2
7 2
4 2
7 0
5 0
4 1
0 2
3 2
6 2
1 2

9 6
1
7 0
3 2

4 10
20
1 7
0 6
2 4
3 9
3 6
3 3
0 1
1 3
2 1
0 7
3 5
2 9
3 3
2 3
3 1
1 6
0 0
0 5
2 9
2 7
4 2

4 3
15
0 1
2 0
1 0
0 1
3 2
1 2
3 2
2 1
2 0
0 1
0 2
2 0
0 0
2 2
1 0
2 2

4 10
13
3 7
2 9
1 7
0 8
3 8
2 1
1 7
0 3
3 0
3 7
2 6
0 3
2 8
3 2

2 4
2
0 2
1 0
2 2

7 10
17
1 0
5 5
1 8
2 5
5 6
6 7
3 9
5 5
3 5
5 5
5 4
0 4
6 7
1 9
5 0
1 0
2 2
2 2

7 6
18
6 3
1 4
6 2
1 3
5 4
2 3
6 2
4 1
0 5
0 2
2 2
3 4
6 5
0 3
2 5
4 4
1 0
5 2
3 2

2 8
11
0 4
0 7
0 2
0 3
1 6
0 6
1 4
1 1
1 0
1 4
1 0
2 2

7 10
16
3 8
3 1
1 1
5 7
0 7
6 1
1 7
1 9
0 0
3 9
2 5
3 4
6 8
0 3
3 3
5 0
1 2

7 3
8
3 1
0 1
1 2
2 0
0 2
6 2
5 1
0 0
3 2

4 2
17
2 0
2 0
2 0
3 1
0 0
3 0
0 1
1 0
0 1
1 1
0 1
0 1
0 1
1 0
0 0
2 0
1 0
1 2

2 4
2
0 3
0 3
2 2

1 3
12
0 1
0 0
0 0
0 1
0 2
0 1
0 2
0 0
0 1
0 0
0 1
0 2
1 2

8 8
2
7 0
2 0
2 2

6 3
19
2 1
4 0
4 2
0 2
2 2
0 1
2 1
4 1
5 1
4 1
3 1
5 0
4 0
0 2
4 1
4 1
2 1
3 1
5 2
1 2

4 10
16
1 3
2 5
0 5
2 4
2 5
2 2
3 6
0 9
3 4
1 0
0 2
0 8
1 0
3 5
1 0
1 3
2 2

10 5
7
2 1
4 3
1 0
1 0
5 2
6 0
0 2
2 2

6 4
5
0 3
4 0
3 0
5 1
3 3
1 2

4 5
6
3 4
3 3
0 2
1 4
3 1
1 2
2 2

10 4
11
3 2
3 1
6 1
8 2
0 3
5 2
5 0
8 1
8 1
8 1
2 2
3 2

6 5
17
2 3
2 2
4 1
1 2
3 1
2 0
2 2
5 4
4 3
1 4
4 1
2 0
5 2
3 0
5 4
1 3
3 4
3 2

4 10
11
0 6
0 3
1 6
2 1
1 2
1 6
3 6
1 1
0 0
0 5
3 2
1 2

9 5
1
4 4
4 2

2 2
18
0 1
0 1
1 1
1 0
1 0
0 1
1 0
1 0
1 1
0 0
1 0
1 1
0 0
0 0
1 0
1 0
0 0
0 0
3 2
