20

102 121
23
6 16
73 51
78 106
1 51
98 38
52 17
41 7
43 107
74 118
6 19
13 92
48 31
78 85
64 80
50 51
101 40
7 106
6 2
42 22
92 65
14 94
5 115
98 112
510 98

7 78
17
0 51
0 37
3 48
6 32
1 44
5 41
5 2
3 48
6 65
2 39
6 50
3 77
0 33
0 57
6 51
3 41
4 13
460 79

143 174
4
54 4
17 165
81 126
142 106
1657 116

59 76
18
12 34
29 32
47 65
20 50
46 3
13 65
36 60
48 49
32 72
38 49
33 10
5 44
31 47
38 45
17 10
31 13
6 24
38 34
1234 177

191 56
27
46 2
61 38
162 34
8 31
104 6
131 15
69 26
75 11
29 41
95 9
189 32
165 55
5 13
94 6
114 5
102 26
164 31
174 12
70 14
44 41
112 24
62 2
16 1
97 47
12 14
34 27
131 30
908 81

36 149
11
12 64
19 18
11 51
7 53
8 45
31 88
34 64
24 100
30 115
34 136
15 14
809 190

91 37
8
75 36
24 9
38 9
7 3
70 33
14 18
35 0
63 13
954 138

138 163
11
80 21
37 126
74 53
36 160
120 54
117 113
104 11
39 47
39 136
98 93
104 119
320 92

152 194
27
143 169
111 57
103 174
0 47
151 163
53 31
39 35
19 153
62 160
90 176
146 177
41 178
98 171
26 59
2 41
9 68
38 29
139 87
132 192
105 123
20 103
88 80
61 159
13 175
89 12
69 99
73 154
509 96

32 141
12
3 133
26 69
23 93
0 118
18 129
18 89
26 96
28 2
6 88
7 86
1 92
23 116
1910 200

191 32
15
24 23
10 31
54 26
93 29
153 6
174 13
17 16
1 2
89 3
10 10
4 4
178 11
90 5
51 27
74 11
1036 79

117 69
29
36 40
52 21
37 29
87 58
68 32
53 2
84 11
72 62
26 58
78 4
18 50
55 47
15 39
25 20
0 65
18 0
8 15
55 38
73 64
102 56
41 46
99 13
31 63
17 17
104 63
76 42
37 36
104 65
64 68
1242 177

149 103
10
99 99
56 16
94 96
54 24
33 69
81 43
114 69
41 18
138 50
65 88
1742 131

29 116
15
15 63
6 65
6 50
26 0
10 25
25 35
17 83
19 38
14 16
14 58
19 11
3 5
11 84
22 62
12 21
1439 200

104 89
16
60 4
54 73
91 12
75 60
97 15
92 20
52 87
99 49
95 41
91 83
9 1
47 51
100 58
72 21
38 53
98 2
1996 66

120 196
25
90 144
85 141
71 122
40 165
42 134
106 132
104 193
19 141
47 178
55 150
26 52
86 65
92 18
4 10
3 23
51 144
46 75
30 186
73 151
27 60
114 42
7 185
78 45
44 154
79 173
125 190

129 1
15
71 0
123 0
68 0
112 0
111 0
64 0
109 0
39 0
99 0
2 0
27 0
71 0
15 0
57 0
128 0
257 113

127 56
22
31 6
23 55
37 34
108 31
88 51
97 0
66 48
88 11
8 50
50 9
122 21
9 43
91 17
106 51
108 8
25 12
40 8
25 43
36 3
86 22
115 15
47 5
644 25

129 62
27
112 49
46 61
33 31
56 49
126 19
84 12
105 44
114 27
75 48
121 7
46 27
117 27
126 1
25 45
116 1
100 29
107 38
128 54
67 17
107 26
8 1
14 59
50 36
107 10
83 45
31 41
82 46
1900 119

174 38
22
85 3
75 24
105 4
109 19
6 20
46 19
171 18
46 20
130 23
7 26
51 37
142 36
73 26
113 6
37 12
153 1
114 37
70 21
82 20
40 12
41 32
78 11
1409 30
