*** Life<FredkinCell> 12x4 ***

Generation = 0, Population = 14.
----
0-0-
0---
--0-
0---
-0--
00--
----
-0-0
---0
-0--
-00-

Generation = 1, Population = 26.
0-0-
1--0
10--
-0-0
--0-
010-
1-0-
0--0
0--1
--01
01-0
0-10

Generation = 2, Population = 21.
1---
----
--0-
-10-
001-
--10
-01-
-0-1
10--
--12
-2--
102-

Generation = 3, Population = 29.
-0--
1-0-
--10
--10
112-
0121
1--0
--0-
2---
0023
-300
2130

Generation = 4, Population = 27.
----
-01-
102-
0-2-
-230
123-
2-11
-0--
3--1
-13-
04-1
324-

Generation = 5, Population = 22.
-00-
---0
-130
1---
1--1
-341
3--2
0---
-0--
0-43
-5--
-35-

Generation = 6, Population = 27.
111-
--11
-2--
2-2-
2--2
14-2
4--3
1--1
3--1
--54
-601
3-60

Generation = 7, Population = 21.
2---
10-2
--30
31--
---3
25--
--1-
-00-
40--
0--5
-7-2
-3--

Generation = 8, Population = 29.
3--0
-113
-24-
42--
--3-
36-2
4023
---1
---1
1156
-8-3
3460

Generation = 9, Population = 19.
---1
--2-
-3--
5-2-
-2--
---3
-1-4
10--
40--
22-7
0---
45--

Generation = 10, Population = 19.
----
----
--4-
---0
---3
--44
-2-5
-101
5101
3---
-8-3
-66-

Generation = 11, Population = 19.
----
--2-
-3--
---1
----
--55
43--
-212
-21-
425-
-90-
4-7-

Generation = 12, Population = 26.
--1-
---3
1--0
-22-
--3-
3-66
5-2-
-323
-32-
5-67
0-13
-680

Generation = 13, Population = 24.
-1--
1--4
---1
-3--
2---
4-77
63-5
---4
--31
627-
1924
-79-

Generation = 14, Population = 24.
--11
--25
1342
--21
3-33
-68-
-42-
13--
5---
-387
---5
----

Generation = 15, Population = 21.
-1--
1-36
2--3
--32
-24-
--9-
-5-5
----
6331
-4--
-9-6
---0

Generation = 16, Population = 26.
---1
214-
334-
5---
335-
-6+-
6-2-
1-2-
74-2
----
1+-7
-791

Generation = 17, Population = 22.
31--
-2--
44-3
-3--
-4-3
4-+7
75-5
-33-
-53-
----
2-28
----

Generation = 18, Population = 26.
4-1-
2-46
55--
--3-
-554
5-+8
---6
-4--
7--2
64-7
--39
4-91

Generation = 19, Population = 24.
5-2-
-2-7
-643
534-
-6--
-6-9
75-7
--3-
8533
-58-
---+
----

Generation = 20, Population = 20.
-1--
-3-8
-75-
6---
---4
---+
8-28
-444
96-4
---7
-+--
---1

Generation = 21, Population = 27.
5221
2-4-
--6-
--42
3-55
5---
-5-9
1-55
+-3-
6-88
2-3-
-79-

Generation = 22, Population = 24.
--32
33--
57--
635-
4---
6-+-
8-2+
24--
---4
--99
3+--
-8-1

Generation = 23, Population = 21.
5-43
---8
68--
7462
----
--+-
-5-+
-5--
+6-5
6-+-
4---
-9--

Generation = 24, Population = 17.
--5-
-3-9
----
-5-3
46-5
----
862-
--5-
--3-
-5--
5-3-
--9-

Generation = 25, Population = 22.
----
3-4-
----
-6-4
5--6
--++
9--+
2--5
--45
--+-
-+4+
49+1

Generation = 26, Population = 21.
5-5-
---9
6863
---5
----
-6++
+6--
35--
+6--
---9
----
5++-

Generation = 27, Population = 28.
----
-34+
7--4
76-6
-65-
---+
-7-+
465-
--45
65+-
5+4+
6-+1

Generation = 28, Population = 27.
-253
-4--
88--
--67
--66
---+
-82+
57-5
-656
-6+9
6+--
7+--

Generation = 29, Population = 21.
5--4
---+
9--4
7---
-6-7
-6+-
---+
68--
-767
-7+-
-+-+
--+-

Generation = 30, Population = 24.
-255
--4-
+865
8---
-76-
6-++
+---
7---
-878
68-9
6+--
----

Generation = 31, Population = 31.
5366
34-+
--76
96-7
58--
76-+
-82+
8-55
+---
-9++
--4+
7+--

Generation = 32, Population = 25.
-4--
----
-887
--68
696-
-7++
+-3+
98--
+---
-++-
6+--
8+-1

Generation = 33, Population = 27.
5-6-
--4+
+99-
967-
7+77
7---
+---
+9-5
+87-
6-++
-+-+
----

Generation = 34, Population = 24.
--7-
--5+
-++-
+-8-
8+88
--++
---+
+-5-
+9-8
7---
--4+
-+-1

Generation = 35, Population = 25.
-48-
--6+
-++-
+---
----
7--+
+-3+
+9-5
++7-
8-+-
6-5-
8-+2

Generation = 36, Population = 22.
55--
-47+
-+--
--8-
---8
87-+
-84+
+--6
++--
-+-+
----
9--3

Generation = 37, Population = 24.
6--6
-5-+
+++7
----
8+-9
9-+-
+--+
+9-7
--7-
-+--
6+--
-++-

Generation = 38, Population = 23.
--87
367-
++--
--8-
-+8-
-7-+
---+
-+58
++--
-+--
7+--
--+3

Generation = 39, Population = 23.
6--8
-7--
--+-
+698
8---
98++
----
----
++-8
8-+-
8--+
9-+4

Generation = 40, Population = 25.
--8-
---+
+++-
--+9
-+--
---+
+84+
++-8
-+7-
-+-+
-+5+
+-+-

Generation = 41, Population = 24.
-5--
377-
+--7
+6-+
8---
9--+
-9-+
-+-9
-+88
8--+
--6-
-++-

Generation = 42, Population = 22.
-6--
-88-
-+-8
+7-+
----
+-++
-+--
+-5-
---9
--++
8-7-
++-4

Generation = 43, Population = 29.
67--
399-
--+9
+--+
-+8-
-8++
+-4+
-+--
+-8+
8+--
9+8+
-++-

Generation = 44, Population = 13.
----
-+--
----
--++
---9
----
----
+-5-
+-9+
9-+-
--9+
----

Generation = 45, Population = 23.
-7--
3-9-
-++9
-7+-
---+
---+
+-4-
+-6-
--++
+--+
9+-+
--+4

Generation = 46, Population = 17.
----
--+-
---+
+--+
-+-+
+--+
+-5-
+---
-+--
+---
-+9-
+-+-

Generation = 47, Population = 20.
--8-
-+--
+--+
--+-
8---
+--+
----
+-6-
+-+-
-++-
9+-+
-++4

Generation = 48, Population = 22.
---8
---+
----
-7--
9+8+
+8+-
--5+
+-79
++-+
+---
++-+
----

Generation = 49, Population = 26.
--89
--++
-+-+
-8-+
--9+
-9++
--6-
++-+
++++
-+--
-+--
++-4

*** Life<FredkinCell> 4x11 ***

Generation = 0, Population = 17.
--0--00----
-00--00--00
-0--00--00-
0---0----0-

Generation = 3, Population = 22.
1-----12-2-
000-1--00--
-10-0-1----
011-3-0-012

Generation = 6, Population = 23.
-1-112-222-
131---20---
0--100212--
---140----5

Generation = 9, Population = 25.
--4213-22-2
-44---214-3
322-1-3---2
32-1---0-15

Generation = 12, Population = 15.
----26--2--
1-5-23-----
-2--23--52-
3---6----2-

Generation = 15, Population = 20.
-3--2--4--4
--51--4-433
-2315-53---
--21---12--

Generation = 18, Population = 25.
235328-4-55
--6-3--3-33
---2-3-49-5
-3--80-2-45

Generation = 21, Population = 23.
5383-95525-
3-914---83-
5-4-8-6--36
----9-3----

Generation = 24, Population = 17.
--+--+6----
-7+--68--45
-4--86--+4-
5---+----8-

Generation = 27, Population = 22.
6-----77-7-
37+-5--38--
-56-8-8----
543-+-4-497

Generation = 30, Population = 23.
-4-45+-757-
4++---+3---
7--48696+--
---3+0----+

Generation = 33, Population = 25.
--+55+-75-7
-++---+4+-8
+68-9-+---+
85-3---3-9+

Generation = 36, Population = 15.
----6+--5--
4-+-69-----
-6--+9--+6-
8---+----+-

Generation = 39, Population = 20.
-6--6--9--9
--+3--+-+78
-694+-+8---
--43---46--

*** Life<FredkinCell> 16x19 ***

Generation = 0, Population = 17.
-------------------
-0-0---------------
----0------0-------
-------------------
-------0-----------
----0--------------
-----0-------------
--0-----0----0-----
----0----00--------
-------------------
----------0--------
-------------------
---0---------------
-----0-----0-------
-------------------
-------------------

Generation = 3, Population = 115.
-0--------0-0------
0-0-0--0-0-0-0-----
-0-00-11--0-0-0----
0-01-000---0-0-----
-0--200-----00-----
---0-0---0000-0----
0-0110---1---0-0---
-0000-1-0-2---0-0--
0020021----21--0---
-01-000----00-0----
---11--0--10-------
-0-0-10-000--------
0-000200-----0-----
-002000-----0-0----
--0100-0-0-0-0-----
---00-0---0-0------

Generation = 6, Population = 123.
0-0-2-1-1--0-0-0---
-0-2--0100---0-----
0-1--21------1---0-
-1---1002-11---1---
1-0-5-0---0-11-0---
-0-310--010-00---0-
1-1141----0-0-0----
-0-0-140--2---10---
3-31-3-02---1-210--
1--03--11---1----0-
0----021-11-000-0--
01---210-01--------
--1----310210-0----
--12---202-------0-
----0--1000-0------
-0-0-0-----0-0-0---

Generation = 9, Population = 112.
------2-2-2--------
----3-1113---------
-02--22-0--0-2-----
--1-1--0--120--2---
-0--8-----03--0-0--
1---1-0---1-3--0---
-2-15-----01--1-00-
-0-0444--1-000-01--
-24204----22-1----1
121--------11----0-
---1------110----0-
--0---21--2-0-----0
-0-0120-2-3210-----
0--51--3--000-0----
-001--0-11-0-------
-0-0-0-0-00-0-0----

Generation = 12, Population = 163.
011-425130221200---
0-0-32--2---10-1---
23-023-41121-32-1--
0---42----1-----01-
10--92--03331--2-21
22--2-0-1--0---02--
-5-162-0-3011----10
200-475-22-3002--02
-3-315-23----444-0-
-51-4--3---410-----
-2---1520-2--2210--
131-23-4132--0-011-
-0-0---6---51--1-10
1-28-1-3-4---2---0-
-00-100--221--0---0
21-1-10--0-000---0-

Generation = 15, Population = 158.
012---6---2--31---0
1-14-5-3-5-31314-0-
56-1-43---52--33-1-
-342--0----4-----1-
----+210----2-05022
-5243-1-2-1---10-30
36---211--0111--1-0
5--15781-3---1----3
44-6-5--41-43---11-
-6-275--10-5-3-0311
-21-1-631--223-4120
4-23--25--3-0---21-
-3-342---1-82------
--2-12--2-11-2--21-
-1-3--12--212-020-0
5-0-2-12-3--131--0-

Generation = 18, Population = 123.
----------22------0
---4-6-3-----------
---1---6328-24-33-0
---3-4-2-12------11
-0--+---146522----3
-52--01--3-1-01-4--
--44--21-41-22----1
6-426-91--5-1442---
-----5----4-4-66123
37----0-20052610--2
--22436---4-332---0
-3--3-2-33-0-2---1-
--2---16-2-92------
-2--1--6-6-4-2-1---
--0-2-12-5---1-----
-1---1---3-1-----0-

Generation = 21, Population = 154.
-12-446-4---3-1-0-1
1-15-----5---------
-631-4----8-35----1
-3--541-4--6-32---4
--0---3---76-3--0-6
25-4-3--3-32--205-1
5--4-3-214233----3-
--5-79+15---4---23-
4--82-4264-44-97-33
-+32+5--5---3-1031-
--33-----5-2-324231
-34443-5--3--5212-1
132---1----+55-2--2
-24+4-173---05-2---
-10332223-2-4-040--
5--13---3--2---00-0

Generation = 24, Population = 106.
----7----0--44---01
-04-46--350--6---11
--4-35---------6--4
-6-487-----7-6-----
--11+-----7--------
-62--6---56552----4
--5-8----5-634-----
---4--+--6--5-6---5
-5--56----5-5-----4
5+63+-----1-47--6--
-36-------5-54-4---
-45--6---4--0----1-
--567-----5-8------
-3-+44----3--5---30
--13-2-5---------3-
-1-1323----32-2---1

*** Life<FredkinCell> 5x5 ***

Generation = 0, Population = 14.
-00--
-0-0-
00000
--00-
--000

Generation = 4, Population = 7.
----0
-----
----4
1-1-1
1-0--

Generation = 8, Population = 7.
----2
-----
----6
2-2-2
3-1--

Generation = 12, Population = 7.
----4
-----
----8
3-3-3
5-2--

Generation = 16, Population = 7.
----6
-----
----+
4-4-4
7-3--

Generation = 20, Population = 7.
----8
-----
----+
5-5-5
9-4--

Generation = 24, Population = 7.
----+
-----
----+
6-6-6
+-5--

Generation = 28, Population = 7.
----+
-----
----+
7-7-7
+-6--

Generation = 32, Population = 7.
----+
-----
----+
8-8-8
+-7--

Generation = 36, Population = 7.
----+
-----
----+
9-9-9
+-8--

Generation = 40, Population = 7.
----+
-----
----+
+-+-+
+-9--

Generation = 44, Population = 7.
----+
-----
----+
+-+-+
+-+--

*** Life<FredkinCell> 16x19 ***

Generation = 0, Population = 18.
-------0-----0-----
----------0--------
---------0---------
---------0---------
------------0------
----0--------------
-------------------
-------------------
-00----------------
-------------0-----
----------0--------
------------0-----0
-------------------
--0----------------
---------0--0------
-------0--------0--

Generation = 4, Population = 61.
---0-------01----0-
----0-0---1---0----
-----0-1-----------
-----1-------1-----
-01----11----1--0--
0-------1-0--0-----
---------10--------
---------0--0-----0
12---10-----1------
--1-1----0-------1-
------0--1--3-1----
-------01-----2-0--
-01----------------
0-----12-----1--0--
-----1--103-01--0--
--01-------1-------

Generation = 8, Population = 62.
-01--1---------2-0-
--2-2--------1----0
-2--------0-1----2-
-0-------1--1----11
----0----2--------2
----------2-0------
-------0-1--01-----
-------0--------0--
----02-3-10--0-----
-----1-0--1-----11-
--1---------4-----0
--4-2----12-3-----2
------------2------
----------0-3-----2
-0--1-----4------12
--------1----010---

Generation = 12, Population = 156.
32--031---0335----1
--6-2-1-131-310-130
--0---0134--3-211--
-2-----11-----4-12-
122-11-4142---2222-
--3-00134-2--42--24
-200-0--0101-5--2-0
-0012-----134----23
33-5222-12-1520--02
-1-2--0--4-2111--3-
22--3-22032-815--12
-----4-43-----510--
----10-0222--2--1--
-----134--2--31120-
0-3-123-6-5-22--4--
--4-------111----11

Generation = 16, Population = 54.
-4-----0----5--2---
--+-3--1----5---3--
-----5---4--44-----
--2--2------56----2
--2----------------
----------3-44-----
-20-------0--------
-------------2-----
-74---------54---42
-2--2----4---------
----5--------------
---------36--------
---------3--5------
---------44-6-----4
--5--4-1-05--------
1-----32--3----2---

Generation = 20, Population = 127.
-420----31--75--0--
--+13-23--3154----0
-65--6-34-4-84-124-
33----1-2----67--3-
2-6---47-----2-2-54
-25---259---5-6--2-
64--1----1--081----
--1--1----2-44---34
798--23-3---651----
24------44--------2
46---5-417---------
2----5-7--+---61---
-34--3--5---6---210
31--43-4384--5-1---
31576--2--67-32----
---52-5---4-2-1---4

Generation = 24, Population = 105.
----04-3-51-85---2-
-4+-4---37---523--0
--5--8-------8----2
-58------23------3-
----23----3--4-----
-----2-7-67-----345
-4--2-------1--1--1
3----212--4----0-5-
-+-----6-----9-2-64
35--353--45----535-
-------4--4--3-----
-2---6---3+--6---87
-36-2----4--6----21
-23-4----+4--7---2-
-3-----------5-5-25
217-2-5545---22---5

*** Life<FredkinCell> 13x9 ***

Generation = 0, Population = 17.
----0----
----0----
---------
--0---0--
-0--00---
--------0
---------
---0-----
0--------
0---0----
0--------
----0--0-
--0-----0

Generation = 2, Population = 37.
--0-2-0--
---------
-0---0---
0---1----
--0---00-
--00----0
00--00---
10--10--0
--0------
0--10-00-
--------0
1-1-011--
--0-1-0--

Generation = 4, Population = 36.
01--20--0
0---2----
----0----
0-11--1-0
----22--0
1---0-1--
0--------
--0-1-1--
-0---1--1
0-0-2----
----0---0
1---0---1
1---3----

Generation = 6, Population = 45.
-3---2-1-
--01----1
001---1--
-03--0---
0-202--22
---2--1--
211-0----
2-------1
1---1-01-
0-0-4---0
101-01---
--2-0---3
------1-1

Generation = 8, Population = 44.
1-0---0--
2-0-3-1-1
22--10---
1-5-1-112
-1----1-4
2-1-2----
--3-0---1
---01----
1---3-2-2
0-2-----0
1-----1-1
---------
202--1--3

*** Life<FredkinCell> 4x11 ***

Generation = 0, Population = 12.
--00-------
-0----0--0-
00--0------
--0-0---00-

Generation = 3, Population = 22.
-0----00-0-
011-00----0
301--020000
-1---0--3--

Generation = 6, Population = 21.
-13----3-1-
-21--1-20-3
---013----0
-21--11261-

Generation = 9, Population = 20.
-2-21----1-
-3-1--1-10-
-0--1-3---3
-3-022-27-1

Generation = 12, Population = 18.
15422-1--42
------4----
3--22--0-1-
2---5----24

Generation = 15, Population = 26.
2553--2-053
-3--22--3--
404--551126
--2-842--3-

Generation = 18, Population = 23.
38643-3--54
1-1-537332-
---628----9
---295-----

Generation = 21, Population = 16.
--95--4-0--
--2-8--3---
8--6---3-4-
-63--62---5

Generation = 24, Population = 12.
--+6-------
-5----8--4-
93--2------
--4-+---+5-

Generation = 27, Population = 22.
-9----45-6-
364-84----6
+35--+85449
-9---8--+--

Generation = 30, Population = 21.
-++----8-7-
-74--5-63-9
---63+----9
-+5--956+6-

Generation = 33, Population = 20.
-+-84----7-
-8-3--9-44-
-3--3-9---+
-+-2++-6+-6

Generation = 36, Population = 18.
4++85-5--+8
------+----
+--84--5-5-
6---+----79

Generation = 39, Population = 26.
5++9--6-0+9
-8--+6--6--
+38--++656+
--6-++6--8-

*** Life<FredkinCell> 13x10 ***

Generation = 0, Population = 17.
----------
-----0----
----------
--0-------
-----0000-
--------0-
---------0
-000------
0------0--
----------
---0------
-0----0--0
----------

Generation = 4, Population = 51.
-----0010-
-1---1--00
---------1
0100--1---
11103--00-
----01--1-
---0-0-0--
2-1--2-0-0
--13120011
--------1-
-------2-0
-1-1--11-2
0--2---1--

*** Life<FredkinCell> 18x11 ***

Generation = 0, Population = 18.
---0------0
--------0--
--------0--
0--------0-
----0------
-0---------
-0--0------
-----------
-------0---
--0------00
-----0-----
-----------
-----0-----
-----------
-----------
-----0-----
----0------
-----------

Generation = 5, Population = 93.
-0-01-11--0
010-201----
020-10--100
1---1101---
--0---02--1
1-2-0-0----
-----0--0-0
2--000--0-1
-102--0-0--
110011024-2
00-0-0---20
-0--0-00---
0--0--0--2-
---001-00-1
-00-1-0---0
--0-0-----0
---01-00---
0----10-0--

*** Life<FredkinCell> 4x1 ***

Generation = 0, Population = 4.
0
0
0
0

*** Life<FredkinCell> 12x11 ***

Generation = 0, Population = 16.
-------0---
-------0---
-----------
0----------
--0--0-----
------0----
----0------
---0-------
-0-----00--
--0--------
---0-00----
----0------

Generation = 4, Population = 45.
--00-2-----
---0--11---
----1--3---
--300------
1-----0-00-
-------1--0
0--1-13-0--
1---0--0---
-1100-----2
0---1------
-0103410-00
0-00----0--

Generation = 8, Population = 50.
-3--0---1--
--2---22---
--21--0----
2---0-2-1--
-0--1----10
1---2--12--
--12-350--1
--20-------
12---10425-
---21--3--0
31-45---12-
0-0---2---1

Generation = 12, Population = 59.
2-31-33-12-
---31---1-1
43-224--3--
3-90----2--
-1--22-1---
1---6-2-6--
---41-50--2
3-2-6-113-3
-4-12----73
3-222---2-0
----554----
2-1----30--

Generation = 16, Population = 46.
-4-1-55-3--
---51--3---
----6------
----4---3--
-3463-3--23
--2-----6--
-53----01-4
-------2---
3---331--8-
----4-5---4
4224-6-357-
2-1----5--2

Generation = 20, Population = 68.
-5-32663--1
2-6-3------
4-44-7257-2
6---6--45-6
6-665--15-4
4--36--2---
--3----1-46
3-609--36-7
4-22-53-5+-
--4---953--
--6--884-8-
6-33--471-2

*** Life<FredkinCell> 15x2 ***

Generation = 0, Population = 14.
--
--
00
0-
-0
0-
0-
--
0-
0-
-0
00
-0
00
--

Generation = 2, Population = 10.
00
1-
0-
--
--
--
-1
--
-1
-0
1-
2-
--
--
-1

Generation = 4, Population = 17.
0-
1-
-2
2-
00
--
--
-0
2-
12
31
42
10
1-
--

Generation = 6, Population = 13.
-2
--
--
--
0-
21
-2
0-
-3
-2
5-
6-
--
-0
11

Generation = 8, Population = 16.
--
--
12
40
21
-1
2-
--
3-
-4
72
8-
-1
22
--

Generation = 10, Population = 16.
12
31
--
6-
2-
3-
23
--
34
36
--
--
3-
-2
-2

Generation = 12, Population = 15.
--
-1
-3
82
-3
--
2-
-0
--
36
-3
+-
32
-4
3-

Generation = 14, Population = 15.
-3
4-
--
+-
2-
4-
24
0-
44
--
8-
--
--
46
33

Generation = 16, Population = 14.
--
--
13
+-
-5
4-
4-
--
4-
4-
-5
+3
-3
46
--

Generation = 18, Population = 10.
13
5-
1-
--
--
--
-6
--
-6
-6
9-
+-
--
--
-4

Generation = 20, Population = 17.
1-
5-
-5
+-
25
--
--
-0
6-
58
+6
+5
43
5-
--

Generation = 22, Population = 13.
-5
--
--
--
2-
63
-7
0-
-8
-8
+-
+-
--
-6
44

Generation = 24, Population = 16.
--
--
25
+3
46
-3
6-
--
7-
-+
+7
+-
-4
68
--

Generation = 26, Population = 16.
25
73
--
+-
4-
7-
68
--
79
7+
--
--
6-
-8
-5

Generation = 28, Population = 15.
--
-3
-6
+5
-8
--
6-
-0
--
7+
-8
+-
65
-+
6-

Generation = 30, Population = 15.
-6
8-
--
+-
4-
8-
69
0-
89
--
+-
--
--
8+
66

Generation = 32, Population = 14.
--
--
26
+-
-+
8-
8-
--
8-
8-
-+
+6
-6
8+
--

Generation = 34, Population = 10.
26
9-
2-
--
--
--
-+
--
-+
-+
+-
+-
--
--
-7

Generation = 36, Population = 17.
2-
9-
-8
+-
4+
--
--
-0
+-
9+
++
+8
76
9-
--

Generation = 38, Population = 13.
-8
--
--
--
4-
+5
-+
0-
-+
-+
+-
+-
--
-+
77

Generation = 40, Population = 16.
--
--
38
+6
6+
-5
+-
--
+-
-+
++
+-
-7
++
--

Generation = 42, Population = 16.
38
+5
--
+-
6-
+-
++
--
++
++
--
--
9-
-+
-8

Generation = 44, Population = 15.
--
-5
-9
+8
-+
--
+-
-0
--
++
-+
+-
98
-+
9-

*** Life<FredkinCell> 15x7 ***

Generation = 0, Population = 18.
00-----
-0-----
0------
0------
----0-0
0------
-0-----
-------
-0---0-
---0---
-------
-0--0--
-------
-0-----
-00---0

Generation = 3, Population = 51.
----0--
2101--0
---0---
-210--0
111--0-
001--00
--0---1
-001-00
--0000-
---02-0
02---1-
01-0--1
01--001
----100
21-----

Generation = 6, Population = 61.
-03-10-
3--10--
30----0
-3-0-01
11-121-
---0011
0----0-
--1-2-1
00--300
2-00310
0-0-012
-420104
-1-0132
1--0--1
52--2--

Generation = 9, Population = 44.
2--01-1
-10--10
-0--3--
-421201
4---3--
--3---2
---0-1-
-------
---0-1-
--0---1
3---1--
-531205
-2--4--
-20--12
5--12-1

*** Life<FredkinCell> 7x6 ***

Generation = 0, Population = 12.
---0-0
--00--
---0--
000---
-----0
00----
0-----

Generation = 5, Population = 24.
01-2-1
------
1203--
31301-
3--00-
1---21
10112-

Generation = 10, Population = 17.
-----1
12--5-
-----2
5-6111
-2--3-
-3---6
-01-5-

*** Life<FredkinCell> 2x4 ***

Generation = 0, Population = 7.
00-0
0000

Generation = 1, Population = 3.
--01
-1--

Generation = 2, Population = 4.
--12
0--0

Generation = 3, Population = 5.
002-
-1-1

Generation = 4, Population = 5.
113-
-20-

Generation = 5, Population = 4.
22-2
---1

Generation = 6, Population = 7.
33-3
0202

Generation = 7, Population = 3.
--34
-3--

Generation = 8, Population = 4.
--45
0--2

Generation = 9, Population = 5.
335-
-3-3

Generation = 10, Population = 5.
446-
-40-

Generation = 11, Population = 4.
55-5
---3

Generation = 12, Population = 7.
66-6
0404

Generation = 13, Population = 3.
--67
-5--

Generation = 14, Population = 4.
--78
0--4

Generation = 15, Population = 5.
668-
-5-5

Generation = 16, Population = 5.
779-
-60-

Generation = 17, Population = 4.
88-8
---5

Generation = 18, Population = 7.
99-9
0606

Generation = 19, Population = 3.
--9+
-7--

Generation = 20, Population = 4.
--++
0--6

Generation = 21, Population = 5.
99+-
-7-7

Generation = 22, Population = 5.
+++-
-80-

Generation = 23, Population = 4.
++-+
---7

Generation = 24, Population = 7.
++-+
0808

Generation = 25, Population = 3.
--++
-9--

Generation = 26, Population = 4.
--++
0--8

Generation = 27, Population = 5.
+++-
-9-9

Generation = 28, Population = 5.
+++-
-+0-

Generation = 29, Population = 4.
++-+
---9

Generation = 30, Population = 7.
++-+
0+0+

Generation = 31, Population = 3.
--++
-+--

Generation = 32, Population = 4.
--++
0--+

Generation = 33, Population = 5.
+++-
-+-+

Generation = 34, Population = 5.
+++-
-+0-

Generation = 35, Population = 4.
++-+
---+

Generation = 36, Population = 7.
++-+
0+0+

Generation = 37, Population = 3.
--++
-+--

Generation = 38, Population = 4.
--++
0--+

Generation = 39, Population = 5.
+++-
-+-+

Generation = 40, Population = 5.
+++-
-+0-

Generation = 41, Population = 4.
++-+
---+

*** Life<FredkinCell> 13x7 ***

Generation = 0, Population = 17.
----0--
-0--0--
--000--
-------
------0
0----0-
-00----
-----00
-------
-------
-------
--0-0--
0-0----

Generation = 5, Population = 42.
--1--01
00-----
033-1--
-1---11
-121--1
1----3-
132---2
1100-32
11-0-0-
--0-1--
-1--0-0
--5----
--3-402

Generation = 10, Population = 48.
03353-2
1--02--
1350--2
-20--42
-12-42-
--31--1
4--30-3
4-3-3-2
1-12--0
---141-
3----0-
-1-1--0
34--5--

Generation = 15, Population = 46.
14-+4--
-03122-
---0134
033-442
3--56-4
2041-44
6---0--
4-8----
2--2442
4---5-1
------1
3----2-
-5--6--

Generation = 20, Population = 38.
-55-6-4
3----2-
----4--
-36-6-4
--36735
3-5----
7-----7
-4----2
2--7-73
--2-751
4--15--
-----20
78-6---

Generation = 25, Population = 43.
28-+---
3----2-
2----36
1-81---
-5---46
-------
-44-0--
--825-2
55--77-
+-3-8+-
-44-6--
34-2651
9+-772-

Generation = 30, Population = 51.
397--56
5342-3-
47+3867
4-+----
46--9-7
50-24-5
-57-31+
--82-7-
-6-9--6
--8-++3
+--4--4
-------
-+88+4-

Generation = 35, Population = 43.
5-++--9
-342-6-
-9--+78
5---+--
-8-++6+
-------
+6-7---
-79----
----+--
+6+3++5
+-4-727
3-+----
++-8-5-

Generation = 40, Population = 46.
6--+9-+
+6--9+-
6+--+--
--+-+--
-85-+--
93--86-
--876-+
--+-++5
975++-8
-6--+--
+8--8-7
--+-986
--88---

Generation = 45, Population = 42.
9++++7+
-6+-++-
--+4+++
--+----
-8-++-+
-3---+-
-----4-
68-2-+7
-8-+-+9
+6-----
+--59--
6--4---
-+-+---

*** Life<FredkinCell> 17x6 ***

Generation = 0, Population = 15.
----00
0-0---
------
---00-
------
-00---
------
--0-0-
0----0
-----0
------
------
---0--
----0-
------
------
------

Generation = 4, Population = 30.
01-34-
-10-1-
----30
0-1--3
0---1-
-12---
------
---0--
-11-0-
--001-
------
--0-2-
1-----
0---01
------
------
---0--

Generation = 8, Population = 34.
-11--2
-2---0
------
201-2-
---0--
2--0-0
----01
2---3-
-3---3
200---
------
---24-
-0-1--
20--2-
---2--
--0-2-
0----2

Generation = 12, Population = 46.
2----3
14---2
-43-3-
622-45
--1--2
23-21-
21-10-
-4-3--
-5-0-3
4-22--
---213
--1-86
4-----
-----5
4-----
--002-
--310-

Generation = 16, Population = 37.
--36-5
--3---
---1--
-33--6
------
2--2-2
2--2-4
3-----
3-30-5
-134--
1----3
--12--
-4---4
502---
----11
---14-
----13

Generation = 20, Population = 53.
36---5
--73-4
0-4--3
---6-6
3-----
--8-24
352-1-
-51347
5-305-
5-54-4
212---
---6+8
4-4-34
7--535
-3-6--
3-1--1
1--5--

Generation = 24, Population = 39.
---88-
18--24
08-2-3
--6-6-
-3-2-6
34-43-
--6---
---7--
----5-
-5--45
-1-2-5
-----9
-5-37-
-1----
--47--
-5----
33-6--

Generation = 28, Population = 15.
----+8
1-8---
------
---88-
------
-6+---
------
--2-5-
6----6
-----6
------
------
---5--
----5-
------
------
------

*** Life<FredkinCell> 12x8 ***

Generation = 0, Population = 17.
00------
-0-00---
---00---
--------
--------
0--00---
-0--0---
------0-
-----0--
-------0
0------0
--------

Generation = 4, Population = 36.
-011-0--
-----1-1
----1--1
------1-
10---1--
2001----
-0-011-0
--0---0-
-2-----0
0---03--
0001-1-2
------13

Generation = 8, Population = 36.
-1--2-10
0-0-----
3-2123-3
--------
---40---
-00--40-
-22-25--
3-0----1
0--0-1--
---02-2-
---3--1-
1--01---

Generation = 12, Population = 47.
-3-4-232
-22-04--
-1-24--3
3-1----1
-1-8113-
---10410
0-6-4---
--2--21-
-312----
-2-436-3
-2-343-5
---1--4-

Generation = 16, Population = 45.
--34-4-4
-342-5--
--2-652-
3--31---
4------2
31---832
--+-593-
-5-1--5-
3--25--5
4--858-4
-42--3-6
-2-32---

Generation = 20, Population = 50.
-5453--4
--42-7-3
-3457-4-
47371-33
4--9----
4533--5-
--+-7-7-
6-3--572
--3371--
-42---55
25-76---
----4-6-

Generation = 24, Population = 46.
7-877--6
---4---5
--45-+8-
6947243-
-12-46--
5--43-72
2-----9-
--3-35--
73-3--0-
----9---
---98559
-62--26-

*** Life<FredkinCell> 7x13 ***

Generation = 0, Population = 17.
0----00--0---
-------0-----
-0-----00----
----------0--
0-0--0---0---
--------0--0-
--0--------0-

Generation = 5, Population = 48.
---0-32----0-
-0010-----0-0
1--31-2---102
0-00-022-0--3
0-02400-1-0-0
--001-001--1-
0110-31--2---

Generation = 10, Population = 37.
2-0-15-3--2--
--0-----23---
--542---1411-
---31-35---3-
2-32-1---21-2
01-------0--0
-140---2----0

Generation = 15, Population = 50.
552337----2--
13--132-4-412
---7-440----5
40-61----02-4
-0----12332-4
--32402-1-2-1
---5--33025-5

*** Life<FredkinCell> 18x1 ***

Generation = 0, Population = 11.
-
0
-
-
-
0
0
0
-
0
0
-
0
0
0
0
0
-

Generation = 3, Population = 11.
-
-
-
0
2
3
0
-
0
3
3
0
1
-
-
1
-
2

*** Life<FredkinCell> 3x8 ***

Generation = 0, Population = 13.
-----0-0
00-00---
0000-000

Generation = 4, Population = 13.
-3-0-0-1
201-11-1
2--21---

Generation = 8, Population = 10.
---1----
--223-23
3-0-3--4

Generation = 12, Population = 10.
-------6
--44-3-3
--26441-

Generation = 16, Population = 9.
---6-3--
44-4-55-
-23-----

Generation = 20, Population = 8.
-5------
----556-
44---63-

Generation = 24, Population = 11.
-6---7--
766---87
----5656

Generation = 28, Population = 13.
-----8-8
88-88---
68+8-868

*** Life<FredkinCell> 7x8 ***

Generation = 0, Population = 14.
0-------
-00-0---
---0---0
0-------
0-0----0
-------0
---000--

Generation = 5, Population = 25.
-0-1--00
-1-23---
-1-0---2
312-1000
--------
2--1-20-
0-2--1-0

Generation = 10, Population = 28.
-2-3005-
1--4-02-
----0214
-33-4001
----0-1-
---1--2-
3---4420

Generation = 15, Population = 31.
22-40--4
-247725-
0-2-----
--6-5103
-4--2--2
5-51-4--
-335945-

Generation = 20, Population = 28.
52---25-
5-78-48-
1----315
5-9-5-0-
2-------
507-0-4-
66-8+6--

Generation = 25, Population = 24.
5-------
--8-97+3
--23-4--
-49---34
-56--0-5
7-94---2
---+--95

Generation = 30, Population = 27.
--7--4-6
+---+-+6
1--8---7
75--5--4
25-1---5
--+4-5--
88-++9+-

Generation = 35, Population = 18.
-6---5--
------+8
--58-83-
+7--8---
35------
7---6---
+----++-

Generation = 40, Population = 19.
--9---9-
++++-+-+
-----9--
--+---5-
55---3--
-3---9--
-----+++

*** Life<FredkinCell> 7x4 ***

Generation = 0, Population = 13.
-00-
---0
-000
-00-
-0--
---0
000-

Generation = 1, Population = 15.
011-
--01
0-1-
01--
01-0
0---
1-1-

Generation = 2, Population = 13.
1---
--12
102-
1--0
1---
--00
2--0

Generation = 3, Population = 12.
-110
---3
---0
----
210-
-01-
-0-1

*** Life<FredkinCell> 15x12 ***

Generation = 0, Population = 17.
-----0------
------------
------------
------0-----
----00------
0-----------
---------0--
------------
----00------
----00----0-
------------
------------
----0--0--0-
------0-----
----0----0--

Generation = 2, Population = 51.
---0-0-0----
------0-----
----0-------
0---1---0---
--01--00-0--
0-0---0-----
-------0---0
0---11----0-
--01--10-0--
--01--100---
-----1-0--1-
----100---1-
--0-010-1---
----0---0---
--0---1--010

Generation = 4, Population = 51.
-0--00---0--
0-----------
-----1---0--
--1-------0-
01--1---10--
--2--1----0-
-----1-----0
------0-----
11---0-0100-
-1------201-
----0-------
------------
0--0-30-3110
--0-200-----
0---11-10-12

Generation = 6, Population = 89.
-01-2-1----0
0---------0-
1--0-1--1--0
--1-31--1-0-
2--3---2-21-
1-210-201-0-
---013---000
-10-23---1--
3-1-1-2-320-
---1---02-11
-101---1---0
-00-211-113-
-1002-0051-2
0-01--001---
0---112-2134

Generation = 8, Population = 50.
-2--21---0-0
2---11----0-
----23------
0-----1---2-
-31-2--4--31
--------3---
-1--13-1-0--
------------
-23-31---4-0
-3---------1
----0--3--3-
------1-----
----242--1--
----30------
-11-31-3-1--

Generation = 10, Population = 76.
-23---2----0
---1---00-0-
---1-30--00-
--2--1--2-4-
3534220424-3
2-----------
--1---01--21
-2------0--1
425-533---0-
---2--1--2-3
-2---3--11-1
-1---1--1--0
-1-2262-6122
--12---2----
23--31-3-1-5

Generation = 12, Population = 81.
145--2--1-0-
-10--31--1--
20-----032-1
----4-2-----
-554-4-44643
40---3----10
1--1-5-3014-
0---------1-
-47--3--440-
-4--0--124--
1-22--0-1-31
--2-------4-
131--8-2612-
2---51--20-0
---0-3-52-3-

Generation = 14, Population = 99.
----342-11-1
3---3-3-2--1
--0--42--211
1---4---3060
3--6361-4--3
--3-1-413130
112---15016-
--1-33-1-213
5-9-63-1460-
0--2-0-3-425
142--504-233
-1--22-11--0
1---2--4832-
4-32-----0--
4-3---272-3-

Generation = 16, Population = 28.
---1-----3--
------------
------------
--4-----3---
---83----76-
--------3-5-
-----6------
------------
---26----62-
0--2-----62-
------------
------------
33-----4--4-
--3-----4---
----45----3-

Generation = 18, Population = 73.
-5-1-4-0-3-2
--0-----3---
----2-----2-
2---6-2-3---
-55---155--4
--4---5---7-
---1---5----
1--1----04--
-4+---325--2
061--0-33--6
25-40--5-3--
1-20----125-
5-123---954-
5---7-1---0-
5451674-4---

Generation = 20, Population = 65.
---134-0-302
--------3-2-
---3-6---3--
2---8-4-----
4---57355--4
4--12-7--3--
-1-------2--
--1-----0---
-4-2745-7634
----0035---8
----2-----4-
------------
-41-3-4--763
--347-3-412-
------4742--

Generation = 22, Population = 86.
-5633-202-24
3---5---3-4-
40---62-3322
---0-----27-
47--7--57-74
-06--4-2---1
21-------481
---24412-625
--+--6------
---32257---+
---5-61-----
--31-2-21352
6-145---9-8-
503--2-4--20
-46--84--2--

Generation = 24, Population = 70.
-7--35-0-426
5--2----33--
---43----52-
3-5-9-----9-
6--9--4---74
6-----8-----
-1-336---4+3
------------
-5--9663-744
-6-3---9---+
35-----7--5-
--3-----3---
--367+--+88-
---47----12-
-4-2886--236

Generation = 26, Population = 84.
-773--303--8
-2--7431---2
4-043---35-4
---0+----2--
6-5-7----9--
--------3-7-
3-353-152---
13-4--24---5
7-+3--63-9-4
-613----4--+
55---729-5-4
22----23-3-3
-63---65++8-
-2---444---1
----+8--62-8

*** Life<FredkinCell> 2x16 ***

Generation = 0, Population = 14.
-00---0---0--0--
00-000-00--0--0-

Generation = 2, Population = 19.
0020--0---0010-0
---202--2-00100-

Generation = 4, Population = 15.
2----00--1---010
-10-0--2-00-3--0

Generation = 6, Population = 19.
--30022-13--2-10
13-2-30-2--1-11-

Generation = 8, Population = 16.
30--0-2--5-1-2--
--241--2-02-4-11

Generation = 10, Population = 14.
-2-1---02--1---2
34-4--0-3--243--

Generation = 12, Population = 12.
------222-13----
--3-24---1--4-33

Generation = 14, Population = 15.
----23-24--522--
4--5-60--132-4--

Generation = 16, Population = 15.
--424---6---2-22
-54-4-2---325--4

Generation = 18, Population = 13.
43-2-4--6----2--
57-66----3-2--4-

Generation = 20, Population = 16.
--44--446-26-2-2
----8622----654-

Generation = 22, Population = 17.
4466---68---44-2
--56----4352-7-5

Generation = 24, Population = 22.
6---5-5886-76-34
6756+632---489-7

Generation = 26, Population = 14.
-----55--8------
6-56+6--4-6-++69

Generation = 28, Population = 15.
---7657-88-7----
677----3--64+--+

Generation = 30, Population = 14.
-57---9---4--4--
87-6+7-34--6--7-

Generation = 32, Population = 19.
7598--9---4874-4
---8+9--6-76++7-

Generation = 34, Population = 15.
9----59--+---454
-88-+--5-37-+--+

Generation = 36, Population = 19.
--+867+-++--8-54
9+-8-+4-6--7-+8-

Generation = 38, Population = 16.
+5--6-+--+-9-6--
--+++--5-39-+-8+

Generation = 40, Population = 14.
-7-9---9+--9---6
++-+--4-7--8++--

Generation = 42, Population = 12.
------+++-5+----
--+-++---4--+-++

Generation = 44, Population = 15.
----88-++--+86--
+--+-+4--4+8-+--

Generation = 46, Population = 15.
--+++---+---8-66
-++-+-6---+8+--+
