*** Life<ConwayCell> 6x9 ***

Generation = 0, Population = 8.
.........
.....*...
........*
*....**..
.......*.
*....*...

Generation = 4, Population = 5.
.........
......**.
.....*.*.
.......*.
.........
.........

*** Life<ConwayCell> 6x8 ***

Generation = 0, Population = 11.
.*......
.*.**...
*.....*.
.*..*...
.*......
..*....*

*** Life<ConwayCell> 6x8 ***

Generation = 0, Population = 9.
.*......
........
*..**...
.*......
*..*..**
........

*** Life<ConwayCell> 6x5 ***

Generation = 0, Population = 12.
...*.
*.***
..*..
..**.
.*.*.
*.*..

Generation = 4, Population = 11.
.*...
*.**.
.**.*
.....
....*
*.**.

Generation = 8, Population = 16.
.**..
*..**
**.**
.*...
..***
..***

*** Life<ConwayCell> 7x7 ***

Generation = 0, Population = 17.
..**.*.
..*....
..**...
.*...*.
******.
......*
....*.*

*** Life<ConwayCell> 8x7 ***

Generation = 0, Population = 12.
...**..
......*
*......
*......
.*.....
.*..*.*
...*...
.*....*

Generation = 1, Population = 7.
.......
.......
.......
**.....
**.....
..*....
..*..*.
.......

Generation = 2, Population = 5.
.......
.......
.......
**.....
*.*....
..*....
.......
.......

Generation = 3, Population = 5.
.......
.......
.......
**.....
*.*....
.*.....
.......
.......

Generation = 4, Population = 5.
.......
.......
.......
**.....
*.*....
.*.....
.......
.......

Generation = 5, Population = 5.
.......
.......
.......
**.....
*.*....
.*.....
.......
.......

*** Life<ConwayCell> 9x8 ***

Generation = 0, Population = 13.
........
*...*...
.***....
..*.....
.....*..
*.*.....
.......*
....*.**
........

Generation = 5, Population = 12.
.***....
.**.*...
...**...
........
........
........
......**
......**
........

*** Life<ConwayCell> 9x7 ***

Generation = 0, Population = 13.
...*...
.......
..*.*..
..*..*.
*.*....
*.*..*.
.*.....
...*...
*......

*** Life<ConwayCell> 10x8 ***

Generation = 0, Population = 8.
.......*
........
......*.
.......*
*.......
.......*
........
.......*
......*.
...*....

*** Life<ConwayCell> 5x6 ***

Generation = 0, Population = 12.
.*....
..*..*
**.**.
*..***
*.....

*** Life<ConwayCell> 10x8 ***

Generation = 0, Population = 16.
.*..**..
........
..*....*
..*....*
*.......
**......
.*.*....
.....*..
...*..**
........

Generation = 1, Population = 12.
........
........
........
.*......
*.......
***.....
***.....
..*.*.*.
......*.
........

Generation = 2, Population = 8.
........
........
........
........
*.*.....
..*.....
*.......
..**.*..
.....*..
........

*** Life<ConwayCell> 10x10 ***

Generation = 0, Population = 12.
..........
......**..
........*.
*.........
*....*....
..........
.**...*...
..........
....*....*
.....*....

*** Life<ConwayCell> 5x10 ***

Generation = 0, Population = 15.
**.....*..
...**.*...
....*...*.
.......***
**...*...*

Generation = 6, Population = 13.
....*****.
...*.*....
...*.***..
.......**.
..........

*** Life<ConwayCell> 6x10 ***

Generation = 0, Population = 13.
..*.*.....
.....*....
.......***
.**..*...*
..*....*..
...*......

Generation = 5, Population = 12.
.......*.*
......**.*
......*..*
......*.*.
......***.
..........

*** Life<ConwayCell> 10x7 ***

Generation = 0, Population = 8.
.......
*..*...
*......
......*
.......
.*.....
.......
...**..
.......
....*..

*** Life<ConwayCell> 10x10 ***

Generation = 0, Population = 8.
.....*....
..........
.......*..
...*......
..........
......*...
..........
..*.*.....
.*........
.....*....

*** Life<ConwayCell> 10x5 ***

Generation = 0, Population = 17.
.**.*
.....
....*
.**..
..*.*
.*...
**.**
*....
..*..
**...

*** Life<ConwayCell> 9x7 ***

Generation = 0, Population = 11.
...*...
*......
...*...
....*.*
*......
..*....
.*....*
..*..*.
.......

*** Life<ConwayCell> 8x10 ***

Generation = 0, Population = 10.
..........
*.........
.......*..
.........*
..**......
...**....*
..........
..*..*....

*** Life<ConwayCell> 5x9 ***

Generation = 0, Population = 5.
.......*.
..*......
..*......
.........
......**.

*** Life<ConwayCell> 8x10 ***

Generation = 0, Population = 15.
**.**.....
......*.**
.....*....
..........
......*...
...*......
....*....*
.*..*.*...

*** Life<ConwayCell> 10x5 ***

Generation = 0, Population = 5.
.....
.*...
.....
...*.
.....
....*
...*.
.....
.*...
.....

*** Life<ConwayCell> 9x5 ***

Generation = 0, Population = 13.
*...*
.**..
*.*..
.*.*.
*...*
.....
...*.
*..*.
.....

*** Life<ConwayCell> 9x9 ***

Generation = 0, Population = 9.
.*.*..*..
.........
.....*...
.........
......*..
.....*...
......*..
...*.....
.......*.

Generation = 1, Population = 2.
.........
.........
.........
.........
.........
.....**..
.........
.........
.........

Generation = 2, Population = 0.
.........
.........
.........
.........
.........
.........
.........
.........
.........

Generation = 3, Population = 0.
.........
.........
.........
.........
.........
.........
.........
.........
.........

Generation = 4, Population = 0.
.........
.........
.........
.........
.........
.........
.........
.........
.........

*** Life<ConwayCell> 8x7 ***

Generation = 0, Population = 11.
.*.....
.......
...*..*
.***...
*......
......*
...*...
.**....

Generation = 3, Population = 8.
.......
.......
..*....
...**..
**.*...
.**....
.......
.......

Generation = 6, Population = 15.
.......
...*...
.***...
.**.*..
*.**...
.***...
.**....
.......
