27

22 82
5
7 41
15 5
4 43
7 57
10 61
919 136

23 117
14
9 47
22 44
16 4
22 13
3 22
14 46
16 109
22 111
3 15
1 45
20 84
17 86
8 39
0 4
73 119

116 33
3
94 26
58 16
57 4
44 107

89 8
5
67 4
66 1
33 4
29 1
59 4
105 125

59 80
21
30 71
1 38
48 56
30 61
47 64
55 51
25 44
42 72
5 14
38 70
8 2
6 17
20 34
23 8
26 47
11 8
16 34
54 14
39 71
55 10
19 58
290 172

12 86
10
7 78
10 9
10 24
2 27
0 28
0 30
5 78
3 52
11 2
5 19
559 64

58 55
10
18 17
39 54
0 37
30 24
20 26
6 27
36 41
41 29
47 24
20 6
799 64

46 3
10
23 0
32 2
0 1
9 2
16 1
35 0
28 2
41 1
17 2
12 2
209 93

19 88
11
1 0
7 30
13 75
7 63
9 0
11 58
11 76
2 53
5 80
15 29
0 2
243 104

49 110
26
8 35
39 12
45 7
24 6
1 23
46 68
24 94
47 61
18 38
35 45
43 17
25 90
42 48
38 62
33 53
37 47
14 48
3 0
10 103
32 35
26 46
12 41
7 107
40 109
9 101
29 5
69 76

114 111
16
111 75
68 82
96 107
76 91
85 80
28 62
2 80
10 9
13 93
58 103
52 103
38 29
107 11
55 97
74 78
27 71
862 148

117 79
1
42 30
925 193

92 63
16
68 5
89 47
58 4
70 50
63 20
86 29
5 58
46 22
60 54
5 48
61 5
73 19
84 1
82 39
30 51
45 14
63 160

48 96
6
32 42
12 70
47 51
25 75
19 3
42 60
786 44

55 86
3
40 74
7 15
51 53
639 94

74 73
26
27 69
44 26
35 36
48 40
41 7
2 35
6 45
4 34
72 39
25 58
14 8
18 62
44 18
37 33
34 67
5 33
21 43
29 24
1 18
2 65
50 45
19 33
40 30
15 65
36 45
68 4
901 84

91 69
19
29 8
15 23
88 54
3 46
62 19
6 68
32 8
10 18
42 58
71 23
69 7
14 46
55 20
72 38
34 14
37 28
82 13
1 58
1 10
293 159

17 115
6
0 46
9 97
11 68
3 90
16 8
6 48
298 5

55 44
3
11 23
40 8
25 39
482 30

15 45
14
5 4
3 36
1 14
10 41
9 23
1 12
7 43
13 33
1 29
4 24
10 39
12 39
11 1
1 28
667 158

80 77
19
69 35
55 58
23 2
13 34
69 75
48 11
17 4
6 19
0 21
23 4
28 56
17 26
52 32
48 8
41 37
63 52
22 27
7 51
70 64
160 142

105 92
22
82 68
92 44
9 88
9 29
75 91
87 81
89 12
96 86
93 90
36 62
4 77
62 1
1 80
102 62
74 11
54 24
12 28
83 10
76 89
56 43
90 59
31 22
921 61

27 33
23
23 10
26 10
24 6
26 0
6 21
6 31
16 31
7 23
10 28
5 18
0 14
26 20
17 14
3 5
25 4
4 2
25 14
10 1
15 15
14 19
24 25
20 20
9 14
174 165

58 39
13
24 32
29 32
31 4
4 9
29 16
17 1
16 36
21 2
55 2
39 26
3 1
19 31
1 12
612 182

17 49
6
1 22
7 21
4 44
13 12
15 48
0 46
61 137

20 31
27
0 0
2 28
19 6
4 30
19 5
2 14
14 10
12 24
7 13
8 22
14 4
9 4
14 27
3 1
11 24
15 21
10 18
19 29
8 22
6 27
18 3
12 7
8 7
16 15
16 6
13 8
14 18
890 159

24 20
28
8 3
21 8
12 9
4 9
7 4
22 11
12 3
21 1
14 19
20 0
10 18
1 17
3 12
22 8
12 14
6 5
6 11
3 17
22 12
9 10
19 5
16 16
23 8
10 9
7 9
20 17
4 3
8 14
583 95
