*** Life<Cell> 1x1 ***

Generation = 0, Population = 1.
0

Generation = 9, Population = 0.
-

Generation = 18, Population = 0.
-

*** Life<Cell> 5x2 ***

Generation = 0, Population = 2.
--
--
--
--
00

Generation = 6, Population = 6.
**
00
..
00
..

Generation = 12, Population = 0.
..
..
..
..
..

*** Life<Cell> 4x4 ***

Generation = 0, Population = 2.
----
---0
---0
----

Generation = 3, Population = 12.
-00*
01-*
01-*
-00*

Generation = 6, Population = 6.
-10.
-.-*
-.-*
-10.

Generation = 9, Population = 8.
-.*.
1.1*
1.1*
-.*.

Generation = 12, Population = 4.
1...
.*..
.*..
1...

Generation = 15, Population = 4.
**..
....
....
**..

Generation = 18, Population = 0.
....
....
....
....

Generation = 21, Population = 0.
....
....
....
....

*** Life<Cell> 4x6 ***

Generation = 0, Population = 1.
------
------
------
0-----

Generation = 5, Population = 7.
0-----
-0----
0-0-0-
-0---0

Generation = 10, Population = 4.
------
--0-0-
------
0---0-

Generation = 15, Population = 8.
0-0-0-
-----0
--0---
-0-0-0

Generation = 20, Population = 3.
------
----0-
------
--0-0-

Generation = 25, Population = 7.
0-0-0-
-----0
0-0-0-
------

*** Life<Cell> 5x6 ***

Generation = 0, Population = 3.
0---0-
------
-0----
------
------

Generation = 4, Population = 10.
111---
------
11--*1
------
10--0-

Generation = 8, Population = 17.
.*.*1-
01--11
.*-*.*
011-01
.-11--

Generation = 12, Population = 14.
...*11
-.-1.-
*.-.*.
*.-0*-
*1**0-

*** Life<Cell> 7x8 ***

Generation = 0, Population = 11.
---0----
--0-----
--0---0-
-------0
0-----0-
-0------
0-00----

Generation = 3, Population = 25.
-1-1011-
--10--0-
00-----0
01-0----
---110-0
-0--000-
0--*--1-

Generation = 6, Population = 23.
*-*-01--
-0.1-1--
--*-0-10
1-----00
--*-*--1
11-.1--1
--..-0*-

Generation = 9, Population = 29.
***-*---
11.1-.-0
--.*--*0
111*1---
10*-.-11
*.1..*0.
0-..-**1

*** Life<Cell> 9x10 ***

Generation = 0, Population = 9.
0---------
----0----0
----------
-------0--
----------
----------
-0----0---
-----0-0--
0---------

Generation = 10, Population = 35.
1.*-*1----
**-*-.0*1*
0.-.----.1
-*1...*-10
0---1.---1
-.*0---1-*
..*1...-0.
-.-.-..-11
-..1-**0-1

Generation = 20, Population = 35.
.....**..-
....1.....
..*.0**...
..*.***-.*
0*****-*.*
.*..1*-*-*
..***.***.
-.1*-..1..
0...-...-.

*** Life<Cell> 8x11 ***

Generation = 0, Population = 5.
-----------
-------0---
------0----
-----------
------0----
--0--------
--------0--
-----------

Generation = 7, Population = 49.
0--00--0-0-
-*01*00-0-0
-0*01-1--0-
--11-0-0---
--*-1-*-10-
1000**-1-10
0-00--100--
-0--*-*10-0

Generation = 14, Population = 46.
***0*10-0--
0..*.0-01-0
-*...-.-0-*
*1.*.11-1-*
1-...0.**1-
1*1-.*...*-
-1-*.11-0.0
0*-0**..-1.

*** Life<Cell> 9x11 ***

Generation = 0, Population = 13.
----0------
0----0-----
---------0-
-----------
---------0-
-----0-----
------0-0-0
-00--0-----
---0-------

Generation = 7, Population = 48.
.-*0---01-0
-1.-.1**--0
*0--0..-**.
*.*-0---000
01-*01.1*-.
..-0-.110--
1--1.-.0.--
**-11*-1*-0
0---0-.-0**

Generation = 14, Population = 40.
.-.*.0-0**.
-.*.**.**1.
.--.-.****.
.**--*-..*.
...*...*.*.
...-0*..*1-
.**.**.*..*
**-.*......
.*.-.***0..

Generation = 21, Population = 20.
.-.....-...
-..*.......
.-1***.....
*..***..*.*
**.........
.*.-0..*..-
.......**..
..-....**..
...-.......

*** Life<Cell> 10x12 ***

Generation = 0, Population = 6.
-------0----
------------
------------
-----0------
-----0------
------------
------------
--0---------
------------
------00----

Generation = 9, Population = 47.
-----.-1-.0-
--1--01-0---
-.-10.0.0-01
-0**.10-0101
0.1.-1-.-.0.
-.--*....--0
--01--.1-1--
--00*.-.*--1
0--*-..-01*-
.*--1*..**.*

Generation = 18, Population = 39.
..0*.**1-..-
-..-1**...*.
...*1......-
...**1..-**-
-...-*....-*
.*-.*....*0*
*.**1...-*-*
*-1-....**.*
-..*...-**..
.*.1........

Generation = 27, Population = 42.
..-.**.*...-
-..1.*..*...
.*...**.*...
**..*..*.*.-
-*.**.******
**....*...*.
**.*..*.-.**
.-.*..*...*.
-.*...*..*..
.......*.*..

*** Life<Cell> 14x13 ***

Generation = 0, Population = 7.
-------------
----------0--
---------0---
-------------
--0----------
-------------
-------------
-0-----------
------------0
0------------
-------------
----------0--
-------------
-------------

Generation = 4, Population = 27.
--0------0---
------0---0-0
-----0-------
-0-----------
0-----0-----0
0---------0--
---------0---
-1---0----1--
--1-----0-*--
--*-0--------
-------------
-1----0-----*
------------1
0---------0--

Generation = 8, Population = 50.
------------1
1-1-----0----
-1*------0--*
0-----*---1--
*0--*----01--
.0--------0--
--0-----*0*0-
.-00.1--.0*--
--.---01*1..-
1..**.0----0-
0-1-1------0*
11.*----*1-1.
----------.-.
-.---------10

Generation = 12, Population = 73.
0**11---1----
-0.11-0-0----
-.*--01--0-.*
.1**11.-00.-*
.0-1.1-*1*.--
.**-1*-1.1--.
-01--0--.***.
*---..***..--
*-.-.**1.-..-
*......-**.--
1-*-.10--0.-.
-.*.-011..-*.
*0-1*0---.*-.
-*1---0-*--.-

Generation = 16, Population = 66.
****-*--*.-11
-..*--*1---*0
-**---*...-*.
.*..-.*00-*-.
**...--..*.-0
...*..-...-1*
----**11**..*
*1--.***.*..*
.-.-..*-*1*.*
*......-***.-
.*.-.---1-...
-..*0.....0..
.-1..-1-..*0.
***-*-0-....-

*** Life<Cell> 15x12 ***

Generation = 0, Population = 15.
------------
------------
------------
------------
---------0--
------0-----
0----0------
---------0--
-----0--0---
--00--------
------------
0----------0
------0-----
0---0-----0-
------------

Generation = 8, Population = 60.
0-------1---
--10--0--.--
---------1--
0----------*
-*-----0----
-.11----1*--
*..1-1*0.1-0
-0.*010*1---
-0-..0*10-10
--.*..-..--0
-.----**--*-
.-..-..-01.*
11--.*-0.01-
------..**.*
0--0***01-*-

Generation = 16, Population = 75.
--*-0-*--**.
*...-.--1*1-
.*-*-0-...-.
-0-****01--.
-*-0*...-1..
***--*--**.-
*..-**.1**--
-***.**.*0**
.....1*.-*.-
-***..*.*1*-
**-*--*.*1.1
**..-....-.*
...1*......*
--00--*...**
-......1**.-

*** Life<Cell> 13x16 ***

Generation = 0, Population = 1.
--------------0-
----------------
----------------
----------------
----------------
----------------
----------------
----------------
----------------
----------------
----------------
----------------
----------------

Generation = 5, Population = 10.
---------0-0-0-0
----------0-----
-------------0-0
----------------
-------------0-0
--------------0-
----------------
----------------
----------------
----------------
----------------
----------------
----------------

Generation = 10, Population = 12.
----0-0---0-0---
----------------
------0---0-----
----------------
--------------0-
----------------
------------0-0-
----------------
------------0-0-
----------------
--------------0-
----------------
----------------

Generation = 15, Population = 24.
---0------------
0---0-----------
-0---0----------
--0---0---------
---0---0--------
----0---0-------
-----0---0------
------0---0-----
-------0---0----
--------0---0---
---------0---0--
----------0-----
-----------0-0--

*** Life<Cell> 16x15 ***

Generation = 0, Population = 20.
-------------0-
-0----0-0------
-0-------0-----
-----------0---
------0--------
---------------
----------00-0-
---------0-----
---------------
----------0----
------------0-0
---------------
--------------0
--0-0----------
--0------------
--------------0

Generation = 6, Population = 103.
---0--*-1--1---
0-1-*-.0--*11-0
-*011-*-1--*0.-
0.--00.--1--0--
01--0--11--11*-
-.-001.1--..10-
--10000.-1..1.-
-1001--10-1.-*0
-01-1-*1--11--.
0-*--0*-*.0--0-
0-.-1-----**.-*
-0100--00--1--*
--1-0-1---*001-
-0*0-1*--0----*
.---*-.-1---.-.
11-0.-----0---0

Generation = 12, Population = 95.
11-*.-.11.-*0*1
*..-.0.0.-...--
*.*-**..1-*...*
*.1-**..1-0---1
-..0-011.--*-..
*.101-.**0***-1
0---0.-..-...*-
*.-*.--*-*.....
01.**1*.1...*-.
*..1-.*-.**1.-0
.-*-.1-.1*.*.-*
-..-..--**.--**
--.-1-**1-.--.-
**.**..-*--.*-.
.-.*.-.-*--*.0.
..-**-1*.-**--0

*** Life<Cell> 17x15 ***

Generation = 0, Population = 13.
---------------
0-------0------
------------0-0
---0-----------
---------------
------------0--
---------------
---------------
---0-----------
---------------
---------------
------0--------
----------0----
------0--0-----
-----0---------
-------------0-
---------------

Generation = 5, Population = 76.
0-0-----0--0---
--.1---0101----
0-0-----*-.-.--
---0--0---0-1-0
0-0-0--0----.-1
-0-1--------00.
0--1--0----0--*
--0-00----0-0-0
---0--0-0--00--
--------0--0-0-
--0-0----00-00-
-0---00--1-00--
--0-0--0-----0-
----0--.---00--
0----00-01---0-
-0-----001-----
----0------0---

Generation = 10, Population = 106.
-0-01010*-0-*-1
0-.-1--....*--1
--0-00.1.-*-.-1
--0-1-*--1-0-11
-0-*1-0-*---*1.
--.*--.0-0...-*
---*---1--1-**.
--0-.-1-0001.--
-0-----0.01--1*
--11--0---1-1.1
--01-0--1-.-01*
0-0--*1--...-*-
00-0*0-0-.01.1-
--1--*1...-...*
--1--***0-*-1.-
01-1-.**-.10-10
---0---0--0--0-

Generation = 15, Population = 107.
*10**---**-..0.
-0.*1--*.*...-*
.-...1.*.-.*.--
11..--*.-..1.-1
-.-..*....--.1*
10..-0....*...*
11*.**1.--*-*..
1.11.*-0.1-..0.
-1-.-1--.-.1-.*
---**0-0-1***.*
*.11-.-*1*.--.*
1-*01.**...*0**
1.-..1-0.....*-
.-.11*1......*.
-*...*...*.*1*0
*.0.*...1*..0*1
-.1.-****0--0.0

*** Life<Cell> 16x19 ***

Generation = 0, Population = 2.
-------------------
-------------------
-------------------
-------------------
-------------------
-------------------
-------------------
-----0-------------
-------------------
---------0---------
-------------------
-------------------
-------------------
-------------------
-------------------
-------------------

Generation = 9, Population = 24.
---------0---------
--------0-0--------
---------0---------
-------------------
-------------------
-------------------
-0-----------0-----
0-0---------0-0----
-------------0---0-
0-0-------------0-0
-0---------------0-
-------------------
-------------------
-------------------
-----0---0---------
----0-0-0-0--------

Generation = 18, Population = 15.
-------------------
-------------------
-------------------
---------0---------
-------------------
-----0-0---0-----0-
-------------------
---0---0-0---0-0---
-------------------
-----0-----0---0-0-
-------------------
-------------0-----
-------------------
-------------------
-------------------
-------------------

*** Life<Cell> 18x17 ***

Generation = 0, Population = 1.
-----------------
-----------------
-----------------
---------0-------
-----------------
-----------------
-----------------
-----------------
-----------------
-----------------
-----------------
-----------------
-----------------
-----------------
-----------------
-----------------
-----------------
-----------------

Generation = 10, Population = 11.
-----------------
-0-------0-------
-----------------
---0---0---0-----
-----------------
-0-------0-------
-----------------
-----------------
-----------------
---------0-------
-----------------
-------0---0-----
-----------------
---------0-------
-----------------
-----------------
-----------------
-----------------

*** Life<Cell> 21x19 ***

Generation = 0, Population = 24.
---0------0--------
-------------------
-----0-------------
---00---------0----
---------------0---
---------0--0------
------00----0------
-----00--0---------
-------------------
-------------------
-0-----------------
-------------------
-----0-------------
-0----0------------
-----0-------0-0---
--------------0----
--------------0----
-------------------
-------------------
-------------------
-------------------

Generation = 4, Population = 83.
-----001------10---
---------0--1------
-1-1--00-00-0------
1-.--001100-------0
---1------10.------
-----0.-1-*.-1--0--
-001-0--1-01----1--
-11*11---01--11----
-----0---------0---
-1----0--0--1------
-1----10----00-0---
-.---10--0----0----
-.-------0----1----
-11--1----0--------
-----------0--.--0-
----------0-------0
-----0----0--.-.--0
-0----0-------.----
-----0-------1-1---
--------------1----
--------------0----

Generation = 8, Population = 124.
---*--0.---01-**1-0
-111-----.11*0-----
1-*-1-*1-*11.000---
*.**.-..1---*---1--
1-010-0*--**.1-----
-1*1...*.1...-1*-01
*0*-.-1..*-..-.*.-0
.*..-.1--*1**..0-1-
-1..-.1-*-1*.-0----
-..110.0.-11*------
1.000-*-11-*0*-----
-*00*.---.*---1----
-.-1011------1*.---
*****..-----0-.----
1----11-------.-010
-----.---0.-.---*1*
-0----1----.-.*.01*
----------.---.----
-1-----------...---
--------------.----
--------------*----

Generation = 12, Population = 163.
-10*-.0.1*--..***1-
0..1..-.1.1-.-.0*10
.-.**-..-..1*0--00*
..*..1..1.1-..--1.1
.-.**-..-0...-00-0*
1-...*.......1.*-1-
*-.*.1..**-.*1...1.
*...**-0*.****.**1-
-.....***-*..-0*-**
1.**.-.1.1.1.*-0-00
-*00*..1..1.1.**0--
*.-1**---..0--.-10-
*...--.*--*1-**.**-
..*....--01-1-*1.-.
*1-.0..**0111**.*.1
-*-0**---0.-.-*..1*
1----.*-1-1.0...0.*
1001*----0.--0.-*1-
11----0---0--..*-.*
---------0-0--.-*--
------0---0-0-.--1-

Generation = 16, Population = 156.
**-.*.0.-.--*....*-
-..-.....*.-*-.-*.-
.1.*.-*.-**.*1*--.*
...**...1**1.*.*..1
.0**.1..-0...-.-.1.
*-**..*..*.*...*1--
*1*..*..*.**.....**
****...-......*..*-
-..****.*1...1....*
...*.1.-......*-*-0
..10..*...1*-*..-.0
...1*.--1.**--...0-
...*-*..0..10*.**.-
...*...100.0.1****.
.10.1..*.-.1.....**
.*0***1.-..-*1**.**
.-.1...--*-.*...***
.-1**-*0*-*---.-..*
---.0--101---*..-**
1.-*01-0------*0.-1
-00-*-0---0-0-.-01-

*** Life<Cell> 22x20 ***

Generation = 0, Population = 20.
0-------------------
0-------------------
-----0----------0-0-
-------0------------
-----------0-0------
--------------------
---0----------------
--------------------
0-------------0-----
----------------0-0-
---------------0----
--------------------
--------------------
-------0----------0-
--------------------
--------------------
------------0-------
--------------------
--------------------
--------------------
0-------------------
--------0---------0-

Generation = 5, Population = 158.
*0*--10---0---00---0
*1.01----0-0000-0---
-*01---.0-0---.0-0-0
-0010.-0--0----0-00-
0--0--0--.00-01*1---
-0---0---0----00*0*0
1---0--*0-----1*--*0
--0-00010-00-0-01---
-0.--0---01*0-0..0-0
--000-0-0-00--.---00
--0-0--0--0-------0-
0--0-------00-0----0
-0-0----------*00---
0-0-0-----0--010-0--
---0-------0--------
0-------0------00---
-0------10-----0-0--
0-----01-0------0---
-------0----------0-
0-0-0--0-0--0----0-0
----10--0--0100-----
0-0010-----01--0-0-0

Generation = 10, Population = 165.
***1...**1-001*-----
*..-.0*100--0---.---
-*1***1.-...-**..*0-
1-....---.1--01-.-.1
---.1.-...*.0**.*-.1
*-011.0--.---0*1.1.-
*1-.---.-*10011..0.0
10*-1--*0*-1-1-*.-*1
--..-*-0*.-.-.0..11.
--1---0-**-1*-.-.-*-
*-.0.--*00.-11.--.-*
1--.01---0-.*0.-1---
0-11-0-1-01.*-...01-
------01--0--*.1110-
00--10-----0--.-1---
------0-1-------.---
--01--1-----0--.----
----1---0-----101-.-
---0-00-0----01--0--
0-00*011--10.0------
-01-.--10---.1*-----
-1***---01.---1-0---

Generation = 15, Population = 183.
....**..***.-*.1.*.-
...-.****--.*11-*.--
*.*.....1..**..*..*0
.-**..--1*.00....*..
.--...-.....*...***.
.1.1-.-.0.1..*....*-
..-*.-*.1.-*-**..1*-
.1.-1--.*.-...-..1.1
*-.*1*0*..-***-...**
--**0--...1..*.-.-*1
.*.-.-0.-.*..*.-0*-.
*11*---.100..1.1-1*-
-0.*-.-*0--.***..-10
---0--*-1-*1-**..*1*
1-0-..1**-00-**1*-*-
---0-0--11---*--.11*
00-*--.1-*.1-.-.--1-
--*.-.*.*10.*1.*.0.-
*-*1-110*0..1-*1.1--
0--1.-..-....0*0--1-
1-..*.*--00.*-.1.--0
1*....*01.***0.0-010

Generation = 20, Population = 181.
..............**...1
*.*-*....-....*.*..-
....*.*.**.*...**.*.
.-..*.*1-.*-......*.
..-*.*1*...**.....*.
*-*.-.**..*.*..**..-
..1.....-**.1..**1**
.-*..--....**.0.....
*1*...-...-.*****.**
..*.1-1**...**.0*-**
...0..-...*.**.**.*.
*.-.*--..-*..**-***.
*...**-**.-.*..**-.-
11-.-..**-.*1**..**.
*.-...*.*-1-*..-**..
*11-1-1*..-***-..*1.
..*.*..*...-..1*1**-
-1..*.****..*.**.**1
*0*-..*0.-*..***.*-0
--1*****-*...1.1..-1
*-...**-1*1***.*.-1.
1......-***.**.*-.-*

Generation = 25, Population = 153.
..............*****1
...*****.-...*...*.*
.....*...*....*....*
.1****.*.*.0*...**.*
.*-.*.-..********...
....-.***.....**.*.*
.*-...*.-***..*.**.*
.-*.*.**.*.***.....*
.1....1...*......*..
.**.**...*....*.*0..
.*.-.***.......*....
**-*..-**1*....-....
*..*.*0.*********-.-
*.1.1........**..*..
*.-*..*..1.-...*....
.111.-**..-.**1**.-.
.*.*.*........-.-..-
0*..*...***........-
.-.-...1*-.*.......-
*-.*....*****-....1.
*-.....*.*.*.....*-.
.***...0.......*..-.

*** Life<Cell> 20x23 ***

Generation = 0, Population = 20.
-----------------------
-----------------------
---------------------0-
--------------------0--
---0-------------------
0----------------------
--------0--------------
-------0-------------0-
-------00--------------
--------0--------------
--------0--------------
----0-0----------------
-----------------------
--------0----0-------0-
----------------0------
---------------0-------
-----------------------
-----------------------
-----------------------
0--------0-------------

Generation = 10, Population = 185.
---0-0-000---0---0--0-0
0-0-0---*-0-0-----0000-
-0-0-01-.10-------01-*1
0-01--1-*-0--00-0-.-.1*
001**0--10-------1-01.1
--0.-10*---1-0-0-00-.0-
0-.-*---*--01--00-1-..-
*.0*.--.----.-1--..-...
*0*-.**-1-*-1*1*001-0*-
0-*101*100-1-1.--1--.10
.---*-**.0.-.-11*-00---
1-.1.1..*1.-.---100--00
10-1.11*.-1---1-1----10
0--1-11--*.*.1----1-10-
---0--.**--11-------0-0
0----00**.-1-0-000-0-0-
--------.-------0-----0
-0----0**.-------------
---0--0-1-0---0---0----
-0-01.1-1--0-0-0-0---0-

*** Life<Cell> 23x21 ***

Generation = 0, Population = 18.
-------------00------
-0-------------------
---------------------
--------------0------
--0------------------
-0----------0----0---
-------------0-------
---------------------
---0----------0------
---------------------
---------------------
---------------------
--------------0------
-------------0-------
---------------------
----------------0---0
-----------0---------
---------------------
---------------------
---------0-----------
---------------------
---------------------
0--------------------

Generation = 8, Population = 89.
---0-11--..--*.**..**
-0---0---0011..1--*--
--*-------*---.--.---
------1------0---.--0
-..1.---.-0-1*1------
-11.-0-*-----.1*-1--0
--.0-0----.010.101.--
--------------.-1.--1
---0--1-.--10..-----*
-1--------...1-------
------------1*-------
---------*----.------
--1---1----*--------*
-1---1----1.---.-*---
0----------.-1----*--
-------.01.-*.1---0--
0-------1.0--.*----0-
---------.--*--.-----
-----------1---------
-0-------11.0-*--0---
-----------*--0------
-------------*-------
------0-0--0---------

Generation = 16, Population = 189.
0..-1...1.***........
*.0--.-..*.....**-.-.
*-.**.-011*111.-..*1.
*..**--..-000*---.1-*
*...*.0-.--..*.1-.-.1
*...-*..-.-0..*.*...*
*1.*-.*11..**.***..1*
1-**-.1***01.....*-1*
-..0..--*1*....0..**.
0.-..*---..***-*.*.*0
*-**-.-10*-...0...-10
1-0---1--..-*..-.*10.
-...-0--.*-....*.1-1.
-.111.1*.**..1*.0*-.1
-00-...0-...*....*...
-0-----.**.....1.*..*
00*-111.**.-....1-1.*
-00-*-*11.-*..1.----*
-----00-*10.-0.*.-0*-
--1*-0*......-*-.--*0
--010--.-.*.-..0.01.1
-0---1*-...1*.*.--0*-
---0--00*1-*-.-*.1---

*** Life<Cell> 23x24 ***

Generation = 0, Population = 26.
--------0---------------
------0-----0-----------
-------0---------00-----
-------0----------------
---0--------------------
------------------------
--------------------0---
------------------------
---0----------0---------
------------------------
----------0-----------0-
---------0--------------
------------------------
-----------------0------
------0-----------------
------------00-0--------
0-----------------------
------------------0-----
------------------------
------------------------
---------------00-----0-
----------0-0-----------
------------------------

Generation = 9, Population = 209.
1-.*.-..01..**1-1*.001--
1001--10.-*..*-0.-00.*0-
0-0-.**..1-.-..*.***....
--.-1..*0.*.1*-10-*---0-
---.*.-**----.0--..-1.0-
--------*..1--.--*-**---
-----1-.-10-*0-.*1--*0--
0--0---1----**--0.--0-0-
-00-0--*1-1-00-0--0--0-0
0-00-01*0---1-0---*0--0-
---0----0---.1*00--0----
0--1--0.0-1--1---**---0-
-.0-0.-0-001.-1-1-.--0--
0--0----0---*..*01--1---
-0-.00---0000..*.--0*-1-
0---**--10-.-**.-.1--*--
--0------00-0--*1*----.-
---0--0-0-0-**--0.0-0*.1
----------*-1.0---------
------.0--0--..-1-.-0-10
--0-0-1*1---*.*.*.1---0-
00---0100---*1.1*0.--0-0
-00-00-0---1.1-.*-11----

Generation = 18, Population = 212.
.***.0..-...........-***
.**1.**..**.....***.....
.1.*.*...*****.....*.*.*
.**........*..*11....**1
1.0.*.-.**.*...*...0...0
*.0.*..*...*-..-*.1*.-.-
..0.*.-.0**-....***1.111
.*..-...-.*.*.**.*****.0
*..1-*..--...*.*-*.1..0.
1.1*0.-*...-...0*...*0..
1**1.*-**..1.....*.-1**-
-.0.--**.0*.*.-..*.-.-..
.*-*-*11......*1*-**.*--
.-*-*.-01*1-..**.*.-*.*.
111.-*-1..-.......**.-.*
0.....1*.-.....*..****-.
**.**..-*.-1.-..*.*.*.**
-*.*1-.-.10...11...1..**
0*.1-1-*11*-..1...0*-1.1
---0--..*..*.....-.*.*.*
.0--..*..*.**.....-*1.-*
*-.-.-.-..-1.....*.**1*.
1*.-*.*.-.....-.....1.0.

Generation = 27, Population = 178.
.***.-..-.*...........*.
.*.**....*.*......****.*
...*.*..*..*....*****...
....*...*..*...*.....*..
..-...***......**......*
..-.**...*.*-.....-....*
...***1***..**.........*
.......*..*.**......*..*
...*.....**..*.....*.*-*
.......*...............*
...-...**...**....***.*.
-***.-.*.*...**.....*...
..-.*...**.*..*..1......
.....***...**......*****
....-*-*.*-.*.**...**...
.*....*.*1.**..*...*....
..*..*..*...*0.....***.*
-*..-..***1.**.....***.*
.*.1.**....0........*.**
*.*.**.**....*.....*.**.
*0--.*.........*.*.*....
*1.*...**.*.**..*.*.*...
1**-...*-.**..-.**.**...

*** Life<Cell> 25x26 ***

Generation = 0, Population = 1.
--------------------------
--------------------------
--------------------------
--------------------------
--------------------------
--------------------------
--------------------------
--------------------------
--------------------------
--------------------------
--------------------------
--------------------------
--------------------------
----------------0---------
--------------------------
--------------------------
--------------------------
--------------------------
--------------------------
--------------------------
--------------------------
--------------------------
--------------------------
--------------------------
--------------------------

Generation = 9, Population = 16.
--------------------------
--------------------------
--------------------------
--------------------------
----------------0---------
---------------0-0--------
----------------0---------
--------------------------
--------------------------
--------------------------
--------------------------
--------------------------
--------0---------------0-
-------0-0-------------0-0
--------0---------------0-
--------------------------
--------------------------
--------------------------
--------------------------
--------------------------
----------------0---------
---------------0-0--------
----------------0---------
--------------------------
--------------------------

Generation = 18, Population = 15.
--------------------------
--------------0---0-------
--------------------------
----------------0---------
--------------------------
--------------------------
--------------------------
--------------------------
--------------------------
--------------------------
--------------------------
0-------------------0-----
--------------------------
0-0---------------0---0---
--------------------------
0-------------------0-----
--------------------------
--------------------------
--------------------------
----------------0---------
--------------------------
--------------0---0-------
--------------------------
----------------0---------
--------------------------

*** Life<Cell> 25x24 ***

Generation = 0, Population = 10.
------------------------
------------------------
-------------0----------
-------------------0----
------------------------
------------------------
--0-----0---------------
---------------0--------
------------------------
------------------------
------------------------
------------0-----------
--0---------------------
------------------------
------------------------
------------------------
------------------------
----------------0-------
------------------------
------------------------
------------------------
------------------------
------00----------------
------------------------
------------------------

Generation = 10, Population = 156.
0-0-000-*-0----------0--
-----------00------0-1--
---0---.1-*--------1-.-0
---------01..10--0-1-*-0
-----0----01---00----1--
-------0---11-01---0-0-0
0-0---0-01--1.*..10-----
-----0---1----011----0-0
0---0-----0--0--1-------
----0--0.-----0*.-000--0
----1-----10-111--0-----
--0---1-------..*11.-10-
-------0----000-0-0-----
----1----------1-0-00---
0---01*-.1------0-------
--------1----0---0------
--0---111---------------
------0-1-0-0--0--------
--0--.-1*1--------------
---0-1001-----0---------
--*11****-*1--00--------
-011--00--100-----------
...*.*11*....*--10------
-0----..----------------
00*---..---*0-00--------

Generation = 20, Population = 274.
--***1.-...***0..*-*1.*.
-**.0-*..00***-***1.-*1.
1-.*.**..*...0.****.*.*.
11-1-.1...*......-0*.*..
01.1.*.*.**.*10-**.-0*0*
--*0*0-0*..*-**...-*01.-
0*1.**0-.*11*......*.1*0
0**1*.101**..**..*0.1...
-..*.*11-**1...-.-..--0-
*0**.---..---*...**-*10.
*.****.*1...**.*11-*.*.-
1*.-1-***1-*-...*....*..
**---1.-*-*0*-.1*..-.100
-0*0.-.1*0*-0...1-0..*00
.*.11...*.1-.....*..*--1
-----.*..-*1.1-..*.0-.--
.-0-...1.-.1-.--1*.11---
--0-....*-.00*..*--110--
-00**..*.*.**0**--0-0-00
-..*1-.-..*.*.*0.--0---1
.**-.....**.1***.-0-0---
.*.*1*.*.....10*.1*-1---
*....*******..***...*...
-*..*-*....1-.1-.-.0-1--
....--**.-***.-.-1.**0-*

*** Life<Cell> 27x28 ***

Generation = 0, Population = 7.
----------------------------
--------------0-------------
----------------------------
----------------------------
----------------------0-----
----------------------------
----------------------------
----------------------------
----------------------------
----------------------------
----------------------------
----------------------------
----------------------------
----------------------------
--------------0-------------
----------------------------
----------------------------
----------------------------
----------------------------
----------------------------
----------------------------
--------0-------------------
----------------------------
----------------------------
----------------------------
-----------00---------------
--------------------0-------

Generation = 10, Population = 106.
----------------------1-----
----0---0-----------1---0---
--------------0---.-0---0-0-
------0-------1---.---1-----
------------0-*-1-----0-0---
------------0---1-----------
------------0-.-0---------0-
----------------------------
--------------*-------------
------------0---0-----------
----------------------0-----
--------0-----0-------------
------0-------------0-0-0---
------1---0-----------------
----0---*-----------0-0-0---
--------1--00---------------
------0-------------0-0-----
---------0*..10-------------
------------------0-0-0-----
0---------------0-----------
----------01100---0-0-0-----
0-0---------1-1---0---------
-----------*-*-11---0-------
0--00---00*-*-.*---00-------
------00-0*-.-0-.-----------
-01-.-10--....**1**.-10-----
------00-0--.100*-1---------

Generation = 20, Population = 298.
------0-----1*1-**1*...1*1*0
0-0-0-----0--01*--0*....-..1
-------10-10-....*...1...-10
--------00-1.*.11..-.-.*-1**
--0----00-**.*...*---...0-*0
0---1-11*0-1*0*-11*1*-.-.0*0
----00--.-.-.*...-.--.---010
--------*10-.1*-*--0-*.0100-
------100-.-.-.0-1.110-*10--
----01.1*11--...1*--0-*01---
0----00....-1**011.1.1*00---
--001--1*.1..1*-00-0--1-----
---*-1*-..10*1.-101-0---0---
01.-.1.**-11**1*-10---------
.--*.****..1.--*--0-0-----0-
1----1--.**.--.*--1---------
--*---.*--.**1-001----0-----
-0*0-0-*-..*...1.0000---0---
00-0--01.0.---*.-0--------0-
0-*---1*-**-...***-1--1-----
0--1101-.....1--***0-.--.-1-
1.*.-1*--.*.*..-1--*--1-1--1
1-11*1..0*..**-***.-*---10--
-*..****.....-*...1-*-*1*---
.....*-..-**..*-....*1.*-00-
0**...*.-..*..*...**-.***.--
1-*1.1*.*-*...***-....-.0-0-

*** Life<Cell> 28x29 ***

Generation = 0, Population = 22.
--------------------------0--
-0---------------------------
-----------------------------
-0---0-----------------------
--------------------0--------
-----------------------------
----------0---0--0-----------
-----------------------------
-----------------------------
---0-------------------------
--------------------0--------
-0----0----------------------
----------------0--0---------
-----------------------------
-----------------------------
------------0-------------0--
-----------------------------
-----0-----------------------
-----------------------------
-----------------------------
-----------------------------
---0-------------------0-----
-------------------------0---
-----------------------------
-----------------------0-----
----------------------------0
-----------------------------
-----------------------------

Generation = 8, Population = 117.
----------0---0--**-----0----
---0-0---0-------------------
-----------------------------
-0----0--0---1-1----0--------
------------1--0-.----------0
-0-----------1-0011-.-0------
--0---*--1---1***0*....--00--
----.-------01-01000--0---1--
------.--------11-1*.0----1--
-*-1-..*--.0---0--0----------
------1-----1----*..-0-.--.-1
1*-.-.---0.-*-.----11---.----
--------0--0*--*1..-.10----0-
---*--.-----.-----1-0--0-----
----------0---0----.1----0---
----0-*---------*-0-*---*----
-----------------*--1--1-----
-0-0----.----1--.-----.-----0
--------------------1--------
-0----0----------------.---.-
----------------0--1---------
---0-------1---0---------.-..
-----------------1-------1-.-
------------0----------.--*.*
---------------0-------1---1-
-----0--------------1-...----
-----------------------.-1---
---0-------------------0-----

Generation = 16, Population = 300.
---------*--.-.*...1.1---*---
-----**-10--.-0--.***-*------
----0-1--*--0**..11.*00-0101-
--0--.0.1-**.-.**--1.-1-.1-1*
----*0.--.*..**-...-*1.---0*-
*-.-.*.1-*.**.*--..0.0.-.*.0-
-1-*.-...1*.*...**...*....1*-
--*....-***0-.0..*.1.*-.-1.0*
.0--**.-1.--.*1..0...1*.0*.*-
...*0..*-*.*.-0.--1-**.**-*1-
--1*11.---.-*0..*...*1..*-**.
....1.*1.-.**..--*...**-.1-1-
..01.**.0-.*..**...*..--.---1
1-*....1*.-*..0.-*.--1.-*.-01
.*.-.1*-00*.*..*1-.....-1-.0-
01.1*.*0....*.*-*.*-.--*...--
-*1*-0--1.1*.0-...*-.1..-1.-0
----1.-...-..--*.*-..-*0.**--
-1-0.-----**-..-.-*.10**0-0--
--.-.-.-0-.*.*--*1*1--***--.-
--0-*11-0--0.-0--*-.*1-.--1-0
---00.**0--*..-1-.1-*-.***-..
----00-----..-0*.1*1*-11**1**
-----01-*--.--*.--1-1-1*-*.**
-------0---.-----11-.-1-.1.*0
---0----*01.101.--0*.1.**1*--
-----------.---.*0.1-1*..--01
-0----0----.---*--*.**-***--.

*** Life<Cell> 27x30 ***

Generation = 0, Population = 27.
----------------------------0-
----0-------0-----------0-----
---------0--------0----00-----
--0---------------------------
-------------------0----------
---0-------------------------0
------------------------------
------------------------------
---0------------------------0-
----------------------0-------
------------------------------
------------------------------
--------------------------0---
------------------------------
---------------0--------------
--------0----------0--0-------
---0---------------0----------
---0---0----------------------
------------------------------
------------------------------
------------------------------
------------------------------
--------------0---------------
---------------------0--------
------------------------------
----------------0-------------
------------------------------

Generation = 5, Population = 261.
0--00---0-0-0---001*--0**0-01-
-0011----0-0--00-00-*01-*----1
---0---------1*00--.1--1-.---0
-0-1---0-----000----0-00.0-0--
0-0---00----0-0-0-.----*-0-0--
--.--00-00-0-0-0--0--0---1--0-
--0.0--00-0-0----0-0---1---0--
-0-.---0-0--------00---0--0-0-
--00--0-0-----------0--0--1---
--0-0--0-------0-0------0010--
---0----0-----0-0-00--0---0--0
-------0-0-----0--010010----0-
---0---00---------0*00-0---0-0
--0-0-0-0--0-------1-010----0-
---10--0--0----0--0.--00--0---
---.-0-.-----00*00-1.-0*00*0--
---10-0*0--00-010-0---010010--
--0.0-0*.-0-0-0----.---0--0---
---.---00--0-0110--1-00-------
---1---0-0----00--0*-110------
--0*0--00-------0-01000-------
--010-0-0-0----0-000----------
---0---0-0-0----1--0-----0----
----------0-----1-------0-0---
------------0---00--0----0----
-----------0-010-0-0-0--------
------------00-00---0---------

Generation = 10, Population = 312.
-----1----0-----*1.*100.*.1-*-
01*-**0--------1.-0*.-1*.*1-0*
-1-*-0--01.**-.-*10.*--*-.-..*
---.----1--00--0-00*.--*.-0.*-
-----0-0-.1*-0*--1.-.--*1-----
0*.-1*0-0*---11-1-0---101*0-1-
-*-*-*-0-0---0-.-1***1*.-*-10-
--..--*-1-01--0-01.-----111---
-.11-.-1-----0-0-10---0**11-*-
0-*10-1-110-0-0-0-11-0-0.--.--
--0-------------0*-.-0-**0.---
0-0---1*----0-0--1.*-*.-00---0
--100---10----0-0-...**-0---0-
0-.-*--1*100--1001..--..1-00-0
1....1--1*010***---.--.*-0.1--
0-*.-0*..*.-1.****...***--.--0
1.-.1--.111*0-*.-.-*--0*1--1.-
-*-..01.*.-11-11*.-*-*----.11-
0-**01-..-*---1*.1.*--1---100-
-10.-01-.*-1-0--0.**-.--1-----
0-0.0--1.-----0-----01000---0-
-1---0---1---0-0-1..1--------0
---.0---------00.0-.--.-0-0---
---*--110-00--01-1-00.-1---0-0
-0-.-00-----0---1--*-11-------
-0----1-*11--0--0--1-0----0--0
---1----------1----0----------

Generation = 15, Population = 347.
01-*1.1.1*..0**-..**.11***.-.-
-..1**..-0.0-1-*.--**-1....--.
0*-*0.-.-***..*-..1.*.*.1.1*..
---..-1*.0*1*-0-.-.**0..**1..1
0111-**-*...**.01...*-..---.1-
*..1*.*--.--..10*---*-*...*..-
1.*..*0*-1010.*..*...*....-.-*
.-.*10*-*-1.*--*...---1--1-.-0
-.--0*0.0*0-0-**-*-0**..*.**.*
-1...-*-*1.0-0-*..-.-.1-*01*-*
.-10--**.1--0--0-*1.--*..-.0-0
0*-1--*.11-.*0*-**.*-*.-*-.1--
1..1--0..-0--1-.11.*...1---0--
*-..*--..1.*-0..1..**-*..01-11
-..*..*11.1.****0--.--*.11**.*
0-.**0....*.-*.***.....**1.-*0
.*1.-0-.-*..-*..-.-...-...*..-
0.*..*....*1**..*.0*-.1****.-1
--**1*-....01*......*-1*-...-.
-.*.--.-..**.---0...*.1*.*.-.-
-**.11--.-.-10--.1-1--10---1-0
-11.01**..10*--.-*...1.**1-0*1
-*-.-*0.*-01-.-..-..-1*0-0.1--
0.*.0-*-.*---1*--.-1.**11--1--
0-**-1-*----*--0.1-.-*.*0*.---
-1-*-0...***1**0--.1**0----*--
01-.0-.**-00.0*-*--*-00-*-1---

*** Life<Cell> 30x29 ***

Generation = 0, Population = 33.
-----------------------------
-----------------------------
--0----------0-------------0-
----0--------0---------------
------------0----------------
-----------------------------
-----------------------------
-----------------------------
---------------------------0-
-----------------------------
-------------0------0--------
----0------------0-----------
-------0--------------------0
-----------------------------
--------0--------------------
--0--0-----------------------
------------------------0----
----------00-----------------
-----------------------------
-------------------------0---
------------------------0----
-----------------------------
------------0-0-------0------
-----------------------------
-------------------------0---
------------0------0---0-----
0----------------------------
-----------------------0-----
-----------------0-----------
-------------0--0------------

Generation = 9, Population = 353.
--00-0-----*.*-011--------0-0
.--0100--11--*1--.-000-0---0-
*--0.-*.---*.1--.10.----0----
*1*1--.1---1011*-.010*00---00
.010000-1--0-010-1-0------011
---0---01---0-------0------00
1----0-1-0-----------------01
-0-00-0-0----------0---00-0*-
--1--1--.-00---0--0-1-0**0...
--1--1-0.-11-0--0.-0-1-00-0-1
-0*10-1-1.1--1*..-.-0-1---0*-
-0.11--..--0---.----000-0--00
--0--*-1..*..00-1--0-----.---
00-1-1--.-.-1-000---0---0----
--.-1-.*0-.--1---0---0-0-----
*.....-**..**0--------0--001-
-*-1*-1..1-010*0-00----001-10
1-*011.--.--.--*.0-00-0-0100-
-0001--1-**0-*.0--00-0---0---
1--..-.00*1**-.-00--0-0---0-0
------0-001--0-0-*0------1.1.
----0-0011.-**-01---0--*0----
--10-0---0.-.0*0---0.------0-
-0-0----10*0**-1-0--0.*.1.--0
--0-00--.01*.1.-1--00*1.*000-
0--0-01-00*1----.-0100*.****0
-0--00.--01-.---.10*---1-----
0-----0-11-1-.-.0**.***.-*1.0
-----0----01*1.1-*0111*-1*-1-
----0-00--0.---.-*0..0--1----

Generation = 18, Population = 325.
...-**-..**.*...1.1.1-.-.**0*
...*..-..*...*.11.*...-0--0**
.*01.-....**.-.1....-1**0*..-
***.*-*...1*...*..-.*..1*11*.
*..--...*1.-.-**1...-.--0-..*
-*1**..-.*-...1.-**.-.*-*-..*
.----1***..*-..--.1.....*.0*.
0-.-**-*--*...1--00**1.1*-.*-
*.***.****.-.-*-..0-*...*1...
*..0-**.*..--..*..1*.1*......
1-..-...-.*-0-.....*.-*..***.
.1*1*-*..*.*-*1*-*-..--.-*1.*
..*-*.*..*....*-..*..1....1..
..*...**.-.*1......0.--1-.-.1
.**......*....*.**.-*11--0...
......**.....--..-*1-1..--**0
-**.*.....1..*.-11.-...-1.-..
1*.****.0....1-.****.*-....0-
*-.**.**1**1....--.-.10...--.
*1*....-**..*.*.*.**0-*.*.-.*
*.*1.-*.*0...-...*.*..**....*
*-.*..*-*..-..*-*.010*1.-.*11
*1.1.-11-1.*.***1.*-...**..-0
..1-.0-.*.*...-**1.-*.....---
*-1--0.*..-......**0-...**.-.
...01.**.-.......*-.-*....*.*
---1.-*1*...*--**.*..*1-**-.*
---0-.0-***.*..**.*..*..0.**-
00-0*..-*0-.***..*1-.-.--....
...0-**.10.*---...-..--..1*-.

*** Life<Cell> 29x29 ***

Generation = 0, Population = 20.
---------0-------------------
-----------------------------
-----0-----------------------
-------------0---------------
-----------------------------
-----------------------------
---0-------------------------
-------------------0---------
-----0-----------------------
-----0-----------------------
-----------------------------
--0---------------------0----
-------0-------0-------------
--------0------------0-------
--------0------------------0-
-----------------------------
-----------------------------
-----------------------------
-----------------------------
-----------------------------
-----------------------------
-----------------------------
--------------------0--------
-----------------------------
---------------0-------------
-----------------------------
----------------------00-----
-----0-----------------------
-----------------------------

Generation = 9, Population = 245.
0----10---------0-0----------
---0010------0---0-----------
0----0--0.0-010------0--0----
---00.0--*-10*00----0-00-0---
--00-.1--*---00-0-------0----
---0--0.-.-0--------0-0----0-
--0*-.1----*0--------0----010
-0-0..*--.-.0--.-1-------.110
0.---.1.-*000*0------------0-
-...-----0--0.0.-------------
---.-****00-----0---------0--
-.-0*.11-1-01-0--0--.----0.0-
0--0*.1-1-0-.-0-0--.--0---0--
10-1---1*-.-1-0-*1-000-..--.-
10.--1-.--*--0-0*00-*10------
0--0-01-.-*0.--00-0*-----.---
----110**10---0-0--0---------
----0110.------0------00-----
--0----.-------------011-----
-0-00-00.------0------0--0---
--0--00-------0-.----01------
--------*0--0--0----0------00
-----0-010-0-0-.-----*.1*--*1
----0-000---0--------1--1--00
-----00-0---------1-.111*01--
-------0------0---0-.*0-*--00
-0-------------1--.1..*-*.*1-
0-0---------0-----01*1*.-1-00
-0-----------0--------**1111-

Generation = 18, Population = 362.
-..*.**.0-00..*0---*0.0*1*-.-
*.1.*..*.*1.-.**-00***-.-.---
.-*0**........*-1*--0.-.*--*1
.01..*-..*....-*--1-0**.**0..
--*.*....*-***-*-1*---0*.1..-
.-***.-...*-..*.-..--*-.*0..-
0*****-*.0..**11*-1101-1---.0
**..**.***..-*.*-1--..-*1.*1-
*.0.-*.***..**1*1..*1*-**.*.-
*.*...*..-...*....-0.*1-*.*.-
0..***...0.--*-.*.*1-1-0-1*.1
**.0...*.....-..*.*...1-...*-
*1-.***1*.-*.*.*1.**.*1..-1.-
.00**.***..0.*.*.*.......-.**
*1.-*.*.*..*1.*-*.1-....-.-*-
*-100**1*.*-..*.-*1*.*.1-.-*-
.-*0.*1..**11*-11*-..--...*.-
--.**.*..-.*..1--...-.**..*1.
-1---**.***-*--.*1.-.*....1.1
-*-.1*****11.--1-000-*0-.**0.
-*---.-1*-.-1.*-.*0**1**.1*.1
10---.-1.-..*0.-....-..0---.0
----*.--.--11**...*-*.***1**.
-0-0***.-.*1-.*-*-*.*.*..*-.*
0-0-0.....0.......****......*
-00---.-.-.**-.--.1-**1*...1*
------.-.11.10*.-...*..-.*...
0---011-0*1*-*1.....**..*.-..
----011****--.-.0.-.0*..**11-

Generation = 27, Population = 250.
-.**..**1.......-...0...**.**
.......*........00-...-.*.*.*
.*.1***...........-..*-*.--.*
.*....-...**...*-1.....*...*.
.******...***.......*-**.1..-
.-.*..0....**....*....*.*-..*
......*..-...**..-..0**....**
...*...*.*...**.*1...*.**....
..-.1.*...*..*.......*-.*....
.....**..1*..*.*.......*.*...
-......**1*1*...*...-.--.*...
...........*....*....**-...*.
..-........**...*.....1*...*.
.***..........*..........*.**
.*...........**.*.......**..*
.0**.......-..**.......1*.*.*
.0.*.........*-.1.-.*...*.*.*
*......*.**..**-1...........*
.**.........*-0.............*
..-.*****...*0.-1.-.1.-1.**..
..*..**.*.**..........**.*...
***01.*..1...-.-....-..**.-.-
*....*-..*****.....-..*.**...
***...***.*..*.1.-...**.*....
0*.11*........**.**.*.**.*...
-.*****-..***1....****1***...
.1*-*-....-*-*.............*.
1--.........-...***..*...*.*.
1-*.1*....*--.-.1*-*-.....-..

*** Life<Cell> 31x33 ***

Generation = 0, Population = 6.
---------------------------------
--------------0-0----------------
---------------------------------
---0-----------------------------
-----------------------0----0----
---------------------------------
---------------------------------
---------------------------------
---------------------------------
---------------------------------
---------------------------------
---------------------------------
---------------------------------
---------------------------------
---------------------------------
---------------------------------
---------------------------------
---------------------------------
---------------------------------
---------------------------------
---------------------------------
---------------------------------
-0-------------------------------
---------------------------------
---------------------------------
---------------------------------
---------------------------------
---------------------------------
---------------------------------
---------------------------------
---------------------------------

Generation = 6, Population = 61.
---------------------0-0-00-0-0--
-------00-0---------0-0----------
-------------------0---00--00---0
-----0---00-0-----0-0------------
-----------------0---00--**--00-0
---0---0----0-0-0-0--------------
-------------------0---00--00---0
-0---0--------0-0----------------
---------------------0---00---0--
---0-----------------------------
-----------------------0----0----
---------------------------------
---------------------------------
---------------------------------
---------------------------------
---------------------------------
-0-------------------------------
---------------------------------
---0-----------------------------
---------------------------------
-----0---------------------------
---------------------------------
-------0-------------------------
---------------------------------
-----0---------------------------
---------------------------------
---0-----------------------------
---------------------------------
-0-------------------------------
---------------------------------
---------------------------------

Generation = 12, Population = 108.
---------------0----1-0----10-00-
--0-0-1-.-*-1-0-0-0-*101-1011-0--
-------------------1000.-1-..0-01
-------0-.-----1---------.*-.1--1
-----------1----1--101*-*.*......
------0-0-1-*-0-0-*-101--..--1.-1
-------------------------00--1-*-
---0-------0------------0--0--1--
---------------0----0--00--00-00-
----------0-0-0-0-0-0----00------
-1-------------------------------
-------0-------------------------
-------------------0----1--1----0
--------------0-0----------------
-0---0---------------------------
---1-----------------------------
-----------------------0----0----
---------------------------------
-0---0---0-----------------------
---------------------------------
---------------------------------
---------------------------------
-0---0---0---0-------------------
---------------------------------
---------------------------------
---------------------------------
-0---0---0-----------------------
---------------------------------
-0-------------------------------
---------------------------------
-0---0---------------------------

Generation = 18, Population = 172.
-----01**---------1..***1.*.-0*-0
--0---...-**1-0--0-0*.0..***--.1*
-----01.010-0---1-0..1-...****0*-
----1--0**.*-*11-011*-.-...*.*-..
-0---0--1*1.0-.0..0.-**0*....*..*
------1--01.*10**1.111..*..0.....
---0---0-0-.----.--1-..*...-*.-*1
--------1-0------01-.1**.*--*0..-
-1----------------.-*.-.1..-.01.*
---1--------0-------.1.*11*1*1-1-
--------------------.-1-1--0---01
-1---1--------0-0------1.**.-00--
-------------------------..--1-0-
---1--------0-0-0-0-----0000--0--
---------------------------------
---------------------------------
---------------------------------
---0--------0-0-0-0--------------
-----------------------0----0----
-0---0--------0-0----------------
-------------0---0---0---00---0--
---0-----------------------------
-0---------0-------0---0----0----
---------------------------------
---0---------0---0---------------
---------------------------------
-0-------------------------------
---------------------------------
---------------------------------
---------------------------------
---------------------------------
