20

13 15
31
1 9
7 4
6 0
0 0
10 0
11 2
5 9
11 2
4 7
6 12
9 9
10 2
7 9
6 2
2 7
6 6
9 3
3 1
9 3
12 0
7 2
7 4
1 9
12 6
6 10
3 10
9 12
1 12
1 4
7 0
4 11
60 7

19 10
28
14 5
7 2
0 0
7 2
13 6
6 7
3 5
12 8
2 3
13 1
4 2
14 4
2 5
10 9
0 7
13 1
5 9
4 3
2 3
4 2
1 7
9 8
13 4
0 5
10 5
16 1
9 1
11 7
20 19

4 20
34
0 19
3 13
2 1
2 1
3 19
3 5
2 19
3 19
1 7
2 7
1 7
1 18
0 12
3 6
3 8
1 8
0 10
2 16
3 8
0 4
3 16
3 9
1 15
3 12
2 10
1 4
1 11
3 18
0 11
1 7
0 16
0 15
3 7
1 10
27 2

11 20
28
3 5
5 8
2 6
9 13
9 8
1 16
10 17
10 9
8 14
10 7
8 12
5 10
0 13
6 13
10 19
1 13
6 17
9 13
2 19
10 17
7 15
1 2
5 10
1 7
0 4
1 17
8 4
4 10
6 1

6 5
9
5 1
3 4
4 4
2 1
2 2
1 4
2 3
0 3
2 3
5 3

14 16
39
12 2
3 13
5 7
4 9
2 8
8 14
10 9
2 6
11 10
11 2
11 6
3 0
12 5
4 9
6 5
6 10
11 15
0 2
7 4
1 15
7 9
1 6
13 12
0 9
11 7
5 15
0 7
9 13
11 4
0 8
5 10
0 9
1 13
2 3
7 8
6 7
8 8
2 14
8 8
18 1

3 15
15
2 13
1 8
1 5
2 0
2 9
0 6
1 2
2 12
1 7
1 5
1 12
0 3
2 10
1 5
2 14
10 9

11 17
44
7 4
7 2
7 0
10 6
4 11
0 6
0 7
8 3
0 1
5 3
8 15
6 4
0 10
2 5
2 9
5 15
2 15
5 1
9 4
1 11
1 16
9 7
2 9
5 4
6 2
2 1
6 15
3 12
4 15
0 8
9 4
2 8
9 8
8 2
0 11
3 3
4 4
2 4
10 7
10 1
8 15
6 16
9 12
9 15
29 6

17 16
25
5 13
15 0
0 4
8 15
15 8
11 3
4 9
5 4
6 8
2 5
9 1
7 7
3 8
13 5
2 7
0 13
5 15
0 10
10 8
7 2
10 14
14 5
16 10
6 9
4 3
5 5

2 19
18
1 9
1 10
0 14
1 8
1 5
0 4
1 2
0 10
1 17
0 13
0 13
1 11
0 8
1 14
1 15
0 17
1 7
1 2
22 10

11 14
22
8 6
10 10
3 1
7 7
3 1
6 2
0 1
0 1
6 10
8 10
4 3
8 4
1 3
10 11
3 9
10 7
4 8
4 2
10 3
2 11
0 7
2 13
13 6

7 17
9
6 3
4 1
0 15
4 16
4 4
2 16
0 6
5 10
2 3
14 14

7 19
18
6 1
5 12
5 5
1 0
5 10
4 7
4 11
0 3
3 7
2 6
1 12
6 8
4 13
4 1
6 14
5 6
4 12
4 10
21 9

7 5
6
3 0
4 1
6 3
4 4
4 1
5 2
5 2

10 17
25
8 9
7 7
4 8
4 4
0 14
7 5
0 2
5 5
0 6
5 5
7 7
3 5
0 1
3 14
7 1
5 4
5 6
1 3
1 1
4 1
0 0
8 15
8 10
3 16
5 10
46 20

13 15
18
11 11
8 6
0 12
1 1
11 10
3 1
3 4
12 7
0 1
6 7
9 0
5 11
8 0
1 3
6 12
7 8
2 1
5 5
8 4

19 10
33
18 3
6 4
15 0
0 9
3 2
12 6
5 6
1 0
8 2
3 0
15 6
1 6
18 3
7 0
15 7
17 8
4 5
1 7
8 9
6 3
7 1
2 1
4 7
14 2
11 6
11 0
1 0
15 4
7 9
7 8
7 2
11 1
9 0
20 6

8 7
23
0 0
5 0
4 2
0 2
0 6
7 4
5 6
2 4
3 0
0 4
2 3
4 2
5 6
3 0
4 0
4 1
4 0
3 0
1 6
3 1
5 6
4 2
0 6
5 2

16 10
26
11 1
2 9
8 5
6 1
10 2
8 9
15 4
1 8
9 1
9 3
0 9
4 9
14 0
15 0
11 8
1 5
7 1
8 3
2 1
5 0
5 1
5 7
0 5
11 9
13 8
9 5
56 18

18 17
45
0 1
4 14
7 4
11 3
17 6
17 5
14 1
1 14
6 4
3 1
4 13
6 12
5 9
0 7
14 11
9 3
3 13
17 16
9 1
7 9
3 9
4 6
7 11
14 3
11 16
6 5
2 8
8 9
0 7
13 9
1 12
0 8
10 7
1 8
15 10
3 3
2 13
11 15
15 4
5 2
5 12
13 1
9 15
4 6
0 7
11 3
