*** Life<Cell> 24x5 ***

Generation = 0, Population = 19.
-----
0----
-0---
-----
----0
-----
-0---
--0--
----0
-----
-----
-0--0
-----
0----
0----
--0--
-0---
-----
----0
--0--
----0
0-0-0
0----
-----

Generation = 9, Population = 52.
0.-.*
-00-.
10*.*
*0.10
*..1-
--.--
*0--0
*.--.
*.-00
*--*1
*--*-
*-..1
..0**
...-1
.*.--
1*.1*
-*0**
--.1*
.-*0-
--1--
.-..*
*-*-*
*..-*
.-...

*** Life<Cell> 9x21 ***

Generation = 0, Population = 1.
-----------------0---
---------------------
---------------------
---------------------
---------------------
---------------------
---------------------
---------------------
---------------------

Generation = 12, Population = 7.
-----0---------------
---------------------
---------0-----------
---------------------
---------0-----------
---------------------
-------------0---0---
---------------------
-------------0---0---

*** Life<Cell> 6x12 ***

Generation = 0, Population = 3.
-----0------
------------
------------
-0----------
------------
------0-----

Generation = 11, Population = 30.
-.*------10-
0*0-*-**--00
--00-*010--1
--*--**-1*--
0----.--0--0
1...-.-1--10

Generation = 22, Population = 16.
....1-.-.**-
-..-.....*-.
*.........-.
.***1...**..
.-**....**..
....-..--*.-

*** Life<Cell> 20x8 ***

Generation = 0, Population = 17.
--------
--00-0--
-0------
--------
00------
----0---
--------
----0---
0-0-----
--------
----0---
--------
------00
--------
--------
--------
--------
--------
-00-----
-----0-0

Generation = 27, Population = 36.
....-.-.
0*...*..
*.*..**.
........
****...-
....-...
..*.....
.....*..
*.**.*.-
*..*....
.***..0-
..**....
...*....
-..***..
...*..*.
-.......
....*-..
.-..*..*
.......1
......-*

*** Life<Cell> 21x4 ***

Generation = 0, Population = 16.
-0--
----
--0-
----
00--
--0-
0---
--0-
----
0---
----
----
----
----
0---
--0-
---0
----
-0-0
-0--
-0-0

Generation = 18, Population = 35.
.*..
*.*.
**..
-.1.
***.
*.*.
....
....
..--
..1.
....
**.1
**..
1.*0
***.
***.
.0..
*.**
*..*
*..-
.*1.

*** Life<Cell> 19x13 ***

Generation = 0, Population = 17.
-0-----------
-------------
-------------
-0---------0-
---0---------
0---------0--
--00---------
-------------
-----0-------
-------------
--------0---0
------------0
-------------
0-----------0
--0----------
-------------
0------------
-------------
----------0--

Generation = 16, Population = 83.
.**--.-..0.1-
*..*.*..*-.*.
..-*.*......-
...*.*-.-1...
..*.****....*
-*....*..0*.*
......*0.*...
..*..-.*.1..*
*.....1**1.1*
1*-.----...-.
-*.***.-.....
.0**.....0*..
.-..--..-1.0.
1-*...--.0*..
.-....1-.-**.
.**..1.0.--1*
.-1-.-*1...0*
.**-01*1*..-*
.-*-.11-**---

Generation = 32, Population = 47.
...**....-...
...**........
.............
........**...
....*...**...
-...*....1...
.............
.....**.**...
..*....**....
.*.*....*....
1.....*......
*...*..*.....
.*.*1.*.-..-.
......*.***..
.......*..*..
..........*..
.**..*...*...
.**..*.*.....
..**.-.....-.

*** Life<Cell> 15x16 ***

Generation = 0, Population = 6.
---0------------
----------------
----------------
------------0---
----------------
---------0------
------0-0-------
----------------
----------------
--0-------------
----------------
----------------
----------------
----------------
----------------

Generation = 7, Population = 123.
--0--1-1**00----
-0--0-0*1---0---
0-01-*11.01--0--
-01001*-1.*0--0-
-111**-0*0101--0
1--11-01100**1--
-0*--0101010*01-
1-*-011001*01*-0
-0--10*01010*-0-
--1--0**1001-0--
---01-*010--0---
---000-00-------
--0-001---------
-0-0-00-0-------
0---0-----------

*** Life<Cell> 20x17 ***

Generation = 0, Population = 3.
-----------------
-----------------
-----------------
-----------------
-----------------
-----------0-----
-----------------
-----------------
-----------------
-----------------
-----------------
-----------0--0--
-----------------
-----------------
-----------------
-----------------
-----------------
-----------------
-----------------
-----------------

Generation = 14, Population = 105.
--------------0--
-0-----0--1--1--0
----------------1
---0-0--11---.*..
----------1-.-.1*
---0-010--1*....-
---------0-110.-0
-0-011-100-1..1.1
--------0*-*-*-11
-010-00--*-.-*---
------0--..1-****
0--1...-..**.*-.*
------0-1-**--.0*
--00-0111**...*1*
--------0--*.---1
-0--11-10-1-..-01
---------0-0--1--
---0--00--0--00--
-----------------
-----0-0110--1-*-

Generation = 28, Population = 128.
10--*1--1..*.-1.-
*---.--.......-.*
11*1*-..*..-.****
01*.1..1.*...*...
.*---..-***.*.*.*
--01....-.*...*.*
1-*.-**.*..*.1*..
*0....0.*1-....**
--.1.*-**.....0..
.......*.***.**..
.*.1.*.*..****...
-**.......*...*..
*-1......1****...
*-....*.***......
-*...*1*.........
1-.**.-.1*..**...
011...1*.1**.-*-*
--1...**----.....
**0***1-..-..1..1
-*-*-.-**1...**..

*** Life<Cell> 18x7 ***

Generation = 0, Population = 25.
---0-0-
-------
-------
0------
-00----
-0--0-0
0--0---
--0-0--
0------
-00----
----0--
-------
-------
-0-----
0----00
0--00--
0-0----
-------

Generation = 8, Population = 62.
---.---
--0*--1
1-1*10-
..--1.1
0*.1.*.
--1**-0
*0--*0*
*-*-0--
-.*-*.1
*1.-10*
*-.*..1
-0.1-10
*11-1--
1--.1.-
-0*.0.*
11-*.0.
.*0*11-
.--.0.1

*** Life<Cell> 12x13 ***

Generation = 0, Population = 12.
-------------
--------0----
-------------
-0----0------
------------0
-----------0-
----------0--
------------0
----------0--
----0---0----
----0--------
--0----------

Generation = 3, Population = 70.
-0--------0--
0-0------0-00
-0-00-----0--
--0110----0-0
-0-00-0--0--1
0-0--0-0---01
-0--0-00101--
---010-0--1--
---0*0-0*--0-
--0-1-0-00--1
00*0-0-000100
--10--00-00--

Generation = 6, Population = 48.
-------------
-0---1---10*-
----------.--
1-.-*-----.-1
----1-------*
--0-----0---1
--1-.-*---*-0
--*1*-000-.--
1--0.1*-.-1--
*0-0.1--.11**
11.11-1-1-.--
*---*-1-*--10

Generation = 9, Population = 69.
0---0---0----
-0-0-1-0-.-.*
-0-00-0--0.--
*....1--11.-.
000-.-00-00**
-0**1-0.10--*
---0.0.01-.-*
-...**1010*-0
.0--.-.-*0.1*
.010..--..*..
.**1--.0.-.01
.1--.1*1.*-**

Generation = 12, Population = 67.
-1--0--0--1*1
*.---*0--.-*.
0.11.-0-0**--
*....---...**
0--0.-1--.0.*
00**.**.*-1*.
-011.1.-.*.*.
-.*...-1*-*.1
*.1*..*-.-*.*
...-*.-0..*..
*..1.-*1*0.-*
..--.**-**1*.

Generation = 15, Population = 78.
1*--11-100...
.***-.011.-..
-.*..----..-.
**...101***.*
--01.1*.-**.*
-1....*.**1.*
-111**.-..*..
-.****1..***.
*******0**...
**.**.*****..
...*.1...0*-.
..-0***1..-..

*** Life<Cell> 7x17 ***

Generation = 0, Population = 8.
--0--------------
-----------------
00---------------
--------------0--
------0--0-------
-----------------
----0-----0------

Generation = 2, Population = 23.
-10-0------------
--------------0--
*--0--0--0-------
------------0---0
00-----11-10-----
--------------0--
--0-0---010-0----

Generation = 4, Population = 13.
-.-------0-------
-----------------
.*---1----1------
----------1-----0
----00-..-.--0---
-----------------
-1------*1----1--

Generation = 6, Population = 42.
-.---0-0-010-----
0---------1-----0
.*--11-001.-00---
0-------0-.-0-0-0
--01-*1.*-.---10-
--------1-------0
-1-0000-.**0011-0

Generation = 8, Population = 37.
-.-010----.------
-00-------.------
.*11..0**..1-----
-01--01---.-*----
**-.1.*.*1.1111--
0----00-.---1----
-----0*-.**-0-.-*

Generation = 10, Population = 54.
0.1*1---0-.1-----
1001--1110.-0----
**1*..-..*.---0--
0-100-*-0-.-.0*--
**-.-*.....*11**-
-0--00-1*0--1-1--
11-1--*-*..0***-.

Generation = 12, Population = 49.
**-.**--*1.--00--
**-.01.-*0.0-1---
..-*..-..**--1-10
0-1**-.---.1.0.-0
.*1.-.**.*......1
----*--..--1101-1
.10-00*1...-*..1.

*** Life<Cell> 6x20 ***

Generation = 0, Population = 16.
------0---0-00------
----------0-0--0----
---------------0----
----0--0-0-0-0------
--------0------0----
-0------------------

Generation = 2, Population = 40.
----0-0----0-*1-----
----0--001*0*-1--0--
------0-0-1-1--*-0--
-00--110--0-00------
------0---0--1-0-0--
-0-00--0-0-0-0------

Generation = 4, Population = 49.
--0---0--1---*1-01--
-0----1-*1.-.-*11--0
------*----110-*---0
1*-1-.-*01-0-0-0-0--
----1-*-0-*0-1-0---0
-0--*1-0-0100*-1----

Generation = 6, Population = 49.
0-0----10*-11*-1-*1-
10--1-1-*1.*.1.*111*
-00--1.0----1--.0*--
**-1-.*.-.-0100-00--
-00-.-.--0.---------
1-1-..----*-0.-*----

*** Life<Cell> 17x20 ***

Generation = 0, Population = 2.
--------------------
---------------0----
--------------------
--------------------
--------------------
--------------------
--------------------
--------------------
--------------------
--------------------
--------------------
-------------------0
--------------------
--------------------
--------------------
--------------------
--------------------

Generation = 1, Population = 7.
---------------0----
--------------0-0---
---------------0----
--------------------
--------------------
--------------------
--------------------
--------------------
--------------------
--------------------
-------------------0
------------------0-
-------------------0
--------------------
--------------------
--------------------
--------------------

Generation = 2, Population = 7.
--------------------
-------------0---0--
--------------------
---------------0----
--------------------
--------------------
--------------------
--------------------
--------------------
-------------------0
--------------------
-----------------0-0
--------------------
-------------------0
--------------------
--------------------
--------------------

Generation = 3, Population = 19.
-------------0---0--
------------0-0-0-0-
-------------0-0-0--
--------------0-0---
---------------0----
--------------------
--------------------
--------------------
-------------------0
------------------0-
-----------------0--
----------------0---
-----------------0--
------------------0-
-------------------0
--------------------
--------------------

Generation = 4, Population = 8.
--------------------
-----------0---0---0
--------------------
--------------------
--------------------
---------------0----
--------------------
-------------------0
--------------------
--------------------
--------------------
---------------0-0--
--------------------
--------------------
--------------------
-------------------0
--------------------

Generation = 5, Population = 27.
-----------0---0---0
----------0-0-0-0-0-
-----------0---0---0
--------------------
---------------0----
--------------0-0---
---------------0---0
------------------0-
-------------------0
--------------------
---------------0-0--
--------------0---0-
---------------0-0--
--------------------
-------------------0
------------------0-
-------------------0

Generation = 6, Population = 22.
--------------------
---------0---------0
--------------------
-----------0-------0
--------------------
-------------0---0-0
--------------------
---------------0-0-0
--------------------
---------------0-0-0
--------------------
-------------0-0-0-0
--------------------
---------------0-0-0
--------------------
-----------------0-0
--------------------

Generation = 7, Population = 28.
---------0---------0
--------0-0-------0-
---------0-0--------
----------0-0-----0-
-----------0-0---0--
------------0-0-0---
-------------0-0----
--------------0-----
--------------------
--------------0-----
-------------0------
------------0-------
-------------0------
--------------0-----
---------------0----
----------------0---
-----------------0-0

Generation = 8, Population = 8.
--------------------
-------0---------0--
--------------------
-------------------0
--------------------
---------------0----
--------------------
--------------------
--------------------
---------------0----
--------------------
-----------0-0------
--------------------
--------------------
--------------------
-------------------0
--------------------

Generation = 9, Population = 28.
-------0---------0--
------0-0-------0-0-
-------0---------0-0
------------------0-
---------------0---0
--------------0-0---
---------------0----
--------------------
---------------0----
--------------0-0---
-----------0-0-0----
----------0---0-----
-----------0-0------
--------------------
-------------------0
------------------0-
-------------------0

Generation = 10, Population = 19.
--------------------
-----0---0-----0----
--------------------
-------0-------0---0
--------------------
-------------0---0-0
--------------------
--------------------
--------------------
-----------0-----0--
--------------------
---------0-0-0------
--------------------
-----------0-0-----0
--------------------
-----------------0-0
--------------------

Generation = 11, Population = 50.
-----0---0-----0----
----0-0-0-0---0-0---
-----0-0-0---------0
------0-0-----0-0-0-
-------0-----0-0-0--
------------0-0-0---
-------------0---0-0
--------------------
-----------0-----0--
----------0-0---0-0-
---------0---0---0--
--------0-----0-----
---------0---------0
----------0---0---0-
-----------0-0---0--
----------------0---
-----------------0-0

Generation = 12, Population = 31.
--------------------
---0---0---0-0-0-0-0
--------------------
---------------0-0--
--------------------
-------0---0---0-0-0
--------------------
-----------0-0-----0
--------------------
-----------0---0---0
--------------------
-------0-0-----0-0-0
--------------------
---------------0----
--------------------
-----------0-0-0-0-0
--------------------

Generation = 13, Population = 64.
---0---0---0-0-0-0-0
--0-0-0-0-0---------
---0---0---0-0-----0
--------------0---0-
-------0---0-------0
------0-0-0-0-0-----
-------0-----0-0-0--
----------0---0---0-
-------------0-0----
----------0-0-0-0-0-
-------0-0-0-----0--
------0---0---0-----
-------0-0-------0-0
--------------0-0---
-----------0-0---0-0
----------0---------
-----------0-0-0-0-0

Generation = 14, Population = 38.
--------------------
-0---------0---0-0--
--------------------
---0-----------0-0-0
--------------------
-----0-----0-0---0-0
--------------------
-------0-0-0-0-0---0
--------------------
-------0---0-0-0-0-0
--------------------
-----0-0-0---0-0---0
--------------------
-------0-0-0-----0--
--------------------
---------0-0---0----
--------------------

*** Life<Cell> 20x2 ***

Generation = 0, Population = 6.
--
--
--
--
--
--
-0
--
--
--
-0
--
--
-0
0-
--
0-
--
-0
--

Generation = 3, Population = 19.
--
--
--
-0
0-
--
0-
-0
--
-0
01
--
1*
-1
--
01
0*
0-
*1
00

Generation = 6, Population = 13.
-0
--
-0
--
-0
--
--
-0
0-
-1
-1
-*
..
-*
00
--
-.
-0
.-
-0

Generation = 9, Population = 19.
0-
--
0-
-0
-0
-*
1-
--
1-
0*
*-
*.
..
0.
*-
-*
1*
01
.-
0-

Generation = 12, Population = 17.
--
-1
01
--
0-
-.
--
1-
*-
**
*-
..
..
..
*-
0*
*.
1*
*1
--

Generation = 15, Population = 17.
1-
-*
1-
0*
--
**
--
*-
.-
**
*-
..
..
..
.-
1*
**
**
.-
-.

Generation = 18, Population = 17.
*-
-*
**
0*
0*
**
*.
*-
..
..
.1
..
..
..
.-
*.
..
..
**
0.

Generation = 21, Population = 7.
.-
*.
**
*.
..
..
..
.-
..
..
.-
..
..
..
.-
..
..
..
**
-*

Generation = 24, Population = 7.
**
**
..
..
..
..
..
.-
..
..
.-
..
..
..
.-
..
..
..
**
-*

Generation = 27, Population = 7.
**
**
..
..
..
..
..
.-
..
..
.-
..
..
..
.-
..
..
..
**
-*

Generation = 30, Population = 7.
**
**
..
..
..
..
..
.-
..
..
.-
..
..
..
.-
..
..
..
**
-*

*** Life<Cell> 20x22 ***

Generation = 0, Population = 13.
------------------0---
------------------0---
---------0--0---------
----------------------
----------------------
---------0------------
----------------------
----------------------
----------------------
----0---0-------------
----------------------
-----0----------------
-------------------0--
----------------------
-----0---------00-----
----------------------
----------------------
----------------------
-----------0----------
----------------------

Generation = 7, Population = 213.
----0----*--0-1-1-.---
---0-0---.-1--.0---0-0
--0---*-1-**------*---
----1---**-00-1---*-0-
--00--0-**0-1--00-.010
-01*-.-*-0---0-1101-10
0-0---0-0-------00-1--
-00--*-1-*---1-00-1--0
-0-00-0-0*0-*--1-1--0-
1*001*-*1.0---100-00--
-001010-00---1**-*-1--
--0*.-0*-*-1-0000-000-
-*-00*000----10.**0-*1
0-10**1-0---00-0000--0
-0-1-*01---*1-.-1.-..-
-00-*1011-0-0--00001-0
0-00-*-10--110-1*1---1
-0-00-0--0-0000-000-00
--0--1--0---0110-0110-
---0-0-0-----00---00--

Generation = 14, Population = 193.
0--0-.--..-.--*.1-*-.1
0-*0**--*.-*1-.-*****1
00-..0..*-......-1.-**
-*1--*0.**0-.*.1..**.*
1.-01.-.***1.--0-**.1-
-*-*1*0***-1-0-.*..---
0--*-1110*.---.-.**-0-
.--....*1*--...0.0--1-
--0--.*-1.-*.*0-**1---
...1-.-..*..--*1.0.**-
1.1*.*-0-*-.01..**0.0-
.*0..0*..*1*1.*.1*-.11
-.-..*..0*--1*0.*..*..
*..1*.*...--*--*01-*1-
-...**-..1*..1.*.*-..-
-*-1.*.**.-*.--**.-.*1
----1.0..-0*.-.**.*.-.
--00.1.00.0-01*-.-*-1-
--0*-.--0*0*---.1*.***
1--1.*--.-1---*00*1-00

Generation = 21, Population = 155.
.***1.*-..-**1...-....
-*....1.**.....-...**.
-0-.*....-.*....-..-..
-.....****1-..***..*..
*.0***-*.***..*....*.*
*.-...*.....*...*..*.*
*-*.-..--...*-**....**
*1-...*.*.--***1.-.-*-
-.*1*..1.......*...-**
.*****-........**0.*.*
.*-***......-.....-*11
..**.*.**....**..*..**
..-*.*.*..--*.*...*.**
....*...**.*.*..-*1..*
........**...**.*...**
..1**.*..*0...*.*.....
-1-.*.**.01.........**
10-.*...*.--*....1..*0
.*-*-.-...0.-.-..*..**
1.....*...*.11**-...-*

Generation = 28, Population = 139.
..**.*...***.....1....
-***.*..*.........**..
*.**.**.*1.*..*...*.*.
-*....***...........*.
**....-**..........*..
**1....**...**........
.*.....*-...***.......
......*....-......*.*1
.....*......*...*..***
.*....-...**.***.....*
**.*..***.**-.*..*-...
.*..**....*...**......
.*....*..**.***..*....
.*......***.**.***....
....*....**..*.***....
.**.**..**.**.........
-*...*...--..*........
.*......**-**..**.....
*.*..*1*...**.......**
.**..........****...**

Generation = 35, Population = 66.
.......***.......1....
-....*...*.......*....
.....****........*....
.....*................
......................
.......**.*...........
.........*.*....*.....
......**.*.1....**...-
....***.*.......*.*...
....**..*........**...
.......*....*.....*...
.......*....**.*....*.
............*.........
..............*.*.*...
..............*..*....
.........**....*......
-..............*......
.......*..-.*.........
......**.....*......**
..........*.**......**

Generation = 42, Population = 61.
.........**......*....
-........**.....*.*...
...............*..*...
...............**.....
........*......***....
.......***....*...*...
........**...*........
.............*.....*.-
......................
.....*.**.**....*.....
.....*.*........****..
.....***..*.....**....
...........*.*...*....
................*.....
..............**......
..............*.......
-.....................
......**..-..*........
......**......*.....**
.............*......**

*** Life<Cell> 15x12 ***

Generation = 0, Population = 15.
----00------
------------
-------0-0--
------------
--0---------
------0-----
-------0----
0----------0
-----------0
------------
---0--------
------------
0-----------
---0--------
-0-0--------

Generation = 7, Population = 87.
*-*****.**1-
*-----.*-0-1
--0.-1--*-0-
.---0**00--*
*-0-.*.--00.
.0-0*---11*-
-010-0-10.-1
*-*-1-0111-*
0-11*10-0.1*
.-1.0-----1*
1.0**-0-01-1
11-1---1--0*
*.*-.------*
-.0---010---
.1-.-.--01-1

*** Life<Cell> 15x11 ***

Generation = 0, Population = 2.
-----------
-----------
-----------
-----------
-----------
-----------
-------0---
-----------
-----------
-----------
-----------
---0-------
-----------
-----------
-----------

Generation = 2, Population = 8.
-----------
-----------
-----------
-----------
-------0---
-----------
-----0---0-
-----------
-------0---
---0-------
-----------
-0---0-----
-----------
---0-------
-----------

*** Life<Cell> 15x16 ***

Generation = 0, Population = 7.
----------------
-0-----0--0-----
----------------
----------------
----------------
----------------
--0-------------
----------------
-------0--------
----------------
----------------
----------------
--0-------------
----------------
-----0----------

Generation = 35, Population = 52.
.-......***..-..
.-..-..*........
.........*.*....
........*...**.-
**.......*1.**..
*.........**..*.
.1.........***..
**...1**..-**.1.
.....****-**....
....***....*....
...***.**.......
-...........-.*.
.........*.....*
..........*..**.
................

*** Life<Cell> 25x25 ***

Generation = 0, Population = 22.
------------------------0
---------0-----0---------
-------------------------
-------------------------
-------------------------
---------0---------------
0----------------------0-
-------------------------
--------------0--------0-
-----------------0-----0-
--0----------------------
0------------------0-----
-----0-------------------
----------------0--------
-------------------------
------------0------------
-------------------------
-------------------------
-------------------0-----
-------------------------
-0------0----------------
-------------------------
----------------------0--
-------------------0-----
----------------0--------

Generation = 19, Population = 210.
01--.*.*.10*------*..-*..
--.*--1-1--1-*.0**-..**.-
-**...-*1.-101*-***...*.*
*1.-*.0-.*.00-.01*..1.1.*
**.....-*.0**.-.*.*..-*-*
...--*.*1*-....-1.*.*.*0*
-.**...*.....-0*.*..-..*.
.**0...-....*-..1..-*--*.
.*-.*....*.-11**....**..*
1.*-*-1-..--*-.*-.......1
.**.***....-**.*1.0...**.
.-.-*..-..******.........
.*....**..-..*..0..*-...-
.11**.1-...-*.**...-....-
.0*11..1..1.*...--..*-**.
*..1*-.-....----1.-.....-
*..*.-.......--..-*.--...
.-1*-.-*.1.-..0*...*.*...
1-..1-...-1-.1-1..-......
.-.-..*.----.-.*.-.-**...
*.--*.*....1.*0.**.*11...
*.0..-*--..-.*.*..1*..1.*
..*...1-..1.*1.*..**..*.*
-.*-*--.1-**...--.***--*1
.*-1--*--*.-.-..1**......

*** Life<Cell> 25x16 ***

Generation = 0, Population = 7.
----------------
-0--------------
----------------
----------------
----------------
----------------
----------------
----------------
----------------
----------------
----------------
----------------
----------------
----------------
----------------
----------------
------0------0--
----------------
----------------
-------0--------
----------------
----------------
------0---------
----------------
---0----------0-

Generation = 18, Population = 136.
----0-0-0--0-*-1
-------0---0-.--
------0-----0.0-
-----0---0---.-0
------0---------
-------0--0-----
---00----.*0--0-
-------01.*00---
-0---011...11*0-
---1-0---1-00---
------**--1-0*0-
-01*-*---**1-*-0
---.0..-01-*11*1
---*----**1*.-0-
0-*--.--**..1-0.
*-.-**-0*.*.---*
...*-*.****....*
-.-.-.1..0-....-
0*...-..*...*0-*
1...****-*.0*.*-
00**...-**-....*
-.**-*.--.1-..11
..*.*.***--1..*.
.*....1.*...*.0*
.-.....**..**...

*** Life<Cell> 11x25 ***

Generation = 0, Population = 25.
---------0---0-----------
-----0------------------0
-------0-----------------
---------0---------------
-------------------0-0---
--------0----------------
--0---0---00-0-0---------
--------0--------0-------
---------------0---------
--00-0-----------------0-
-0-----0-------0---------

Generation = 20, Population = 104.
.-..1-.....-..*01......*.
..1.....**.0..**..**...-*
..-....****..1*..*1*....-
..**.**..***.*.***.*-*...
*.-.1.*.-.0***.-*.....*.*
*1..*-**1..01*.*-.-*0.**.
.**0.-......-....*-..-1..
.*.*.***......**.***1.*..
.**..***1.**1.*..**.1.*.0
.**....*.....-*....*....-
..-.....-....1*.**-**-..*

*** Life<Cell> 3x9 ***

Generation = 0, Population = 10.
0---000--
-00----0-
00---0---

Generation = 33, Population = 0.
.........
.........
.-.......

*** Life<Cell> 18x22 ***

Generation = 0, Population = 25.
-------00------0------
--00------------0-----
----------------------
0------------0--------
----------------------
-----------0----------
----------------------
-------------0--0-----
--0--0----------------
------0---------------
0---------------------
----------------------
------0------------0--
-----0----------0-----
-------------0--------
----------------------
------------0------0--
--0--0--------------0-

Generation = 14, Population = 163.
--11*...***..1.1-.**00
.*.*.-.1-*.*-..*1**00-
**..-*-..-*..-......*.
-*.-.-.*-1..*-.....*.*
-1-.**.-.***......-*1-
-.**.1....001-...*-*.1
..1*0.0..-....-.-0----
.-*.0*.0---.....***...
....**-.1*-*0.*1..*.-*
***..1--1--1*.*0.*--..
1-**1*.*01**..--*-*--.
..----.--*.-*.*.-*0--*
...0*--*-.....*--0-0-0
....0*10.*.*.*--**0--0
*-.0-.-*1*.**1..*1----
.--**11-11*.-0--0.***0
.-.*1*.10..-*.*.**...*
-.1*..-*--**0.**-1*.-*

*** Life<Cell> 23x18 ***

Generation = 0, Population = 13.
------------------
---------------0--
------------------
-----0------------
------------------
----0-------------
------------------
----------0-------
----------0-------
-------------0----
-0-------0--------
------------------
------------------
--------0---------
-0----------------
------------------
---------0--------
------------------
------------------
------------------
------------------
------------------
0------------0----

Generation = 8, Population = 77.
----------1-------
-------1--.-------
-1--0----1.-------
-011.01---1--*----
-.--0---*-.0------
--*00.-1-0**---*--
-1----.001.111.---
--1--*-..-.-0...--
--0--0-.-.*0.11---
-----**-*-1-------
-0---0---0*------0
-----1---**--.----
--------1*0-------
0---0----0----.-1-
0----0---*---.----
----------1--.----
**--------1--*---0
-------------1----
-*.------0--------
------------------
------------------
--------0---------
-0---1*-10-----0--

Generation = 16, Population = 180.
-.000--0**111---0-
-..**0.*--.*0-1--0
0.0*11..-**-*.-01-
.--......1****-1*1
..-*.--..-*.**-010
-*.**...0-*.1...-.
11..-0.*-**....--.
.1..1.1**..-......
.*11.-..****..*.**
.-1.1****-*11-*--*
*..--..---*-*-**-0
-*.....-..*01.-*--
...1.1-..*-.1-00--
.*1-...-.*.*.-**--
--*-**1-**-**.-0--
-1-.--0---.1..*1-0
.*..*---***.-..---
.0*.-0*0-1-*0.01.-
....1.-1-*1-**..-1
--*-0-1-.-*01*00*.
.*0-1..1..*1*.0-1-
001--0--*0110.*.--
-.1**..*-****-*-0-

*** Life<Cell> 11x7 ***

Generation = 0, Population = 22.
---0--0
0---00-
-0--00-
---0---
-0-----
--0---0
000-0--
--0---0
-------
---0-0-
0--0---

Generation = 28, Population = 26.
.**....
*.*....
*.**...
..*1***
.**.*.*
...***.
.-..*..
....***
....*.*
.....*.
.......

*** Life<Cell> 9x22 ***

Generation = 0, Population = 22.
-----------0----------
--------------0----0--
-0--------0-----------
-----00---00-0---0----
---------------------0
----------------------
---------00------0-0--
--0----------0--------
--0---0-0------0------

Generation = 15, Population = 71.
--..0..-0......*.-***.
-*0.....**.-.*..-..-.*
.***....*-.**-*...-...
.**-**.*.*****.*..*-.1
.0.10....**-1..1.....-
....-...-*.1.-.*-*..--
..**...****.*-*.*.-.-*
.0**........-***1-0.*.
.-**.****..*..1.....0.

*** Life<Cell> 23x4 ***

Generation = 0, Population = 14.
--0-
----
-0--
--0-
----
0-0-
---0
----
-0--
----
0---
0---
0---
----
----
---0
----
----
-0--
--0-
----
----
-0--

Generation = 9, Population = 34.
*.-.
.-.0
-..*
--.-
0..*
***-
*0--
*---
.*--
.1.*
..--
--1.
-..-
.--0
.-00
..--
*-..
*0.*
-*1.
0..*
**01
00-1
--0-

*** Life<Cell> 25x5 ***

Generation = 0, Population = 3.
-----
-----
-----
-----
-----
-----
-----
-0---
-----
-----
-----
0----
-----
-----
-----
-----
-----
-----
-----
-----
--0--
-----
-----
-----
-----

Generation = 3, Population = 33.
-----
-----
-----
-----
-0---
0-0--
-0-0-
--0-0
00-0-
110--
-00--
---0-
--0--
-0---
0----
-----
-----
--0--
-0-0-
0-0-0
-0-0-
0-0-0
-0-0-
--0--
-----

*** Life<Cell> 12x8 ***

Generation = 0, Population = 22.
------0-
-0------
--0-----
---0--00
--------
---00---
--0-0---
-0----0-
------0-
0-0--00-
---0---0
000-----

Generation = 1, Population = 38.
-0---0-0
0-----0-
------00
----0011
----0-00
---1-0--
---0100-
0---0010
000----0
----01--
-00-00--
1-1----0
