22

37 69
15
21 18
21 46
33 10
17 38
32 34
4 67
16 9
30 31
31 66
6 27
36 33
27 58
14 27
5 33
33 1
917 78

50 44
22
49 0
40 2
45 20
10 8
7 2
46 5
5 31
34 33
21 6
12 12
18 9
4 18
38 2
43 21
33 23
21 9
18 6
17 13
37 23
33 41
11 22
38 23
186 166

30 8
4
25 3
12 6
4 3
12 6
747 182

26 96
5
23 23
3 12
5 84
20 86
7 53
876 150

105 83
1
87 45
366 104

58 55
8
3 8
54 14
41 35
1 6
19 25
30 25
42 52
48 13
985 61

12 34
18
1 4
4 25
1 13
5 11
8 30
4 18
9 17
1 6
10 22
5 14
5 8
4 17
4 21
4 3
5 7
0 16
6 31
0 4
323 173

105 46
24
58 7
59 2
103 14
47 43
58 15
2 20
32 17
68 39
42 26
54 38
97 23
98 4
56 4
37 22
6 6
35 38
65 30
75 30
94 20
81 24
20 36
26 19
66 35
31 15
345 107

22 52
4
12 25
14 49
13 11
2 34
335 195

4 100
21
3 57
2 41
3 78
2 45
3 30
1 21
2 70
0 60
3 92
0 56
3 28
1 34
1 49
1 26
1 4
1 29
3 41
0 55
0 52
2 38
2 96
1000 74

73 24
30
55 5
0 12
46 20
40 12
60 22
59 9
33 18
17 18
63 8
40 7
33 1
51 11
32 17
68 10
48 13
59 4
13 20
50 9
58 2
63 1
45 1
35 18
20 18
61 0
67 23
49 21
50 8
45 0
24 22
29 20
170 69

118 51
27
100 20
116 11
19 26
99 42
25 50
7 2
108 31
12 20
18 9
96 15
70 32
82 25
92 8
48 36
41 40
63 44
111 10
100 50
13 8
3 22
88 32
73 38
68 4
103 42
92 37
38 4
110 32
345 16

19 51
10
16 30
8 2
2 20
12 12
12 4
17 32
9 29
18 34
3 8
0 47
456 34

52 33
16
30 2
0 29
28 4
38 23
34 21
16 2
10 13
2 26
17 12
9 5
26 9
18 26
51 5
38 9
7 15
16 32
789 87

16 53
4
7 38
9 16
8 27
1 29
345 38

36 10
25
6 7
15 6
21 6
14 1
6 8
11 6
6 0
12 4
14 0
17 2
6 1
25 5
34 8
18 1
21 0
0 5
12 7
1 9
24 3
15 8
29 8
17 4
19 5
33 0
33 7
251 140

101 30
17
56 25
70 22
29 18
6 10
70 28
62 16
39 3
18 5
14 18
53 7
67 5
38 2
76 8
16 18
57 7
73 7
40 0
385 72

103 59
6
62 22
91 52
55 49
8 15
12 19
0 31
209 127

75 43
20
22 24
14 1
10 31
27 4
58 37
28 9
7 29
24 9
63 29
72 3
29 20
5 33
57 32
24 2
30 20
65 13
36 40
20 25
74 42
1 13
989 25

58 70
13
31 49
9 4
18 3
12 17
44 16
8 62
21 35
39 52
22 62
29 60
16 19
27 50
5 67
578 53

39 22
17
17 19
14 1
11 6
22 9
6 6
11 14
3 21
7 8
30 15
10 20
25 3
9 2
15 6
17 8
25 21
27 1
5 7
353 62

83 4
26
32 3
48 1
77 1
82 3
62 3
38 1
17 1
80 3
22 3
65 2
26 3
44 2
7 2
42 2
30 1
14 2
56 2
56 2
36 0
23 2
25 3
36 2
3 3
39 2
4 3
77 2
313 119
