29

9 17
17
4 9
1 11
6 9
7 8
3 4
7 13
3 2
5 6
6 8
1 7
6 13
6 8
1 12
5 16
3 2
6 12
5 13
3 6

10 2
12
7 1
8 1
3 1
5 1
2 1
2 1
4 1
1 1
4 1
1 1
7 1
4 1
4 9

14 11
11
1 6
6 10
4 8
13 9
13 10
1 5
3 6
11 10
12 10
2 8
4 1
6 5

20 5
15
3 3
2 2
11 1
9 4
3 2
5 2
8 4
13 4
10 4
7 1
17 2
6 1
16 2
3 1
1 4
9 6

9 8
5
3 5
6 1
2 4
2 6
5 2
5 9

17 3
18
10 1
7 1
1 2
8 1
12 1
13 1
6 2
10 2
3 1
12 1
7 1
2 2
6 1
16 1
5 1
6 2
4 2
5 2
4 10

12 9
13
1 6
7 4
5 4
6 4
4 7
4 6
3 2
1 5
10 2
9 4
3 2
7 1
5 1
5 5

11 13
15
9 6
5 12
8 12
4 3
5 5
6 6
10 10
5 1
2 10
6 1
7 11
2 4
8 6
2 3
6 2
6 6

13 5
16
12 4
11 3
4 3
7 3
1 4
5 3
10 2
3 1
11 4
11 4
9 4
12 4
1 3
12 2
5 4
11 4
6 9

15 17
19
1 8
14 11
12 3
7 6
1 14
3 13
8 8
11 6
3 5
10 11
14 12
1 14
9 16
6 10
10 13
14 4
5 10
8 14
8 2
4 4

20 2
7
15 1
1 1
18 1
3 1
2 1
15 1
6 1
8 5

5 12
19
2 2
3 1
4 2
2 7
2 8
4 1
1 8
2 7
4 2
4 1
3 9
2 7
1 3
2 2
3 3
4 7
2 2
1 1
3 9
7 9

14 2
12
2 1
8 1
10 1
11 1
13 1
4 1
12 1
6 1
11 1
2 1
4 1
2 1
3 6

13 19
11
9 9
3 4
3 17
5 11
5 10
11 2
1 4
12 13
10 13
7 5
2 18
10 10

17 11
13
15 2
14 3
5 10
9 10
10 4
3 4
12 8
4 2
10 3
1 8
10 4
14 9
15 3
6 4

2 4
17
1 2
1 1
1 1
1 1
1 1
1 1
1 1
1 3
1 2
1 2
1 2
1 3
1 2
1 3
1 2
1 1
1 2
7 9

12 14
12
4 4
5 5
6 7
5 12
5 11
1 2
4 4
2 3
5 5
3 7
10 7
6 1
5 3

8 4
11
3 3
3 3
4 1
2 3
3 1
1 2
2 1
4 2
4 1
1 2
5 3
8 3

6 10
5
1 4
3 2
5 2
4 7
5 8
3 9

6 5
6
2 3
4 1
4 2
5 2
4 2
5 1
6 5

13 20
18
4 2
7 5
2 17
3 13
7 15
11 10
5 10
3 17
8 14
7 7
7 16
9 14
3 15
9 3
6 16
1 19
4 2
5 8
5 9

19 6
12
3 4
3 2
18 3
16 3
13 5
11 3
14 2
14 3
8 5
4 4
9 5
11 3
4 7

15 19
14
11 9
10 10
8 6
4 9
1 2
7 13
6 3
12 15
5 10
10 14
14 2
2 16
5 2
8 8
10 6

4 7
11
1 2
1 2
1 6
1 3
3 6
3 2
3 2
3 5
3 5
2 4
1 1
7 10

3 18
11
1 15
1 4
2 9
1 16
2 6
1 13
1 15
2 3
2 12
2 17
2 15
6 4

4 19
18
3 16
1 16
1 8
2 15
3 10
1 2
3 12
1 6
1 9
1 8
2 5
2 11
3 14
3 1
3 12
3 8
3 11
2 7
9 6

19 12
15
16 10
3 3
10 4
16 8
8 5
6 6
8 9
8 3
7 10
8 11
10 5
1 8
10 9
7 3
17 3
6 10

2 17
7
1 8
1 11
1 1
1 7
1 7
1 2
1 14
8 7

3 15
5
2 8
2 2
2 4
1 4
1 8
8 5
