*** Life<Cell> 8x8 ***

Generation = 0, Population = 7.
--------
----0---
0-------
--------
--------
-0---0--
-0---0--
----0---

*** Life<Cell> 1x7 ***

Generation = 0, Population = 7.
0000000

*** Life<Cell> 6x6 ***

Generation = 0, Population = 10.
------
-0---0
0--0--
-000--
00----
-----0

Generation = 2, Population = 15.
0--0--
-011-0
--0--1
1--010
--0---
-10---

Generation = 4, Population = 18.
-0-*--
-*.1-*
--*-01
11---0
*-*-11
-*0--0

*** Life<Cell> 9x7 ***

Generation = 0, Population = 15.
00-----
0----0-
0--0-0-
-0-0---
------0
------0
0------
---0---
--0---0

Generation = 2, Population = 27.
0*1--1-
000----
--1*-*1
00-*--1
---101*
-0--0-*
0------
-0---01
--0----

*** Life<Cell> 5x8 ***

Generation = 0, Population = 6.
0---0---
--0-----
00------
--0-----
--------

*** Life<Cell> 1x6 ***

Generation = 0, Population = 3.
0-0--0

Generation = 2, Population = 4.
--0110

*** Life<Cell> 5x1 ***

Generation = 0, Population = 5.
0
0
0
0
0

Generation = 2, Population = 2.
-
0
-
0
-

*** Life<Cell> 2x1 ***

Generation = 0, Population = 1.
0
-

Generation = 2, Population = 1.
0
-

*** Life<Cell> 1x3 ***

Generation = 0, Population = 3.
000

*** Life<Cell> 4x8 ***

Generation = 0, Population = 16.
0--00000
-0--0--0
-00-00--
-0-0---0

Generation = 2, Population = 13.
--1-*--0
-*0--10-
--*1-*--
-*--0--0

*** Life<Cell> 5x3 ***

Generation = 0, Population = 11.
000
000
-00
-0-
-00

*** Life<Cell> 1x5 ***

Generation = 0, Population = 3.
00-0-

*** Life<Cell> 10x5 ***

Generation = 0, Population = 5.
0----
----0
-----
-0---
-----
-----
---0-
-----
-----
--0--

Generation = 2, Population = 15.
--0--
-00-0
0----
---00
---0-
-0---
-0---
--0--
---0-
0-0-0

*** Life<Cell> 2x5 ***

Generation = 0, Population = 7.
0000-
0--00

Generation = 2, Population = 4.
0---0
-0-0-

Generation = 4, Population = 0.
-----
-----

*** Life<Cell> 2x2 ***

Generation = 0, Population = 2.
00
--

Generation = 2, Population = 0.
--
--

Generation = 4, Population = 0.
--
--

*** Life<Cell> 6x1 ***

Generation = 0, Population = 6.
0
0
0
0
0
0

*** Life<Cell> 7x1 ***

Generation = 0, Population = 6.
0
-
0
0
0
0
0

Generation = 2, Population = 3.
-
0
-
0
-
0
-

Generation = 4, Population = 2.
-
0
-
-
-
0
-

*** Life<Cell> 7x10 ***

Generation = 0, Population = 7.
-0--------
-0--------
0-------00
----------
-------0--
----------
------0---

Generation = 2, Population = 20.
1*-0----00
---0------
000---0--*
-0--------
0----01-1-
----------
----0-010-

Generation = 4, Population = 22.
..0--0-1**
-1---0----
-**--101*.
----------
-0-0--.--1
-0--------
0-0----1*1

*** Life<Cell> 3x6 ***

Generation = 0, Population = 5.
-----0
-0--00
-0----

Generation = 2, Population = 7.
-1-0--
--1--0
-*-0-1

*** Life<Cell> 4x3 ***

Generation = 0, Population = 9.
00-
-0-
000
000

*** Life<Cell> 5x10 ***

Generation = 0, Population = 11.
--------0-
----0--0--
----0-----
00---0----
0-0-0-0---

Generation = 2, Population = 17.
----1-0-0-
000---1--0
1---*---0-
0-0-1-----
*-0-----0-

*** Life<Cell> 5x3 ***

Generation = 0, Population = 5.
-0-
0--
00-
0--
---

Generation = 2, Population = 8.
0--
--0
**1
--0
10-

*** Life<Cell> 3x3 ***

Generation = 0, Population = 9.
000
000
000

Generation = 2, Population = 0.
---
---
---

*** Life<Cell> 6x9 ***

Generation = 0, Population = 3.
------0--
---------
---------
-------0-
-0-------
---------

Generation = 2, Population = 9.
----0-0-0
-------0-
-0----0--
-----0---
---0-----
-------0-

*** Life<Cell> 2x5 ***

Generation = 0, Population = 2.
-0---
---0-

Generation = 2, Population = 4.
-0-1-
-1-0-

Generation = 4, Population = 2.
---*-
-*---

*** Life<Cell> 4x1 ***

Generation = 0, Population = 4.
0
0
0
0

Generation = 2, Population = 2.
-
0
0
-

*** Life<Cell> 7x3 ***

Generation = 0, Population = 11.
00-
0--
0-0
---
000
0-0
0--

Generation = 2, Population = 9.
0*-
0-1
--0
--0
--0
---
*1-

*** Life<Cell> 1x5 ***

Generation = 0, Population = 5.
00000

Generation = 2, Population = 2.
-0-0-

Generation = 4, Population = 2.
-0-0-

*** Life<Cell> 6x3 ***

Generation = 0, Population = 4.
---
0--
---
---
00-
--0
