20

4 17
17
0 7
3 1
2 6
1 5
2 3
3 15
3 5
2 15
1 7
3 2
0 5
0 1
0 5
3 7
3 9
1 2
1 8
5 1

20 19
17
3 13
19 3
16 9
7 0
1 4
9 9
18 7
7 17
15 8
1 6
9 7
12 10
9 4
6 13
19 9
4 0
7 11
5 1

16 5
17
9 1
10 1
4 3
14 1
14 4
8 1
3 4
0 2
4 0
12 4
12 4
5 1
2 0
7 1
14 2
4 0
4 1
5 1

13 15
17
3 4
10 3
0 8
2 3
2 9
12 11
4 4
2 9
5 3
6 7
12 5
5 0
10 0
7 6
3 3
10 0
12 1
5 1

8 8
17
3 0
0 7
0 2
1 6
7 0
0 5
6 3
4 6
0 6
0 1
0 2
3 1
2 0
5 7
5 5
3 6
2 6
5 1

15 19
17
7 9
13 1
1 7
8 2
5 8
9 15
12 4
6 10
12 9
0 17
10 0
1 18
3 17
3 14
11 9
8 7
3 15
5 1

8 11
17
4 8
3 10
3 3
0 1
7 8
5 10
7 4
4 6
1 6
4 1
1 9
4 4
6 5
1 6
1 5
2 3
2 1
5 1

17 11
17
5 7
9 8
0 6
12 0
10 5
2 1
9 6
15 0
15 3
15 8
9 6
10 7
1 3
15 7
13 4
15 5
11 2
5 1

4 3
17
1 0
3 1
1 2
1 0
3 0
2 1
1 2
0 0
3 2
3 1
3 1
3 0
0 2
2 0
0 0
1 2
3 1
5 1

19 6
17
10 0
5 0
5 5
13 3
7 0
2 4
7 4
1 5
10 0
0 4
14 2
8 4
11 3
12 2
4 3
10 4
4 0
5 1

12 6
17
7 3
11 4
10 1
9 3
3 0
7 0
8 2
8 1
4 3
0 1
1 3
9 2
5 3
1 4
7 1
4 2
11 2
5 1

11 3
17
0 1
9 2
7 0
0 1
7 2
1 2
0 0
8 2
7 0
6 2
6 1
5 0
3 1
2 1
8 2
0 1
0 0
5 1

13 20
17
10 14
10 6
8 10
9 11
12 16
3 8
0 16
4 6
7 2
1 2
6 13
2 2
12 13
1 3
8 14
9 19
2 3
5 1

2 13
17
1 0
0 3
1 0
0 5
0 4
0 2
1 7
1 4
0 10
0 10
1 12
1 7
0 1
0 4
0 4
0 2
0 11
5 1

9 6
17
8 4
4 4
1 3
2 5
8 2
0 5
0 0
1 1
6 1
2 5
3 0
2 5
8 2
4 2
2 1
0 3
0 2
5 1

9 19
17
0 0
6 11
8 10
5 12
3 17
1 17
4 7
5 15
2 17
1 2
4 6
0 4
0 7
0 15
7 5
8 13
3 7
5 1

5 14
17
2 13
3 4
1 3
3 0
2 1
3 0
3 7
3 11
4 13
1 12
1 7
3 11
4 1
4 7
3 1
3 3
4 7
5 1

9 16
17
5 12
8 15
0 1
0 6
7 8
1 7
3 15
6 7
4 14
7 13
4 5
1 1
1 3
3 13
4 0
8 10
5 13
5 1

13 12
17
12 6
6 5
5 11
1 3
8 9
0 6
10 1
8 1
6 2
2 2
7 6
3 6
11 10
6 11
11 8
2 7
9 3
5 1

19 6
17
0 5
11 0
17 4
18 4
6 4
16 2
18 4
4 0
17 3
13 0
10 4
0 0
7 0
14 2
17 4
3 3
14 3
5 1
