23

8 19
19
4 9
3 7
4 15
3 13
1 0
0 14
2 14
7 4
7 7
6 11
7 10
3 9
6 1
1 14
6 16
3 2
4 7
5 17
2 15
9 2

12 16
24
6 15
5 7
3 13
5 10
10 0
10 3
2 5
2 8
7 1
5 3
10 2
8 8
10 8
1 5
2 10
6 7
5 5
5 11
9 12
10 7
11 6
8 13
1 13
11 15
8 4

13 16
24
3 1
5 4
9 5
2 2
1 0
7 1
5 9
5 12
0 7
11 10
1 5
11 13
6 7
7 6
5 2
9 0
9 3
1 1
1 4
11 12
8 13
2 3
2 12
7 5
15 2

9 13
14
4 4
4 10
7 4
1 2
7 7
1 1
6 8
5 7
4 8
7 5
4 1
8 5
7 8
2 8
13 1

19 16
17
11 7
15 11
0 4
10 2
15 4
11 13
9 6
4 6
9 12
18 0
4 2
1 7
14 9
5 6
12 5
15 12
0 11
10 1

8 20
25
3 7
1 16
1 0
2 11
1 18
6 5
7 10
3 3
5 6
4 14
5 3
5 9
3 15
1 8
1 14
2 16
7 3
3 14
5 5
5 17
0 9
2 0
1 13
6 0
7 5
7 1

5 16
16
2 1
3 4
4 3
3 1
0 13
3 7
1 14
3 0
0 2
1 13
2 6
1 0
0 8
0 14
3 12
3 11
14 1

19 18
28
18 17
12 7
5 1
5 7
9 14
9 11
1 6
0 14
0 11
2 14
7 16
6 14
12 9
14 6
2 7
2 10
6 16
4 7
14 5
4 4
17 10
1 1
0 6
8 13
1 13
18 2
15 3
7 2
9 2

17 9
25
12 1
4 0
4 3
9 2
10 0
9 8
0 5
15 5
7 4
7 7
14 6
5 0
2 1
16 0
13 7
13 1
15 1
6 7
3 2
4 1
4 4
9 3
8 7
2 0
15 6
6 1

7 15
16
4 0
0 4
4 13
6 11
0 0
0 13
2 10
1 8
2 0
3 10
2 9
3 13
5 10
2 6
4 8
1 9
5 3

18 8
17
0 1
4 4
17 1
1 2
9 0
2 2
8 1
0 0
7 0
6 4
9 5
16 2
10 6
13 6
8 6
0 5
16 1
15 3

8 5
14
7 4
2 4
6 2
2 2
4 1
0 3
6 4
4 2
1 4
2 3
7 2
6 0
6 3
1 3
13 1

14 20
21
9 5
10 6
13 2
11 14
13 14
13 17
5 6
9 7
9 19
8 17
6 1
7 0
6 7
6 13
6 16
12 8
1 1
9 12
11 6
0 15
1 16
12 3

16 10
15
8 8
8 4
10 4
2 0
5 1
5 7
4 2
2 3
0 6
5 0
0 5
11 5
7 5
4 1
11 8
5 3

15 9
14
0 7
7 4
9 7
8 4
7 7
11 0
6 4
8 3
13 6
5 3
12 5
2 5
4 1
5 2
5 2

18 16
23
17 0
14 10
3 13
10 9
9 11
10 12
15 14
5 6
17 5
4 11
0 1
13 1
1 5
6 1
7 9
7 6
17 4
9 0
17 7
1 4
16 2
16 5
16 8
10 2

12 19
24
3 4
4 3
4 9
4 12
8 12
2 2
2 14
1 12
7 1
6 5
4 5
9 7
5 12
9 13
7 0
2 13
5 11
4 13
10 4
10 1
1 4
11 12
2 12
6 0
6 1

20 13
19
3 4
14 10
9 5
13 5
11 11
18 1
4 5
9 1
0 4
11 10
13 7
6 1
2 10
18 3
14 2
9 3
9 6
1 10
6 0
8 3

16 11
16
11 7
3 4
2 7
15 8
14 1
3 7
1 1
9 2
5 7
3 0
14 0
4 5
5 0
2 6
6 0
14 2
14 2

17 10
15
2 1
9 9
6 1
1 1
13 3
16 2
10 6
9 8
15 3
3 6
6 6
7 5
9 1
4 1
1 9
13 3

17 16
21
14 10
0 2
13 2
2 5
6 14
3 0
5 9
8 14
10 5
9 13
13 1
15 7
1 14
16 6
16 15
4 1
3 8
8 7
9 6
8 13
6 3
6 4

11 9
25
4 0
4 3
3 1
4 6
1 0
2 5
1 3
2 8
6 8
4 2
4 5
5 6
5 3
8 2
9 7
10 2
0 7
1 8
6 7
3 2
0 0
10 7
6 0
6 6
6 3
10 2

6 14
21
3 7
4 6
4 12
3 10
2 2
1 0
0 11
4 2
3 0
4 5
5 0
5 3
3 12
2 1
0 10
2 13
3 2
3 8
5 5
5 11
1 4
10 3
