*** Life<FredkinCell> 7x9 ***

Generation = 0, Population = 12.
0-------0
0-------0
0-------0
0-------0
0-------0
0-------0
---------

Generation = 10, Population = 16.
--6---6--
3-------3
--2---2--
--1---1--
1-------1
4-------4
3-3---3-3

*** Life<FredkinCell> 9x9 ***

Generation = 0, Population = 7.
0--------
0--------
0-------0
0--------
---------
---------
---------
0-------0
---------

Generation = 10, Population = 17.
3-3-1-4--
----1----
1-0------
2---0-3--
3--------
2-------2
--3------
------2--
0-----1--

Generation = 20, Population = 17.
------6-3
------6-2
4-1---5-1
------6--
4-------7
5--------
9--------
--2---5-6
--------4

Generation = 30, Population = 20.
------8--
1-0---7-3
----0----
--+-----2
7-----2-8
--+-4-4--
--9---7-8
------6--
4-------7

Generation = 40, Population = 21.
5-8-+---6
1-0-+----
9-3---+--
2-+-0---3
+--------
+--------
+-------9
--3---9-+
---------

Generation = 50, Population = 21.
--+-+-+--
----+----
--4------
2---0-+--
---------
--+-8-8--
+-+------
+-4-3---+
7-3-+---+

Generation = 60, Population = 20.
----+---+
1-0-+----
------+--
------+--
--4------
--+-8-8-6
+---0-+--
+---4----
----+-+-+

Generation = 70, Population = 17.
8-+-+-+--
----+----
+-5------
2---0-+--
+--------
+-------7
--+------
------+--
+-----+--

Generation = 80, Population = 17.
------+-+
------+-7
+-6---+-6
------+--
+-------+
+--------
+--------
--7---+-+
--------+

*** Life<FredkinCell> 4x7 ***

Generation = 0, Population = 2.
0------
-------
0------
-------

Generation = 10, Population = 3.
0------
-------
0-0----
-------

Generation = 20, Population = 3.
--0-0--
-------
0------
-------

Generation = 30, Population = 4.
0---0-0
-------
------0
-------

Generation = 40, Population = 1.
0------
-------
-------
-------

Generation = 50, Population = 3.
0-0----
-------
--0----
-------

Generation = 60, Population = 4.
0------
-------
0-0-0--
-------

Generation = 70, Population = 3.
------0
-------
0---0--
-------

Generation = 80, Population = 1.
-------
-------
0------
-------

*** Life<FredkinCell> 7x5 ***

Generation = 0, Population = 4.
-----
0---0
0----
0----
-----
-----
-----

Generation = 10, Population = 12.
--0-2
1-3--
1-6--
--6-6
--2-2
--0-0
-----

Generation = 20, Population = 10.
--5-3
-----
--9-5
--+-+
-----
6---5
--3-4

Generation = 30, Population = 12.
1-8--
--7-+
6---+
--+-+
-----
7-6--
7---9

Generation = 40, Population = 6.
-----
5---+
--+-+
--+-+
-----
-----
-----

Generation = 50, Population = 12.
--+-7
6-+--
+-+--
--+-+
--7-7
--+-+
-----

*** Life<FredkinCell> 9x7 ***

Generation = 0, Population = 10.
--0-0--
-------
0------
------0
----0--
----0--
0-0----
----0-0
-------

*** Life<FredkinCell> 4x7 ***

Generation = 0, Population = 3.
-------
--0---0
0------
-------

Generation = 10, Population = 6.
--0----
--1---0
5------
0-4----

Generation = 20, Population = 11.
8-6-1--
3-5-3-1
--6-4--
6---3--

Generation = 30, Population = 9.
+---5--
7-6----
+---6-3
--9-5--

Generation = 40, Population = 6.
+------
--+---2
+------
--9---2

Generation = 50, Population = 7.
+------
+-----2
+-+----
--+---2

Generation = 60, Population = 9.
--+-9--
--+---2
+------
+-+-+-3

Generation = 70, Population = 8.
+---+-6
+---+--
------6
+-+----

Generation = 80, Population = 3.
+------
-------
-------
--+---4

*** Life<FredkinCell> 9x9 ***

Generation = 0, Population = 15.
0-------0
0-------0
0-------0
0-------0
0-------0
0-------0
0-------0
--------0
---------

Generation = 10, Population = 20.
3-------2
1-0---0--
---------
------2-6
8-0---0-0
--1------
6-------5
--5-0----
2-2---1-2

Generation = 20, Population = 23.
--9---9--
--0---0--
--4---2--
--3---7-+
+-6---6-6
1-6---6-2
8-7---3-+
--+-----2
---------

Generation = 30, Population = 23.
6-------4
4-0---0--
---------
------+-+
+-+---+-+
1---0-8-2
+-------+
--+-0----
6-8---5-3

Generation = 40, Population = 24.
--+---+--
--0---0--
--9---6--
--6---+-+
+-+---+-+
1-+---+-2
+-+---6-+
9---0-+--
---------

Generation = 50, Population = 19.
+-------5
----0---3
---------
------+-+
+-+---+-+
--+------
+-------+
--+-0----
9-+---8-5

Generation = 60, Population = 23.
--+---+--
--0---0--
--+---8--
9---0----
+-+---+-+
1-+---+-2
+-+---+-+
+---0-+--
---------

Generation = 70, Population = 20.
+-------7
+-0---0--
---------
------+-+
+-+---+-+
--+------
+-------+
--+-0----
+-+---+-7

Generation = 80, Population = 23.
--+---+--
--0---0--
--+---+--
--+---+-+
+-+---+-+
1-+---+-2
+-+---+-+
--+-----7
---------

*** Life<FredkinCell> 6x9 ***

Generation = 0, Population = 7.
---------
0-------0
0-------0
0--------
0-------0
---------

Generation = 10, Population = 13.
1-------4
2--------
0-------3
1-0-0-1-1
--4---3--
--2------

*** Life<FredkinCell> 5x8 ***

Generation = 0, Population = 15.
00--00--
-0-00---
0----00-
00-0--00
--------

Generation = 10, Population = 21.
4--062--
4-3434-3
-3---4--
313-3--5
-1--315-

Generation = 20, Population = 21.
-66-9-8-
-6--8668
89-+2+-3
----8-6-
4--3-39-

Generation = 30, Population = 25.
7--2+---
-++++++-
-+2+-+-6
-4+4+-+-
48-5-6+4

Generation = 40, Population = 19.
----++++
+-++--++
++-+--+7
+-+---+-
--8----6

*** Life<FredkinCell> 9x6 ***

Generation = 0, Population = 22.
-0--00
0---0-
00--0-
----00
00--0-
00---0
00--00
-0---0
------

Generation = 10, Population = 21.
3-1---
-----1
-2--1-
-212-2
-0----
5-73-5
14----
-+1--3
-2--2-

Generation = 20, Population = 24.
---433
-8-2-4
-64-47
7---+6
7--5--
8--4-7
2---9-
3-5---
24----

Generation = 30, Population = 30.
--6-5-
--9---
97-+--
+73-+8
+47+--
9-+7++
-8--++
3+---+
395--+

Generation = 40, Population = 27.
+486--
----78
+-9-++
+8-+--
--+-+-
-9+9+-
6+--+-
-+6---
--77-+

Generation = 50, Population = 27.
+-----
--+++-
+-++-+
-++-+-
+-++-6
-+-+++
-----+
+-87-+
5---5+

Generation = 60, Population = 29.
--+-+-
++++-+
--+---
-+-+-+
++-++7
+-+-+-
9--+-+
+-++-+
-++-9-

*** Life<FredkinCell> 4x6 ***

Generation = 0, Population = 6.
-0---0
-0--00
-0----
------

Generation = 10, Population = 10.
-5-6-3
--3--2
-----2
2--183

*** Life<FredkinCell> 6x6 ***

Generation = 0, Population = 8.
0---0-
----00
----0-
----00
0-----
------

Generation = 10, Population = 20.
2-4-5-
435-55
----5-
32-33-
5-3-6-
11-20-

Generation = 20, Population = 11.
7-----
--717-
----7-
------
7---8-
46-40-

Generation = 30, Population = 13.
------
--+1+-
--+-+-
--89+-
+-+-+-
----08

Generation = 40, Population = 15.
+-+-+-
++-1-+
--+---
+++---
------
9+-+-+

Generation = 50, Population = 16.
--+-+-
+++-++
--+-+-
+++---
+---+-
----0+

Generation = 60, Population = 11.
--+-+-
++-1-+
------
++-++-
--+---
------

*** Life<FredkinCell> 6x9 ***

Generation = 0, Population = 10.
0-------0
0-------0
0-------0
0-------0
0-------0
---------

Generation = 10, Population = 12.
---------
--1---1--
3-2---2-3
0-------0
1-------1
3-------3

Generation = 20, Population = 10.
--6---6--
4-3---3-4
7-------7
---------
---------
--2---2--

Generation = 30, Population = 8.
---------
6-9---9-6
+-8---8-+
---------
---------
---------

Generation = 40, Population = 14.
5-------5
--+---+--
---------
+-7---7-+
7-+---+-7
--7---7--

Generation = 50, Population = 16.
8-+---+-8
8-+---+-8
+-------+
+-------+
+-------+
--+---+--

*** Life<FredkinCell> 4x8 ***

Generation = 0, Population = 8.
-00--0--
00----0-
--0--0--
--------

Generation = 10, Population = 21.
-1-33-44
3133-30-
312-5---
44-211-1

*** Life<FredkinCell> 9x4 ***

Generation = 0, Population = 19.
--00
00-0
000-
0000
-0--
--0-
0--0
000-
----

Generation = 10, Population = 20.
--3-
45--
145-
-714
-+9-
-076
---4
42--
3-14

Generation = 20, Population = 20.
-4--
89--
-890
-+1+
-++-
-0++
+---
88--
95-+

Generation = 30, Population = 20.
--8-
++--
1++-
-+1+
-++-
-0++
---+
++--
+-6+

Generation = 40, Population = 20.
-9--
++--
-++0
-+1+
-++-
-0++
+---
++--
++-+

Generation = 50, Population = 20.
--+-
++--
1++-
-+1+
-++-
-0++
---+
++--
+-++

Generation = 60, Population = 20.
-+--
++--
-++0
-+1+
-++-
-0++
+---
++--
++-+

*** Life<FredkinCell> 8x4 ***

Generation = 0, Population = 11.
--0-
0000
0---
--0-
0---
00--
--0-
----

*** Life<FredkinCell> 9x8 ***

Generation = 0, Population = 4.
--------
--------
--------
----0-00
--------
--------
------0-
--------
--------

Generation = 10, Population = 28.
----0-2-
00----31
--------
3-4313-6
1-1-0---
20--1---
--0-2-5-
--3-1076
0-1-----

Generation = 20, Population = 18.
------5-
--------
--1-3-3-
-375467-
------5-
--------
4-------
1--0--+-
--7-4-8-

Generation = 30, Population = 32.
1---1-8-
--4-1253
------9-
9-+9-++-
2-----+-
412--222
7-4-6---
4--1--+-
5-+-7-+-

Generation = 40, Population = 18.
1-----+-
--------
------9-
+--+--+-
3-----+-
--------
9-8-6-+-
-6+1-6-+
------+-

Generation = 50, Population = 23.
--------
-4-3---4
5---+---
-+-+---+
5---+-+-
72--5---
+---8-+-
8+----++
--+-+---

Generation = 60, Population = 19.
----7-+-
--------
6-9-+---
+--+--+-
----+-+-
--------
--+---+-
++----++
9-+-+---

*** Life<FredkinCell> 9x9 ***

Generation = 0, Population = 16.
0-------0
0-------0
0-------0
0-------0
0-------0
0-------0
0-------0
0-------0
---------

Generation = 10, Population = 24.
2-------2
--0---0--
---------
6-2---2-6
0-0---0-0
2-2---2-2
7-------7
--8---8--
1-3---3-1

Generation = 20, Population = 24.
--+---+--
--0---0--
--0---0--
+-8---8-+
0-0---0-0
2-8---8-2
+-0---0-+
--+---+--
---------

Generation = 30, Population = 24.
2-------2
--0---0--
---------
+-+---+-+
0-0---0-0
2-+---+-2
+-------+
--+---+--
1-+---+-1

Generation = 40, Population = 24.
--+---+--
--0---0--
--0---0--
+-+---+-+
0-0---0-0
2-+---+-2
+-0---0-+
--+---+--
---------

Generation = 50, Population = 24.
2-------2
--0---0--
---------
+-+---+-+
0-0---0-0
2-+---+-2
+-------+
--+---+--
1-+---+-1

Generation = 60, Population = 24.
--+---+--
--0---0--
--0---0--
+-+---+-+
0-0---0-0
2-+---+-2
+-0---0-+
--+---+--
---------

Generation = 70, Population = 24.
2-------2
--0---0--
---------
+-+---+-+
0-0---0-0
2-+---+-2
+-------+
--+---+--
1-+---+-1

*** Life<FredkinCell> 5x5 ***

Generation = 0, Population = 5.
0---0
0----
----0
0----
-----

Generation = 10, Population = 10.
----3
8-8-7
0-0--
7-8-7
----3

Generation = 20, Population = 10.
9----
+-+-+
--0-0
+-+-+
8----

Generation = 30, Population = 10.
----+
+-+-+
0-0--
+-+-+
----+

Generation = 40, Population = 10.
+----
+-+-+
--0-0
+-+-+
+----

Generation = 50, Population = 10.
----+
+-+-+
0-0--
+-+-+
----+

Generation = 60, Population = 10.
+----
+-+-+
--0-0
+-+-+
+----

*** Life<FredkinCell> 9x4 ***

Generation = 0, Population = 11.
-0--
----
----
000-
-000
---0
0---
-00-
----

Generation = 10, Population = 20.
---3
441-
---4
--4-
1522
29-5
1115
0---
64--

Generation = 20, Population = 17.
2--5
---5
-686
5-+4
-9--
-+--
2--7
-555
-8--

Generation = 30, Population = 17.
-65-
+96-
-++-
--+-
4---
7+-+
3---
0---
+-+8

Generation = 40, Population = 20.
--7-
---+
++--
+-+9
6+77
-+--
--6-
-+++
++++

Generation = 50, Population = 17.
7-7-
+++-
+-+-
--+-
-+--
++-+
-+--
0---
-+++

Generation = 60, Population = 17.
-+-+
---+
+-++
+-++
9---
-+--
-+-+
-+++
+---

Generation = 70, Population = 20.
---+
+++-
---+
--+-
++++
++-+
6+++
0---
++--

Generation = 80, Population = 17.
+--+
---+
-+++
+-++
-+--
-+--
7--+
-+++
-+--

Generation = 90, Population = 17.
-++-
+++-
-++-
--+-
+---
++-+
8---
0---
+-++
