*** Life<ConwayCell> 10x8 ***

Generation = 0, Population = 22.
...*..*.
........
..*...**
*..*.*.*
**......
..*...*.
**......
.*.....*
...*...*
..*..**.

Generation = 10, Population = 0.
........
........
........
........
........
........
........
........
........
........

*** Life<ConwayCell> 9x9 ***

Generation = 0, Population = 13.
...*.....
.*.......
.*.*.....
.......*.
.*....*..
..*...*..
*...*....
.........
.....**..

Generation = 1, Population = 7.
.........
.........
..*......
..*......
......**.
.*...*...
.........
.....*...
.........

Generation = 2, Population = 2.
.........
.........
.........
.........
......*..
......*..
.........
.........
.........

Generation = 3, Population = 0.
.........
.........
.........
.........
.........
.........
.........
.........
.........

*** Life<ConwayCell> 12x12 ***

Generation = 0, Population = 43.
**..*......*
*******..*.*
........*..*
**...*..*...
...*..**..**
*..*.....*..
*.....*.....
.***.*...*..
............
.*.......*.*
....**......
*.*..*.*....

Generation = 1, Population = 46.
*...*.....*.
*.****.....*
...*..*****.
......*.****
***.*.*****.
......**..*.
*..**.......
.**.........
.*........*.
............
.*..***.....
....***.....

Generation = 2, Population = 37.
.*..**......
.**..****..*
..**..*.....
.***.......*
.*..........
*.*.*.*...*.
.***........
****........
.**.........
.....*......
....*.*.....
....*.*.....

*** Life<ConwayCell> 6x11 ***

Generation = 0, Population = 25.
..**...*...
.**.....***
.**....*.*.
.....***...
..****....*
..***....**

Generation = 16, Population = 19.
...........
.........*.
..***.****.
..***.*.**.
...*..*.**.
....*......

*** Life<ConwayCell> 9x8 ***

Generation = 0, Population = 27.
........
.***.**.
**.*.**.
..*.**..
.***....
.*..*...
..*...*.
.**.***.
*......*

Generation = 9, Population = 15.
........
........
.**.....
*.**....
*..*....
*.***...
*..*....
.**.....
........

*** Life<ConwayCell> 10x12 ***

Generation = 0, Population = 9.
..*.........
.*..........
...........*
............
....*.*.....
............
............
..*.....*...
.*..*.......
............

Generation = 2, Population = 0.
............
............
............
............
............
............
............
............
............
............

Generation = 4, Population = 0.
............
............
............
............
............
............
............
............
............
............

Generation = 6, Population = 0.
............
............
............
............
............
............
............
............
............
............

Generation = 8, Population = 0.
............
............
............
............
............
............
............
............
............
............

Generation = 10, Population = 0.
............
............
............
............
............
............
............
............
............
............

*** Life<ConwayCell> 10x11 ***

Generation = 0, Population = 28.
*..*......*
.*.........
...*....**.
.*.*.....*.
...*.*.*.**
........*.*
*.....*....
.*..*..**.*
.*.........
...*...**..

Generation = 1, Population = 18.
...........
..*......*.
........**.
...*.......
..*.*.....*
......***.*
........*..
**.....*...
..*......*.
...........

Generation = 2, Population = 17.
...........
........**.
........**.
...*.....*.
...*...*.*.
.......**..
......*.**.
.*......*..
.*.........
...........

Generation = 3, Population = 12.
...........
........**.
..........*
.........**
.......*.*.
......*....
.........*.
.......***.
...........
...........

Generation = 4, Population = 15.
...........
.........*.
........*.*
........***
........***
........*..
.......*.*.
........**.
........*..
...........

Generation = 5, Population = 14.
...........
.........*.
........*.*
.......*...
.......*..*
.......*..*
.......*.*.
.......*.*.
........**.
...........

Generation = 6, Population = 22.
...........
.........*.
........**.
.......***.
......***..
......**.**
......**.**
.......*.**
........**.
...........

Generation = 7, Population = 13.
...........
........**.
.......*..*
......*....
..........*
.....*....*
...........
......**...
........***
...........

*** Life<ConwayCell> 11x4 ***

Generation = 0, Population = 16.
*..*
..**
.*..
.**.
...*
...*
*.*.
****
....
.*..
....

Generation = 3, Population = 12.
..*.
**..
**..
**.*
.*.*
..**
....
....
....
....
....

Generation = 6, Population = 5.
....
....
....
....
.*.*
.*.*
..*.
....
....
....
....

Generation = 9, Population = 0.
....
....
....
....
....
....
....
....
....
....
....

Generation = 12, Population = 0.
....
....
....
....
....
....
....
....
....
....
....

Generation = 15, Population = 0.
....
....
....
....
....
....
....
....
....
....
....

*** Life<ConwayCell> 11x11 ***

Generation = 0, Population = 44.
.....*...*.
******...*.
.****......
****.......
*...*.*..*.
**..*.**...
**.*......*
.....*....*
**.***.*.*.
*.........*
......***..

Generation = 16, Population = 23.
...........
.....**....
....*..*...
....*..*...
...........
...*...*...
..*...**...
..*...*....
..***.*....
....*....*.
.....****..

*** Life<ConwayCell> 8x5 ***

Generation = 0, Population = 4.
..*..
.....
..*..
.....
.....
*.*..
.....
.....

Generation = 7, Population = 0.
.....
.....
.....
.....
.....
.....
.....
.....

*** Life<ConwayCell> 4x5 ***

Generation = 0, Population = 1.
.....
.....
.....
....*

Generation = 4, Population = 0.
.....
.....
.....
.....

*** Life<ConwayCell> 9x7 ***

Generation = 0, Population = 13.
*......
.*.*...
....*..
.......
.*...*.
**...**
*......
..*...*
.......

Generation = 7, Population = 0.
.......
.......
.......
.......
.......
.......
.......
.......
.......

*** Life<ConwayCell> 6x7 ***

Generation = 0, Population = 14.
*****..
...**..
...*.*.
.......
..*..*.
.***...

Generation = 6, Population = 10.
..*.*..
.*..*..
*...*..
*......
.*.*...
..*....

Generation = 12, Population = 2.
.......
.......
.......
.......
...*...
..*....

*** Life<ConwayCell> 10x6 ***

Generation = 0, Population = 22.
.*..**
*...*.
.*.*..
**....
..**..
.....*
...**.
**..*.
*..*..
...***

Generation = 1, Population = 30.
....**
******
.**...
**.*..
.**...
..*...
...***
***.*.
****.*
...**.

Generation = 2, Population = 20.
.**..*
*....*
......
*..*..
*..*..
.**.*.
....**
*.....
*....*
.*.**.

Generation = 3, Population = 19.
.*....
.*....
......
......
*..**.
.**.**
.*.***
....**
**..*.
....*.

Generation = 4, Population = 13.
......
......
......
......
.*****
**....
.*....
***...
...**.
......

Generation = 5, Population = 18.
......
......
......
..***.
*****.
*..**.
......
****..
.***..
......

Generation = 6, Population = 13.
......
......
...*..
....*.
*....*
*...*.
*...*.
*..*..
*..*..
..*...

Generation = 7, Population = 18.
......
......
......
....*.
....**
**..**
**.**.
**.**.
.***..
......

Generation = 8, Population = 11.
......
......
......
....**
...*..
***...
......
......
**.**.
..*...

Generation = 9, Population = 14.
......
......
......
....*.
.****.
.**...
.*....
......
.***..
.***..

Generation = 10, Population = 12.
......
......
......
..*.*.
.*..*.
*.....
.**...
.*....
.*.*..
.*.*..

Generation = 11, Population = 12.
......
......
......
...*..
.*.*..
*.*...
***...
**....
**....
......

Generation = 12, Population = 8.
......
......
......
..*...
.*.*..
*..*..
..*...
......
**....
......

Generation = 13, Population = 6.
......
......
......
..*...
.*.*..
.*.*..
......
.*....
......
......

Generation = 14, Population = 4.
......
......
......
..*...
.*.*..
......
..*...
......
......
......

Generation = 15, Population = 3.
......
......
......
..*...
..*...
..*...
......
......
......
......

*** Life<ConwayCell> 5x12 ***

Generation = 0, Population = 21.
**.....**..*
*.......**..
*.**...*..*.
..*..*..*...
*.***...*...

Generation = 1, Population = 19.
**.....***..
*.*......**.
..**...*....
.......***..
.****.......

Generation = 2, Population = 23.
**......***.
*.**...*.**.
.***...*..*.
.*..*..**...
..**....*...

*** Life<ConwayCell> 12x10 ***

Generation = 0, Population = 5.
..........
..........
..........
..........
......*...
.....*....
.....*....
...*......
..........
..........
..........
........*.

Generation = 3, Population = 0.
..........
..........
..........
..........
..........
..........
..........
..........
..........
..........
..........
..........

Generation = 6, Population = 0.
..........
..........
..........
..........
..........
..........
..........
..........
..........
..........
..........
..........

Generation = 9, Population = 0.
..........
..........
..........
..........
..........
..........
..........
..........
..........
..........
..........
..........

*** Life<ConwayCell> 3x10 ***

Generation = 0, Population = 6.
.***.*.*..
..........
..*.......

Generation = 6, Population = 0.
..........
..........
..........

Generation = 12, Population = 0.
..........
..........
..........

*** Life<ConwayCell> 6x8 ***

Generation = 0, Population = 5.
*..*....
..*.*..*
........
........
........
........

Generation = 4, Population = 0.
........
........
........
........
........
........

Generation = 8, Population = 0.
........
........
........
........
........
........

*** Life<ConwayCell> 6x3 ***

Generation = 0, Population = 7.
***
...
.**
*.*
...
...

Generation = 7, Population = 0.
...
...
...
...
...
...

Generation = 14, Population = 0.
...
...
...
...
...
...

*** Life<ConwayCell> 8x7 ***

Generation = 0, Population = 5.
..*....
.......
......*
.......
**.....
..*....
.......
.......

Generation = 1, Population = 2.
.......
.......
.......
.......
.*.....
.*.....
.......
.......

Generation = 2, Population = 0.
.......
.......
.......
.......
.......
.......
.......
.......

Generation = 3, Population = 0.
.......
.......
.......
.......
.......
.......
.......
.......

Generation = 4, Population = 0.
.......
.......
.......
.......
.......
.......
.......
.......

Generation = 5, Population = 0.
.......
.......
.......
.......
.......
.......
.......
.......

Generation = 6, Population = 0.
.......
.......
.......
.......
.......
.......
.......
.......

Generation = 7, Population = 0.
.......
.......
.......
.......
.......
.......
.......
.......

Generation = 8, Population = 0.
.......
.......
.......
.......
.......
.......
.......
.......

Generation = 9, Population = 0.
.......
.......
.......
.......
.......
.......
.......
.......

Generation = 10, Population = 0.
.......
.......
.......
.......
.......
.......
.......
.......

Generation = 11, Population = 0.
.......
.......
.......
.......
.......
.......
.......
.......

Generation = 12, Population = 0.
.......
.......
.......
.......
.......
.......
.......
.......

Generation = 13, Population = 0.
.......
.......
.......
.......
.......
.......
.......
.......

Generation = 14, Population = 0.
.......
.......
.......
.......
.......
.......
.......
.......

*** Life<ConwayCell> 5x4 ***

Generation = 0, Population = 5.
....
....
**..
..**
...*

Generation = 5, Population = 0.
....
....
....
....
....

Generation = 10, Population = 0.
....
....
....
....
....

*** Life<ConwayCell> 10x3 ***

Generation = 0, Population = 11.
*.*
.**
...
.*.
*..
*..
.*.
..*
..*
.*.

Generation = 1, Population = 14.
..*
.**
.**
...
**.
**.
.*.
.**
.**
...

Generation = 2, Population = 12.
.**
...
.**
*.*
**.
..*
...
*..
.**
...

Generation = 3, Population = 9.
...
...
.**
*.*
*.*
.*.
...
.*.
.*.
...

*** Life<ConwayCell> 10x10 ***

Generation = 0, Population = 27.
...**.*...
**..*...*.
.....*.*..
***......*
.**...*...
*........*
.**.*..**.
.*.....*..
......*...
.*........

Generation = 3, Population = 31.
.....***..
.****..*..
.*...***..
....*.*...
.*..*..**.
.*.**..**.
*.**.....*
.*.....**.
.......*..
..........

Generation = 6, Population = 42.
......**..
***..*..*.
..*.*..***
..**.*....
**..**.*.*
*.*.**.*.*
*...*.**.*
.****.**.*
..*....**.
..........

Generation = 9, Population = 33.
.*........
**......*.
.*.**.*..*
.....*.*..
**...****.
**........
*.*......*
*..*...*.*
.*.*..**..
..*....**.

Generation = 12, Population = 35.
......*...
....**.*..
...*...*..
...*****..
.*.*......
..**...***
..**..*.*.
.*.*..***.
.*.***..*.
..*...**..

Generation = 15, Population = 30.
....*.**..
...*...**.
.....*...*
....*.***.
....**....
.*....**..
*.**..*..*
........**
**....*..*
.......**.

*** Life<ConwayCell> 11x8 ***

Generation = 0, Population = 24.
*.......
..*.....
***.....
...*....
.*.*....
..*.*..*
**.*..*.
*...*..*
*.......
.*.*....
..*..*.*

Generation = 7, Population = 20.
........
........
***.....
........
........
..*...**
..*..*.*
**...*.*
.***....
..*...*.
..*..*..

Generation = 14, Population = 3.
........
.*......
.*......
.*......
........
........
........
........
........
........
........

*** Life<ConwayCell> 6x8 ***

Generation = 0, Population = 15.
...*....
..*....*
...*.*..
.***..*.
.*.*.**.
.*.....*

Generation = 5, Population = 15.
...*....
.***....
.....*..
*.*..**.
..***..*
**......

Generation = 10, Population = 6.
..*.....
..*.....
........
......**
......**
........

Generation = 15, Population = 4.
........
........
........
......**
......**
........

*** Life<ConwayCell> 9x3 ***

Generation = 0, Population = 10.
.**
*..
**.
...
*.*
*..
...
*..
..*

Generation = 1, Population = 8.
.*.
*.*
**.
*..
.*.
.*.
...
...
...

Generation = 2, Population = 7.
.*.
*.*
*..
*..
**.
...
...
...
...

Generation = 3, Population = 6.
.*.
*..
*..
*..
**.
...
...
...
...
