*** Life<Cell> 8x50 ***

Generation = 0, Population = 2.
--------------------------------------------------
--------------------------------------------------
--------------------------------------------------
-0------------------------------------------------
--------------------------------------------------
--------------------------------------------------
--------------------------------------------------
-------------0------------------------------------

Generation = 2, Population = 7.
--------------------------------------------------
-0------------------------------------------------
--------------------------------------------------
---0----------------------------------------------
--------------------------------------------------
-0-----------0------------------------------------
--------------------------------------------------
-----------0-0-0----------------------------------

Generation = 4, Population = 7.
--------------------------------------------------
--------------------------------------------------
--------------------------------------------------
-0---0-------0------------------------------------
--------------------------------------------------
-------------0------------------------------------
--------------------------------------------------
-0-------0-------0--------------------------------

Generation = 6, Population = 22.
--------------------------------------------------
-0---0-------0------------------------------------
--------------------------------------------------
-------0---0-0-0----------------------------------
--------------------------------------------------
-----0---0-0-0-0-0--------------------------------
--------------------------------------------------
-0-0---0-0-0-0-0-0-0------------------------------

*** Life<Cell> 8x20 ***

Generation = 0, Population = 4.
--------------------
-0---------------0--
--------------------
--------------------
--------------------
--------------------
----0-----0---------
--------------------

Generation = 2, Population = 11.
--------------------
---0-----------0---0
--------------------
-0---------------0--
----0-----0---------
--------------------
--0---0-0---0-------
--------------------

Generation = 4, Population = 14.
--------------------
-----0-------0---0-0
----0-----0---------
--------------------
--------------------
-0---------------0--
0---0-0-0-0---0-----
--------------------

Generation = 6, Population = 27.
----0-----0---------
---0---0---0-----0--
--0---0-0---0-------
-0---0-------0-----0
0-----0-0-----0-----
---0-----------0---0
0---0-----0-----0---
-0---------------0--

Generation = 8, Population = 12.
----0-----0---------
-----0---------0----
----0-----0---------
--------------------
--------------------
-0---------------0--
------------0-----0-
-0---------------0--

Generation = 10, Population = 33.
--0---0-0---0-------
---0---0-----0---0--
--0-0-0-0-0-0-------
-0---0---------0-0--
----0-----0-0-----0-
-0-0-----------0-0-0
----------0---0-0---
---0-----------0---0

Generation = 12, Population = 38.
0---0-0-0-0---0-----
-----0---0-0---0-0-0
0---0-0-0-0-0-0---0-
-0---------------0--
----0-----0---------
-------------0-0-0-0
----0---0-0-0-0-0---
-----0-------0---0-0

Generation = 14, Population = 44.
0---0-----0-0---0-0-
-0-0-----0-0---0-0--
----0-0-0-----------
---0-0---0-0-0-0---0
0-0-----0---0---0-0-
-0---0-----0-------0
--0-0---0-0-----0-0-
---0-0-0---0---0-0--

Generation = 16, Population = 11.
--------------------
-0-----0-----0---0--
--------------------
-0---------------0--
----0-----0---------
--------------------
----0-----0---0-----
--------------------

Generation = 18, Population = 31.
--------------------
-0-0-0---0-0-----0-0
----0-----0---------
-0-0---0-----0-0-0-0
--0-0-0-0-0-0-0-----
-0---------------0--
--0-0-0-0-0-----0---
--------------------

*** Life<Cell> 7x12 ***

Generation = 0, Population = 8.
-0----------
--------0---
----0---0---
---0--------
0----------0
------------
--------0---

Generation = 1, Population = 24.
0-0-----0---
-0--0--010--
-----0-010--
0-0-----0--0
-0-0------0-
0-------0--0
-------0-0--

*** Life<Cell> 6x11 ***

Generation = 0, Population = 4.
-----------
-0-----0---
---0-------
-----------
--0--------
-----------

Generation = 1, Population = 16.
-0-----0---
0-00--0-0--
-00-0--0---
--00-------
-0-0-------
--0--------

Generation = 2, Population = 12.
---0-------
---1-0---0-
-11--0-----
-0-----0---
0--10------
-----------

Generation = 3, Population = 32.
--0100---0-
-0-*-10-0-0
0-*-0100-0-
-1-0000-0--
--0*10-0---
0--00------

Generation = 4, Population = 10.
--1*-------
---.-*-0---
--.----1---
-----------
0-1.--0----
-0-----0---

Generation = 5, Population = 20.
-0*.00-0---
--0.0.-10--
--.--10*0--
0-0---00---
-0-.-0-----
--------0--

Generation = 6, Population = 23.
01*.-1-1---
--1.1.-*-0-
0-.--*1.-0-
-1-0-0-----
---.1--00--
-0---0-0-0-

Generation = 7, Population = 31.
1-**---*00-
--**-.-*-10
--*0-**.010
----01-000-
---.-00-1--
0-0----10-0

Generation = 8, Population = 24.
--**0-0*---
00..1.-.-*-
-1*-0*..---
--0-1*-1---
0-1.--1---0
---0-0-*---

Generation = 9, Population = 27.
1-**--1.00-
1-..-.0.0.0
--*-1.*.-1-
0----.0-0-0
--*.10-0-0-
0-----0.0-0

Generation = 10, Population = 26.
*-..01*.-1-
*0*.1.-.1.-
-1.--.*.0-0
-1---.11---
-0..*1----0
-00-0--*-0-

Generation = 11, Population = 26.
*-.*--..--0
*1***.-.*.0
--.-1**.1--
0-0-1.-*---
0-.***-----
0-1-1-0.---

Generation = 12, Population = 26.
*-.*--..011
*-*...0*..1
-1.-*.*.*10
1--0-.-*---
-0*...-0---
1--0*0-.---

Generation = 13, Population = 28.
.1..0-.*1--
*1**.*-...-
0-*-.**.*--
-1---.-*-00
01*...111--
---1*10.---

Generation = 14, Population = 37.
**.*--..*1-
**.*.*-.*.-
1-.-*****-0
1*0--*1.-11
1****.-**-0
10-**--.0--

Generation = 15, Population = 31.
**..01..**1
...*.*-...1
-1.-....*11
*.--1.-.0**
*.....-**01
--1.*1-*100

Generation = 16, Population = 28.
....1-...*-
***..*0...-
--.0*...***
**-0-.-.1..
.*.***1..-*
10-..*-**1-

Generation = 17, Population = 30.
.*..--....1
.**..*1.*.1
--.-**.***.
**--1.1**.*
...*.**..-.
*-1..*0***-

Generation = 18, Population = 29.
.**.-1...**
.**.***.*.*
1-*0*.....*
..0-*.-....
*.**.....0.
.--.**1**.0

Generation = 19, Population = 25.
.***-**..**
*.....*...*
-1.-.....*.
..--*.-....
.**...***-.
.-1***-***-

Generation = 20, Population = 25.
.**.-**..**
*....**...*
--.-.......
.*00..1**..
.**...*..-.
.--***1..*0

Generation = 21, Population = 28.
.*..1**..**
.*...**..**
11*0.*.....
.*11..-*...
.*......*0.
.0-***-...1

Generation = 22, Population = 21.
....*.*..**
...*.....**
*-.-.*.....
..*-*.1.*..
**......*1.
.1-.*.1..*-

Generation = 23, Population = 27.
.........**
....**...**
.1.0**...*.
*..-.*-***.
****....*-.
**1...-.**1

Generation = 24, Population = 18.
.........**
...*.*..*..
.-.1.......
*..-.*-*.*.
...*.....1*
*.-*..-.***

Generation = 25, Population = 15.
.........*.
....*....*.
.-.*..*.*..
...-*.-.***
....*....*.
..1...-.*.*

*** Life<Cell> 8x24 ***

Generation = 0, Population = 8.
------------------------
----------------------0-
----0-------------------
------------------------
---0-0------------------
--0-0-------------------
----------0-------------
---0--------------------

Generation = 2, Population = 29.
----0-------------------
--------------------0---
--01-10-----------------
--0-1-----------------0-
-0-010-0--0-------------
0-010-0-----------------
---1-0--0---0-----------
-01010------------------

Generation = 4, Population = 24.
---101------------------
--1-1-------------0-----
0--.-.--0-0-------------
---0.-------------------
-0-----0-1--------------
---1--0-1-------------0-
----0-0---0---0---------
--1-1--0----------------

Generation = 6, Population = 64.
000***100-0-------------
1-11.-0---------0---0---
011.-.11000-0-----------
-1*-.-0-1---------0---0-
1--0-10011-0--0---------
-1*1-1*11-1---------0---
-01-*-*0-1------0-------
0--1*1-010------------0-

Generation = 8, Population = 47.
-0**.**0--0-------------
--*1*-0-------0---0-----
-**.0.*1--*-0-----------
-1.0.000----------------
-1-*--0--*-0-1----------
-1*--1.---1-0---------0-
---1.1*--.--------0-----
--1.**1----0----------0-

Generation = 10, Population = 73.
1-*.**.*-1--------------
1-...1010---1-------0---
-*.*-**---.0011---------
--.*.*-0*11-1-0---0---0-
--1.*-*-*.1-11-0--0-----
1-.-1..11-110-0-----0-0-
--*1.*.*0.-1-0--0---0---
0*1**.11101010------0---

Generation = 12, Population = 57.
.1.***..----100---------
.-**.*-.----*-----------
0...-..--1*---1-0-1-----
-*.***--*-------------0-
**-.*-*-*.11.*-0-1------
--*-*.*1.0-*----1-------
0-.-....-.-10-0---0---1-
**..*****0--1--0--0-----

Generation = 14, Population = 65.
.-**.**.-1-1-0*1--0-----
.-**..*.1---.-0-------0-
-...-..1-*.*1--0-01-0---
-..*..0-.--1----1---0---
*.-*.-.-..*1*.--11-0--1-
-1.-.....0-.-110------1-
*-.1....*.110-00-1------
**...***.*--.100-1*-1---

Generation = 16, Population = 57.
.-.....*11--1*..--------
.-......---0.0----------
0...-.*--.****----.-*---
-***..0-.-11-010.-----1-
..*..-.-.**...-0-*-0-1.-
*1*1...*.0-.1..---0-1-.-
.1*1..*...*1--**-.----*-
*.*...*..*1**.----.0----

Generation = 18, Population = 72.
.-......-*11**..----0---
.0.....*--0-*---------0-
0*.*-..--***..---1*1.11-
-..*..**.-.-*--0*11-----
*....-*-....**0--*--11.0
**.-..*..***-.*-1-0110.0
.1*1...*...1-*..-.*111*-
.......***.**.*1--.-*0--

Generation = 20, Population = 77.
***.....-.*-....-0-101--
.-*.....*10-*0-001--1---
-..*-**1-.....1101....--
0.*......-.-*01**-1--0*1
*....*.1*...**0--*--11.-
*..**.....*.1..011-*--**
.-**.....*.1-...-..*11.0
.***..***..*..**--*0.---

Generation = 22, Population = 72.
.***....**.*....-*0***10
*1....*..-0-***-*.-0.0-0
-...-...-***..1-0-*.***-
*....*..*-*-**1..-----.*
*......*..*...--*.-0.-.-
.**.*.....**.**-110**-..
.-..*......*-**.-..*-*.-
.......*..*....*-**0.1-1

*** Life<Cell> 3x11 ***

Generation = 0, Population = 8.
----0-000-0
----00-----
---------0-

Generation = 1, Population = 15.
---0101-1--
---0-1-0000
----00--0-0

Generation = 2, Population = 15.
--0--1*0*-0
--01--01---
----1-0-101

Generation = 3, Population = 16.
-01-1*.1*--
-0-*--1-00-
--0---10*-*

Generation = 4, Population = 17.
0-*0*****--
01-*--*-11-
-----0--*0.

Generation = 5, Population = 21.
10*1***.*--
-*0*-1.1*-0
00-01--0*-.

Generation = 6, Population = 17.
*1.*.**.*00
0.1.-*.-.--
1-0-*-1-*0.

Generation = 7, Population = 13.
***.***..-1
-.*.-..-.-0
*-1-.0--.1.

*** Life<Cell> 3x17 ***

Generation = 0, Population = 7.
---0--------0----
--00----0-----0--
------------0----

Generation = 2, Population = 16.
-0-*-0----0---1--
01--100---0-0---0
---1------0---1--

Generation = 4, Population = 11.
---.---00-------1
*---.-*1--0-0---0
--------0-------1

*** Life<Cell> 4x36 ***

Generation = 0, Population = 4.
------------------------------------
-----------------0------------------
--------------------------------0---
-----------0---------------0--------

Generation = 1, Population = 14.
-----------------0------------------
----------------0-0-------------0---
-----------0-----0---------0---0-0--
----------0-0-------------0-0---0---

Generation = 2, Population = 14.
--------------------------------0---
-----------0---0---0-------0--------
------------------------------0---0-
---------0-0-0---0-------0-0-0------

Generation = 3, Population = 32.
-----------0---0---0-------0---0-0--
----------0-0-0-0-0-0-----0-0-0-0-0-
---------0---0-0-0-0-----0-----0-0-0
--------0-----0-0-0-----0---------0-

Generation = 4, Population = 13.
--------------------------------0---
-----------0-0---0---0-----0--------
----------------------------0---0---
-------0-------0-0-----0-------0----

Generation = 5, Population = 30.
-----------0-0---0---0-----0---0-0--
----------0---0-0-0-0-0---0---------
-------0---0-0-0-----0-0-----0---0--
------0-0-----0---0---0-0---0-0-----

Generation = 6, Population = 27.
----------------------------0-0---0-
-------0-0-0-0-0-0-------0---0-0----
--------------------------0-----0-0-
-----0-0-0-0-----0-0---0-0-0-0-0-0--

Generation = 7, Population = 31.
-------0-0-0-0-0-0-------0-0-0---0-0
------0-----------0-----0-----0-----
-----0-------0-0---0---0-0-----0-0-0
----0-------0---0---0-0---0-----0---

Generation = 8, Population = 12.
--------------------------------0---
---------0-0-------------0-0--------
------------------------0-------0---
---0-------0-----0---------0-------0

Generation = 9, Population = 27.
---------0-0-------------0-0---0-0--
--------0---0---------------0-------
---0-----0-------0-----0-------0-0-0
--0-0-----0-0---0-0-----0-0-0---0-0-

Generation = 10, Population = 26.
------------------------0-----0---0-
---0---0-0---0---0-----0-0---0-----0
----------------------0---0---0-0-0-
-0-0-0-------0-0-0-0---------0---0--

Generation = 11, Population = 37.
---0---0-0---0---0-------------0-0--
--0-0-0---0-0-0-0-0-----0---0-0-0-0-
-0---0-0-0-----0---0-0-----0-0---0--
0-----0-----0-------0-0---0-0-------

Generation = 12, Population = 27.
------------------------0---0---0---
---0-0-0-0---0-0-0---0-0-0---0-0---0
--------------------0---0-----------
---------0-0-0-0-----0-0-0-0-----0--

Generation = 13, Population = 37.
---0-0-0-0---0-0-0---0-----0-----0-0
--0-------0-0-----0-------0-------0-
---0-0-0---0-----0-0-0-0-0-0-0-0-0-0
--------0-------0-------0---0---0-0-

Generation = 14, Population = 29.
--------------------0-0-----0---0-0-
-0-0-------0---0-0-----0---0-0-0-0-0
------------------0-----0-0-0---0---
---0-0---0-0---0---0-0-----------0--

Generation = 15, Population = 32.
-0-0-------0---0-0-0-------------0--
0---0-----0-0-0-----0-------------0-
-0---0---0-----------0-----0-----0-0
--0---0-0---0-0-0-----0-0-0-0-----0-

Generation = 16, Population = 14.
--------------------------------0---
-0---------0-----0---------0-----0--
----------------0-------0-------0---
---0-------0-----0---------0-0------

Generation = 17, Population = 32.
-0---------0-----0---------0---0----
0-0-------0-0-----0-----0-0-0---0-0-
-0-0-----------0-0-----0-0---0-0----
--0-0-----0-0-----0-----0-0---0-0---

*** Life<Cell> 1x26 ***

Generation = 0, Population = 6.
----0---00----0-0------0--

Generation = 2, Population = 10.
--0----1--100-0-0-0--0---0

Generation = 4, Population = 9.
0---00--*-.--0----011----0

Generation = 6, Population = 12.
0--1---*.-.0---001*-.100-0

Generation = 8, Population = 8.
011----..-.0--1*0-.-..--0-

Generation = 10, Population = 8.
--.*1--..-.0*-**-*.-..0---

Generation = 12, Population = 4.
--...*0..-.-.-..-..-..0-0-

*** Life<Cell> 3x8 ***

Generation = 0, Population = 2.
----0---
---0----
--------

Generation = 1, Population = 3.
-----0--
--0-----
---0----

Generation = 2, Population = 6.
--0-0-0-
-0---0--
----0---

Generation = 3, Population = 6.
-----0-0
0---0---
-0-0----

Generation = 4, Population = 2.
0-------
-------0
--------

Generation = 5, Population = 5.
-0-----0
0-----0-
-------0

Generation = 6, Population = 4.
--0-----
-----0-0
0-------

Generation = 7, Population = 10.
-0-0-0-0
0-0-0---
-0---0-0

Generation = 8, Population = 4.
--0-0---
---0-0--
--------

Generation = 9, Population = 6.
-0-0----
----0-0-
---0-0--

Generation = 10, Population = 8.
0-----0-
-0-0-0-0
--0-0---

Generation = 11, Population = 6.
---0----
--0-0-0-
---0---0

Generation = 12, Population = 2.
------0-
-0------
--------

Generation = 13, Population = 7.
-0---0-0
0-0---0-
-0------

Generation = 14, Population = 4.
----0-0-
---0----
------0-

Generation = 15, Population = 5.
-------0
--0-----
---0-0-0

*** Life<Cell> 4x17 ***

Generation = 0, Population = 3.
--------0--------
-0---------------
---0-------------
-----------------

Generation = 1, Population = 11.
-0-----0-0-------
0-00----0--------
-00-0------------
---0-------------

Generation = 2, Population = 9.
---0--0-0-0------
---1-------------
-1---0--0--------
-0---------------

Generation = 3, Population = 25.
--0100-----0-----
-00*000---0------
0*000-00-0-------
010--0--0--------

Generation = 4, Population = 8.
---*1-------0----
---.-1-----------
-.-1---10--------
-*---------------

Generation = 5, Population = 21.
--0.*------0-0---
---*--000---0----
-.0-000*10-------
0.00---00--------

Generation = 6, Population = 23.
-0-*.0000-0-0-0--
--0.0--1---------
0*1-1-1.-10-0----
-*-1-0-----------

Generation = 7, Population = 30.
0-0**1-11------0-
001.1-0*-0----0--
1.-1*0-.1*1--0---
-*0-0----00-0----

Generation = 8, Population = 21.
10-.**0-*-------0
1--.--1.-1-------
*.1*.1-**.-0-----
-*111------------

Generation = 9, Population = 26.
-10..*--.------0-
--1*11*.0-00----0
*.-..-1**.1-0----
-****--00--0-----

Generation = 10, Population = 19.
1*-..*--.-00--0--
1--*-*..1--1-----
..-..--...*--0--0
-***.0---0-------

Generation = 11, Population = 32.
-*0.*.0-.01-00-0-
*-1.-...-10*000-0
.*1*.--..**-0-00-
0.*..-0-0----0--0

Generation = 12, Population = 22.
-*-*..-1.--0--0--
*--.1...1*-.-1---
*.-*.-1.*..01--10
-.**.0----0------

Generation = 13, Population = 32.
-.-...0-*01-0--0-
*--*-...-*0*---00
.*-*.--**.*1*-0*1
0.***---00--0--00

Generation = 14, Population = 29.
1.-...--*1-0-001-
.-1.1...1.-.0--1-
**1..-1*...**-1.*
-****0---1--10---

Generation = 15, Population = 31.
-.0...-1**--01--0
*-**-...**-.1-0*-
*.*..-***..*.0-*.
-..**1-00-0--1--0

Generation = 16, Population = 35.
1*1*..0*.*10-*---
.-**1.*...0**-1*-
..*..-*...**.11**
0..***0-----1*0--

Generation = 17, Population = 27.
***.**-*.**-0*-1-
.-..*.*...1..--.-
.**..-**..*..--.*
-..***-0--0-*.--0

Generation = 18, Population = 29.
.*.***0..**-1.--0
*-..*...*.-..1-.0
..*..-.*.**..--..
-.****01011-..-01

Generation = 19, Population = 32.
...***1..*.--.-11
.-*.*.***.-*.-1.1
.**..1....*..1-**
-.****-*-*-0..01*

Generation = 20, Population = 24.
...**.-.*..0-.-*-
.-*....***-..--.-
.*...*...****--..
-*****-.-.1-..1**

Generation = 21, Population = 30.
...*..-***.-1.0.1
.-***..*..-.*--.-
.*...**....*.11*.
0*****0.-**-..**.

*** Life<Cell> 5x45 ***

Generation = 0, Population = 9.
--------------------------------------------0
----------------------------0----------------
------------0-----0----0---------------------
-0-------------------------------------------
------------------0---------------------0-0--

Generation = 2, Population = 25.
------------0-----0----0------------------0--
-0------------------------0---0--------------
----------0---0-0-0-00---0--------------0-0-0
---0------------------------0----------------
------------0---0---0--0--------------0-----0

Generation = 4, Population = 24.
------------0----------0---------------------
------------------------0---0---0------------
--------0-----0-0-00--1----0------------0-0-0
-----0---------------------------------------
------------0-0---0---10------------0-0-----0

Generation = 6, Population = 47.
--------0-0-0---0-00-010-0-0------------0-0-0
-----0----------------1-----------0----------
------0---0-0----0---*1-10---0------0---0---0
---0---0----------------0---0---0------------
--------0-0---0-0--1-1**10-0------0---------0

Generation = 8, Population = 40.
------------0---------**------------0-0-0-0--
--------------------0-------0-------1--------
----0-----0----0--*-**1---1----0--------0-0-0
-0---0---0------------00---------------------
----------0-0-----1-0.***-0-----1-0-----0-0-0

*** Life<Cell> 3x46 ***

Generation = 0, Population = 6.
---00------0----------------------------------
---0------------------------------------------
----------------------0-0---------------------

Generation = 1, Population = 13.
--0-10----0-0---------------------------------
--01-------0----------0-0---------------------
---0-----------------0---0--------------------

Generation = 2, Population = 18.
-010*10--0-0-0--------0-0---------------------
-0---0----------------------------------------
---10------0--------0-----0-------------------

Generation = 3, Population = 29.
0---**100-----0------0---0--------------------
01--01---0---0------0-0-0-0-------------------
-00*1-----0-0------0-0---0-0------------------

Generation = 4, Population = 12.
1--0*.--1------0------------------------------
----1--0--------------------------------------
---*--------------0-0-----0-0-----------------

Generation = 5, Population = 23.
-011*.---0----0-0-----------------------------
0--1*10--------0--0-0-----0-0-----------------
--0.---0---------0---0---0---0----------------

Generation = 6, Population = 26.
-1-*..1-1-0--0-0-00-0-----0-0-----------------
--0-.-1--0------------------------------------
00-*10--0------00-----0-0-----0---------------

Generation = 7, Population = 41.
1-1...*--0-00----11--0---0---0----------------
01-1.-*00----0--000-0-0-0-0-0-0---------------
110*-1-0------0110---0---0---0-0--------------

Generation = 8, Population = 20.
*1-...*----11------0--------------------------
1--**-.11--0----------------------------------
-*-*--01------1-*-------------0-0-------------

Generation = 9, Population = 32.
**1....-1-0-*0----1-0-------------------------
*10**1.-*001--0-0--0----------0-0-------------
-.-*-11----0-0--.0-----------0---0------------

Generation = 10, Population = 36.
*.-.*..0*011*1--01-0-0--------0-0-------------
**1..-*1*-1--0--------------------------------
1*-*1-*100-1----.-00--------0-----0-----------

Generation = 11, Population = 45.
*.1...*-.-*-*-001*----0------0---0------------
..*.*1.-.-*1-10-000--0------0-0-0-0-----------
-.0**-**110-00--.0110------0-0---0-0----------

Generation = 12, Population = 32.
.***.*.0.0*1*1--*.-----0----------------------
..*.**.1*-.*---0------------------------------
-.-.*1**---11---*-*-1-----0-0-----0-0---------

Generation = 13, Population = 40.
.***.*.1.1****0-..----0-0---------------------
.**....*.-..010-0-0-0--0--0-0-----0-0---------
-.0***.*--0-*0--.-.--0---0---0---0---0--------

Generation = 14, Population = 35.
.*.*..******..-0..1-00-0-00-0-----0-0---------
.....*.*.0..1---------------------------------
-*-**.*.11--*---.-.---000-----0-0-----0-------

Generation = 15, Population = 48.
......**.***..0-..--11---11--0---0---0--------
...*.*...-..*1-0--0-000-000-0-0-0-0-0-0-------
1.-.*****-01.0--.-.--01-10---0---0---0-0------

Generation = 16, Population = 23.
......*...****--..10-------0------------------
.........0...-0-00----------------------------
-.-.****.-1*.111.-.-------------------0-0-----

Generation = 17, Population = 30.
..........****--.**11-----1-0-----------------
.......*.-...11011-0-------0----------0-0-----
-.-..**..-*..****0.------------------0---0----

Generation = 18, Population = 30.
...........***-0.*.**1---1-0-0--------0-0-----
......*..-*..**1**01--------------------------
-.-...*..1...*...-*1-------0--------0-----0---

Generation = 19, Population = 36.
...........***01.*.***0-0-----0------0---0----
.........-**...*..1*-0---0---0------0-0-0-0---
-.-......-...*.**-.-1-----0-0------0-0---0-0--

Generation = 20, Population = 23.
..........****--*..*.*1--------0--------------
.........0**.....**.-1------------------------
-.-......-....***0.---------------0-0-----0-0-

*** Life<Cell> 3x34 ***

Generation = 0, Population = 6.
---------0------------------------
---0-----------------------------0
----0--0-----------------0--------

Generation = 2, Population = 16.
----0----0-0-------------0--------
-0---0-------------------------0-0
--0-0110---------------0-0-0------

Generation = 4, Population = 12.
-----0-------0--------------------
-------1---------------------0-0--
0--0-*--1--0---------0-------0----

Generation = 6, Population = 27.
0------10----0-0-----0-------1----
-----1---0-----------------0-*-0-0
-11--.*11110-------0-0-0---0-*-1--

Generation = 8, Population = 22.
-1---1-*---------0-----------*----
---0-------1-------------0-*0*0---
-..1-..1-*--1--0-0----------0.0*-1

Generation = 10, Population = 35.
-1-1---.----0------0-------10.0--0
-11--*0--*---0---------0-00*-*-10-
-...-*.--**1111--0-0------0-*.0.01

Generation = 12, Population = 36.
-.---*-.-1-1-0-------0---1-1*.00-0
11*-1.--1.0----0-----0-00--.-.0.-1
0..*-..1-.*--**-1--0-0--0---*.0.0.

Generation = 14, Population = 50.
1*---.-.-111-0110-------0-0.*.---*
--.-1.1--**-0----0-1-00*-11*1*0*0.
-***1..-1.***..1-11--*10*1-**.-.0.

Generation = 16, Population = 47.
.*--1.-*--.*1*-1-----*-00*-*..1-0.
-1*-..1*-**--1-0-*--00-.--*.1*0.0.
**.*1*.*1..*.*.---*-1***.1*...-*-.

Generation = 18, Population = 39.
..--1.-***.*-.-*-1000.--0*-**..-*.
-*.-*.*.*..--1---.0--*-*1*....-.*.
***.-.**......*-1-.0-...****.*-.-.

Generation = 20, Population = 35.
..--**0*******-*-*-0-.-10.1....-..
-..-.....***-1-*1.-*0.1.1.....0*..
*...****.......1--*--.........-.-.

Generation = 22, Population = 32.
..0-..-.....**-*-*1*-.0.0*1....-..
-..1**.*....**0..*-*-.-.**....**..
.............***1**-*.........*.-.

Generation = 24, Population = 29.
..--*.-.......-.1.-.*.-*-*....**..
-..***.......*0.**1.1.****......*.
...**...........-.*1...*......**1.

*** Life<Cell> 6x21 ***

Generation = 0, Population = 3.
---------------------
---------------0---0-
---------------------
---------------------
-------------------0-
---------------------

Generation = 2, Population = 5.
---------------------
-------------0-------
-------------------1-
---------------0---1-
-----------------0---
---------------------

Generation = 4, Population = 6.
-------------------0-
-----------0-------1-
-------------------.-
-------------------.-
---------------1-----
---------------0---0-

*** Life<Cell> 1x20 ***

Generation = 0, Population = 4.
0-0-0------0--------

Generation = 1, Population = 3.
-----0----0-0-------

Generation = 2, Population = 4.
----0-0--0---0------

Generation = 3, Population = 6.
---0---00-0-0-0-----

Generation = 4, Population = 6.
--0-0-011------0----

Generation = 5, Population = 6.
-0----1-*0----0-0---

Generation = 6, Population = 7.
0-0--0--.10--0---0--

Generation = 7, Population = 10.
---00-1-.*100-0-0-0-

Generation = 8, Population = 6.
--011--1..--1------0

Generation = 9, Population = 8.
-01-*01-..-0-0----0-

Generation = 10, Population = 9.
01*-.-*1..1---0--0-0

Generation = 11, Population = 8.
1-.1.0.*..-0-0-00---

Generation = 12, Population = 5.
-1.-.-....1----110--

Generation = 13, Population = 6.
1-.-.-....-0--0*-10-

Generation = 14, Population = 8.
-1.-.-....1-101.-*10

Generation = 15, Population = 5.
1-.-.-....--*-*.1.-1

Generation = 16, Population = 3.
-1.-.-....-0.-..-.1-

Generation = 17, Population = 3.
1-.-.-....1-.-..-.-1

Generation = 18, Population = 3.
-1.-.-....-0.-..-.1-

*** Life<Cell> 4x18 ***

Generation = 0, Population = 3.
---------0--------
----------------0-
---0--------------
------------------

Generation = 2, Population = 9.
---0---0-0-0------
--------------0---
-0---0---0--------
----------------0-

Generation = 4, Population = 8.
---0-0-------0----
------------0-----
---0---0-0--------
----------------0-

Generation = 6, Population = 19.
-0-0-----0-0-0-0--
----------0---0-0-
-0-0-0-0-0-0-0----
------------0-0-0-

Generation = 8, Population = 10.
-0-0-----0-------0
--------0---0-----
---0-----0-0------
----------------0-

Generation = 10, Population = 17.
---0-0-0-------0--
------0-------0-0-
---0-0-0---0-0---0
--------0---0-0-0-

Generation = 12, Population = 15.
-0-0---0-0-0---0--
----0-------------
-0---0-----0-0-0-0
--------0-------0-

*** Life<Cell> 2x36 ***

Generation = 0, Population = 10.
-----0---0000-0------0--------------
-------------0----00----------------

Generation = 2, Population = 18.
---0-0--1---*1--0--1-0-0------------
-----------1-0-001**11--------------

Generation = 4, Population = 21.
-0----111--0*1-0*0-*-*---0----------
---------0---*0*--**--11------------

Generation = 6, Population = 24.
-0-001*1.--**1-0*-1.-.---0-0--------
-------1-0--0*0*--..*-*.11----------

Generation = 8, Population = 20.
--0*--*1*-1*.1-0.1-.-.-0-----0------
-----10*--1--.-*--...-...111--------

Generation = 10, Population = 26.
01-.1-***--..--**1-.-.--1*-1-0-0----
----1***-1*--.-.-*...-..**1.11------

Generation = 12, Population = 26.
-.****..*1-..1-..1-.-.0--*11-*---0--
--0--...-**-0.0.-*...-...**.*111----

Generation = 14, Population = 30.
-**.*....-1..1-..**.-.01-***1*---0-0
01-0*...-*.10.0.-*...-...*...*-*11--

Generation = 16, Population = 28.
-**.*....--..--.*.*.-.**1*.*-*-1---0
-1--*...-.*.**0.*.*..-.***.*.*-.--11

*** Life<Cell> 8x25 ***

Generation = 0, Population = 7.
----------------0--------
-------------------------
-------0-----------------
-------------------------
---------------0-0-------
------00-----------------
-------------------------
----0--------------------

Generation = 2, Population = 24.
-------0------0-0-0------
-------------------------
-----0---0-----000-------
------01-----------------
-------1-----0-0-0-0-----
-----1--10---------------
---------------0-0-------
--0-0--0-----------------

*** Life<Cell> 1x44 ***

Generation = 0, Population = 3.
-----------0-----0---------0----------------

Generation = 1, Population = 6.
----------0-0---0-0-------0-0---------------

Generation = 2, Population = 6.
---------0---0-0---0-----0---0--------------

Generation = 3, Population = 10.
--------0-0-0---0-0-0---0-0-0-0-------------

Generation = 4, Population = 6.
-------0-----0-0-----0-0-------0------------

Generation = 5, Population = 8.
------0-0---0---0---0---0-----0-0-----------
