*** Life<FredkinCell> 13x12 ***

Generation = 0, Population = 15.
------------
0-----0-----
--0----0-0--
------0-----
----------0-
--0---------
---0--------
------------
-------0----
------------
0----0-0---0
----0-------
------------

Generation = 6, Population = 60.
--4-1-0-0-11
--5---2---3-
3--01-0101--
--3---0-1-3-
--2-0134---1
--1-0-1---1-
--0-0010---1
----0-0-0---
0---0---0--2
----1-0-0---
--0-3-1---10
2-2-------0-
-1-000---0-0

Generation = 12, Population = 62.
31-2421-----
6-7-5---0---
5-1-3---2---
4-----2-4---
0-3------321
0-1-0-3---1-
3-101-4-1---
--0-0---2-0-
-31-021--22-
5-----4-----
0-3-525----2
2---1-----2-
1203----113-

Generation = 18, Population = 60.
-384-32-----
8-8---------
6--3---23---
4-4-7-3-----
--74------4-
1-3-3-4-----
-1305---52--
1---0---4---
36-41--1343-
--5-2---3-0-
-4-3-36--212
2---3-------
1-0-11-121-2

Generation = 24, Population = 59.
--+---812-2-
+-+-7-6---5-
75-44---4-2-
6---7-3-----
------7+----
3-5-4-----5-
53-1--7-----
5---0-5-----
4+-67--54-4-
----5---4-2-
2565-7+42---
6-6-9---5-5-
-2-5---3-2--

Generation = 30, Population = 65.
69+---813---
--+-+-7-----
+778-+------
+---+-5-9---
13+-847--+-5
--6---5-0-7-
777275+2-5--
8-0-2-+---2-
-+--8---6--5
--7-6-9-6-3-
3---68+5----
--8-+-7-----
5---1----3-3

Generation = 36, Population = 68.
9++79+-1-8+5
+---+-------
----6+8---3-
--6---8-----
33+68--+5+--
9---6-5---7-
8--3----65-6
+-2-4---6---
++--9-7-79+6
--7-----7---
56-8-8-96557
--8-+---8---
-627-78---53

*** Life<FredkinCell> 13x1 ***

Generation = 0, Population = 4.
0
-
0
-
-
-
-
-
0
-
-
0
-

Generation = 26, Population = 7.
5
6
7
-
8
5
-
-
-
6
-
-
5

*** Life<FredkinCell> 14x16 ***

Generation = 0, Population = 6.
----------0----0
----------------
----------------
----------------
----------------
----------------
----------------
----------------
--0-------------
----------------
----------------
-0---0----------
-----0----------
----------------

Generation = 4, Population = 22.
------0----0-21-
----------------
----------0----0
----------------
--0-------0----0
----------------
----------------
-0---0----------
0----00---------
----------------
----------------
-----2---0------
-11--2---0------
-0---1----------

Generation = 8, Population = 20.
-------0-0----3-
----------------
----------------
-0---0----------
-----0----------
----------------
----------0----0
----------------
----31---------0
-2---1----------
----------------
-3---4---2---0--
-22----------0--
----------------

Generation = 12, Population = 46.
---0------32-33-
----------------
-------2-02---11
-----2---1------
-1--12-2------10
-0---2----------
------1----1-21-
---------0---0--
0-3--2--20-1----
-----5---1------
----------0----2
-------------2-0
2-4-3-0--2---2--
---------1---1--

Generation = 16, Population = 21.
-0--030---------
-0---2----------
-----3----------
-3---6----------
--1-------------
----------------
--2-------------
----------------
------------0-2-
----------------
----------------
---------2-3-3-2
---------411---1
----------------

Generation = 20, Population = 51.
1-------414-----
-2-------2------
--0-231--1------
-----8---2------
02--47------2-2-
-1---7----------
1----11---------
-1---2---3-0-1-1
--4-----32-2--21
----------------
--2-------------
-----6-3-4-4----
-----223-61-3---
---------6-3-2-3

Generation = 24, Population = 51.
12---4---3---5--
-3---4---4---0--
-20----------0--
-----------3---0
----69---1-1---1
-5---8----------
-3---52---0-----
----------------
-1---4---2-43--3
-3---6---6-3-0-3
-----8----------
---2---5-8-4-3-5
-3-4---3-+--53-5
----------------

Generation = 28, Population = 67.
-2---6---5-5----
---------6-----1
-2---5----6--4-3
-------1---5-1-4
-2---9-313--23--
-----9---1-4---4
-5----4--30--44-
---0---3-8---1--
-3-576--56--52-7
-5---7-1---5----
-----+2--52-----
---4-9---+------
-3---5--3+-2-5-7
-4-3-5-4--------

Generation = 32, Population = 18.
--------5-5-36--
----------------
----------6----3
----------------
----------------
----------------
--2-------------
----------------
0---7-----------
-6---7----------
--2--+----------
-------8--------
---7---5--------
-5---7----------

Generation = 36, Population = 52.
----2-1-566-4-7-
----------------
--1---4-1-622-3-
----------------
1---7---1-2-33--
-6---+----------
1-2--64---1----2
-------3--------
0-458--46-------
-6-------7------
112---3--6------
-8-4-+-----5----
3---5------2----
-7-----4-+------

Generation = 40, Population = 52.
-----6-----54-7-
-3---5----------
-----6-3-2----3-
-------2--------
---1---3--2----3
-6---+----------
----0---0---34--
-2---6----------
--56--64--0--2--
-8---+-1-8---1--
-13-3+-------3-7
-+---+---------7
4--85------3---7
-8---8---+---5--

Generation = 44, Population = 60.
-2-0-7-46-------
-----5---8------
-2-14---12+-----
-5-2-+-----5----
--3--+----234---
-----+-4-----3--
162----6----468-
-2-----4-+-----4
--78+----8----57
---1-----+-6---7
----4+3----63--+
-----+-----6----
------275-6-----
-------4-+------

*** Life<FredkinCell> 23x6 ***

Generation = 0, Population = 24.
------
-0----
----0-
----0-
0-----
0-----
---0--
0--0-0
-00---
--0---
------
0----0
0-----
--00-0
------
-0----
------
0-----
----00
0-----
------
-0----
------

Generation = 3, Population = 74.
----10
0--1-0
101-1-
2-1-1-
3011--
-0121-
-021-2
0-0--0
1--010
---2-0
2---0-
-0-0--
3-2-00
---3-1
10000-
2--0-1
00-01-
02--0-
-012--
02--0-
000-11
-00--0
0--0--

Generation = 6, Population = 73.
2--1--
1-0-2-
-----1
3-2022
4-2--0
23-320
1-310-
------
2-102-
1----3
30--0-
-1-102
--3-31
--1--4
101030
--201-
-101-1
-5--3-
-3-3-2
-32---
11-0-2
11-003
--012-

Generation = 9, Population = 70.
-21-20
-01---
30--2-
403-35
---1--
---4-1
2-4-04
1214--
31-1-3
2--323
--1---
-40-02
-14-42
---6-4
-0-3--
--30--
---11-
-61--1
34-3-2
-430--
2201--
2--113
0-1---

Generation = 12, Population = 65.
-21---
--24-3
4-3---
------
-24--0
-6---4
-35--4
--4--1
-2-1-6
313---
---2--
2-32-3
524255
101---
203---
406--2
23----
---0-4
452433
-5-12-
2--2--
-13---
-12-40

Generation = 15, Population = 78.
-5---1
5-3-3-
426--4
4-6236
435--1
3-3--4
--6545
347--1
435---
62-333
-25333
3--52-
--5565
-1-74-
3-434-
-164-2
--413-
---15-
56-5--
-65-21
---5--
32---4
-2--5-

Generation = 18, Population = 75.
4-2-42
---73-
7-7067
44733-
7-8---
4845--
6-96-8
-----4
--6--8
-36-6-
3---34
3-3-3-
7-8678
----7-
3-4--1
7--53-
3-4132
0--468
87-87-
07-33-
-51-35
-3----
--4-61

*** Life<FredkinCell> 10x6 ***

Generation = 0, Population = 1.
------
------
------
------
------
------
------
----0-
------
------

Generation = 20, Population = 7.
------
0-----
------
--0-0-
------
----0-
------
----0-
------
--0-0-

Generation = 40, Population = 9.
------
0-0---
------
0-0-0-
------
0-----
------
0-0-0-
------
------

*** Life<FredkinCell> 3x22 ***

Generation = 0, Population = 12.
-0--0----0----0-0--0--
----0-----------0-----
---0-0--------0-----0-

Generation = 3, Population = 33.
01--3-11---11-10122--1
--10--10---0-010---0-0
--00-0----00-00--0--10

Generation = 6, Population = 25.
--20--12-0-1--1--3301-
2-1---1-------1---0---
0--0-0-----1-001----41

*** Life<FredkinCell> 21x11 ***

Generation = 0, Population = 7.
-----------
-----------
-----------
--------0--
--------0--
-----------
-----------
--------0--
-----------
-----------
-----------
-----------
-----0-----
-----------
--------0--
-----------
-------0---
-----------
-----------
-----------
--------0--

Generation = 8, Population = 24.
-----------
-----------
--------3--
0-----2-2--
0----11----
-----------
--------4--
0-----1----
-------1---
-----------
-----------
--------2--
-0-------1-
-----------
1-----0-1--
--------0--
-------3---
-----------
-------3---
-----------
0----11-1--

Generation = 16, Population = 25.
-------26--
-----------
-----1-----
4-----4----
4-----1-7--
-----------
--------7--
6-----3-6--
-----------
-----------
-------16--
--------4--
-2------42-
-----------
4----43----
-----------
-------3---
-----------
-----------
-----------
1-----3-1--

Generation = 24, Population = 40.
3-----748--
-----------
42----54-3-
--------+--
-0---5--74-
-----------
-----6-5+--
-----------
--------7--
-----------
2----6+3---
-----------
43----3--4-
-----------
-3-------4-
0-----4-4--
-------4---
-----------
--------8--
--------2--
11---44-25-

Generation = 32, Population = 25.
-----6-----
-----------
--------9--
8-----9-+--
+-----57---
-----------
--------+--
+-----8-+--
--------9--
-----------
--------+--
-----------
-7-------6-
-----------
+-----95---
--------7--
-------5---
-----------
-----5-----
--------2--
5-----5----

Generation = 40, Population = 44.
-5-------4-
-----------
-------6+--
+-----+-+--
+4----5987-
-----------
-----9-+---
--------+--
2----584---
-----------
5----++-+--
+-----9----
-9-----7-+-
-----------
-------9+--
-----------
-----3-69--
-----------
-6-----7+5-
4-----5-4--
-6-----4-9-

*** Life<FredkinCell> 8x17 ***

Generation = 0, Population = 24.
-------------0---
0----0---------0-
-0-----0----00---
0-----0-0-----0--
--------------0-0
-------0---0---00
0-----00---------
--0-0---0--------

Generation = 3, Population = 78.
0--0---1--012---0
--1-0-221-0---200
--01020-011-13021
0--0121-10-120100
-10--0--0-00-2301
-01--1-100---0-11
--2------1-0-0-0-
200-0001-0110--1-

*** Life<FredkinCell> 22x9 ***

Generation = 0, Population = 8.
-------0-
---------
---------
---------
--0--0---
----0----
---------
---------
---------
-----0---
------0--
-------0-
---0-----
---------
---------
---------
---------
---------
---------
---------
---------
---------

Generation = 1, Population = 19.
------0-0
-------0-
---------
--0--0---
-0-0--0--
--00-----
----0----
---------
-----0---
----0----
---------
---0----0
--0-0--0-
---0-----
---------
---------
---------
---------
---------
---------
---------
---------

Generation = 2, Population = 26.
-----0-0-
---------
--0--0-0-
----0----
0--10--0-
--1---0--
--0--0---
----00---
------0--
---0-----
---00---0
---------
-0---00--
-------0-
---0-----
---------
---------
---------
---------
---------
---------
---------

Generation = 3, Population = 54.
----0---0
--0------
-0-0----0
0-0-1----
-0-2-0--0
002-0----
-010-1---
--001----
---00--0-
--01--0-0
--0-10-0-
-0-0000-0
0-0-011--
-0-0-0--0
--0-0--0-
---0-----
---------
---------
---------
---------
---------
---------

Generation = 4, Population = 29.
--00-0-0-
----0----
-------0-
---------
01----00-
1----0--0
------0--
-------0-
--01-0---
-0--0----
--1-----0
---1---0-
-------0-
-----1---
------0--
-------0-
---0-----
---------
---------
---------
---------
---------

Generation = 5, Population = 50.
-0110---0
--0------
----0-0-0
00----0--
-20---11-
2---0-0--
0-------0
--00-0--0
--120-00-
0-0-----0
----1----
----0-01-
---0-1110
----0--0-
---------
---0----0
--0-0--0-
---0-----
---------
---------
---------
---------

Generation = 6, Population = 78.
012-10-0-
--1---0--
0000--1--
1---10--0
0-1200220
3-20--1-0
101001001
00--1---1
002310110
--1---0--
0-1020000
----10---
--0--22-1
-------1-
---00--00
---------
-0---00--
-------0-
---0-----
---------
---------
---------

Generation = 7, Population = 90.
1---210-0
-0--0-1--
--11--200
---0--0-1
---3113-1
-03100---
21211-1-2
1100-0-0-
-13-2-2--
---1-0-0-
----311-1
0----101-
-0-0--31-
--0001-20
--01100-1
-0-000000
0-0-011--
-0-0-0--0
--0-0--0-
---0-----
---------
---------

Generation = 8, Population = 30.
---1-----
----10---
--2--03--
-------0-
-2-422--2
--4---1--
-------0-
---------
-------1-
-0---1---
0---4----
---1-----
--01-2-2-
----1----
---------
---------
---------
-----1---
------0--
-------0-
---0-----
---------

Generation = 9, Population = 45.
--2--1---
--1-2----
-0-1--4--
-0001----
0-15-3---
----0---0
--2-----2
---------
-1---02-0
--1---00-
---------
0--2-1-1-
-01-0---1
--0----2-
----1----
---------
-----1---
----0----
---------
---0----0
--0-0--0-
---0-----

Generation = 10, Population = 64.
-131--0--
--20--1--
01-200-0-
--1-2-0--
-2----3-2
3------01
-1-11--03
-10--00--
0---21-1-
---1---1-
0-10-11--
----1----
-1-1---2-
--10--0--
--01-0-0-
----00---
------1--
---0-----
---00---0
---------
-0---00--
-------0-

Generation = 11, Population = 99.
124-2110-
00-1--2--
12--11--0
10-0301-1
----23423
-0-10---2
-2222----
--1-1-101
--3-3-220
---2---20
--2-422--
0002--01-
0-12----1
---11--2-
-0--110-1
--0-1--0-
---00--0-
--01--0-0
--0-10-0-
-0-0000-0
0-0-011--
-0---0--0

Generation = 12, Population = 85.
-3513-210
112-203-0
2322--401
---1---0-
0--5345-4
314-1-1-3
2-333110-
---0---1-
-1434---1
--1-010--
0-3-5--01
-------2-
11-3--32-
00------0
0---2-1--
---0---1-
--0--1-1-
-0--0----
--1-----0
---1---0-
---0---0-
-----1-0-

Generation = 13, Population = 81.
--6--1---
--3---4--
-43----1-
-0---0111
1---4--25
4------04
32-44-2--
111-10-2-
0254--2--
0--21-1--
--4-6---2
-0021----
----024--
1-111----
1-------1
0----0-20
-------20
0-01---00
----1----
---20-01-
--01011-0
---00--10

Generation = 14, Population = 90.
-3713----
---1-----
2--2-142-
-1---1---
2--5---36
---1-----
4-35-1-03
2----1--1
136-4-3--
1-1---220
0-5--220-
011-2-0-0
11-31-52-
2-2---0-0
-00121--2
10--1---1
--00-1131
--12--0--
0-10200-0
----10-2-
-01-----1
-------2-

Generation = 15, Population = 102.
14-241---
11---040-
--33---31
1-1-32--1
--1644547
----10---
5-4--2-1-
---0-2--2
2----14--
-0-21-331
-0-0-3--2
12-231---
2--4--631
3-31--121
1-1-32-0-
2-00200--
0---022--
0023-1---
---131-0-
00----0-0
012101-0-
-00---0--

Generation = 16, Population = 25.
---3---1-
---------
---4-----
-------1-
22-------
4----1--4
---------
---------
---------
-1--2----
-----4--3
---3---2-
-------4-
---------
-------1-
---------
---0---3-
-------0-
------0--
-----0---
--3--2---
----0----

Generation = 17, Population = 63.
--7-4-2-0
-------0-
--3-1--3-
11-1--1-1
-31--4-47
5---1-10-
5----2--3
---------
-3--4----
1-12----1
-0-0--2--
--1-3103-
---4--651
---------
------1-2
---0-----
--0-0-241
---3---10
---------
--0-11---
-1-1-31--
--00-----

Generation = 18, Population = 59.
-4-----1-
-------1-
2--4-1-4-
2-------2
2-2------
6-41--2-4
62-------
21--12--2
-----1--1
--2---33-
---1--3-3
----4----
-------62
---1---2-
---1-2---
-------2-
-0----35-
---------
--1131-00
---22----
0--20-20-
--1-010--

Generation = 19, Population = 100.
1-7---220
11-1-04-0
343----5-
-111-2---
--3---5--
-1-211---
7--5422--
--102-123
236--2--2
-1-----41
-----440-
-----103-
---41-6-3
--321113-
--12--1--
-0-0-0-31
0-0--24-1
-023010-0
-02242-11
0--33-0-0
-1--13-11
00-0-----

Generation = 20, Population = 64.
24-------
2----1--1
---4-----
---2---1-
-34644-4-
--4-2-2--
---6-3--3
---1-----
34-----2-
-2-------
-0--6-51-
---3-----
---------
-0--2--4-
---3-2212
---1-1-4-
--10-3-5-
---41--1-
--3----22
-0--4----
0232-422-
1----1-20

Generation = 21, Population = 100.
-57--1--0
3--12-41-
3-3511-51
-1---2122
245755557
--5-3---4
---74--1-
211222-23
4-64--4-2
--2-2-3--
015---623
-21---03-
-1-41--6-
3-3----5-
-0143---3
------0--
-02104--1
--2-2-0--
------0-3
-10---0-0
-3-31----
2-10020-1

Generation = 22, Population = 108.
-68------
4-3---5-1
44462--6-
221-332-3
356-66668
6-6---205
724-5-223
--2-331--
547-4-523
---2-----
126164734
-3--41-4-
-2-522--3
--42--16-
-12-422--
-------4-
013-1545-
--343111-
-0--42--4
0-1-411-1
-4-------
-0211-1--

Generation = 23, Population = 101.
-7-3--2-0
5---21-1-
55----4-1
3-2244--4
467--7-79
---2--3-6
--5-6333-
-1--4-22-
6--452--4
--2321---
23-275-45
---352050
231-3--6-
-0--21-7-
12-45--1-
2-----051
1--1-6561
00----2--
--3-530-5
-----22-2
-533-4--1
2---2--2-

Generation = 24, Population = 68.
-------2-
61--32--1
66-6-1-62
---------
---7-868+
616--14-7
---7-----
---------
---------
--3--234-
3463-67--
-----3---
3425-2---
3---32--1
---5-----
----2----
--3--7-7-
-1-431---
0---641-6
-1-3-3---
-6-415--2
--2---1--

Generation = 25, Population = 85.
27--412--
--3-4-512
----22-7-
32----2--
46----7--
7-723--08
72--633-3
---2-----
--7--252-
1-4-2-451
4-74-7---
----5----
---63-6-3
4-424-17-
1-2-52--3
--0----5-
----18--1
--3542-10
-0-2--2--
-2-4-----
073----2-
----2--21

Generation = 26, Population = 103.
38-3----0
6------23
6646-3-8-
--2-4-3--
5--7688-+
--8---41-
-3-7--434
21-----23
648--36--
2--3---62
5--5---45
1-136-0-0
3---4-76-
5--352-81
2--5-3-1-
2011--0-1
------572
--465-22-
013-----6
--154-22-
184-1-23-
2021-21-2

Generation = 27, Population = 96.
-9--4---1
-13--25--
--572-49-
--3-5-4-4
-6787-98-
7--23-5-8
-45-63---
-2-2-32--
759-5472-
---422---
-4------6
--24--1-1
-426-2--3
-04-6-192
----54223
----2-1-2
11--1868-
0---6---0
1-42---2-
-22------
-95-253--
-13223-2-

Generation = 28, Population = 98.
3+-3--22-
6---43--3
--6--35+-
---------
-7898-+9+
-18-4161-
--6---4-4
-----4---
86+---834
2--53--62
5---77747
-3--6----
3---4-7--
5--37--+3
-2256--34
20-1----3
-2312-792
--4-7-22-
21-3--2--
--3-4322-
1+64-64--
2-4-3-1-2

Generation = 29, Population = 94.
-+----33-
7-3-5-52-
66-7---+-
-2-254--4
5-9--8-++
7-92----8
--776353-
22--4-22-
--+-5-94-
---6--473
6---8--5-
1-24---51
4-------3
6---82---
2----42-5
31--2-15-
--42---+-
015-8-3--
32--6--2-
-24-54-32
---5--5-2
3152-32--

Generation = 30, Population = 100.
----41--1
8--1---33
--6823-+-
333---425
67+9-9-++
8-+---619
---87-6--
332--4333
8--46-+5-
2---32--4
7475-7--7
--35--1--
-42642--4
-0-39----
----6--3-
-2---1---
-2-32-7+2
-2-69--2-
-343---3-
--55-52--
1-66-6633
4----4-22

Generation = 31, Population = 109.
3---523-2
-1-25-5--
---9-45-2
-442545--
78-+---++
91+24--2-
-47983-3-
--3245-44
---5----4
--46----5
--8-88-58
1346-3-5-
4-3-53-6-
614-+--+3
----7-2-5
33112---3
1----88+3
0-57-2---
3-54-4-46
0-66---32
2----774-
5152352--

Generation = 32, Population = 26.
---------
-------3-
------6--
-----5---
-9--89--+
--+---6--
---------
----5----
--+--4---
-2---2---
7---9----
---7-----
---6-----
---------
-------3-
---------
---------
---------
--65-5---
----5--4-
------8--
-----6---

Generation = 33, Population = 47.
-------3-
--------3
---------
-4---6--5
7--+9--+-
---24--29
--7-8-6--
--32-----
---5-5+--
-----34--
---------
1-48-----
--375----
---3---+-
------2-5
-------5-
---------
--57-2---
-3766-24-
--6-----2
----2----
----3----

Generation = 34, Population = 61.
------3--
---------
-6---4---
--42--5--
--+---+++
9---51--+
-48-9---4
-3---5---
---6---5-
---63--7-
7-85-87--
---------
44--63-6-
---4-----
---5-4---
---------
--43-8-+-
----9--2-
34-77535-
--7---2--
--6637--3
---246---

Generation = 35, Population = 100.
-----2-3-
-1---35--
6--92----
---35-6-5
79+-9----
---2-2---
--9-+3-35
34-2--344
-6+7-5+64
2--74--85
--9-998--
-3486-15-
553-74--4
6145---+-
--26--2--
--1----5-
-2542--+3
0257+2--0
45788-4-6
0-86-53-2
-+-74--4-
----5-2-2

Generation = 36, Population = 77.
-+--533-2
--32--6--
--6-----2
-4--6----
8-+-+-+-+
91+--362+
7---+-6--
4--3-5--5
8--866+-5
--4--34--
7-+-+--58
----7--6-
--4--5-6-
-2---2---
2-3-74-3-
---12--6-
---5--8--
-----3---
56----5--
1--7-6-43
--6---8-3
-1--6--2-

Generation = 37, Population = 80.
3---6----
---3--73-
--7-2-6+-
--43766--
9-+-+9+++
+--254---
--9---7--
-434-6346
96------6
-25-4----
--+-+---9
1--88-1--
---7-6-74
--4---1--
-2-6---45
3------73
--56-----
02-7+-3--
-778-5--6
2------5-
2---4---4
5--2-6---

Generation = 38, Population = 100.
-+---333-
8---53--3
-68-347-2
345--7725
+-+-+-+-+
+1+36-62+
7-+9+38-5
--45-74--
+7+866+-7
----53---
7-+5-985-
-3---3---
5--87--85
---5---+-
--3-7----
--1---1--
--6---8+3
1--8+3-20
5---8----
3-87563-3
-+-------
615-6-2-2

Generation = 39, Population = 108.
--8----4-
-133-47-4
6------+-
-5637---6
---++9---
+--4747-+
84+-+4936
--56-854-
+-+97----
-2-7-4485
-4+6++-69
1----4--1
--4-8-7-6
6--6+-1+-
-246-424-
-3-1212-3
127-2--+-
22-9+43--
-778-555-
429-6-4--
2+67-7---
726------

Generation = 40, Population = 67.
--9--3---
-244-58--
-6--34--2
-6-4-----
+9-+-----
+------2+
-------4-
--6---6--
-7--86--7
-3-----9-
---7-+8-+
---885---
-5-896887
--4--22--
---7-----
----32---
--8--88--
-3--+5-2-
588----66
--+---5--
3--84----
-3---6---

*** Life<FredkinCell> 24x1 ***

Generation = 0, Population = 2.
-
-
-
0
-
-
-
-
-
-
0
-
-
-
-
-
-
-
-
-
-
-
-
-

Generation = 4, Population = 3.
-
-
-
-
-
-
1
1
-
-
-
-
-
-
0
-
-
-
-
-
-
-
-
-

Generation = 8, Population = 4.
-
-
0
1
-
-
-
-
-
-
-
1
-
-
-
-
-
-
0
-
-
-
-
-

Generation = 12, Population = 5.
2
-
-
-
-
-
3
-
-
-
-
-
-
-
1
1
-
-
-
-
-
-
0
-

Generation = 16, Population = 4.
-
-
-
-
3
-
-
-
-
-
-
2
-
-
-
-
-
-
-
1
-
-
0
-

Generation = 20, Population = 6.
2
-
-
-
-
-
-
3
3
-
-
-
-
-
-
-
-
-
1
-
-
-
1
0

Generation = 24, Population = 8.
-
-
1
3
-
-
-
-
-
-
-
3
1
-
2
-
-
-
1
1
-
3
-
-

*** Life<FredkinCell> 6x18 ***

Generation = 0, Population = 3.
------------------
------------------
------------------
------------------
----0----0--------
---0--------------

Generation = 22, Population = 45.
1-304-3---1-4-1-0-
-1-1-1-0-1-2-1-0--
23004-----202-1-0-
-2---------5---2--
2---7---5-43-35-12
-2---5-2-----3-4-1

*** Life<FredkinCell> 22x4 ***

Generation = 0, Population = 9.
----
----
----
-0--
--0-
----
----
----
----
-0--
----
-0--
-0--
----
----
-0-0
----
-0--
----
----
----
---0

Generation = 9, Population = 29.
-0--
0---
----
00--
1100
01--
-1-0
0---
----
0---
----
0-05
--21
---5
-1--
0---
----
0---
-1-0
-1--
0-0-
-0--

Generation = 18, Population = 30.
-2--
----
2-32
-3--
-52-
-4--
2-1-
-5-4
--1-
----
01-5
-8--
-35-
----
---3
---3
---3
-3--
-51-
-4-5
0---
-2-2

*** Life<FredkinCell> 21x22 ***

Generation = 0, Population = 15.
----------------------
-----0----------------
0-------------0-------
----------------------
----------0----------0
----------------------
-------0-----------0--
---------------0------
----------------------
----------------------
----------------------
----------------------
----------------------
----0-----------------
---------0-----0---0--
----------------------
----------------------
----0-0---------------
-0--------------------
----------------------
----------------------

Generation = 23, Population = 217.
44---0-6---5-3--403-1-
20413--22621--020-03-4
5-----------52-4---63-
2-20--3-1---0102--0--1
5-5194---1-3-5--22----
1-34-5---22---0--402-5
5-------15-----6---604
1-10---22--4---20-----
4-01100---2-3-2-12-331
3--6-13-42-----4-----2
-350221---2---6--4-22-
--40-2-11--2-126-4021-
----152431---55----3-1
-10------2--3----02-0-
4-111303-254-26--3-2--
-0---1-0-0011-410320-1
---2-403--321----1----
1-0----23--1---4-----0
213-1-0--152143-232---
-----3--1-31--234-1--2
020------2-------12101

*** Life<FredkinCell> 16x24 ***

Generation = 0, Population = 23.
------------------0-----
------0-------------0--0
-------0----------------
-------------------0----
---------0--------------
-----------------------0
------------0---------0-
-----0--------------0-0-
0--------------------0--
----------0-------------
-----------0--00-----0--
------------------------
------------------------
----------0---------0---
---------------0--------
------------------------

Generation = 24, Population = 170.
--5-32-5----4--14---43-3
+3---3-1-58---2753--6--3
6--2---4-4--4-40--8---5-
--3--5----1276----25-6-2
-3-4--40-3-------7----7-
-33-3-33453----9-+55---7
5--35---5-7-7--5-2-56-84
4-6-1-2----------+3+8--3
-4344----------2--1-2-6-
-32-4-22462-52-4-6--+-66
----4-4-5553--42----5-7-
---0--4---3066-5-2-4-4+2
-1---1-1-2-1--9--3---4-0
2---8--5-3514--0-356-4-9
--00-42-----4-7--92-34-4
1-----3--5----41-2--3341

*** Life<FredkinCell> 8x12 ***

Generation = 0, Population = 12.
-----------0
------------
--0---00----
----0---0---
---0--------
----0-------
------------
---000----0-

Generation = 16, Population = 31.
-367--75---2
----3---6---
-329--434--2
6-----1---2-
--6--578---4
---402--0---
---3--------
8--------3-2

Generation = 32, Population = 31.
--8+-8+-----
----8-------
9+6-----6---
+-++67----2-
-5-------9-+
0--706------
--+---5+----
+9--4----447

*** Life<FredkinCell> 16x14 ***

Generation = 0, Population = 18.
--------------
--0----0------
----0---------
---0----------
------------0-
--------------
--------0-----
--------------
--------------
-0--------00--
------0------0
-0------------
--------------
-------0------
---0---0------
0-0---0-------

Generation = 32, Population = 57.
----5---------
5--+74---5----
--+---6-----6-
-78--8-9------
----5---3-5---
---5----------
------3---4-5-
-6--------45--
------5-2----5
-3-8----66--3+
----5---4--9-8
-3-8---8--82--
---6--35-----5
6+9--56--5----
-5-------4----
8-----+87-----

*** Life<FredkinCell> 10x6 ***

Generation = 0, Population = 15.
-0-0--
-0-00-
0-----
00----
--0---
------
----0-
---00-
------
00---0

Generation = 20, Population = 34.
645---
---41-
6---+2
-97567
---4-2
6824-5
455---
1--87-
2462--
-773-6

*** Life<FredkinCell> 25x13 ***

Generation = 0, Population = 8.
-------------
-------------
-------------
-------------
-------------
-------------
---------0---
--------0----
---0---------
-------------
-------------
-------------
----------0--
-------------
-------------
------0------
-------------
-------------
-----------0-
-------------
-------------
-------------
-------------
-0---0-------
-------------

Generation = 26, Population = 113.
--0--0--32---
-3---2-------
---3-135-----
-------2-----
120--232---64
--------01--1
3--217-1--5--
------5----11
---2-2-3--32-
------1-2---0
--62-422-----
----4---3--2-
42---47-63-51
1----4---41-1
-62--41--4---
8-413-----5--
-2-1-2-4--8--
------3-1-6--
1---2----564-
2-23--3-----3
210---21-3--2
----1-4---1-2
---2--32-7-3-
2--26-----3-3
-10-----43---

*** Life<FredkinCell> 4x11 ***

Generation = 0, Population = 11.
---0-0-000-
---0------0
----0------
-0--0--0---

Generation = 29, Population = 23.
84-+4-3--+8
-7-7-----2+
765-6-5---2
-++5-++--5-

*** Life<FredkinCell> 24x1 ***

Generation = 0, Population = 19.
0
0
0
0
0
0
0
0
-
0
0
0
-
0
0
0
0
0
-
-
-
0
0
0

Generation = 15, Population = 9.
2
-
3
-
-
3
-
-
-
1
-
2
-
-
8
3
-
3
-
3
-
-
-
-

Generation = 30, Population = 14.
5
5
-
7
-
6
8
7
7
5
-
+
-
-
+
6
-
-
9
-
8
-
8
-

Generation = 45, Population = 13.
8
8
+
-
-
9
+
9
-
-
6
+
-
-
+
-
+
9
+
-
-
-
-
+

*** Life<FredkinCell> 3x23 ***

Generation = 0, Population = 25.
---0-00--0--0-00-0----0
----00-00-----0-00-00-0
0-0-----0-0-0-------0--

Generation = 4, Population = 30.
-01--1-012-3----3--301-
00-01---0211-1-34----22
0-0-----2---2-0-------0

Generation = 8, Population = 34.
1--01-42-2-4-4--72--222
022---0-24-2-267--05-3-
2-2---0-4-1-2---0---4--

Generation = 12, Population = 32.
5--232--24362--19-1---6
22----26-4-3526---29-72
3-------8-3---1-----4-2

Generation = 16, Population = 34.
733--35--6-7-5-3+-34--+
-4-63--+56-4-26-4---3+4
--3---5---5-3-3-1---4-4

*** Life<FredkinCell> 23x14 ***

Generation = 0, Population = 1.
--------------
--------------
--------------
--------------
--------------
--------------
--------------
--------------
--------------
--------------
--------------
--------------
--------------
--------------
--------------
--------------
--------------
--------------
--------------
--------------
--------------
--------------
------0-------

Generation = 21, Population = 40.
--------------
------0-------
-----0-0------
--------------
-----0-0------
--0---0---0---
-0-0-----0-0--
--------------
-0-0-----0-0--
--0---0---0---
-----0-0------
--------------
-----0-0------
------0-------
--------------
--------------
--------------
------0-0-----
-----0---0----
--------------
-----0---0----
--0-0-0-0-0-0-
-0---0---0---0

*** Life<FredkinCell> 20x4 ***

Generation = 0, Population = 25.
-0--
-0-0
0-0-
----
----
0--0
----
--00
00-0
---0
----
-0--
000-
----
----
--00
--0-
00-0
-0--
---0

Generation = 7, Population = 39.
-7-4
-5--
--11
---0
-0-4
11-1
--11
223-
-51-
1--4
21-3
0-01
332-
--21
---2
-0-4
1-1-
--01
---1
----

Generation = 14, Population = 46.
-92-
370-
1---
2250
131-
62-1
3-21
-662
----
---5
3-1-
04--
--5-
2222
4-04
4-47
---1
-122
02-5
--3-

Generation = 21, Population = 40.
6-2+
---6
-53-
----
--36
+52-
-633
5--2
-81-
---5
8---
--1-
3-86
-447
7445
716+
---4
8--5
---9
-0--

Generation = 28, Population = 36.
-+4-
+--+
3-5-
6-8-
5--+
+7--
--4-
---4
----
--7-
+---
3-38
-7+8
--6-
-7--
7---
-39-
-9-7
355+
607-

Generation = 35, Population = 42.
-+6+
-+3-
5--5
--+6
55-+
++-4
---5
-+-4
-+--
9187
+--9
-+3-
-+-8
7-9+
99--
9--+
-3--
++--
-5--
72--

Generation = 42, Population = 51.
++--
-+5+
7-8-
99-+
568-
-+--
-+45
-+85
-+67
+---
+79+
--5+
7++-
---+
+-9-
+++-
-6+9
--6-
7+9+
+2+5

*** Life<FredkinCell> 25x18 ***

Generation = 0, Population = 20.
--------------0---
------------------
--------0---------
------00----------
------------------
----------0-------
----------00------
-0-0--------------
-0----------------
------0-----------
------------------
-----0--0---------
------------------
---------------00-
--0---------------
------------------
------------------
------------------
------------------
------------------
------------------
------------------
--------0---------
-0-------00-------
------------------

Generation = 11, Population = 243.
-2-1-03--2-402----
-00--------1-0-10-
3-2--03--253110--0
-----6-2142-233-01
220-0-20-0--00--21
010-1---4-2-1--3--
-2--100--511----3-
16-4--4-34-1-1-310
0-----0--204--51-1
05-2--21120-132-11
-1---1-002-1-0----
-22-3-2---21-21-1-
112110--001-0-0-0-
1-0-0--320-3-7--43
-22---10-121---00-
02-0-1110----10---
--0--000-0-100----
02--121----0------
020000-020200--00-
000---011---1002-0
--10-0-0-0--100-20
00-00-102-1002-20-
003-10-01030--3020
11-041--0-2-1-12-2
1--01------0---01-

*** Life<FredkinCell> 18x18 ***

Generation = 0, Population = 6.
------------------
------------------
------------0-----
------------0-----
------------------
---------------0--
--------0---------
------------------
------------------
------------------
------------------
------------------
------------------
------------------
-------------0----
------------------
--------0---------
------------------

Generation = 15, Population = 147.
0----0--------1--0
-0--2-0-0------20-
--10-0---0-----23-
---12---1-4---1--1
--1-2--001-0-1----
-1-12202-40------3
1-0000--0-0--2--2-
-0221-1--213-321--
-000-2-0-210---2--
0-0-2-0-1-0-32-30-
-011-0-2-02122-311
-0000-1-201-1---22
0-0023-031-1------
-0-000002-0-1---13
--0-11-1-2-4-3-220
-0-0--0---1-1--20-
0-0--------2--11--
-0----------210---

*** Life<FredkinCell> 9x18 ***

Generation = 0, Population = 18.
-0---0------------
-0----------------
-----------------0
---00-------------
----0-----0-------
---0-0---0------0-
-------0-0---0-0--
------------------
0-----0-----------

Generation = 5, Population = 65.
----110-0-10------
-10----00------0--
--001--1010-----0-
-0----1-------0---
--1-11001---1--00-
00-01-0-02001--0--
-0010-2-032--10---
0-0-1-00-------0-0
---00-1---0-0---0-
