*** Life<FredkinCell> 2x3 ***

Generation = 0, Population = 2.
--0
0--

Generation = 10, Population = 2.
3--
--3

Generation = 20, Population = 2.
--5
5--

*** Life<FredkinCell> 4x4 ***

Generation = 0, Population = 4.
0---
0---
----
-00-

Generation = 7, Population = 9.
1--0
-6--
6000
-7-6

Generation = 14, Population = 7.
--0-
2+--
+---
-+2+

Generation = 21, Population = 9.
1--0
-+--
+000
-+-+

*** Life<FredkinCell> 3x3 ***

Generation = 0, Population = 2.
---
00-
---

Generation = 8, Population = 0.
---
---
---

Generation = 16, Population = 0.
---
---
---

*** Life<FredkinCell> 7x7 ***

Generation = 0, Population = 1.
-------
-------
-------
-------
-------
------0
-------

Generation = 4, Population = 4.
-------
------0
-------
-------
-------
--0-0-0
-------

Generation = 8, Population = 0.
-------
-------
-------
-------
-------
-------
-------

Generation = 12, Population = 0.
-------
-------
-------
-------
-------
-------
-------

*** Life<FredkinCell> 8x5 ***

Generation = 0, Population = 11.
----0
-----
---0-
-0-00
00---
----0
0-0--
-0---

Generation = 7, Population = 20.
0-24-
--034
1--5-
--1--
-13--
-11-1
-2112
---50

Generation = 14, Population = 19.
--34-
2-13-
-4---
--24-
21541
5----
72--5
--3-3

*** Life<FredkinCell> 9x7 ***

Generation = 0, Population = 12.
-------
0------
--0---0
-------
---0---
0--0---
------0
00--0--
---00--

Generation = 3, Population = 35.
0010-0-
1-2----
20-200-
00-2000
01---10
--2-2--
--0-0-1
-1001-2
02---2-

Generation = 6, Population = 30.
-1-101-
--5--11
--2----
------0
02-322-
003--1-
10---04
--112-3
-31--31

Generation = 9, Population = 29.
0-2-1--
-0620-2
-0--20-
34-230-
0---2--
---24--
--020--
--11--3
-4-2-4-

Generation = 12, Population = 30.
1-----2
1-9-3--
4---3--
441-310
3-362-1
3--2---
--1-0-6
22--4--
1--31-1

Generation = 15, Population = 27.
4263-2-
2-+----
5044-0-
--25---
-4---4-
6-----1
2------
23134--
25---5-

Generation = 18, Population = 30.
4394-32
2---52-
--4----
------1
-5-9253
7-5----
203-106
---4--3
-64--61

Generation = 21, Population = 41.
5-+-3--
50+46--
505--01
65-562-
----2-4
8184-11
2-444-6
6--47--
2755372

*** Life<FredkinCell> 9x7 ***

Generation = 0, Population = 11.
-0--000
-------
0----00
-------
-------
---00--
-0-----
------0
-------

Generation = 3, Population = 31.
2-20---
---0-0-
1---0-1
----100
1--0--1
--2-12-
-0-2000
-00100-
0-00--0

Generation = 6, Population = 27.
21-112-
-10--0-
-1-03-4
0--0---
1-1----
2-----0
0-02-1-
--1---2
1--0--1

Generation = 9, Population = 35.
3-321--
-21431-
---04-4
10----3
2110-1-
2-23-2-
1-0---3
0----03
2200-0-

Generation = 12, Population = 23.
4-----1
0-----0
----425
--1-1--
5---1--
2--42-0
-23---6
------4
-21--13

Generation = 15, Population = 35.
52-314-
-3-4---
-2--42-
302----
8540256
--5-24-
1-64---
1--2--4
43-2144

*** Life<FredkinCell> 11x9 ***

Generation = 0, Population = 9.
-----0---
---0-0---
---0---00
---------
-0----0--
---------
---------
---------
---------
---------
-0-------

Generation = 7, Population = 54.
020-04-33
010-0--40
---12421-
-2010-01-
23-1-2--1
-10--1-20
--130--2-
----0100-
--0-----0
-0-00-0--
0-0-01-10

Generation = 14, Population = 25.
-7-5-9-4-
-6-----+-
-0-1-6---
-4-1-2-3-
----0----
---------
-0----13-
-1-----0-
---1----0
---5-1---
-------33

Generation = 21, Population = 58.
2+5--96-3
0-0-04--0
221-4--56
-6-3--040
-+44--44-
03070-050
2-3-25--2
--0-01-1-
2-12-4-1-
0-090-0-0
0---3--5-

*** Life<FredkinCell> 9x9 ***

Generation = 0, Population = 6.
---0-----
0--------
--0---0--
---------
---------
------0--
---------
---------
---0-----

Generation = 8, Population = 13.
-------3-
--------1
3--2----1
---------
--1---2--
----0-1--
---1-----
---------
--0---12-

Generation = 16, Population = 19.
--7---75-
3-3-0-1--
4-34--4-5
---------
---------
0-6-----0
--33--3--
---------
-------8-

Generation = 24, Population = 22.
0-9---890
--------8
--45--5--
---------
3-------3
0-9-----0
5-34--3-5
---------
1------+8

*** Life<FredkinCell> 10x10 ***

Generation = 0, Population = 13.
---------0
-------0-0
-----0---0
0---00----
------0---
----------
----------
0----0----
-0--0-----
----------

Generation = 9, Population = 39.
-00-3-----
0---1--1--
0--2-3--0-
-343-1--13
4--1---011
1----20---
21---32--2
0---------
0--2----1-
-2011-0-0-

Generation = 18, Population = 44.
---4--685-
654-6----2
161-----34
66-4--4524
+-24--13--
-----3----
--5--43-63
---2--5241
1-254----1
6--2------

*** Life<FredkinCell> 12x13 ***

Generation = 0, Population = 6.
0------------
-----0-------
-------------
-----0-------
-------------
-------------
-------------
-------------
-------------
-------------
---------0--0
--------0----

Generation = 10, Population = 58.
----0----10-0
-0-0-0--1----
------000-110
-0---0110-0--
0------------
-0-0-0110-0--
--0----0--222
--------0----
-10-0-0-----0
1--0-3-0--2--
0-111-112--1-
--00---02-2-2

Generation = 20, Population = 46.
-----30--6---
-0--25--6---2
---------22--
-0--5----3--3
0----0--16---
-2---2--2----
-12--2-------
-22--52-2----
--2-1----0--0
--1--42------
322---5--2---
0-2--22---2--

Generation = 30, Population = 73.
-3--1--3-8---
---2----8771-
-1-1-26----5-
------725-744
-----2--4----
-6-14-3-8-22-
15---5-3-4957
-4512843-0-1-
--4-------54-
7-1535--3-5--
-3--84-356647
--6--63-64436

*** Life<FredkinCell> 15x15 ***

Generation = 0, Population = 12.
0------0-------
---------------
---------------
---------------
-----0--0------
---------------
---------------
----------00---
---------------
0--------------
---------------
--------0--0---
-----0---------
------0--------
----------0----

Generation = 10, Population = 102.
----12--2-2----
0-0-----0--2---
11-0-0-44-0--00
1--------13--2-
--1--3--1-221-4
--000-------0--
321----1321-200
11--111-123--32
--1----1110-1--
1-0---0-0-301-0
10-1-1--0-2--0-
001--21-5-2-4--
--1--033--412--
0--0----1---1--
011-22--0-1-011

Generation = 20, Population = 0.
---------------
---------------
---------------
---------------
---------------
---------------
---------------
---------------
---------------
---------------
---------------
---------------
---------------
---------------
---------------

*** Life<FredkinCell> 16x15 ***

Generation = 0, Population = 12.
---------------
---------------
---------------
0--------------
---------------
--0---0--------
------0---0----
--------------0
-----0---------
---------------
---------------
---------------
------00-------
-0------------0
0--------------
---------------

Generation = 6, Population = 91.
------1---0----
0-0-0---0-----0
----11------0--
--0-0-2---1-0-0
--00---0------1
0---0-----3---1
01---331-1----0
-01-----0---2--
0-0001-401-0--1
---1----0-1----
00-00222-1010--
--1--11---0----
0022-521221-00-
-0-----00-2-0-0
--00001---10---
---0-0----0----

Generation = 12, Population = 103.
-01----3-10---0
-0--2----------
--0--23---0-1-0
------3-2-2-2--
-002-42----1-0-
42--10--2-----2
------6-1-1-2-3
-11-1-5-2-3-2-1
12---2---2---14
112-01--112----
----0---1-0-1-3
-23-142-2-0-2-2
-1-31------221-
02--130--2--200
0---1-2-3-5-2-1
110--1--121-2-1

Generation = 18, Population = 54.
3-2---33-------
-1-1--------2--
--0-255311-----
-1-0--------4--
1---2-4621-----
-3-------------
---1-5----2----
--2---7-----3--
---23616--0-3--
--3---1-2---2--
----153---0-4--
3-----8-4-----5
------6---2----
------0--------
---------------
1--------------

Generation = 24, Population = 62.
--------2-4----
--3--5--10----0
4-----551-3---2
011--5--40----2
------66------1
73------------4
34-----------1-
------9-3------
-56---------427
12--3-2-4-3----
--5---75----5-9
-3--4-+-4-3----
------75-------
0-2-----1------
-----24---8----
--1---2--------

*** Life<FredkinCell> 16x17 ***

Generation = 0, Population = 15.
--------------0--
-----------------
----------0------
---0-------------
------0----------
-00------0-------
-----------------
--0--------------
-----0-----------
----------------0
------0----------
-----------------
----------0------
--------0--------
-------0---------
-------0---------

Generation = 4, Population = 51.
------0---------0
-01------0-------
------0----------
--1----0---------
--0--0----0---0--
11----0------0--0
------2---0------
2--1--0----------
-1----3--10------
-10-----10--0-0--
--1----1--0------
--0----0---------
-----10-------0--
----0--0----1---0
---0--01---1-----
---0----1--0-----

Generation = 8, Population = 49.
-----10-----0----
-13------0------1
--0-------------2
-----------0-----
1-------------1--
-3--11--000------
-------0------0--
----3--1--1------
-2-----------00--
-------03-0------
0------2--0---1--
---1----3--------
--3---2---0-----1
010------0------2
------4--------1-
--0------------10

Generation = 12, Population = 121.
11------200---2--
233-311-0-1-012-3
1----4-0---------
----1-----3----1-
-11-311---1-211-2
233-3-32--1-001-1
2-20---1---1--1--
3-----4-------0--
120--16--1----2--
0-20-23-5-213-2-1
--112--3--41---11
--2-------1-1--04
105-------0-210--
11--2-232-4-10204
0-0---42---2--2--
-204--3-21-22-112

Generation = 16, Population = 51.
3---4--2---------
-------41--------
----3--02-1------
--------1--1---2-
------3-1-1-3----
-----3---3--12---
-----43----------
--2---------3----
-----2---2---1---
423------2-------
------3-3---3----
-423-----2-------
----1-5-3-1------
---1--2---8------
-------3--04--4--
-------3---2-----

Generation = 20, Population = 125.
3-22--532--20----
---264-611-2-1---
---1-6-03--12-0--
--7-2--2---1-----
2-2--442501-533-3
2-6--4-3-4---4--2
-53-4-55-6--4----
5743--5--2-1---00
-2--24------61---
647104---64-6----
--3-67334--23-4-3
464---3----251---
1-7-127-512-330--
42----3--190--4--
---2----2---0--32
-445--97-326---1-

Generation = 24, Population = 88.
--4-----22--22-1-
-44--5------23-04
3---------4-6--1-
009----340------3
--2-4-42---------
---166354-3---8--
-7--6-----23-4---
-------3--43--4--
4---36-1---------
-6--065--866-----
--------5--3--4-4
-7--045-75-----1-
----5---------0--
53---2-----4345-8
--33-45-4-------6
06-6-----5--5----

*** Life<FredkinCell> 16x18 ***

Generation = 0, Population = 10.
-0----------------
------------------
-----0------0-----
------------------
------------------
------------------
-0----------------
----------------0-
--0---------------
------------------
------------------
0-----------------
---------0--------
------------------
------------------
---0------------0-

Generation = 4, Population = 30.
-0----------0-----
------------------
-0------11------0-
----------------0-
-01---------------
------------------
-1----------0-----
1-----------0---0-
0-----0--0--------
------------------
-1----------------
--210-------------
--1--0-------0----
---0------------0-
------------------
1------0----0---0-

Generation = 8, Population = 38.
-01--0---0--------
------------------
-1--1--------0--2-
1-----------------
-----1---2--2-----
------------------
-1---1---2--------
---0----1---2---0-
-2--2-----0-------
---2------------0-
-----0------0-----
------0-0---------
-3-------0-------0
0-----------------
-0----------------
---2----0--00---0-

Generation = 12, Population = 73.
31--101-----0---1-
------------------
113--1--22--4---30
--011---0---1---2-
-12-2---1-1--3--3-
---2------------2-
-3--31---4--2---0-
4---1-01----------
3-----0-5---2-1--0
3------0----2---0-
-2---0--1-------1-
--4-3-----001-----
----2-----0----0--
--3-3---0--00-----
------------0-----
3---0-2--------1--

Generation = 16, Population = 32.
-------------0---1
---0------------2-
--3-----4------3--
2-----------------
---------4--------
0-----------------
--4----------1---3
5---5-----------0-
-31---------3-----
----------------2-
-3----------------
--------------2-3-
-----------01-----
------------------
-1---1------1-----
3---2------5-----0

Generation = 20, Population = 83.
--5-----1----0---1
1--0---0----1-----
7-4-2-1----37----2
3-5-------------2-
-22--2------2----1
--322-------------
144---1-14---2---3
--0-5---1---4-2---
35---13-54-24---0-
6-----------4---2-
--3---------00---1
----------107----0
-43----11---3--12-
0---6------5----22
--------11--3---1-
3-0-2--02----31-1-

Generation = 24, Population = 104.
-3---0---2-022-0-1
3--0----2--12---2-
73--3--2-56--2--4-
7-----0-0-----1-2-
-43-----6--42--4-1
---2--3-5-------5-
-4--7----82542-1-4
6-1-5-1----0-----0
-----3---51--5--12
8--31---1--44---42
-53-----20--1--1--
2-----0-1---8-5---
---33----2-15---42
1-------------2-6-
--3-01---3------30
3-234-3-42-73----3

*** Life<FredkinCell> 18x19 ***

Generation = 0, Population = 18.
-------------------
------0-0----------
-------------------
-------------------
--0--------0-------
----0---0----------
--------------0----
-------------------
-------------------
-------------------
-------0--------0--
------0------------
------0------0-----
---------------0---
-------------------
-----------------0-
--0-------------0--
-0------0----------

Generation = 4, Population = 61.
--0--------0-------
--1---0---0-0------
--------------0----
-------------------
0-----10-------1---
1---1-0-----1------
-------0--0-----0-0
------0------------
--0---0----0-1-----
----0---0------0---
---0-------01-2---0
--0-------0------0-
---------11-----21-
-0------1--1-------
-------1--------0--
-0----1-0----1---0-
0-0---------01--0-0
-0--01------0--0-0-

Generation = 8, Population = 62.
--------------0----
----1---0-----3-1--
--3----2---2----2--
------1------------
---05-1---2--3-----
3-2---1-0---2--00--
------1---------2--
-----------------0-
--1-------------2--
-1----4------------
--------1-----20---
21------3-----1----
1----0-----1--1-62-
----1--11------1-1-
--------------2----
---------1---2-2---
----3-0-0-2--10----
0----50--0------1--

*** Life<FredkinCell> 20x19 ***

Generation = 0, Population = 20.
------0------------
-------------------
---0---0-----------
----------------0--
-------0-----------
----0--------------
-------------------
-------------------
-0-----------------
-------------------
------0-0----------
----00---------0---
-------------------
--0------------0---
-0-----------------
-------------------
-------------------
-----------0----0--
-0-----------------
-------0----0------

Generation = 9, Population = 151.
323-2--------0-0---
00---0100--0--00---
--2-1-8--01-0--1---
---011-030-0-01-10-
--0--11-----0------
-0-0--10---0-0031--
0-0--0-0----0--0---
-0---1---0---------
----25302-10----0--
-1-0-210-00-0-0121-
021-6-2-1--0---0-0-
1-2---------0-03-0-
-22---3-1-1-10--0--
-1---1-2-----01-0--
0-0-1-1-1--00--00--
-----0---10-1--2-0-
0-00----1--0--0-0--
--0-01001----0-1---
0--00-1--10---00--0
---204--01----0-00-

Generation = 18, Population = 174.
---4--336-56--134-0
-----131-1--4-32-20
-3-1-199-------422-
3-13512-72-20341311
-1--25323510-0-4-0-
1---1-122111--16--1
------224----1-2-1-
----4--1-01-231----
-1----524--3--4-2--
------22-110---3-22
----9476314-512-201
4---6---57-4-02-+14
------60-2---00-51-
---0-41------136---
-5-2---2--22-------
0--53021---35--6--1
----1--1-----------
10---3-2101--3-21--
------5--2-1-------
---3-7-324031223320

*** Life<FredkinCell> 20x20 ***

Generation = 0, Population = 7.
--0-----------------
-0------------------
--------------------
-----------------0--
--------------------
--------------------
--------------------
------------------0-
--------------------
--------------------
--------------------
--------------------
--------------------
---0----------------
--------------------
-----------------0-0
--------------------
--------------------
--------------------
--------------------

Generation = 5, Population = 67.
-0-----0------------
0-0-0---------------
-0-0-0-------0----00
------------0-0--021
---0---------0----00
0-------------------
-0------------0--00-
-------------0-00210
---0----------0--00-
--0-0---------------
---0-------------000
----------------01-1
-------0---------000
------0-0-----------
-------0-----0-0-0-0
------------0-------
---0---------0-0-0-0
--0-0---------------
---0-------------0-0
----------------0---

Generation = 10, Population = 77.
--0-0-0-0-0-0-------
---0-----0-0---0-0--
----0-----0---------
-0-0-0-0-0-0-0-2-3-2
--0-----------------
-0-0-0---00---10---0
0-0-0---------------
---0----0------212--
0-0-0---------------
---0------0---0----0
--0-----------------
-0-0-------0---1---1
--------------------
-0---0-----0---0-00-
--------------------
---0---0-0-0---01--1
--------------------
---0-----0-0-0---00-
--------------------
-0-0-0-----------0-0

*** Life<FredkinCell> 22x20 ***

Generation = 0, Population = 25.
--------------------
---------0----------
--------------------
--------------------
-----------------00-
--0------------00---
--------------------
------------0-------
----------0--0------
----0-----------0---
--0-----------------
-0--------0---------
--------------------
-------------------0
----0---------------
--0--0--------------
------0------0------
---0----------------
----------00--------
--------0--0--------
--------------------
--------------------

Generation = 9, Population = 185.
-00-0----0-00-01-3--
02---0----0--01--3--
-0200-----1----00-31
0---------21--21-00-
-0--0--0--20-023-3-1
---03004-3-4--2-44--
--10---0022-----00-2
-12----------0----10
-0----4111----1-0022
-1-2-000223----1-002
----------32----0-1-
-1-1--0011-10-----20
-----0--10---0-0-1-0
-132------0-0--32-1-
--501-----1-41-00---
---1-----32--------1
---00-1-1010--100-0-
0-4-4--3-0-1-001-10-
0002----21-13----01-
1110--1--13--1-1-0-1
000----1--0-0-2-0---
-1-02--------2----0-

*** Life<FredkinCell> 20x23 ***

Generation = 0, Population = 12.
------0----------------
--------0--------------
-----------------------
-------0---------------
-----------------------
-----------------------
-----------0---0-------
-----0-----------------
------0----------------
-----------------------
-----------------------
-----------------------
---------0-------------
-----------------------
--0--------------------
----0------------------
-----------------------
-----------------------
----------0------------
------------------0----

Generation = 5, Population = 130.
-0-00---10-00----------
--00-022-00--0-0-------
---00--00-01--0-0------
--0-------020--0-------
---0-0--0--0-----------
---------0-0---0---0---
-0----02-00-0-0-0-0-0--
0-----01-2-0---0---0---
---0---00-20-----------
---------000---0-------
-0-000----0-0-0-0------
--001------0-0-0-------
------20----0-0--------
0----0----0--0---------
10---0-000-0------0----
20----00--0------0-0---
0---------0------------
--0---0--00---0--0-0---
-0-000-0-0-0-010--0---0
--00-00---0--010-----0-

Generation = 10, Population = 123.
--1-1-1-20-33-2200-----
3-2----2------10--0----
1-----2--1-1--01-------
0----1--33---1--10-----
--00--0----0-------0---
-0--0-20--1--0-0-------
-0----2-0-----0--0---0-
--00--0----2---0-------
0--02-013-2-1---0--0---
-0--1-11--1--0----0----
00----0-1---0-0--0-----
-----0--10------0-0-0--
---10-----00-------0---
--0--1-0----0---0-0-0--
-02------1-------------
3--1---0--1---0---0----
--------0--0---0--0----
-----11---0-0-------0--
------0---------0---1--
----0---0-0-0-----1-0-0

Generation = 15, Population = 215.
--2----2----4------111-
-154--2----1-2----02-0-
2230212---2-1-1--02-01-
1203---2--03-2-122-22-0
-01--0-201-10-12---2-0-
----1----31-110--2010--
-144---5--12----00200--
10------2-24-10-021--0-
1--2-0---2---01--1---00
1-0---2-3---2----1--1--
1---3------2--1-2110--0
12-3-13-1-2--3--10-0-0-
-0--3233----1--2--11---
-01-3-11-202--3---2-0--
3-2-22--41-2-2---201-0-
-03--26-1-212---10-00-0
-0-2--0-01-01--10-1--0-
010-2-2--11--040-0-----
1100-0300-1--0--0----0-
-011-23-000-00-0------1

Generation = 20, Population = 134.
2---5-3--53-4-----3-3--
--5---3---0---------2-4
--31-2--2-5--112---2--1
---4-3---6-4--0------02
--2--------1---2-------
----1-4-------0--------
------45-3-3--03---2---
-1---2---4---2---23--2-
----41-3-4-21--1--2021-
2-----------------2----
1--2--2---1-2--2--10---
---3-2---231--------01-
-1---3--21-4-1-2-1---00
-----1--4---1----------
----4---5-43--000---1-0
--3---6-----5-1-2-----0
-----1---1-----------1-
-20-2--212-------------
2---3-500---0---1-412-3
0--1-33---20----2---1--

Generation = 25, Population = 195.
4053-----83-41-51---41-
8---514-1--2--31-04---6
--4-2-----6----3-1620--
-2---6---647--3-3-1----
----1---01-4---2--0-0--
2--2--912-231-3------03
-15-10---6-4---4--3-113
--1---1--4-60------2-3-
---352-6-63-30-1--3--15
523-32425----101---0111
-----32-----2-233-22-21
-4-6-----3---42110-01--
4------3-------20------
3-------4----030----2--
414-43--626-24-01--32--
32----63-451-020---0---
203-0--31----02-----2--
141--23322----5--0---01
411--07----0---23-5-2--
---1----5--21-5-5----0-

*** Life<FredkinCell> 23x21 ***

Generation = 0, Population = 25.
---------------------
-----------------0---
-----0---------------
---------------0-----
---------------------
---------------------
---------------------
----0-----------0----
------0--------------
------0-----------0--
--------------0--0---
---------------------
---------0-----------
------0--------------
---------------------
----0----------------
-0-0-0------0-0-----0
-0--------------0----
------------------0--
----------0---0------
---------------------
---------0-----------
---------------------

Generation = 8, Population = 83.
------0--------------
------1--1-------10--
-0-----------01--1---
-------1-------1---0-
-----3---0-----------
------3----------2---
---------------------
--1-1---2---1-----1--
31-1-2------3-------0
11--------0---2--0---
-----12--1-------11-1
----------1---11-----
-4---------------0---
0--------0----1------
---------------------
--1-1-------2---1----
-3-002---3-1311------
-----14-0------------
----------3---5-30---
--0---0---1---1---2-0
---------1--------0--
------1---------10---
-1-0-1------0-0-----0

Generation = 16, Population = 82.
-1-0-1------1-2-----1
------2--2------4----
------------------1--
----------31--4------
--------------2--3---
------6--1--------4--
------3--------------
1---3-----------0---3
--------3-----------1
--3------0----------1
21-------1--0--------
----------3---43-----
-----------------23--
-3------1-------12--2
-2-4-2------1-7-----0
----3-----4---------2
3-2-1-2--9-3843--3-1-
1-----7---4--1-------
--1--3--21-----------
0---4-------2--01----
--------------2--2---
-----22----------21--
------0--------------

*** Life<FredkinCell> 24x23 ***

Generation = 0, Population = 25.
---0-------------------
-----------------------
---------0-------------
-------0-0-------------
--------0--------------
-------0---------------
-----------------------
-----------------------
---------0-------------
-----0-----------------
-----------------------
-------------------0---
--------------0--------
-------0---------------
-----------------------
------------0----------
---0-------0------0---0
----0-------------0----
-----------------------
------------------0----
-0---------------------
-------0------------0--
-----------------------
0------0-----------0---

Generation = 6, Population = 196.
---0--1-1-10-0---------
---1-----3-0-1---------
-0--03--2--21--0-------
-0-------4---2-0-------
-012--00-021-00--------
-0---------0-------0---
---101-124-1000--------
-0-0---2---------0---0-
---0--10-1001--10------
---0-----1-00--0---0---
---0-0--0100-00-------0
-0-100---110-11--00----
-0---1-013-110------0-0
-011-21001--20-0--010--
-0-1-----001---0--1-0--
0--0000-1-00----10---01
---0---------0--113----
--0---010-0---0-----2-2
---0-0-----0---0----1--
0-0101-010000----011-13
-0---1-0-0---0--1-----1
-0113-1----210-100-311-
-0-0-0-----0------0---1
-1--3-1--------0-101---

Generation = 12, Population = 195.
01---3--45---11112-----
-1-5-3---3-1---2-------
-3--14---1-231-------1-
-2-3--------1--3---2-0-
-31321---13-00---0--0-0
-3-212-2-----2----10---
-1-----135-------0-----
-1------1--0---0103----
0----13012---4-32-1-01-
02---1-112----1--1--2-1
---1-1-------0---------
1--103-----2222----30-0
--1-22---6--2-0-10-1--2
011-33-1--0320--0-1-2-1
---------0-------------
0-020---131----01-4---4
-------2342-03--3-5-4--
01230--140-10-31----4-2
-----------------------
0--3---14---3-1---1-3--
-----------1-12-2-311--
0-136320--03---52-351--
-----------------------
0-1-3--2---3--301-----1

*** Life<FredkinCell> 26x23 ***

Generation = 0, Population = 26.
-------------0-0-------
-----------------------
-----------------------
---0------------0------
---------------0-------
--0-0------------------
--0---0----------------
-----------------------
-0-0-0-----0-----------
0----------------------
-----------------------
------0-------0--------
-----------------------
--------------------0--
------------------0----
----0------------------
-------------0---0-----
-----------------------
-----------------------
---------0-------------
----0---------------0--
---------------0-------
-----------------------
-----------------------
-----------------------
----------------0------

Generation = 8, Population = 87.
-131--00---0---------0-
2-5-1------------------
---------------0-------
------2-1--0--0-0-----0
-------3---------------
--3-3-----3-2-------0--
4---1-----1--200--0----
----3------------------
-1---3---1-2-0-0-1-1---
------2-1--------------
-----------------------
1--1--3--0----1-1-----2
----1----------1----0--
--1-2-------1--0--3----
--1---1---1---------3--
--2---------0----------
-1-1-----3-1-----------
2---------------1------
-----------------------
-1----1-------1-11-----
--2---------------0----
-------0------------1--
------------------1----
----1----------2-------
----0--------1---0--1--
--------12------------2

Generation = 16, Population = 78.
-4-----------0-0--3----
--------------------1--
-----------------------
2-----3--3-0-------1---
----1----------2----0--
8---------8-3--1--2-2--
-4-3-5--2--12-----0---4
-----------------------
--22--2--1-7-1---2---4-
--5-4---------3--------
---------------3-------
2--3----0-------2-----4
-----------------------
----5-----1------------
--2---------11-4-------
----------4----2----3--
----3----------1-1--1--
---------1-------------
-----------------------
---4-3----------5----2-
----2--------4-1-3--5--
--3------------0-------
--1---1-----------1----
--------------------4--
-1-0-0-----4-----------
------0----------------

Generation = 24, Population = 157.
-6+--6664-2-13---44-3-2
5-7-5-----1---24----1--
----5---------------2--
51-------5----1-33-2--1
--2----5----------1----
--4---937---6-------4--
5-7-++---767534---26---
----------2----3----4--
7----4---16+--4--2558--
--7-+-+--43-2-------4-1
-------0---------------
-----7---0----3-3--0-17
-------------+---4-----
6-5-------3---------4--
-432--223-493-------658
--7----3----5-------5--
-2---131-----3---57----
-21-5-3-------4--3-----
---------------0-------
35----4----1----54-----
-243---2-6-3------1----
-------3------------7--
2---4-2-----0442--1-4--
--4-------3-1-----3-5--
-3---1---0-4-------5---
3--3-0---5----2-1----3-

*** Life<FredkinCell> 25x24 ***

Generation = 0, Population = 11.
--------0---------------
----------------------0-
------------------------
0-----------------------
------------------------
------------------------
-------0----------------
---------0--------------
------------------------
------------------------
-----0------------------
--0---------------------
------------------------
------------------------
----------0-------------
------------------------
--------0---------------
------------------------
-0----------------------
------------------------
------------------------
-----------0------------
------------------------
------------------------
------------------------

Generation = 9, Population = 121.
-0----1-1-----00-00-----
0----0-0-----0-000-0----
0-0-2---3-----0---0-----
---0-----0--------------
0-0---1-2-------------0-
--------0-0----0-----0-0
-0-----0---1--0-00----0-
0-1-----0-0----00-0-----
-0---------------0----0-
-------------0-------0-0
0---0-----1-1-0-------0-
-0-0-0---1-1-0----------
0---0-----00------------
--0----0--0-0-----0-----
-0-0--1-00-0-----0-0----
0-0----00-0-----0-0-----
-0-------0-----0-0------
0--------0------0-------
--0-----0-0-------------
-0-0-----0--------------
--00-------0-------0----
--0-0-------0-----0-0---
---0-----0---------0----
-0------0-0-------------
0-0----0-0--------------

*** Life<FredkinCell> 26x26 ***

Generation = 0, Population = 29.
-----------0-----------0--
--------------------------
------------------0-------
-0------------------------
--------------------------
--------------------------
------0---0---0--0------0-
----0---------------------
----0---------------------
-------0--------0---------
--------------------------
-----------------0-0------
-------0-------------0----
---------0---------------0
--------------------------
---0---------------0---0--
--------------------------
-----------------0--------
--------------------------
-------------------------0
-0------------------------
--------------------------
--------0--------0--------
--------------------------
-----0--------0-----------
--------------------------

Generation = 7, Population = 357.
-0-----1-1-1---1------1--0
0-001-----0-0--000-0---0--
-00-00-----3-10-01--1---40
-0-0-11---0-0000--0--0--00
0-0-2010---20010-2----22--
-0-0200-2--0002---1--000-0
--1010-1--0-21-----1240--0
1--01---------0-3-0211000-
-010---2--0-------0-11010-
-00---0-11--1-3-0311-11--1
1----0-4-0-1---121020---0-
--2-1-2-02-----332-31-00--
0----1-0032---1-0-0---02-1
--0---030102----21--01-1--
0--1--0200010-00-1--020001
-0--0004-0-00--11001-2-100
--01--0-220--0-0-2-10-0-00
--010000000---00020-03-1--
-0-0--120--0--110102-10---
0-01---0----01-001010-0---
-00-1--0----020-13000200--
-0-1-00-00-0-0-1-10002000-
011-13200---123-0-1100010-
-000000-00--00000--00001--
--0120-1-212-20--1-01100--
---00---0--000------00--0-

Generation = 14, Population = 323.
--131-2-0-21-5-----7-143--
-112---1-20230-1---3-010-0
00--402324--22-2-4--443-4-
12-12--2121-2-00-1-01---01
0--1-241-033--2--3-20-3-3-
1-3-----5-0-223-4-10--0--5
-131-03324-14---4-22--3---
4422--3--4001-1-3-1321-1--
3--0-0-3-02-052-232-332---
22-322-136334-3-041----1--
2------4--042---41132--2--
0-51--34241-23144---1----1
--22---015----13--24-0---2
1-1-111-0-130012-320--1--2
-3--0-13-0---11211---2---1
0-2--02-320-12-34--115-401
----021-4--001-33--2-2-1--
1---21-20-0--12---03--0--2
--01--1-1----02-3312-2----
-101--01---101--01--0----1
00--2-----3--21013-10-----
---203-3-2----0--20----2--
1-1--------1-3----3---1---
---1---2-1---1-003---1-5--
0-0------3-3--------2---1-
-0-0-0---1---2-------1----

*** Life<FredkinCell> 29x26 ***

Generation = 0, Population = 11.
-----------------------0--
--------------------------
--------------------------
--------------------------
--------------------------
-------------------0------
---------------------0----
------------0-------------
--------------------------
--------------------------
--------------------------
--------------------------
0-------------------------
----0---------------------
--------------------------
--------------------------
--------------------------
--------------------------
--------------------------
-0------------------------
--------------------------
--------------------------
--------------------------
0----0--------------------
--------------------------
------------------0-------
--------------------------
-------------------0------
--------------------------

Generation = 8, Population = 38.
---------------0----------
-------------------2------
--------------------------
--------------------------
0-------------------------
----0------1-------------3
-------------1------------
----0---------------1-----
-----------------------1--
--------------------------
--------------------------
-1------------------------
------2-1-----------------
--4---------0------0------
---------------------0----
0----1------0-------------
--------------------------
------------------0-------
--------------------------
-----1---0---------1------
0-------------------------
----0---------------------
--------------------------
-0----2-1----1-----2------
--------------------------
----------1-------0-------
--------------------------
00---0-----0-------------0
--------------------------

*** Life<FredkinCell> 29x27 ***

Generation = 0, Population = 5.
---------------------------
---------------------------
-------------0-------------
---------------------------
---------------------------
---------------------------
---------------------------
---------------------------
---------------------------
---------------------------
---------------------------
---------------------------
-------------0-------------
---------------------------
---------------------------
---------------------------
---------------------------
---------------------------
---0-----------------------
---------------------------
---------------------------
----------0----------------
---------------------------
---------------------------
---------------------------
---------------------------
-----------------------0---
---------------------------
---------------------------

Generation = 7, Population = 171.
--------0---------0--------
-------0-0-------0-0-------
------0-0-0-----0-0-0------
-------0-0-0---0-0-0-------
--------0-0-0-0-0-0--------
---------0-0---0-0---------
----------0-----0----------
---------------------------
----------0-----0----------
---------0-0---0-0---------
--------0-0-0-0-0-0--------
---0---0-0-0-0-0-0-0-------
--0-0-0-0-0-0-0-0-0-0------
-0-0-0-0-0-0-0-0-0-0-------
0-0-0-0-0---0-0-0-0--------
-0-0-0-0-----0-0-0---------
--0-0-0-------0-0----------
---0-0---------0-----------
----0----------------------
---0-------0---0-------0---
--0-------0-0-0-0-----0-0--
-0-------0-0-0-0-0---0-0-0-
0-0-----0-0-0-0-0---0-0-0-0
-0-0---0-0-0-0-0---0-0-0-0-
--0-0-0-0-0-0-0---0-0-0-0--
---0---0-0-0-0---0-0-0-----
--------0-0-0---0-0-0---0--
---------0-0-----0-0-----0-
----------0-------0-------0

Generation = 14, Population = 138.
-0-0-0-0-0-------0-0-0-0-0-
---------------------------
---0-0-0---0---0---0-0-0---
---------------------------
-0-0-0---0---0---0---0---0-
---------------------------
-0-0---0---0---0---0-0-0---
----------0----------------
-----0---0---0---0-0-0-0---
--------0---0--------------
-0-----0---0---0-0-0-0---0-
------0---0---0------------
---0-----0---0-0-0-0-------
----0---0---0---0----------
-0---0-----0---0-0---------
--0---0---0---0---0--------
---0---0-----0-------------
0---0---0---0---0---0------
-----0---0-------0-----0---
0-0---0---0---0---0---0----
-------0-------0-----0---0-
0-0-0---0---0---0---0---0--
-------------0-----0---0---
0-0---0-------0---0---0----
-------0---0-----0---0-----
0---0-----------0---0------
---0-0---------0---0-------
--0---------------0--------
-0-0-0-0---0-0-0-0---------

Generation = 21, Population = 188.
0---0-----0-0-0---------0-0
---0-0-0---0-0---0---0-----
0-0-0-----------0-0-0-0-0-0
-0---0-0-0-------0---0---0-
------0-------0------------
-0-0-0-0-------0-------0-0-
0---0-0-----0---------0---0
---0-------------------0---
0-0-------0-0-0---------0-0
-0-------0-0-0-----0-----0-
----------0-------0-0------
-0---0---0-------0-0-0-0-0-
0-0-0-0-0-0-----0-0-0-----0
-0---0---0-0-0---0-0-0---0-
----------0---0---0-0-0-0--
-0---------0-----------0-0-
0-0-0-----0-0-0---0-0---0--
-0-0-0-0---0-0---0-0---0---
----0-0---------0-0---0-0-0
---0---0-0-------0---------
0-0-0-0-0-----0------------
-0-0-0-0-0-0-------0-0-0-0-
0---------0---0-0-0-0-0-0--
-----------0---0---0-------
----0-0-0-0-0-0-----------0
-----0-0-0-0-------0-----0-
--0-------0-0-0---0-0-----0
-------0-0---0-0-0-0-------
--0-0-0---0---0---0--------

*** Life<FredkinCell> 29x30 ***

Generation = 0, Population = 32.
----------------0-------------
------0-----0-----------------
0-0---------------------------
------------------------------
0-0--------------0------------
--0---0-----------------------
------------------------------
-0----0---0----------0---0--0-
------------------------------
----------------------------0-
------------------------------
--------------------0---------
------------------------------
------------------------------
-0-----------------0---------0
0-----------------------------
---------------------------0--
---------0--------------------
------------------------------
------------------------------
----0-------------------------
---------------------0--------
------------------------------
--------------0---------------
----------------------0-------
0-----------------------0-----
--------------0-0-------------
------------------------------
------------------------------

Generation = 5, Population = 297.
--------0-0010----00-0--------
0-0-1-00----10-01---0---------
-0----100---0--031---0---0--0-
0-0--0-0-0-0-0------010-0-00-0
303---20------00-0--020--0----
---00-0--0------0----0-----0-0
30-0-00-----0-0--0--00--00---0
02201110-0-0-0-002002100122132
-0-0-0----0---0-010-00---0---0
0-20-0-0---------0-0---0-1-0--
-2--------0-----0-0-00---0--0-
1-0--0-0-0-0---0-0-00-00110---
00----0--00-----0----0--000-0-
-0---0--0-0----0-------0-0-0-0
0-----0--0----0-0---0-0-------
----1----------0---0-0---0-0-0
--001--------0------000-0---0-
-0----0-----0-0----00-00------
--0--0-------00---0-00------0-
1-------0----0-0---0--0----0-0
-0-----0------0--0---0-0000-0-
10--------0---0---0---002100--
0--------00--0----0-----00----
----0----0-0--0-1010------0---
--0010----0------01000---0-00-
-0--10----0-0------0-22---00-0
--0-0----0---01--0--1-------0-
----------0-00100-0-0-0-------
-------------01--0---0-0------

Generation = 10, Population = 275.
1-1-1------------0----0-0-0---
------3-1---2---1-0-1-0---0---
4-5-6-3--0--2--0---0----00----
--1-------0-1-----0-0-0-----1-
604-2-402--11---10-0---0---0-0
5-2-312--02--0--110-----0--0-2
3-301-3-011---0-010--1---0---2
---1-----11-1-3---31----2333--
122-----------1-1-10-----0----
--5-02-1111101---2--1---1-1100
2---------------00---------0--
--0------10-0-0-----01--2-0---
0-3-111--0-0---0---1-1-0---1--
22--------2-0-0----0-2-1-1----
0-101----1-1-1---0---000-1---0
1020----1-1-----00-1-5--1-100-
-----0---0-0--1-01--1---0-----
4211----0-0---30---2201--0--0-
--0-----------1-0-00--0--0----
10-----------2---00---0-0---00
12--0-----1-----1--0---------1
1-----0----1---1----0-1----1-2
--10--------1---20---0-------2
--1-2-1--2---0--3---0-------11
-0----1-1-----3---20----40----
--1-3--01-20------0-----------
------3-2-1-----1-----1---10--
0-----1-10--2-----------1---0-
--0-1---0---------------0-----

Generation = 15, Population = 383.
-13--021-1--5221-1--5-2----2--
--2031-0--205--0--1----0--11-2
--6---40-12----14--12-2-331-2-
-11-1-0--1-------0130--01--4--
60----5-31-----1-1-013-0------
53---17-2-2-1---61--02-1------
--4-44---3--20--1----1111---0-
1---1------0-2434------154-6-8
--30-03-2----03-2--0--130-0---
1082243--3-20--2331-22-0-1---1
---0-130---2---0--101310----0-
-3501-000250---041--54--42-2--
20-0-1-1----0-0--0-------1----
---21-42-25------01-12---330--
301-34---401--3-0-0-012-0--20-
1-3--5-11-2021-20-1--71--3--30
0020-0-100-2-0-20-22---3--1--1
--42-4--000-004--3-270--1--2-1
---------341-24---1--20-0----4
2--1-1----401--0--------11-021
-23---1----12-4-2-2--012-1-4--
33-----0--2----1-0-0-1-431-2-3
4-3--10-20--2---3-2---11---2--
22-0-12002-0-0---2----1--20133
1-2-----3-3-2-5-------2-6--142
10---1--32-1-0-0-0---2------1-
-1--1-603-4-3---2-1-----3-----
-020-24--1-0-----0-0-1-0-0-0--
---020----2-------2-1---3---2-

*** Life<FredkinCell> 32x31 ***

Generation = 0, Population = 9.
-------------------------------
-------------------------------
-------------------------------
-------------------------------
----------------------0--------
-------------------------------
------------------------00-----
------------------0------------
-------------------------------
---------0---------------------
-------------------------------
-------------------------------
-------------------------------
-------------------------------
-------------------------------
-------------------------------
-------------------------------
-------------------------------
-------------------------------
-------------0-----------------
-------------------------------
-------------------------------
-------------------------------
------------------------------0
-------------------------------
--0----------------------------
-------------------------------
-------------------------------
-------------------------------
-------------------------------
---0---------------------------
-------------------------------

Generation = 4, Population = 35.
----------------------0--------
-------------------------------
------------------------00-----
------------------0------------
------------------1-------1----
---------0---------------------
--------------------10------10-
--------------0-------0--------
----------------------0--------
-----0-------0-----------------
------------------------00-----
------------------0------------
-------------------------------
---------0---------------------
-------------------------------
-------------0-----------------
-------------------------------
-------------------------------
-------------------------------
---------0-------0------------0
-------------------------------
--0----------------------------
-------------------------------
-------------0------------0-0--
-------------------------------
0-----0------------------------
---0---------------------------
------------------------------0
-------------------------------
--0----------------------------
---0---0-----------------------
-------------------------------

Generation = 8, Population = 35.
------------------------10-----
---------0---------------------
----------------------1--------
-------------------------------
--------------1---------------1
-------------------------------
----------------10-----------21
----------1---------------0----
-------------------------------
-0---------------1-------------
-------------------------------
-------------0-----------------
----------------------0--------
-------------------------------
------------------------00-----
------------------0-----------0
-------------------------------
--0------0---------------------
-------------------------------
-----0---------------0---------
-------------------------------
-------------------------------
---0---------------------------
----------------------0-0------
-------------------------------
----0-----0--------------------
---0---------------------------
-------------0-----------------
-------------------------------
-------------------------------
---0-------0-------------------
--0---------------------------0

Generation = 12, Population = 131.
--------------0-----001-----100
-----0---0---0-----------------
----------------002-----211--10
----------1---------------0----
----------1-------3-----012-2--
-0-------1-------1-------------
------------10------310--12-34-
------0------30-------1-------1
--------------0-------1-------2
-0---0-------0-------0---------
----------------01------11---00
---------01------01-------0---0
------------------1-------1----
-00------0-------1-------------
--------------------10------00-
-----0-------00------10---1-0--
----------------------0--------
0----20------0-----------------
---1--------------------00-----
-1-------0-------01---1-10----0
-------------------------------
--0-1----00--------------------
---0---0-----------------------
-----0-------0----0-00----0-0--
-------------------------------
0-----0-0-----1----------------
-------0---1-------------------
--0------1-------0----0-0-----0
-------------------------------
--0-0-----0-------------------0
-----------0---0---------------
0-----0------1------------0-0--

Generation = 16, Population = 36.
-------------------------------
-------------------------------
-------------------------------
-------------0-----------------
------1-----------------1------
---------2---------------------
--------11-----------11--------
--0---------------1---------2-3
------------------------22-----
--0--1-------------------1-----
----------------------0--------
-------------------------------
-------------------------------
-------------------------------
---0---------------------------
-------------------------------
-------------------------------
-------------------------------
---1---------------------------
-2---------------------------0-
----------------------0--------
-------------------------------
------------------------01-----
--2-----------3-2-2------------
-------------------------------
---------1--3-----2-----------0
-------------------------------
-------------------------------
-------------------------------
-------------3-----------------
-----------1-------0-----------
-------------------------------

Generation = 20, Population = 131.
------0-----------------3------
---------0---------------------
--------01-----------01--------
--0------2-------21---------1-0
--1-------3---------1---12--3--
--0----------1-----------1-----
----11------31---12---3--43----
0-----1------30-------2-1-0-2-3
------0-------------03--4---22-
00----3--------------1-------0-
---1----00--------1--10---3----
--0---------------1---------0-3
------------------------13-----
--1--2-------------------0-----
---0---0--------------0--------
-1---------------------------0-
----------------------1--------
-------------------------------
---2---0----------------00-----
-34--2--------0-2-2------1---0-
------------------1-------1----
---------2--0-----0-----------1
---0----------------10------11-
01----2---1-0-3---2-3-2------1-
----------------------0--------
-----2--2-----1-1-----1---0-0--
-----------2-------0----00-----
--0-----------2-0-0------------
-------------------------------
------------2----20-----------0
-------0---2-------0---0-------
-------------3-----------------

Generation = 24, Population = 128.
--------13-----------03-32-----
--2--0---4---------------1-----
------1---------------3-3------
-----0-------2-------0---------
2-------------1-1-------------2
-1---------------2-------------
01-1---------32-52-----------53
----3---------------6-6-3------
----------------13-----------23
-2--4-----1--0---2-----------2-
---2----------1---------------1
-1-----------1---------------0-
------0---------------0-3------
---------1---------------------
---0----10-0---------00-24-----
--------------1-0-----------4-1
------------------------22-----
--0--4---2--0-----3------5----0
---2-------0----------1--------
-----3---3-----------0---3-----
--------------0---------------1
-------------1-----------------
---1-------1----10-1---------20
----2-3-2-------------3-1-2----
-------------------------------
-0--2-----3------0--1-3-0-2----
---1-------2-------0-----------
-1-----------2---------------0-
----------------------0--------
-----1---------------1---------
---0-------3-------1----10-0---
--0------0--1-0-0-------------0

*** Life<FredkinCell> 30x31 ***

Generation = 0, Population = 31.
-------------------------------
------0------------------------
------0---0--------------------
-----0-0-00----------------0---
--0------0---------------------
-------------------------------
------------0------------------
------------------0------------
-------------------------------
---------0---------------------
----------------0--------------
0------------------------------
-------------------------0-----
0--00---------------------0----
-------------------------------
----------------------0--------
-----0-------------------------
-------------------------------
-------------------0-----------
-------------------------------
-------------------------------
-----0-0------------------0----
-------------------------------
------0------------------------
------------------------0------
-------------------------------
-------------------------------
-0-----------------------------
-----0-------------------------
------------0------------------

Generation = 10, Population = 296.
2--------42-0---0-0------------
-----3---32122-11010-----------
114-1-21---0--4--13-0----0-----
--1--23-2---311-1--321----0----
2-01--3-02----111-010--0---0---
-11-4-3201---2-0-100--1-0-1-0--
-01-42-----------00---1--1-----
00-02---2---0----0--2-----3-0--
---02-111-1--------01---0------
---20151-1-----1---1--0---01---
--2-021--12-0--------21---0--0-
-03-3-22221------11------01-11-
0---0-011-011--0--------0--1---
12-3-51--22--1--0-1-1---0-000--
-01------10--11--2------0----0-
--011211-1-0------1-0-----0---0
---2--------1--10-----0---00---
02----02---1--0---0-----------0
-1---3---1----0---0-----2----0-
-21-0----0--00-0--0-------0-0--
---3---0---0----0------2-------
2--2-30---0222-111--1-1-3-1-2-0
-----0----------0--------0----0
--102-----0--0011-0-0---0-2-0--
--------------1---12--------0-2
1--0-1---1--0-0-------0--------
-3-----------0--00---0--1-----0
-4-13320---0--------0-----1----
---1-------0---0---0--0---2----
--01-1--1---------0-0-0-1-1-0--

Generation = 20, Population = 329.
-5--25--54--1---1-33--2---1----
--2333---6--3-----1-------2---0
3-5-10--2---4--1--8--032--3-210
22-1248263-2-1---227-441-7-3210
-3---4--44----2-1---211-0----1-
53--9---43-1-3-----------04---1
--4-5-4-34---------0--2-021----
-16-5-3----2----4--4-1201551--0
------2-251-0-----3-21---1--4--
-8---362---02-4-0--3-1----1--1-
0---353------1------------1----
--41--7--+52-11-----1--12---4--
-23---2---1-312--2---2--21-----
-43--8783---6---1-5-2--1-1-----
1-20--5--33----------------3--0
-32-----1-3---2-----1-------0--
-41---4--15--0---0---0--31-----
-51--2-8-5-23-2-0--101-0-------
--4---32--2-0-1--------1-------
-5-3---122-3420---2---203-0----
0-----3-13---1------211-----3--
-234-8---388-41-26-4----52-0---
---0--0-1-1--------2-------1---
45-154-4--41232--21-------41--1
--0-05------1-----2--0--315----
2-103344-30--1------2131--3-4--
---------------3----0--2-------
3--3-3-306---3---10--1------0--
-3------0----2---1----1------0-
1-5-2-3310---0---01---2-2-2----
