20

40 43
20
7 10
23 11
1 30
7 4
32 33
36 20
16 15
21 16
22 4
6 42
16 13
4 28
3 21
27 16
0 22
31 35
19 13
28 29
13 19
3 37
270 112

13 50
19
9 33
5 42
7 6
3 7
12 49
1 30
4 23
1 16
12 20
2 15
2 35
7 14
8 41
7 36
0 18
3 22
0 49
10 18
4 32
214 27

46 47
17
45 21
28 16
6 17
4 1
45 15
32 46
31 18
11 28
4 43
24 27
43 33
0 22
4 26
24 34
45 40
6 17
26 10
11 86

30 10
19
9 6
28 9
12 9
7 4
17 9
22 2
5 7
25 4
14 6
7 0
15 1
0 7
1 1
17 3
5 3
1 9
1 6
4 6
15 9
13 129

40 2
20
29 1
38 0
36 0
36 1
10 1
5 1
4 1
16 1
3 1
34 0
12 0
18 0
34 1
7 0
4 0
17 1
28 0
21 1
3 0
34 1
147 158

48 16
18
44 7
8 12
27 4
35 0
3 15
7 14
4 0
10 2
8 8
41 0
37 15
29 1
47 9
34 3
34 4
3 14
47 3
47 10
215 180

47 46
19
16 27
33 11
44 26
24 16
4 23
28 1
15 30
14 14
1 25
30 45
46 28
33 25
31 42
16 15
2 33
35 15
39 27
9 4
2 8
230 152

11 39
19
1 9
1 24
0 36
10 13
3 25
8 20
2 0
3 19
0 22
9 13
8 6
2 19
4 12
1 36
10 0
2 37
3 12
6 33
6 23
231 69

8 5
16
6 3
5 1
1 2
1 1
0 3
6 4
6 2
2 2
7 0
7 2
0 1
1 0
2 1
5 4
2 4
0 1
239 87

35 48
16
9 28
7 22
28 2
3 23
24 16
6 42
1 10
6 3
9 36
27 35
21 35
24 27
16 46
7 39
9 8
28 22
183 144

3 20
16
0 19
2 2
2 10
2 8
2 9
0 3
0 5
0 13
0 14
0 6
1 0
2 16
2 10
0 10
2 17
1 19
289 35

4 29
16
3 5
2 18
2 14
3 3
0 18
1 14
1 23
0 20
1 21
0 28
1 7
2 1
3 26
1 26
0 3
3 2
280 14

48 24
18
34 19
32 13
18 2
45 3
29 21
37 4
0 7
46 17
11 15
24 22
35 13
32 6
17 3
42 7
39 5
8 15
44 18
31 18
155 56

4 44
15
0 5
1 5
1 27
0 42
0 15
2 7
2 5
3 5
0 43
0 24
2 11
0 2
1 34
3 19
1 19
8 70

8 3
18
3 2
0 0
4 2
4 1
3 2
5 2
3 1
2 0
5 2
7 2
7 0
6 1
7 2
1 2
6 2
4 0
7 1
5 1
97 8

48 13
20
44 5
47 2
18 3
45 6
35 1
37 12
37 12
24 2
18 2
11 2
18 2
0 5
44 11
2 5
29 4
37 10
9 6
24 2
32 5
37 7
204 115

7 44
18
1 38
4 10
4 21
6 29
0 3
4 30
1 7
5 27
3 1
2 33
1 17
3 12
5 0
1 16
5 13
4 26
3 28
0 2
52 29

45 35
17
34 31
7 33
39 24
41 33
11 3
15 22
15 2
3 7
42 28
35 32
42 16
44 14
8 26
44 8
22 16
21 16
23 34
190 22

11 25
19
3 4
0 21
5 13
4 0
8 5
10 11
3 21
1 4
4 15
4 2
1 9
10 12
4 22
6 15
1 23
8 18
10 4
1 3
1 5
123 200

4 1
15
3 0
1 0
3 0
0 0
1 0
0 0
3 0
2 0
1 0
1 0
2 0
2 0
1 0
0 0
2 0
101 42
