*** Life<Cell> 6x5 ***

Generation = 0, Population = 9.
---0-
0-0--
-00--
-00--
0----
0----

Generation = 2, Population = 12.
--00-
-1--0
----0
0-010
*0---
-1---

*** Life<Cell> 6x8 ***

Generation = 0, Population = 17.
0-0-0-0-
-000--0-
0---0--0
-00---00
--------
00------

Generation = 1, Population = 29.
-010--10
0111001-
-0---001
-110001-
0-0---00
110-----

*** Life<Cell> 8x7 ***

Generation = 0, Population = 23.
--0-0-0
-00--00
-0---00
000---0
0--0--0
----0--
-0---0-
-0-00--

Generation = 3, Population = 25.
1--01*1
0---001
------.
0.--1--
*11-1-1
------0
*1-*--*
01--11-

*** Life<Cell> 5x9 ***

Generation = 0, Population = 3.
---------
-0--0----
-----0---
---------
---------

Generation = 2, Population = 9.
-----0---
--11--0--
---0---0-
-0--0----
-----0---

*** Life<Cell> 8x6 ***

Generation = 0, Population = 2.
-----0
------
------
------
---0--
------
------
------

Generation = 1, Population = 6.
----0-
-----0
------
---0--
--0-0-
---0--
------
------

Generation = 2, Population = 6.
---0--
------
---0-0
------
-0---0
------
---0--
------

*** Life<Cell> 9x9 ***

Generation = 0, Population = 23.
--------0
------000
----0----
---0--0--
0----0---
00000-000
---------
0-00----0
0-0------

Generation = 2, Population = 34.
----0-1--
---011---
0-0--10-1
1-10-0--0
*-100--1-
0000--*-*
--0--0---
*--*-0-1-
*---0----

*** Life<Cell> 8x6 ***

Generation = 0, Population = 15.
------
0-0-0-
0-----
0--0-0
0-0--0
-0-0--
0--0--
0-----

*** Life<Cell> 10x5 ***

Generation = 0, Population = 11.
---00
---00
0----
--0--
-----
--0--
0--0-
-0---
-----
--0--

*** Life<Cell> 7x8 ***

Generation = 0, Population = 16.
---00--0
----00--
---0-0--
0-----00
000---0-
--------
--0-0---

Generation = 1, Population = 25.
--01--0-
---0--00
0-0-01-0
1-00---1
--10-01-
00--0-0-
-0---0--

Generation = 2, Population = 23.
-01-001-
0-01----
1-1-1*0-
*-1----*
----01--
1-----10
-10-----

Generation = 3, Population = 29.
-1-11-*0
101*0---
---0**1-
.-*0---.
--101*--
--0-0-*1
-*10--00

Generation = 4, Population = 31.
-*1---.1
*1-.1--0
1011.**0
.0.10-0.
-0*1**-0
----10.-
0**1-0--

*** Life<Cell> 10x10 ***

Generation = 0, Population = 9.
-0--------
------00--
----------
-0--------
-0--------
----------
--0-------
--0---0---
---------0
----------

*** Life<Cell> 9x10 ***

Generation = 0, Population = 13.
----0-----
-------0--
----------
----------
------0---
----0----0
-----0----
0-0-0-----
-0--0--0-0

*** Life<Cell> 8x9 ***

Generation = 0, Population = 12.
-0-------
0-----00-
0---0----
---------
---------
---0-----
--000--0-
----0----

*** Life<Cell> 8x10 ***

Generation = 0, Population = 15.
-0-0-00---
---0--0-0-
----------
-----00--0
----------
--0-------
--0--00---
0---------

Generation = 1, Population = 41.
0--1-1-00-
-0010-1--0
---0-0--00
----01100-
--0--00--0
-010-00---
00100110--
-00--00---

Generation = 2, Population = 28.
---*0-011-
-1--1---01
-0-1-10---
--0-1-*--0
--1--11---
----011--0
1--1---10-
----------

Generation = 3, Population = 39.
-00*--1---
0*01*----*
010--*-00-
--10--.00-
-0*00-*0--
0-1-1*----
-01--1-*1-
0--0---00-

Generation = 4, Population = 32.
--1.-1-1-0
-.-**-10-.
-*11-.----
00*--1.1-0
-1.1-1*---
---0-.--0-
11---*-*-0
----000--0

*** Life<Cell> 9x5 ***

Generation = 0, Population = 9.
-----
---0-
0----
-----
--0--
-0--0
0-0-0
-0---
-----

Generation = 1, Population = 16.
---0-
0-0-0
-0-0-
0-0--
---00
--001
----1
----0
-0---

Generation = 2, Population = 19.
0----
-0---
0----
-0-00
0-0--
-011*
--0--
-0-01
0-0-0

Generation = 3, Population = 19.
-----
0-0--
-0-00
0-011
--10-
-1--.
-010-
---1-
-0-01

Generation = 4, Population = 14.
0-0--
-0--0
0----
-0---
0----
0*1-.
0---1
-----
0---*

*** Life<Cell> 10x10 ***

Generation = 0, Population = 4.
----------
----------
------0---
--0-------
-0--------
----------
---------0
----------
----------
----------

Generation = 3, Population = 29.
--0--0-0--
---00-0-0-
---010-0-0
----100-00
0----0-00-
------00--
0-----0---
-0-----0--
--------0-
---------0

*** Life<Cell> 10x4 ***

Generation = 0, Population = 21.
000-
---0
0--0
-000
0-00
----
00-0
-0-0
00-0
--0-

*** Life<Cell> 9x4 ***

Generation = 0, Population = 17.
-0--
0---
--0-
-00-
00-0
0000
0-0-
--00
0---

Generation = 1, Population = 18.
--0-
--0-
0-10
----
-1-1
111-
10-0
-0-1
-000

Generation = 2, Population = 18.
-010
00--
---1
000-
-*0-
--*0
-101
--0-
0---

*** Life<Cell> 9x5 ***

Generation = 0, Population = 5.
--0--
-----
-----
-----
-----
--0--
-----
0---0
---0-

*** Life<Cell> 4x5 ***

Generation = 0, Population = 12.
-0--0
0-000
00-0-
000--

*** Life<Cell> 4x7 ***

Generation = 0, Population = 8.
0-----0
0---0-0
---0---
-0-0---

Generation = 1, Population = 16.
10--001
10----1
0001--0
0--10--

Generation = 2, Population = 15.
--001--
*1-00--
11---01
1---100

Generation = 3, Population = 15.
1-11-0-
*-0---1
*-010--
*--1*1-

Generation = 4, Population = 11.
*--*---
*--00--
*--*--1
.0--.*0

*** Life<Cell> 6x4 ***

Generation = 0, Population = 2.
----
----
----
----
---0
--0-

Generation = 1, Population = 2.
----
----
----
---0
----
-0--

*** Life<Cell> 7x9 ***

Generation = 0, Population = 17.
-----0-00
---00----
0-----0-0
-0---0-0-
------0-0
-----000-
-----0---

Generation = 1, Population = 24.
---0---11
0-011-00-
---00--0-
--0-0---0
-0---01--
----0-11-
----01-0-

Generation = 2, Population = 27.
0--1----*
--1---11-
0-0-10-1-
---01-0--
0---01--0
-0-01---0
---0-*010
