29

24 5
19
11 1
15 2
11 4
8 4
20 4
22 0
6 1
21 2
4 4
21 0
7 2
18 4
13 0
16 1
2 1
21 4
19 2
1 0
14 0
13 9

9 21
1
0 17
19 12

6 12
3
0 5
3 1
5 6
24 11

20 8
17
18 2
7 4
19 5
4 0
19 7
1 2
12 6
1 3
10 4
8 2
4 1
18 1
5 4
12 7
1 5
2 1
8 0
30 27

21 4
16
4 0
20 3
5 2
18 1
4 1
14 0
20 1
6 0
15 2
9 0
2 2
0 1
7 2
19 1
16 3
18 3
20 18

19 13
17
11 12
10 12
8 5
3 11
6 2
10 8
5 10
13 0
5 0
14 2
3 1
0 1
18 10
13 12
16 0
4 3
6 3
34 16

15 16
6
6 6
0 3
5 9
3 12
6 8
9 2
8 7

20 17
3
11 14
11 11
5 11
31 14

18 7
25
15 4
9 1
14 6
7 4
5 4
14 5
5 1
13 1
10 4
6 3
4 2
15 3
16 2
16 0
7 2
0 5
8 0
4 1
15 0
0 3
14 0
6 0
3 0
9 2
5 6
8 8

12 13
12
10 4
5 11
7 12
3 6
4 12
3 1
1 8
9 4
11 2
9 8
6 10
8 10
15 3

7 17
8
4 6
6 4
2 1
4 9
3 14
6 10
0 2
2 0
13 2

6 20
16
4 8
3 4
3 9
0 12
0 13
1 12
4 15
3 11
3 7
3 13
1 15
5 1
1 10
0 6
2 15
0 10
6 2

17 20
2
1 15
11 19
14 1

20 2
6
13 1
10 1
18 1
16 0
6 1
14 0
31 3

20 22
13
9 8
2 9
12 19
11 5
2 12
18 11
1 18
14 15
14 16
5 9
0 18
14 5
9 4
43 7

15 12
15
8 11
12 0
0 5
2 9
6 7
10 3
13 3
14 3
0 4
2 7
5 6
7 11
7 0
14 1
4 2
8 7

15 11
2
6 7
11 3
2 2

15 16
7
1 10
14 5
12 2
6 2
1 1
1 7
8 7
41 35

25 25
22
23 19
11 19
6 23
9 23
1 15
20 1
24 16
8 14
8 23
10 2
12 5
6 0
5 9
18 19
0 24
20 8
15 12
13 16
11 0
22 22
1 9
9 17
36 19

25 16
7
24 3
16 13
22 6
1 1
16 6
24 14
19 7
19 18

11 25
25
9 5
3 9
7 8
7 17
9 3
6 13
6 11
4 19
10 7
6 6
9 2
0 13
8 15
5 8
10 15
6 10
2 7
4 21
10 1
1 24
9 23
0 9
1 5
6 2
6 15
31 20

3 9
10
2 0
2 5
0 6
0 0
1 1
2 1
1 7
0 5
1 2
0 4
37 33

18 22
25
1 16
8 2
1 3
16 19
3 13
16 12
7 13
10 0
8 5
0 7
1 2
5 11
13 16
17 2
13 5
12 19
0 15
17 5
12 6
7 16
3 0
14 13
0 8
9 6
17 20
16 14

23 18
13
1 15
22 0
8 10
7 10
9 13
13 8
5 4
22 13
16 9
14 1
10 9
3 5
10 1
20 8

11 7
22
7 6
1 0
5 2
10 0
0 3
1 4
5 6
2 4
3 3
9 5
6 2
6 0
2 5
9 3
10 3
4 1
2 1
6 1
0 6
7 2
6 4
1 5
50 28

9 22
22
3 6
0 11
7 13
6 10
3 10
4 21
2 10
8 8
6 19
3 13
1 14
8 15
2 1
7 2
1 19
6 9
6 17
8 2
8 6
3 17
3 5
3 11
23 15

23 4
14
18 1
0 2
10 0
3 2
5 0
22 1
2 1
8 1
6 3
19 2
12 0
11 0
15 3
5 2
16 9

25 5
3
20 2
7 1
11 0
3 3

12 8
22
8 6
0 6
9 2
10 7
5 3
3 3
7 6
7 1
1 1
2 2
9 5
9 0
11 0
11 1
9 6
6 4
6 2
11 2
5 4
3 6
3 7
10 3
1 1
