*** Life<ConwayCell> 3x11 ***

Generation = 0, Population = 13.
..**..*.*..
.*..*.*....
*...**.*.**

Generation = 18, Population = 4.
.......**..
.......**..
...........

*** Life<ConwayCell> 1x7 ***

Generation = 0, Population = 7.
*******

Generation = 6, Population = 0.
.......

Generation = 12, Population = 0.
.......

Generation = 18, Population = 0.
.......

*** Life<ConwayCell> 2x14 ***

Generation = 0, Population = 22.
***...********
*..********.**

Generation = 5, Population = 0.
..............
..............

Generation = 10, Population = 0.
..............
..............

Generation = 15, Population = 0.
..............
..............

Generation = 20, Population = 0.
..............
..............

Generation = 25, Population = 0.
..............
..............

Generation = 30, Population = 0.
..............
..............

Generation = 35, Population = 0.
..............
..............

Generation = 40, Population = 0.
..............
..............

Generation = 45, Population = 0.
..............
..............

Generation = 50, Population = 0.
..............
..............

Generation = 55, Population = 0.
..............
..............

Generation = 60, Population = 0.
..............
..............

Generation = 65, Population = 0.
..............
..............

Generation = 70, Population = 0.
..............
..............

Generation = 75, Population = 0.
..............
..............

Generation = 80, Population = 0.
..............
..............

Generation = 85, Population = 0.
..............
..............

Generation = 90, Population = 0.
..............
..............

Generation = 95, Population = 0.
..............
..............

Generation = 100, Population = 0.
..............
..............

Generation = 105, Population = 0.
..............
..............

*** Life<ConwayCell> 1x5 ***

Generation = 0, Population = 3.
**..*

Generation = 5, Population = 0.
.....

*** Life<ConwayCell> 14x18 ***

Generation = 0, Population = 3.
..................
..................
......*..*........
..................
..................
.*................
..................
..................
..................
..................
..................
..................
..................
..................

Generation = 10, Population = 0.
..................
..................
..................
..................
..................
..................
..................
..................
..................
..................
..................
..................
..................
..................

Generation = 20, Population = 0.
..................
..................
..................
..................
..................
..................
..................
..................
..................
..................
..................
..................
..................
..................

Generation = 30, Population = 0.
..................
..................
..................
..................
..................
..................
..................
..................
..................
..................
..................
..................
..................
..................

Generation = 40, Population = 0.
..................
..................
..................
..................
..................
..................
..................
..................
..................
..................
..................
..................
..................
..................

Generation = 50, Population = 0.
..................
..................
..................
..................
..................
..................
..................
..................
..................
..................
..................
..................
..................
..................

Generation = 60, Population = 0.
..................
..................
..................
..................
..................
..................
..................
..................
..................
..................
..................
..................
..................
..................

Generation = 70, Population = 0.
..................
..................
..................
..................
..................
..................
..................
..................
..................
..................
..................
..................
..................
..................

Generation = 80, Population = 0.
..................
..................
..................
..................
..................
..................
..................
..................
..................
..................
..................
..................
..................
..................

*** Life<ConwayCell> 13x10 ***

Generation = 0, Population = 21.
.*........
*....*....
...**.*...
...*....*.
.....*..*.
...*......
..........
........*.
..........
.....**...
....*.*..*
.*.*...*..
*.........

Generation = 9, Population = 10.
...****...
...*...*..
..........
...*...*..
...**.....
..........
..........
..........
..........
..........
..........
..........
..........

Generation = 18, Population = 5.
..........
..*...**..
......*...
..........
....*.....
..........
..........
..........
..........
..........
..........
..........
..........

Generation = 27, Population = 4.
..........
......**..
......**..
..........
..........
..........
..........
..........
..........
..........
..........
..........
..........

Generation = 36, Population = 4.
..........
......**..
......**..
..........
..........
..........
..........
..........
..........
..........
..........
..........
..........

Generation = 45, Population = 4.
..........
......**..
......**..
..........
..........
..........
..........
..........
..........
..........
..........
..........
..........

Generation = 54, Population = 4.
..........
......**..
......**..
..........
..........
..........
..........
..........
..........
..........
..........
..........
..........

*** Life<ConwayCell> 13x6 ***

Generation = 0, Population = 14.
*...*.
...*..
.*..*.
....*.
......
.*.*..
*...*.
....*.
....**
......
......
......
....*.

Generation = 12, Population = 4.
......
...**.
...**.
......
......
......
......
......
......
......
......
......
......

Generation = 24, Population = 4.
......
...**.
...**.
......
......
......
......
......
......
......
......
......
......

Generation = 36, Population = 4.
......
...**.
...**.
......
......
......
......
......
......
......
......
......
......

Generation = 48, Population = 4.
......
...**.
...**.
......
......
......
......
......
......
......
......
......
......

Generation = 60, Population = 4.
......
...**.
...**.
......
......
......
......
......
......
......
......
......
......

Generation = 72, Population = 4.
......
...**.
...**.
......
......
......
......
......
......
......
......
......
......

Generation = 84, Population = 4.
......
...**.
...**.
......
......
......
......
......
......
......
......
......
......

Generation = 96, Population = 4.
......
...**.
...**.
......
......
......
......
......
......
......
......
......
......

Generation = 108, Population = 4.
......
...**.
...**.
......
......
......
......
......
......
......
......
......
......

Generation = 120, Population = 4.
......
...**.
...**.
......
......
......
......
......
......
......
......
......
......

Generation = 132, Population = 4.
......
...**.
...**.
......
......
......
......
......
......
......
......
......
......

Generation = 144, Population = 4.
......
...**.
...**.
......
......
......
......
......
......
......
......
......
......

Generation = 156, Population = 4.
......
...**.
...**.
......
......
......
......
......
......
......
......
......
......

*** Life<ConwayCell> 4x4 ***

Generation = 0, Population = 15.
****
****
****
**.*

Generation = 9, Population = 0.
....
....
....
....

Generation = 18, Population = 0.
....
....
....
....

Generation = 27, Population = 0.
....
....
....
....

Generation = 36, Population = 0.
....
....
....
....

Generation = 45, Population = 0.
....
....
....
....

Generation = 54, Population = 0.
....
....
....
....

Generation = 63, Population = 0.
....
....
....
....

Generation = 72, Population = 0.
....
....
....
....

Generation = 81, Population = 0.
....
....
....
....

Generation = 90, Population = 0.
....
....
....
....

Generation = 99, Population = 0.
....
....
....
....

Generation = 108, Population = 0.
....
....
....
....

Generation = 117, Population = 0.
....
....
....
....

Generation = 126, Population = 0.
....
....
....
....

Generation = 135, Population = 0.
....
....
....
....

Generation = 144, Population = 0.
....
....
....
....

Generation = 153, Population = 0.
....
....
....
....

Generation = 162, Population = 0.
....
....
....
....

Generation = 171, Population = 0.
....
....
....
....

Generation = 180, Population = 0.
....
....
....
....

Generation = 189, Population = 0.
....
....
....
....

*** Life<ConwayCell> 18x16 ***

Generation = 0, Population = 29.
.............*.*
......*.........
................
.......*........
.*..........*...
*..*.*.*........
..*.*...........
....*.*......*..
...........*.*..
.....*....*.....
.............*..
................
....*...........
................
...*....*.......
*.*.*....*.....*
..............*.
................

Generation = 17, Population = 9.
................
................
................
................
................
.....*..........
....*.*.........
....*.*.....*...
.....*......*...
............*...
................
................
................
................
................
................
................
................

*** Life<ConwayCell> 10x11 ***

Generation = 0, Population = 30.
.*..*.....*
...**....**
.....***...
...*.*...*.
...*.**....
..........*
..*.....**.
...*..*....
......***.*
.....*.**.*

Generation = 5, Population = 19.
...*****...
..*....**..
..*..*.*...
...*.*...*.
....*.**.*.
........*..
...........
...........
...........
...........

Generation = 10, Population = 26.
..*******..
.*....*..*.
.*......***
....*....*.
...*.*.**..
....****...
.....**....
...........
...........
...........

Generation = 15, Population = 17.
...........
....**..*..
...*...*.*.
....*....*.
.....*.*.**
......**.**
........*..
...........
...........
...........

Generation = 20, Population = 22.
...........
....***.*..
...*.****..
....*....*.
.....******
......**...
...........
........***
...........
...........

Generation = 25, Population = 23.
...........
......*.**.
..**.*.*..*
...*..***.*
...*..*..**
....**.....
.........**
.........**
...........
...........

Generation = 30, Population = 28.
...***.....
..**.*...**
.*..*.....*
..***......
..**.****..
....**.....
.......**.*
........***
...........
...........

Generation = 35, Population = 25.
.....**....
......*....
.....**....
.....*.....
.......*...
..******...
..**...*...
....**..*.*
......****.
........*..

Generation = 40, Population = 23.
...........
....***....
....**.....
...*...**..
...*****...
..*.*.**...
..*........
......*.*..
......**...
......*....

Generation = 45, Population = 27.
...*.*.....
...*.*.....
..*........
..*.**..**.
.....**....
.*.**.*....
..**..*..*.
....**.....
...*...**..
....*.*....

Generation = 50, Population = 19.
...........
...........
*....*.....
*.***......
*...**.....
...........
.****......
..*..*.....
..*........
...***.....

Generation = 55, Population = 14.
...........
....*......
.*.........
*.....*....
*..........
*..........
*.*........
.*.....*...
....*.*....
....**.....

Generation = 60, Population = 7.
...........
...........
...........
...........
.*.........
..*........
.*.........
...........
....**.....
....**.....

Generation = 65, Population = 4.
...........
...........
...........
...........
...........
...........
...........
...........
....**.....
....**.....

Generation = 70, Population = 4.
...........
...........
...........
...........
...........
...........
...........
...........
....**.....
....**.....

Generation = 75, Population = 4.
...........
...........
...........
...........
...........
...........
...........
...........
....**.....
....**.....

Generation = 80, Population = 4.
...........
...........
...........
...........
...........
...........
...........
...........
....**.....
....**.....

Generation = 85, Population = 4.
...........
...........
...........
...........
...........
...........
...........
...........
....**.....
....**.....

Generation = 90, Population = 4.
...........
...........
...........
...........
...........
...........
...........
...........
....**.....
....**.....

Generation = 95, Population = 4.
...........
...........
...........
...........
...........
...........
...........
...........
....**.....
....**.....

Generation = 100, Population = 4.
...........
...........
...........
...........
...........
...........
...........
...........
....**.....
....**.....

Generation = 105, Population = 4.
...........
...........
...........
...........
...........
...........
...........
...........
....**.....
....**.....

Generation = 110, Population = 4.
...........
...........
...........
...........
...........
...........
...........
...........
....**.....
....**.....

Generation = 115, Population = 4.
...........
...........
...........
...........
...........
...........
...........
...........
....**.....
....**.....

Generation = 120, Population = 4.
...........
...........
...........
...........
...........
...........
...........
...........
....**.....
....**.....

Generation = 125, Population = 4.
...........
...........
...........
...........
...........
...........
...........
...........
....**.....
....**.....

Generation = 130, Population = 4.
...........
...........
...........
...........
...........
...........
...........
...........
....**.....
....**.....

Generation = 135, Population = 4.
...........
...........
...........
...........
...........
...........
...........
...........
....**.....
....**.....

Generation = 140, Population = 4.
...........
...........
...........
...........
...........
...........
...........
...........
....**.....
....**.....

Generation = 145, Population = 4.
...........
...........
...........
...........
...........
...........
...........
...........
....**.....
....**.....

Generation = 150, Population = 4.
...........
...........
...........
...........
...........
...........
...........
...........
....**.....
....**.....

Generation = 155, Population = 4.
...........
...........
...........
...........
...........
...........
...........
...........
....**.....
....**.....

*** Life<ConwayCell> 1x16 ***

Generation = 0, Population = 10.
....******.***.*

Generation = 15, Population = 0.
................

*** Life<ConwayCell> 17x19 ***

Generation = 0, Population = 16.
......*............
...................
........*..........
.................*.
...................
.*.................
.............*.....
......*...........*
.............*...*.
.................*.
...................
...................
...................
...................
.*...........*....*
...........*.......
............*..*...

Generation = 10, Population = 0.
...................
...................
...................
...................
...................
...................
...................
...................
...................
...................
...................
...................
...................
...................
...................
...................
...................

Generation = 20, Population = 0.
...................
...................
...................
...................
...................
...................
...................
...................
...................
...................
...................
...................
...................
...................
...................
...................
...................

Generation = 30, Population = 0.
...................
...................
...................
...................
...................
...................
...................
...................
...................
...................
...................
...................
...................
...................
...................
...................
...................

Generation = 40, Population = 0.
...................
...................
...................
...................
...................
...................
...................
...................
...................
...................
...................
...................
...................
...................
...................
...................
...................

Generation = 50, Population = 0.
...................
...................
...................
...................
...................
...................
...................
...................
...................
...................
...................
...................
...................
...................
...................
...................
...................

Generation = 60, Population = 0.
...................
...................
...................
...................
...................
...................
...................
...................
...................
...................
...................
...................
...................
...................
...................
...................
...................

Generation = 70, Population = 0.
...................
...................
...................
...................
...................
...................
...................
...................
...................
...................
...................
...................
...................
...................
...................
...................
...................

Generation = 80, Population = 0.
...................
...................
...................
...................
...................
...................
...................
...................
...................
...................
...................
...................
...................
...................
...................
...................
...................

Generation = 90, Population = 0.
...................
...................
...................
...................
...................
...................
...................
...................
...................
...................
...................
...................
...................
...................
...................
...................
...................

Generation = 100, Population = 0.
...................
...................
...................
...................
...................
...................
...................
...................
...................
...................
...................
...................
...................
...................
...................
...................
...................

Generation = 110, Population = 0.
...................
...................
...................
...................
...................
...................
...................
...................
...................
...................
...................
...................
...................
...................
...................
...................
...................

Generation = 120, Population = 0.
...................
...................
...................
...................
...................
...................
...................
...................
...................
...................
...................
...................
...................
...................
...................
...................
...................

Generation = 130, Population = 0.
...................
...................
...................
...................
...................
...................
...................
...................
...................
...................
...................
...................
...................
...................
...................
...................
...................

Generation = 140, Population = 0.
...................
...................
...................
...................
...................
...................
...................
...................
...................
...................
...................
...................
...................
...................
...................
...................
...................

Generation = 150, Population = 0.
...................
...................
...................
...................
...................
...................
...................
...................
...................
...................
...................
...................
...................
...................
...................
...................
...................

Generation = 160, Population = 0.
...................
...................
...................
...................
...................
...................
...................
...................
...................
...................
...................
...................
...................
...................
...................
...................
...................

*** Life<ConwayCell> 8x7 ***

Generation = 0, Population = 21.
***...*
*.....*
****.*.
....***
..**...
...*..*
..*....
...*.*.

Generation = 9, Population = 8.
.......
.***...
.......
*......
...*...
.***...
.......
.......

Generation = 18, Population = 10.
.**....
**.*...
***....
.......
.......
.......
..*....
..*....

Generation = 27, Population = 12.
.**....
*..**..
*...*..
.*..*..
.***...
.......
.......
.......

Generation = 36, Population = 18.
.....**
...**.*
....*..
.*...*.
.**..*.
*....*.
*....*.
.**.*..

Generation = 45, Population = 0.
.......
.......
.......
.......
.......
.......
.......
.......

Generation = 54, Population = 0.
.......
.......
.......
.......
.......
.......
.......
.......

Generation = 63, Population = 0.
.......
.......
.......
.......
.......
.......
.......
.......

*** Life<ConwayCell> 16x4 ***

Generation = 0, Population = 19.
.*..
*...
..*.
.*..
....
..**
..*.
..**
....
.*.*
...*
**.*
*...
....
.*..
*.*.

Generation = 7, Population = 0.
....
....
....
....
....
....
....
....
....
....
....
....
....
....
....
....

Generation = 14, Population = 0.
....
....
....
....
....
....
....
....
....
....
....
....
....
....
....
....

Generation = 21, Population = 0.
....
....
....
....
....
....
....
....
....
....
....
....
....
....
....
....

*** Life<ConwayCell> 2x6 ***

Generation = 0, Population = 11.
******
.*****

Generation = 16, Population = 0.
......
......

Generation = 32, Population = 0.
......
......

Generation = 48, Population = 0.
......
......

Generation = 64, Population = 0.
......
......

Generation = 80, Population = 0.
......
......

Generation = 96, Population = 0.
......
......

Generation = 112, Population = 0.
......
......

Generation = 128, Population = 0.
......
......

Generation = 144, Population = 0.
......
......

*** Life<ConwayCell> 7x6 ***

Generation = 0, Population = 24.
**.*.*
..****
**.*..
**.***
.**.*.
..*.*.
...***

Generation = 5, Population = 6.
......
......
......
......
.***..
.***..
......

Generation = 10, Population = 6.
......
......
......
..*...
.*.*..
.*.*..
..*...

Generation = 15, Population = 6.
......
......
......
..*...
.*.*..
.*.*..
..*...

Generation = 20, Population = 6.
......
......
......
..*...
.*.*..
.*.*..
..*...

Generation = 25, Population = 6.
......
......
......
..*...
.*.*..
.*.*..
..*...

Generation = 30, Population = 6.
......
......
......
..*...
.*.*..
.*.*..
..*...

Generation = 35, Population = 6.
......
......
......
..*...
.*.*..
.*.*..
..*...

Generation = 40, Population = 6.
......
......
......
..*...
.*.*..
.*.*..
..*...

Generation = 45, Population = 6.
......
......
......
..*...
.*.*..
.*.*..
..*...

Generation = 50, Population = 6.
......
......
......
..*...
.*.*..
.*.*..
..*...

Generation = 55, Population = 6.
......
......
......
..*...
.*.*..
.*.*..
..*...

Generation = 60, Population = 6.
......
......
......
..*...
.*.*..
.*.*..
..*...

Generation = 65, Population = 6.
......
......
......
..*...
.*.*..
.*.*..
..*...

Generation = 70, Population = 6.
......
......
......
..*...
.*.*..
.*.*..
..*...

Generation = 75, Population = 6.
......
......
......
..*...
.*.*..
.*.*..
..*...

Generation = 80, Population = 6.
......
......
......
..*...
.*.*..
.*.*..
..*...

*** Life<ConwayCell> 18x6 ***

Generation = 0, Population = 30.
....*.
.....*
.*....
...*..
.*...*
*...**
*....*
....**
...***
*....*
...*..
...*..
*.*...
..*.*.
....*.
*.*...
..**..
.*....

Generation = 11, Population = 0.
......
......
......
......
......
......
......
......
......
......
......
......
......
......
......
......
......
......

Generation = 22, Population = 0.
......
......
......
......
......
......
......
......
......
......
......
......
......
......
......
......
......
......

Generation = 33, Population = 0.
......
......
......
......
......
......
......
......
......
......
......
......
......
......
......
......
......
......

Generation = 44, Population = 0.
......
......
......
......
......
......
......
......
......
......
......
......
......
......
......
......
......
......

Generation = 55, Population = 0.
......
......
......
......
......
......
......
......
......
......
......
......
......
......
......
......
......
......

Generation = 66, Population = 0.
......
......
......
......
......
......
......
......
......
......
......
......
......
......
......
......
......
......

Generation = 77, Population = 0.
......
......
......
......
......
......
......
......
......
......
......
......
......
......
......
......
......
......

Generation = 88, Population = 0.
......
......
......
......
......
......
......
......
......
......
......
......
......
......
......
......
......
......

Generation = 99, Population = 0.
......
......
......
......
......
......
......
......
......
......
......
......
......
......
......
......
......
......

Generation = 110, Population = 0.
......
......
......
......
......
......
......
......
......
......
......
......
......
......
......
......
......
......

Generation = 121, Population = 0.
......
......
......
......
......
......
......
......
......
......
......
......
......
......
......
......
......
......

Generation = 132, Population = 0.
......
......
......
......
......
......
......
......
......
......
......
......
......
......
......
......
......
......

Generation = 143, Population = 0.
......
......
......
......
......
......
......
......
......
......
......
......
......
......
......
......
......
......

Generation = 154, Population = 0.
......
......
......
......
......
......
......
......
......
......
......
......
......
......
......
......
......
......

Generation = 165, Population = 0.
......
......
......
......
......
......
......
......
......
......
......
......
......
......
......
......
......
......

*** Life<ConwayCell> 20x17 ***

Generation = 0, Population = 15.
.................
.................
..........*......
.................
.........*.......
..........*......
.................
........*........
.....*...........
.................
.........*.......
..**..........*..
.................
*................
..............*..
......*......*...
...........*.....
.................
..........*......
.................

Generation = 7, Population = 0.
.................
.................
.................
.................
.................
.................
.................
.................
.................
.................
.................
.................
.................
.................
.................
.................
.................
.................
.................
.................

Generation = 14, Population = 0.
.................
.................
.................
.................
.................
.................
.................
.................
.................
.................
.................
.................
.................
.................
.................
.................
.................
.................
.................
.................

Generation = 21, Population = 0.
.................
.................
.................
.................
.................
.................
.................
.................
.................
.................
.................
.................
.................
.................
.................
.................
.................
.................
.................
.................

Generation = 28, Population = 0.
.................
.................
.................
.................
.................
.................
.................
.................
.................
.................
.................
.................
.................
.................
.................
.................
.................
.................
.................
.................

Generation = 35, Population = 0.
.................
.................
.................
.................
.................
.................
.................
.................
.................
.................
.................
.................
.................
.................
.................
.................
.................
.................
.................
.................

Generation = 42, Population = 0.
.................
.................
.................
.................
.................
.................
.................
.................
.................
.................
.................
.................
.................
.................
.................
.................
.................
.................
.................
.................

Generation = 49, Population = 0.
.................
.................
.................
.................
.................
.................
.................
.................
.................
.................
.................
.................
.................
.................
.................
.................
.................
.................
.................
.................

Generation = 56, Population = 0.
.................
.................
.................
.................
.................
.................
.................
.................
.................
.................
.................
.................
.................
.................
.................
.................
.................
.................
.................
.................

Generation = 63, Population = 0.
.................
.................
.................
.................
.................
.................
.................
.................
.................
.................
.................
.................
.................
.................
.................
.................
.................
.................
.................
.................

Generation = 70, Population = 0.
.................
.................
.................
.................
.................
.................
.................
.................
.................
.................
.................
.................
.................
.................
.................
.................
.................
.................
.................
.................

Generation = 77, Population = 0.
.................
.................
.................
.................
.................
.................
.................
.................
.................
.................
.................
.................
.................
.................
.................
.................
.................
.................
.................
.................

Generation = 84, Population = 0.
.................
.................
.................
.................
.................
.................
.................
.................
.................
.................
.................
.................
.................
.................
.................
.................
.................
.................
.................
.................

Generation = 91, Population = 0.
.................
.................
.................
.................
.................
.................
.................
.................
.................
.................
.................
.................
.................
.................
.................
.................
.................
.................
.................
.................

Generation = 98, Population = 0.
.................
.................
.................
.................
.................
.................
.................
.................
.................
.................
.................
.................
.................
.................
.................
.................
.................
.................
.................
.................

Generation = 105, Population = 0.
.................
.................
.................
.................
.................
.................
.................
.................
.................
.................
.................
.................
.................
.................
.................
.................
.................
.................
.................
.................

Generation = 112, Population = 0.
.................
.................
.................
.................
.................
.................
.................
.................
.................
.................
.................
.................
.................
.................
.................
.................
.................
.................
.................
.................

Generation = 119, Population = 0.
.................
.................
.................
.................
.................
.................
.................
.................
.................
.................
.................
.................
.................
.................
.................
.................
.................
.................
.................
.................

*** Life<ConwayCell> 3x10 ***

Generation = 0, Population = 23.
.****.****
***.*.**.*
********..

Generation = 19, Population = 0.
..........
..........
..........

Generation = 38, Population = 0.
..........
..........
..........

Generation = 57, Population = 0.
..........
..........
..........

Generation = 76, Population = 0.
..........
..........
..........

Generation = 95, Population = 0.
..........
..........
..........

Generation = 114, Population = 0.
..........
..........
..........

Generation = 133, Population = 0.
..........
..........
..........

Generation = 152, Population = 0.
..........
..........
..........

*** Life<ConwayCell> 5x14 ***

Generation = 0, Population = 27.
.*..*.*.**.*..
***.*.**......
.*.*..........
.*****..*..*..
*.**......**.*

Generation = 17, Population = 4.
...**.........
...**.........
..............
..............
..............

Generation = 34, Population = 4.
...**.........
...**.........
..............
..............
..............

Generation = 51, Population = 4.
...**.........
...**.........
..............
..............
..............

Generation = 68, Population = 4.
...**.........
...**.........
..............
..............
..............
