28

11 20
11
1 9
2 13
7 7
4 4
9 0
5 7
3 19
1 10
6 13
7 12
9 13
4 3

6 13
3
2 2
5 8
5 9
13 8

12 2
1
8 0
9 8

15 16
15
13 2
7 6
3 10
14 5
10 11
10 0
12 0
0 11
3 0
10 3
6 2
1 0
13 10
2 13
5 9
3 1

12 16
7
7 15
9 2
6 7
11 8
4 15
1 11
10 0
13 8

4 15
3
2 2
0 11
1 0
15 3

14 12
5
2 4
8 6
7 3
7 5
11 10
20 19

18 7
1
3 1
11 9

17 19
13
10 6
6 0
0 16
13 16
12 6
0 11
16 13
14 4
3 11
14 6
12 15
8 9
16 0
18 7

20 13
11
10 10
7 4
16 3
3 12
16 10
6 11
7 7
17 11
3 6
7 7
2 2
16 6

12 6
5
8 1
4 4
10 1
4 3
5 4
15 15

5 20
17
3 10
0 0
1 6
0 8
3 15
0 12
3 18
3 11
4 12
3 1
2 13
2 7
0 13
2 4
3 12
3 14
4 19
18 8

7 5
6
2 0
2 1
2 3
3 3
2 1
0 0
5 3

14 15
15
9 1
10 9
13 14
3 13
2 11
12 14
12 2
12 2
8 14
13 11
7 1
10 0
0 8
11 1
5 11
6 5

20 7
4
10 5
14 5
14 6
4 5
10 5

12 13
13
10 3
0 12
5 5
1 7
3 5
10 1
2 1
3 0
0 0
3 2
7 3
1 11
10 0
5 2

15 19
17
8 7
4 15
12 0
0 5
1 16
13 3
8 10
8 4
13 9
12 12
4 11
10 6
10 5
14 18
1 13
8 5
10 16
9 3

6 8
10
1 5
0 4
2 6
0 5
2 6
5 4
5 2
4 7
0 7
4 0
15 13

13 13
16
12 0
3 2
12 2
5 8
7 2
7 7
6 10
11 7
2 6
10 0
8 10
9 10
0 10
11 10
7 6
11 6
10 6

4 8
18
0 1
3 6
3 4
2 1
2 4
3 5
0 7
3 0
2 6
0 7
2 0
0 2
0 6
2 4
0 5
3 4
0 0
2 6
16 9

8 3
3
1 2
7 1
0 0
6 1

8 10
10
1 1
4 0
1 7
3 7
1 7
6 1
4 1
4 9
3 8
2 6
9 5

16 15
9
15 5
0 4
4 0
15 4
15 10
5 13
10 10
0 5
12 13
7 6

6 15
18
5 7
2 4
1 1
3 14
4 4
0 13
0 7
5 6
2 4
4 6
3 3
4 4
0 0
3 14
3 6
4 5
4 1
2 7
4 3

19 18
13
11 4
6 2
3 7
8 12
9 16
9 12
8 6
10 13
3 3
2 16
4 16
0 17
8 3
15 4

1 6
13
0 4
0 3
0 5
0 1
0 3
0 5
0 2
0 0
0 5
0 3
0 2
0 3
0 3
13 11

1 17
15
0 13
0 9
0 4
0 10
0 1
0 10
0 5
0 3
0 6
0 2
0 2
0 9
0 1
0 0
0 7
9 7

14 1
18
13 0
0 0
13 0
3 0
7 0
8 0
12 0
9 0
7 0
7 0
10 0
2 0
13 0
8 0
8 0
10 0
7 0
1 0
4 3
