*** Life<Cell> 5x5 ***

Generation = 0, Population = 8.
-----
-0---
00---
0---0
-00-0

Generation = 1, Population = 13.
-0---
-10--
--0-0
10001
-11-1

Generation = 2, Population = 14.
01---
0--00
00-01
*1--*
---0*

Generation = 3, Population = 16.
-*000
-10--
1---*
*-00.
0111*

Generation = 4, Population = 10.
0*1-1
-----
*---.
*1--.
--***

Generation = 5, Population = 13.
1**--
-10-0
*---.
**-0.
0-**.

*** Life<Cell> 5x5 ***

Generation = 0, Population = 8.
0----
00---
---0-
---00
-0-0-

Generation = 1, Population = 14.
1----
-100-
0001-
-0011
0--1-

Generation = 2, Population = 11.
--00-
0-1-0
1--*-
0-1-*
---*-

Generation = 3, Population = 12.
10-1-
1-*--
-00.0
1---*
0--*-

Generation = 4, Population = 14.
-10-0
*-.-0
11-.1
*-1-*
100.-

Generation = 5, Population = 12.
-*1-1
*1*0-
**-.-
.-*-.
---*0

*** Life<Cell> 5x5 ***

Generation = 0, Population = 8.
---0-
00---
-0--0
0--0-
----0

Generation = 1, Population = 14.
000-0
1-000
010--
--0-0
0----

Generation = 2, Population = 8.
---01
--1--
--1--
--1--
-00-0

Generation = 3, Population = 11.
---1*
-0*-0
-1-0-
---00
01---

Generation = 4, Population = 18.
-0-**
1-.-1
0*110
0-1-1
1*000

Generation = 5, Population = 9.
---**
*0.0-
1.*-1
-----
-.1--

*** Life<Cell> 5x5 ***

Generation = 0, Population = 9.
00---
---0-
-----
0-000
0-0--

Generation = 1, Population = 16.
1100-
000-0
0-0-0
1---1
1-1-0

Generation = 2, Population = 14.
-*11-
11101
-01--
-0-0-
*---1

Generation = 3, Population = 9.
-.*--
*--1*
-1-00
-10--
.----

Generation = 4, Population = 10.
1..-0
.---*
-*1--
1-1-1
.01--

Generation = 5, Population = 10.
-..11
.111.
-*-0-
-----
.1-01

*** Life<Cell> 5x5 ***

Generation = 0, Population = 9.
0--0-
----0
-0-00
0---0
-0---

Generation = 1, Population = 12.
-00--
00-01
---11
-0--1
--0-0

Generation = 2, Population = 9.
--1-0
1-0--
0-0-*
0----
----1

Generation = 3, Population = 11.
00*--
*--0-
--1-.
100--
0--0-

Generation = 4, Population = 7.
--*--
*-0-1
--*-.
-----
1---1

Generation = 5, Population = 12.
00.00
.----
00.1.
1-0-1
-0-0-

*** Life<Cell> 5x5 ***

Generation = 0, Population = 9.
00--0
-----
00-0-
0-0--
--0--

Generation = 1, Population = 16.
1100-
---00
-10-0
101--
0010-

Generation = 2, Population = 11.
*----
0-0--
---01
--*-0
-1*10

Generation = 3, Population = 10.
.10--
1---0
0-01-
--.--
0**--

Generation = 4, Population = 13.
.*100
*----
1-1*-
-0.0-
1*.1-

Generation = 5, Population = 16.
.*--1
*---0
*1**1
11.-0
**.*0

*** Life<Cell> 5x5 ***

Generation = 0, Population = 9.
0----
--0--
-000-
--00-
00---

Generation = 1, Population = 13.
-00--
0-1--
01--0
00--0
11-0-

Generation = 2, Population = 13.
-1-0-
1-*00
1--01
110-1
-----

Generation = 3, Population = 13.
--01-
*0.--
--0-*
--10*
110-0

Generation = 4, Population = 17.
0-1*0
.1.00
1-10*
1-*-*
*--01

Generation = 5, Population = 11.
-1*.-
*-.11
*1-1.
--*-.
.1-1-

*** Life<Cell> 5x5 ***

Generation = 0, Population = 8.
0--0-
0-0-0
-00--
-0---
-----

Generation = 1, Population = 11.
10---
1010-
---00
01---
-0---

Generation = 2, Population = 9.
---0-
-1---
----1
1-000
-10--

Generation = 3, Population = 14.
-00-0
1-100
000-*
-1---
-*--0

Generation = 4, Population = 12.
-1-01
*-*-1
-1-0*
-----
0.00-

Generation = 5, Population = 13.
--01-
*-.--
--01*
110-0
-.110

*** Life<Cell> 5x5 ***

Generation = 0, Population = 8.
--00-
00---
-----
0---0
-0-0-

Generation = 1, Population = 9.
0-110
11-0-
-0--0
-----
-----

Generation = 2, Population = 12.
10**1
--010
-10--
-0--0
-----

Generation = 3, Population = 11.
*-..-
111*-
0----
01-0-
-0--0

Generation = 4, Population = 8.
*-*.-
*--.0
-10--
-----
-10--

Generation = 5, Population = 11.
.-..1
*--*-
-*100
-----
0*10-

*** Life<Cell> 5x5 ***

Generation = 0, Population = 8.
--0-0
-----
--000
-00--
----0

Generation = 1, Population = 8.
-0---
---0-
----1
01---
-000-

Generation = 2, Population = 12.
0-00-
-00--
00---
1--00
---10

Generation = 3, Population = 10.
-0-10
0----
---01
*-0--
0-0--

Generation = 4, Population = 9.
---*1
-----
---1*
.-1-0
1-11-

Generation = 5, Population = 8.
--0.*
-----
---**
.1*-1
---*-

*** Life<Cell> 5x5 ***

Generation = 0, Population = 5.
--0--
-0---
-0---
---00
-----

Generation = 1, Population = 14.
---0-
01---
01000
-0011
---00

Generation = 2, Population = 10.
000-0
----0
--11-
--1-*
-0---

Generation = 3, Population = 13.
1-1-1
01--1
-1-*0
--*1.
0---0

Generation = 4, Population = 9.
*0--*
-----
-*1.-
0-*-.
-00--

Generation = 5, Population = 10.
.110.
0-0-1
-*-.-
--.1.
-1-0-

*** Life<Cell> 5x5 ***

Generation = 0, Population = 9.
-----
--0--
0-00-
0--0-
00-0-

Generation = 1, Population = 10.
--0--
001--
1---0
----0
-1-10

Generation = 2, Population = 13.
0-10-
---00
*-001
00---
0--*-

Generation = 3, Population = 13.
--*--
--11-
*011-
11--0
1-0.0

Generation = 4, Population = 15.
-0*--
0-*-0
*1*--
*-0-1
*1-*1

Generation = 5, Population = 15.
-1*00
1-.--
*-*1-
.-10*
**0*-

*** Life<Cell> 5x5 ***

Generation = 0, Population = 8.
00---
0-00-
-----
0-0-0
-----

Generation = 1, Population = 12.
-1-0-
10110
---00
-----
0-0-0

Generation = 2, Population = 10.
-*01-
*1---
00---
0-00-
-----

Generation = 3, Population = 15.
-*-*0
.*-1-
1--0-
10110
0-00-

Generation = 4, Population = 12.
0.-*1
**---
*0---
*-*-1
10---

Generation = 5, Population = 11.
1*0.*
..110
.---0
.-*--
-1--0

*** Life<Cell> 5x5 ***

Generation = 0, Population = 9.
-0---
0-0-0
----0
0-0-0
0----

Generation = 1, Population = 10.
----0
-0--1
---0-
1---1
100-0

Generation = 2, Population = 15.
-0-01
0-0-*
000-0
*-0-*
--1-1

Generation = 3, Population = 15.
--01-
1-10*
1-1--
*0--*
10*-*

Generation = 4, Population = 12.
00---
*-*1*
-0*--
.-00.
-1*-.

Generation = 5, Population = 13.
-1-11
*-.-.
-1.00
.011.
1**-.

*** Life<Cell> 5x5 ***

Generation = 0, Population = 8.
000--
-----
--0-0
0--0-
0----

Generation = 1, Population = 14.
1-10-
00--0
00-0-
10---
10-0-

Generation = 2, Population = 12.
*0*1-
1--0-
11---
*10--
----0

Generation = 3, Population = 17.
*-*-0
-0-10
*--0-
**100
1000-

Generation = 4, Population = 13.
.0*11
1-0--
*1--0
..*-1
-11--

Generation = 5, Population = 17.
.1*-*
*-1--
**001
*.*-*
1*-00

*** Life<Cell> 5x5 ***

Generation = 0, Population = 7.
0--00
0----
-0--0
-----
-0---

Generation = 1, Population = 12.
10011
1--0-
--00-
----0
0-0--

Generation = 2, Population = 10.
---**
*-0--
001--
0----
---00

Generation = 3, Population = 16.
1--*.
*01-0
1--0-
1-000
0-011

Generation = 4, Population = 9.
*--*.
*-*--
--110
-----
1--*-

Generation = 5, Population = 13.
.0-..
.-*00
10--1
1-0-0
-00.1

*** Life<Cell> 5x5 ***

Generation = 0, Population = 9.
----0
00---
--0-0
-0---
-00-0

Generation = 1, Population = 12.
00-0-
11---
00---
010--
0-1--

Generation = 2, Population = 14.
----0
**00-
11---
1*-0-
10*0-

Generation = 3, Population = 13.
000--
*.-1-
**---
*.010
-1.-0

Generation = 4, Population = 8.
--1--
..--0
*.--0
*.1--
--*-1

Generation = 5, Population = 14.
-0-00
..011
.*001
..*1-
11.--

*** Life<Cell> 5x5 ***

Generation = 0, Population = 9.
-----
-0--0
---00
-00--
-00-0

Generation = 1, Population = 8.
-0--0
0-0-1
---1-
0----
0----

Generation = 2, Population = 10.
---01
-0-0*
-----
10-0-
10---

Generation = 3, Population = 9.
-00--
0---*
0---0
----0
--00-

Generation = 4, Population = 16.
-1101
1-00.
10-1-
1-0-1
-011-

Generation = 5, Population = 14.
-**1*
*--1.
*1-*-
*-1--
-1**-

*** Life<Cell> 5x5 ***

Generation = 0, Population = 7.
---0-
-0---
-0---
00---
---00

Generation = 1, Population = 17.
-00-0
0100-
--0--
1-000
00011

Generation = 2, Population = 12.
---0-
1*-1-
---00
*011-
--1*-

Generation = 3, Population = 13.
00010
*.---
---11
.-**-
0--*1

Generation = 4, Population = 11.
----1
*.0--
0---*
.0*.0
-0-**

Generation = 5, Population = 14.
0-01-
.*-1-
1--1.
*-*.-
011**

*** Life<Cell> 5x5 ***

Generation = 0, Population = 7.
00-0-
----0
0--0-
-----
--0--

Generation = 1, Population = 11.
11---
-0-0-
-00--
0-00-
-0-0-

Generation = 2, Population = 10.
*-00-
--0-0
---0-
----0
--010

Generation = 3, Population = 10.
.--1-
001--
----0
--001
-01--

Generation = 4, Population = 11.
.1--0
1-*-0
00--1
-----
01--0

Generation = 5, Population = 11.
.--11
*-*--
-1-0*
-----
1*11-

*** Life<Cell> 5x5 ***

Generation = 0, Population = 9.
0--0-
0-0--
-00-0
----0
-0---

Generation = 1, Population = 15.
10--0
101-0
-1--1
--001
0-0-0

Generation = 2, Population = 10.
---01
--*--
-*0--
0---*
--101

Generation = 3, Population = 11.
---1*
--*-0
-*-01
----*
00*--

Generation = 4, Population = 13.
---**
--*--
0.01*
0-0-*
1-.01

Generation = 5, Population = 12.
---*.
10*0-
1.1-*
--1-.
*0.1-

*** Life<Cell> 5x5 ***

Generation = 0, Population = 8.
-0---
000--
0-0-0
-----
---0-

Generation = 1, Population = 13.
-1---
-1-00
101--
0-000
--0-0

Generation = 2, Population = 18.
0*000
--011
-1-0-
101--
00101

Generation = 3, Population = 13.
1*11-
01---
-*-1-
---00
-1*-*

Generation = 4, Population = 10.
-.-*0
-*---
-*-*-
-----
0**0*

Generation = 5, Population = 13.
-.1.1
0.0-1
1.-.0
1-1-0
1**-.

*** Life<Cell> 5x5 ***

Generation = 0, Population = 10.
---0-
-----
0-000
-0-0-
0--00

Generation = 1, Population = 14.
--0-0
0-0-0
-0111
0-0-0
--0-1

Generation = 2, Population = 15.
001-1
-0-0-
01--*
-0-0-
001-*

Generation = 3, Population = 19.
11*0-
0-0-0
1*11*
0-0-0
11*0.

Generation = 4, Population = 8.
--*1-
----1
*.--*
----1
--*1.

Generation = 5, Population = 12.
-1.*-
0-0-*
..-1*
0-0-*
-1.*.

*** Life<Cell> 5x5 ***

Generation = 0, Population = 9.
0----
0-0--
-0-0-
--0--
00-0-

Generation = 1, Population = 13.
100--
10---
----0
00-0-
110-0

Generation = 2, Population = 9.
-110-
----0
-----
--0-0
-*10-

Generation = 3, Population = 12.
1*-1-
-00--
--0--
--10-
1**1-

Generation = 4, Population = 10.
**1-0
-----
-----
0-*-0
**.-0

Generation = 5, Population = 16.
.**--
100-0
0-0-0
10.-1
**.11

*** Life<Cell> 5x5 ***

Generation = 0, Population = 7.
-----
-0-00
---0-
----0
00---

Generation = 1, Population = 15.
-0-00
0---1
-0010
00---
110-0

Generation = 2, Population = 10.
---1-
-000-
0----
-100-
-*1--

Generation = 3, Population = 11.
-0-*0
-1--1
-0---
--110
1*---

Generation = 4, Population = 17.
01-*-
0-0-*
01-1-
01*-1
**-00

Generation = 5, Population = 11.
-*0*-
----*
1---0
1-.-*
*.11-

*** Life<Cell> 5x5 ***

Generation = 0, Population = 7.
---0-
0-0-0
-----
-0-00
-----

Generation = 1, Population = 12.
0----
---0-
0000-
0--11
-0-00

Generation = 2, Population = 9.
-0-0-
-0-10
---1-
10-*-
-----

Generation = 3, Population = 15.
01-1-
01-*1
0-0--
*1-.1
00-0-

Generation = 4, Population = 6.
---*-
1-0**
-----
.--*-
-----

Generation = 5, Population = 11.
0--*-
--1**
0-0-0
.-0.1
---0-

*** Life<Cell> 5x5 ***

Generation = 0, Population = 10.
---00
-00-0
-----
00000
-----

Generation = 1, Population = 16.
-0-1-
01101
0--0-
1---1
00000

Generation = 2, Population = 10.
-10*-
-*--*
---10
--00*
-----

Generation = 3, Population = 15.
0--*-
0*-0*
-0--1
-011*
--000

Generation = 4, Population = 10.
1-0*-
-*--*
---1-
1-**.
---1-

Generation = 5, Population = 15.
-11*-
-*-0*
00-*-
--***
0--*0

*** Life<Cell> 5x5 ***

Generation = 0, Population = 8.
-----
-00--
0---0
0--0-
--00-

Generation = 1, Population = 15.
-00--
-1100
1-0--
10-1-
001-0

Generation = 2, Population = 11.
0---0
----1
*-100
*----
-1*0-

Generation = 3, Population = 11.
-0-01
--1--
.-*--
*---0
-**10

Generation = 4, Population = 12.
0-01*
--*-1
.0.00
.---1
-**--

Generation = 5, Population = 10.
----*
0-.--
.-*11
.-0-*
0..10

*** Life<Cell> 5x5 ***

Generation = 0, Population = 9.
00-0-
-0---
----0
00---
-00--

Generation = 1, Population = 12.
1---0
-1000
0--0-
1---0
--10-

Generation = 2, Population = 16.
--0-1
0*-1-
1--10
*000-
00*1-

Generation = 3, Population = 14.
1--0-
-*0*0
-0-*1
.111-
-1.-0

Generation = 4, Population = 8.
---1-
-*-.-
1--.-
**--0
0*.--

Generation = 5, Population = 11.
-00-1
-.0.-
*0-.1
..11-
-*.-0

*** Life<Cell> 5x5 ***

Generation = 0, Population = 8.
---00
-----
00---
0-0-0
---0-

Generation = 1, Population = 13.
--011
00-00
-1--0
10-0-
0----

Generation = 2, Population = 12.
0-1*-
1-0-1
0-001
-----
1--0-

Generation = 3, Population = 9.
1--*-
----*
1----
--0-0
-00-0

Generation = 4, Population = 10.
-01.-
----.
-10--
1-1-1
11--1

Generation = 5, Population = 12.
11*.-
----.
-*-01
*-*-*
-*-0*
