*** Life<FredkinCell> 6x8 ***

Generation = 0, Population = 15.
-----000
-0---000
0-----00
--0--0--
-0---0--
-------0

Generation = 2, Population = 21.
0--01---
--1-1---
001-010-
10-11201
1-----1-
--0-----

Generation = 4, Population = 23.
0-02----
-031-0-1
---12--0
30----0-
-0---13-
-101-010

Generation = 6, Population = 21.
01---1-1
----2-0-
1--1-2-2
5-133-2-
---1----
-103-0-2

Generation = 8, Population = 21.
2312-1--
0--2----
--1--2-2
--335--2
31-1---1
-----022

*** Life<FredkinCell> 6x8 ***

Generation = 0, Population = 13.
-----000
-0------
-----0-0
----0--0
-0--0-0-
--0-0---

Generation = 4, Population = 23.
--103---
--1-20--
-3-0--0-
1-0142--
1-2-0-02
-1--4-10

Generation = 8, Population = 24.
01104-1-
--2--4--
-5-12323
--2----3
2---0202
-11---1-

*** Life<FredkinCell> 6x8 ***

Generation = 0, Population = 12.
-0--0---
--------
0----0--
-00----0
--0-00--
0-----0-

Generation = 6, Population = 28.
245--31-
12001---
20---10-
1-0331-1
0-61-6-3
1---31--

*** Life<FredkinCell> 6x8 ***

Generation = 0, Population = 12.
-00-0---
-----0--
----0-0-
-------0
----0-00
0------0

Generation = 2, Population = 15.
12-00---
---0----
-0--0--0
0-------
--0--0-2
--0--0-2

*** Life<FredkinCell> 6x8 ***

Generation = 0, Population = 14.
0----0--
----0-0-
-0-0----
----0--0
000---0-
--00----

Generation = 1, Population = 19.
-0------
00---0-0
0---0-00
0-0--0--
1---00--
0--10-0-

*** Life<FredkinCell> 6x8 ***

Generation = 0, Population = 12.
0-00----
--0-0--0
----0---
--0-----
--0--0--
-0---0--

Generation = 4, Population = 23.
0----201
-0214-32
--03----
21---31-
-1-1-110
----12--

*** Life<FredkinCell> 6x8 ***

Generation = 0, Population = 13.
--0-----
0----0--
--0-0-00
---00---
-00-0---
-----0--

Generation = 4, Population = 22.
31-----0
012-2--1
---0-3--
2----1-1
----100-
10-022-2

*** Life<FredkinCell> 6x8 ***

Generation = 0, Population = 15.
0-00-00-
-0------
000-00-0
--------
--0--00-
--------

Generation = 4, Population = 12.
------41
-----0--
2---22-1
--------
-101---0
-1------

*** Life<FredkinCell> 6x8 ***

Generation = 0, Population = 12.
---0-00-
-----0--
-00----0
--------
0-------
-00-00--

Generation = 3, Population = 20.
-0-0----
----0-02
-11-1-2-
--2-100-
-1--00-1
--1-13--

*** Life<FredkinCell> 6x8 ***

Generation = 0, Population = 13.
----0---
-00--0-0
--0---00
-0---0--
--0-----
--00----

Generation = 1, Population = 23.
-000---0
01-0--01
-010-01-
0-0-0--0
--1--0--
-0-10---

*** Life<FredkinCell> 6x8 ***

Generation = 0, Population = 14.
000-----
--0-----
-0-0---0
0-----0-
----0-0-
---0-0-0

Generation = 3, Population = 23.
-0-010--
--1---10
1-2120--
1-02-2--
0--1---1
1--0-12-

Generation = 6, Population = 25.
-00113--
-04-0023
4--4-0--
--033-10
0-----22
4---14--

*** Life<FredkinCell> 6x8 ***

Generation = 0, Population = 13.
-------0
--0-----
---00---
-0-0----
-0---000
-00-0---

Generation = 2, Population = 15.
---000--
01-01---
--0-----
---201--
---1-2--
1-----1-

Generation = 4, Population = 22.
-1--2-10
23--1-0-
1-------
--0-01-0
-013-4-1
--11-01-

Generation = 6, Population = 25.
0311-1--
2-11-020
3--0111-
-1----0-
-2--1---
10--003-

*** Life<FredkinCell> 6x8 ***

Generation = 0, Population = 13.
-0-0---0
--------
--0-----
--0-0--0
0-00--0-
0-----0-

Generation = 1, Population = 27.
0---0-0-
-000---0
-0100--0
00-0-0--
1--1-01-
1000-010

*** Life<FredkinCell> 6x8 ***

Generation = 0, Population = 14.
0--00--0
--------
----0---
00----0-
---000-0
------00

Generation = 2, Population = 25.
-1-2--1-
10----0-
1-0--11-
2-110-00
-1120-0-
00--10--

Generation = 4, Population = 19.
0-0-2---
------01
---00--0
-2--01-2
-1-4----
2000-2--

Generation = 6, Population = 24.
0-022-31
-0------
1--20-20
44-3---4
-1--11-2
42-0-2--

Generation = 8, Population = 25.
-32---53
20-----1
--2222-0
-42--3-4
1-3631-4
620-----

*** Life<FredkinCell> 6x8 ***

Generation = 0, Population = 11.
---000-0
0----0--
-00-----
--------
---00---
-------0

Generation = 2, Population = 19.
----0000
0-11---1
0--101-0
0----0-0
-----10-
-----0--

Generation = 4, Population = 20.
1-1-20--
203-11--
02-10-00
-------2
1----3--
0--0----

Generation = 6, Population = 26.
-13-20--
----3-0-
0223--20
-1011--4
-10-2-2-
-110-2-0

Generation = 8, Population = 20.
--51-2--
-1-1--21
-443-220
1----1--
-3-----1
21---2--

*** Life<FredkinCell> 6x8 ***

Generation = 0, Population = 12.
-0------
--0-0---
0-0---00
---000--
--------
-0---0--

Generation = 1, Population = 21.
0---0---
0-1--000
--1---11
0--1-1-0
-0-00---
0-0-0-0-

*** Life<FredkinCell> 6x8 ***

Generation = 0, Population = 14.
------0-
-000----
-0----0-
-000----
---000--
--0-0---

Generation = 1, Population = 23.
-000-0-0
0--10---
0-0--0-0
0----00-
-00-110-
-0-01---

Generation = 2, Population = 19.
-1--0---
1-0-10--
-----10-
1----1--
--10-2-0
0101--0-

Generation = 3, Population = 17.
---01---
-0------
--0--210
-0000--0
-----30-
1-1-1---

*** Life<FredkinCell> 6x8 ***

Generation = 0, Population = 11.
--------
-00--0-0
------0-
000----0
-----0--
--0-----

Generation = 1, Population = 24.
-00--0-0
01100-0-
0------0
1-10-0--
00--0-00
-0-0-0--

*** Life<FredkinCell> 6x8 ***

Generation = 0, Population = 12.
-0-00---
-0--00--
-0------
--------
0----0--
0-0--0--

Generation = 1, Population = 26.
01-1----
0-0--10-
010-00--
00---0--
100-010-
1--0010-

Generation = 2, Population = 26.
-20-000-
--1---10
12--11--
110-0---
2110---0
2--112-0

Generation = 3, Population = 27.
03--1---
0020-1-1
--00-2-0
2--01--0
322-0101
3----3-1

Generation = 4, Population = 22.
-------0
-13-02-2
---113--
3-0--0--
4-30-2-2
4-0--402

Generation = 5, Population = 31.
-30-1001
0240---3
12022400
4-10--00
--41--03
5-1-1---

Generation = 6, Population = 22.
---12---
----0-1-
23----11
5121--11
-25--2--
--21-402

Generation = 7, Population = 22.
--02-00-
02--1-2-
---2242-
--321---
--61030-
---2---3

*** Life<FredkinCell> 6x8 ***

Generation = 0, Population = 15.
00---00-
---00---
0-------
0-------
0--0---0
00-0---0

Generation = 1, Population = 29.
1100-110
-0011-0-
10-00---
-0-0---0
--010-01
-1-10-01

Generation = 2, Population = 28.
221-0221
011--01-
2101-000
-10-0--1
-01----2
0-0-----

*** Life<FredkinCell> 6x8 ***

Generation = 0, Population = 13.
-0000---
----0---
----0---
00------
--00-00-
------0-

Generation = 4, Population = 28.
-1112--1
0---0-2-
11212---
-10-301-
3-2-040-
001-2-2-

*** Life<FredkinCell> 6x8 ***

Generation = 0, Population = 12.
-------0
-----0-0
--0--0--
0-----00
----0---
--0--00-

Generation = 6, Population = 28.
---2-0--
112216-4
----1--1
10203232
-0---1-3
03-30-10

*** Life<FredkinCell> 6x8 ***

Generation = 0, Population = 12.
0-0---0-
--0--0-0
--------
---0----
----0---
00---00-

Generation = 2, Population = 23.
0-----0-
1---10--
0-1-0-0-
0-1--000
--0---1-
-2100221

*** Life<FredkinCell> 6x8 ***

Generation = 0, Population = 12.
0------0
------00
---0--0-
0-------
00--0---
--0---0-

Generation = 1, Population = 23.
-0-----1
0--0-0--
0-0-001-
1--00-0-
-1-0-00-
0--000-0

*** Life<FredkinCell> 6x8 ***

Generation = 0, Population = 12.
-----0--
----0---
0--0---0
---0---0
--0-----
-00--00-

Generation = 2, Population = 24.
0----0--
--00--01
01---0-2
--0-1012
---00--1
1201-22-

Generation = 4, Population = 28.
0111----
002-112-
--120--2
-002--14
1-2--11-
3-0114--
