*** Life<Cell> 11x20 ***

Generation = 0, Population = 11.
--------------------
---------00---------
-------------0------
-------------------0
----0---------------
-------0------------
-------------0------
-------0----0-------
--------------------
0------------0------
--------------------

Generation = 3, Population = 72.
-------00--0--0----0
----0-01*11-1--0--0-
---0-0--00-1--0-00--
--0-0----11----00---
-0-0---0--0-0----0--
--0---0---0--0-0--0-
0--0-0-------0--0--0
-0-------11-0-1-----
--0--0---000-*-0----
---0--0-0-01*-0-0---
0-0----0---00--0----

*** Life<Cell> 6x13 ***

Generation = 0, Population = 3.
-------------
-------------
--0----------
-------------
-------------
--------00---

Generation = 8, Population = 22.
---------1---
--------..1--
--0-*-01*0-0-
-------1.*--*
--1-----1-0-1
11-1..-**..-*

*** Life<Cell> 12x2 ***

Generation = 0, Population = 1.
--
--
--
--
--
--
--
--
0-
--
--
--

Generation = 8, Population = 1.
0-
--
--
--
--
--
--
--
--
--
--
--

*** Life<Cell> 15x16 ***

Generation = 0, Population = 15.
-----------0----
0---------------
-------------0--
0---------0-----
----------------
---------0------
--0-------------
------0---------
----------------
----------------
0--0-------0----
----------------
0---------------
--0-------0-----
-----0----------

Generation = 1, Population = 50.
0---------0-0---
-0---------0-0--
----------0-0-0-
-0-------0-0-0--
0--------00-----
--0-----0-0-----
-0-0--0--0------
--0--0-0--------
------0---------
0--0-------0----
-00-0-----0-0---
---0-------0----
-00-------0-----
00-0-0---0-0----
--0-0-0---0-----

Generation = 2, Population = 45.
---------0-0----
--0-------0-----
---------------0
--0-----01--0---
--0----------0--
0-----00--10----
0---0-----------
----0---00------
0-00-------0----
------0---------
-11--0---0---0--
--0-------0-----
--10-0-----0----
1---0---0---0---
0--0-0-0--------

Generation = 3, Population = 104.
--0-----0-0-0---
-0-0-----------0
--------000-0-0-
-010---01*00---0
0010--000000--0-
100-001100*100--
10-010000000----
--0-10-01100----
--11--0-000-0---
00-0---0-0-0-0--
0*-00---0---0-0-
-------------0--
00-10-0-0-------
*000-0---0---0--
100-0-------0---

*** Life<Cell> 12x16 ***

Generation = 0, Population = 7.
----------------
-----------0----
----------------
----------------
---------------0
----------------
-------0--------
---------------0
----------------
--0-------------
0---------------
--------0-------

Generation = 8, Population = 31.
-------1-------*
--00----------1.
0---------------
-------.1--1----
-------*-*1.1-0.
--------*------1
*-0-------------
*------0-..---0.
1--*-------.---0
.-0-------**---1
.0.-..-10------.
--.-1---------.-

*** Life<Cell> 4x15 ***

Generation = 0, Population = 3.
-----------0---
0--------------
--0------------
---------------

Generation = 3, Population = 22.
0010----0-----0
1-*00----0---0-
-000-0----0-0--
10--0------0---

Generation = 6, Population = 17.
1-.-1010-0-0---
*1.---1--------
-------100---0-
.11-0----------

Generation = 9, Population = 24.
.0.*.-.10------
*.*---.0-000---
*0.0-0-.01*10--
.**1------00---

Generation = 12, Population = 25.
.1..*-.-1--*---
*..--*..*0*-1--
*-..11-.1***.-1
***-*-01*------

Generation = 15, Population = 24.
**...1*1.-1.---
*..-*...*1*0*--
.1..*--..**...-
**.-*-.1.0-0--0

*** Life<Cell> 14x12 ***

Generation = 0, Population = 5.
------------
------------
----0-------
------------
------------
------------
------------
---0-0------
------0-----
------------
------------
----------0-
------------
------------

Generation = 19, Population = 63.
---0-01--***
--0---00-0-0
-0--.-*-*-**
---1*.*-.1--
00**--...--.
1--.*0..*-.-
*1.1111.0-*0
*..*..-.*...
0-.--*0*...-
-..*.*.*.-.-
**.**...1-..
*--.-*...-..
.-.1*-......
-**1**.1.*.-

*** Life<Cell> 18x7 ***

Generation = 0, Population = 1.
-------
-------
-------
-0-----
-------
-------
-------
-------
-------
-------
-------
-------
-------
-------
-------
-------
-------
-------

Generation = 9, Population = 8.
-------
-------
-0-----
0-0----
-0-----
-------
-------
-------
-------
-------
-0-----
0-0----
-0-----
-------
-------
-------
-------
-------

*** Life<Cell> 17x19 ***

Generation = 0, Population = 13.
-----------0----0--
-------------------
-------------------
-----------0-------
-------------------
-------------------
0------------------
-------------------
---------0---------
-------------------
------0------------
-------------------
------0--------0---
----------------0--
----0-0------------
-------------------
0------------0-----

Generation = 7, Population = 129.
-0--0--1-11-1**---0
--0--00-0-0--00--0-
---0-00*-10.-0111--
--------0-00-1000--
-----01--*-*--10-0-
----00-1--0-0--10-0
---00---1--*-1---0-
--000--001--0-001--
-001**.1-01--10-0--
--000--0000----0---
---00---1.-*-0-----
-----0-0-00--0-0---
---0--0-0.01*0--0--
0-0---00-0-0---0-0-
-----0-0--00-1----0
0---0--0000-1------
-0-0--1----1------0

Generation = 14, Population = 139.
1.*1-0-*1.*....***-
-1-*-.-1011-1--.-*0
-0..---***.****..--
--01-.-01-0*-.-----
1.-0-****.-**-*...-
1-*0-1*.*-0.-1.**0*
*1-*.0*..***.*01.1-
-0-..-11*..--1--.--
.*1-.*.1*..*1.-*..*
1-.-.---*1*--..1--1
1-*-.0*-....*..--*.
--.1-1.**--**------
1-0101**.*-.*-**-*0
--1-1---.-0-1--00--
0---1--.-*-0-.-.-.*
--0-0-*0*--1--.--0-
--.*1-*1.1*--011--1

*** Life<Cell> 20x13 ***

Generation = 0, Population = 10.
-------------
-------------
--0----------
------0-----0
-------------
-------------
-----------0-
----0--0-----
-------------
-------------
----------0--
-------------
-------------
-------------
-------------
-------------
---0------0--
-----------0-
-------------
-------------

Generation = 6, Population = 88.
--0-0-0----0-
--1-0--00----
0---*---10---
1-1-.1-.-10--
0-1---01--0--
0-100--*---10
1---00--0-.-0
010--..--*--*
--0---00--1-1
0--00--00--11
---01---00-.*
--0--10--0-1-
-0---00-0-00-
----0--0-0---
---0--000-0--
-------1-----
----01.-10--0
-----0-----0-
------01----0
-------0-0---

Generation = 12, Population = 93.
----.--1---0-
-0.-.--.1--0-
-0-*.-*-111-1
--.-.1-.-.10-
.0.**1**-0..-
*--0-*-.--*.-
-0**0.-*0**0*
-.-.....*.*1.
--**--.--..1-
-10--.--.11.*
---0*0*0001.*
---1-.-10--.*
--00-----0-**
---1-10----1-
------*0*0..-
1--.-1*.00--1
0---.1.1...-.
---1.--*1--1-
-------1--*.*
---01--1---1-

*** Life<Cell> 12x6 ***

Generation = 0, Population = 5.
------
------
------
------
---00-
----0-
------
------
-0----
------
-0----
------

Generation = 15, Population = 32.
-.**..
-.*.*.
.--*..
1..*.-
.*1-..
*-.-..
**..*1
*1--*.
**-..*
.0--*-
1111**
0.**.1

*** Life<Cell> 5x20 ***

Generation = 0, Population = 17.
0-------0---00------
------0-------------
----0--0-----0------
-0--------000-00--0-
------------0------0

Generation = 8, Population = 43.
*1-0.*.*0*11*---..--
0-.1.--*.*.*---.*-00
00--..--.00*--*.*.-*
-0-.--*.***-1.*.-..*
0---*-0.**.-.-.****-

Generation = 16, Population = 28.
..-.....-......-..1*
.-...00.....1-*...**
-0*-**.*.*..-......*
.***-....*.-***....*
.*-.*1-....-.*....*-

*** Life<Cell> 7x5 ***

Generation = 0, Population = 5.
0----
-----
00-0-
---0-
-----
-----
-----

Generation = 3, Population = 18.
1---0
0-0-0
1*-*0
-----
1--*0
00010
---0-

*** Life<Cell> 14x15 ***

Generation = 0, Population = 14.
--------0------
---------------
-----------0---
-------------0-
---------------
-----------0---
---------------
-0-------------
--------------0
-0-------------
0--------0-----
-0-------------
--0-----------0
-----------0--0

Generation = 5, Population = 70.
---0-0----1**0-
----0--00-0*---
-0----0**--0-.-
0-0----00-0-0--
---------------
--0---0--0-0--0
-----0-00---00-
0-0-0-0--000---
---0-----0---01
0-0--10---0-0-*
----110----10--
0----1-----*-0.
---0-----1*0.0.
0-0-----0111..-

*** Life<Cell> 20x7 ***

Generation = 0, Population = 4.
-------
-------
-------
-------
-----0-
-------
-------
-------
-------
-------
-----0-
-------
-------
-------
-----00
-------
-------
-------
-------
-------

Generation = 5, Population = 37.
----0-0
-----0-
-------
-0---0-
0-0-0-0
-0-----
----0-0
-------
----0-0
-0---00
0-0--0-
-0----0
-------
-00----
01*1.-.
-00----
-------
-----00
----011
-----00

Generation = 10, Population = 30.
-------
-------
-------
-------
-----00
-------
---01--
-------
-----**
-------
--0-0*-
--0-0--
0011-.-
1--0---
*....-*
1--0-0-
01*-**.
--0-10-
----.-.
-------

*** Life<Cell> 12x13 ***

Generation = 0, Population = 13.
0-----------0
-------0---0-
-0-----------
0-0--0-------
-------------
-----0-------
-------------
---0---------
-------------
-------------
00-0---------
-------------

Generation = 2, Population = 28.
-10-------0--
1-0----------
0--0--------0
--0110-----0-
-0-----------
0-0--0-0-----
-------------
-0-----------
00-1---------
---1---------
**00-0-------
-------------

Generation = 4, Population = 42.
-*0-0---0-0--
.--0-0-----0-
*1---1------0
10*.1-1--0---
0-----------0
-1-----0-0-0-
1--0---------
0-1--0-0-----
---.---------
00---1-------
**-000-0-----
11-1---------

*** Life<Cell> 15x19 ***

Generation = 0, Population = 17.
-----0-------------
-------------0--0--
-------------------
-------------------
-----------0---0---
-------------------
-------------------
-------------------
----00-0--0--------
-------------------
-----00---------0--
-------------------
0-----------0------
---0-----0---------
------------------0

Generation = 3, Population = 112.
--0-----0--0--00--0
---0---0--0100*-00-
----0-0---0100-1--0
-----0---0-00-0----
--------0-0--0----0
----00-0-000---0-0-
---011--00110-0-0--
--0000--00000--00--
-01*1-01-*00-0-0-0-
0-0--0-0-00---0-0-0
-001-.10-0-----0-0-
---10-0---0-0---0--
-0--0-1------0-----
0---010-0-----0---0
-----0-0-----0-0-0-

Generation = 6, Population = 93.
-0-0-0-0------11-1-
-------0--1-...1*--
-0-01--0-10---0----
---------0--0----00
--0-----01.-1---00-
-----1-----1--10--0
-0-0*.-1--110---.-0
-----1---0---0--1--
-1-.-*--1.0--0*.-0-
-0-0-0-0-*-0-------
1**10*1-1--0---00-0
-----1-1-----0-----
-1001*-0*---0---0--
-0-00.1--0-----0---
---111*-----------0

Generation = 9, Population = 135.
0-001--.-1*-1**-*1-
-0--------*-..***1-
----***10--**0-----
0----100-0001---0--
-0----1---*1.-*-1--
0-0*0--*0--.0-.--01
-00*..*-*1*.-00*.*.
-1-*0.0-0-000-0---0
**1.-.*1-.0-*-*.-0-
0--.0--11.-.-*-*-0-
**..1.*0*11-*-011--
000*--*.010000-00-0
-10-..11.--*0-0110-
0.-.*.*-1-01---0---
-0--*-**-----0---0-

*** Life<Cell> 6x8 ***

Generation = 0, Population = 9.
----00-0
-----0--
------0-
--------
0------0
--0-0---

Generation = 13, Population = 19.
*.*.***.
..-.-.*.
.-.*.*..
...**.10
*1*.1*..
.-0...*.

*** Life<Cell> 13x13 ***

Generation = 0, Population = 16.
----------0--
-------------
------0------
--0----------
-------------
--------0----
----------0--
--0---00-----
----------0--
----------0--
0------------
------00--0--
0-0----------

Generation = 6, Population = 58.
--0----------
0-1---01--1--
1-.-1---*----
--*--0--*01-0
1-1-------*-1
---1--0-0--0*
.-----0--000-
*-0-1-1--1*11
.01-0--01..*.
----1---.*.-*
----11---110-
-0---*.*-.-*-
----.0*---1-1

*** Life<Cell> 4x8 ***

Generation = 0, Population = 14.
000--000
--------
00--0-0-
0---000-

Generation = 9, Population = 12.
.1-.....
1-1-..**
.***....
--**.10.

*** Life<Cell> 8x3 ***

Generation = 0, Population = 3.
0--
--0
---
---
---
---
---
-0-

Generation = 1, Population = 8.
-00
00-
--0
---
---
---
-0-
0-0

Generation = 2, Population = 7.
--1
1-0
0--
--0
---
-0-
---
-0-

Generation = 3, Population = 15.
00*
*-1
10-
00-
-00
0-0
---
0-0

Generation = 4, Population = 7.
--*
.-*
*--
-1-
0--
-01
---
---

Generation = 5, Population = 11.
-0.
.0.
.-0
0-0
-00
-1*
-00
---

Generation = 6, Population = 12.
01.
.1*
.-1
-1-
--1
0*.
0--
-00

*** Life<Cell> 8x10 ***

Generation = 0, Population = 9.
----------
-0-----0--
------0---
-------00-
00-------0
----------
-0--------
----------

Generation = 5, Population = 46.
1100----0*
0-----0.*1
1**000-01-
0-0*-1-..1
***1*0-.01
01--00--1-
.---01100-
0----0-110

*** Life<Cell> 16x15 ***

Generation = 0, Population = 9.
----00---------
---------------
---------------
---------------
0--------------
-------------0-
---------------
---------------
---------------
---------------
----------0----
---------------
-------------0-
---------------
---------------
----00----0----

Generation = 6, Population = 83.
--1.**.-**10---
--00--00---0---
-0-1..1000-----
---------0-----
0--1-0-0--0----
-------0-------
0-0--0--0---01-
---------0-----
0-0---0---00-.1
----00----00-.-
0---1---00--1-1
--01**000-1-01-
------00--1---1
0001..-0-0.-0-0
--00--10-0--00-
-*-...*1*--00--

*** Life<Cell> 6x15 ***

Generation = 0, Population = 15.
0------0-----0-
-0-------------
----0--0-------
---0--0-------0
-0--000--------
------00-------

Generation = 3, Population = 33.
-0--11--0------
00---------0-0-
1-1-1-010-0---0
00-0--.1---0-0-
-0---0.-----0--
---1-10**10--0-

*** Life<Cell> 19x18 ***

Generation = 0, Population = 13.
-----------------0
------------------
----------------0-
---0---0----------
----------------0-
------------------
--0---------------
------------------
---0--0-----0-----
------------0---0-
-------------0----
----0-------------
------------------
------------------
------------------
------------------
------------------
------------------
------------------

Generation = 4, Population = 39.
-------------0-*.-
------------------
--0---------0---**
---0---0---0------
---0--0---------01
------------1---0-
0-----0------1--*-
---10--0----.-----
--.--.-10-*--.----
--------1---*-----
--0------0-------0
0-------0---------
---0--1-----0-----
------------0---0-
-------------0----
----0-------------
------------------
------------------
------------------

Generation = 8, Population = 67.
--00--0--0-0*-0.*-
------------0----*
--------0---0*0-**
----0--0---1--0-10
--.-----0---1--.-.
----0-------1-0-0-
--0.*--------*1-.-
---.*1--0-0-.-----
*-.-*.-1*-.-.*11--
----100-.-*-.-----
--0-----.-1-.--01-
--*0--*00---*-----
--1--*--.----.--0-
------------------
--0---------------
------------------
---0--1-----0-----
------------0---0-
-------------0----

Generation = 12, Population = 143.
*1**-.0-110..0-.*0
--0-0---0-0.0---*.
---*--1-**0--.0*..
0-0*-1-1---*1*--*0
1*.-1111-10-.1-.-*
0-11**--1--.*0.1-1
---..*-*-----.-1*-
---.*.*--1-1.-00*0
*-.1..-..0*0..*.*1
101-11-1*-*-.-11--
*-.*-*1-**...*1..1
1**-1-*-*---.0--1-
-1.0**10**1-*.11--
----*00-----.---0-
0-0*--10000--1-1*-
--01--*0----.-----
--.-..-10-*--.----
--------1-------0-
--10--0--0--0----0

*** Life<Cell> 1x6 ***

Generation = 0, Population = 6.
000000

Generation = 11, Population = 0.
.-..-.

*** Life<Cell> 1x17 ***

Generation = 0, Population = 11.
00000000-00--0---

Generation = 7, Population = 6.
11*1-0-.....-..-1

*** Life<Cell> 14x1 ***

Generation = 0, Population = 10.
0
0
0
0
-
-
-
0
0
0
0
-
0
0

Generation = 3, Population = 9.
1
1
-
*
*
-
*
*
-
1
1
0
.
.
