*** Life<FredkinCell> 6x5 ***

Generation = 0, Population = 14.
0-0--
0--00
00-00
0-0--
-0---
---00

Generation = 31, Population = 14.
+98--
6---9
6-+-8
+4++-
+---6
-----

*** Life<FredkinCell> 10x4 ***

Generation = 0, Population = 15.
0000
000-
--0-
0---
---0
0---
0--0
0---
----
--0-

Generation = 3, Population = 18.
1---
113-
0---
-20-
11-0
---0
---0
-000
-0--
00--

Generation = 6, Population = 21.
-1--
22-2
3-3-
-330
2233
---0
1-10
100-
---0
----

Generation = 9, Population = 15.
----
----
6142
033-
---6
----
4---
--1-
-210
-1-0

Generation = 12, Population = 16.
-454
--62
----
--4-
3-6-
----
5410
-1--
-3--
--23

Generation = 15, Population = 20.
55--
4473
7---
--73
---8
3-1-
----
--30
--30
2254

*** Life<FredkinCell> 8x5 ***

Generation = 0, Population = 15.
0----
--0--
-00--
0--00
----0
0-0--
--00-
00-0-

Generation = 19, Population = 23.
-322-
2-7--
3---5
593-8
1--3-
4-423
843--
581--

*** Life<FredkinCell> 12x12 ***

Generation = 0, Population = 22.
-----------0
------------
-0--000--0--
----0-----0-
0----0------
--0-------0-
-0-------0--
---0--0---0-
-0--------0-
0------0----
--0---------
------------

Generation = 1, Population = 54.
----------0-
-0--000--0-0
0-00--100---
00-0100----0
-00---0-----
0--0-0-----0
0--0--0-0-0-
--0-00-0--10
--00--00-010
--0---0-0-0-
00-0---0----
--0---------

Generation = 2, Population = 58.
-0--000-----
----1-----0-
1-1-002-1---
------1-0-0-
0-100010----
1--1--0-0---
10-1-0-0--10
001-11-1--2-
-011----01--
0-10-01--01-
11--0-----0-
0------0----

Generation = 3, Population = 65.
0-00--10--0-
0000-0--00-0
--------20--
---0-0-01--0
1-21---10-0-
-----01--000
2-020101-0-1
----2--2--3-
0-----0-1-1-
1---0120---0
22----00--10
1---0-0-0-0-

Generation = 4, Population = 51.
10--0-21----
--1-------0-
101-----3-0-
0--1----2---
--3-0----010
-------0--1-
--1-121--1-2
--1-3-03--4-
10----1---2-
---01-----11
330---1--0--
2--0--10--1-

Generation = 5, Population = 75.
21-0--320-0-
-0201-000010
-------04-10
1-0----03--0
10-1-0-1-121
-----0--0020
-02----10---
0-2-41140-5-
21-1-02--1--
---121-----2
--10002-0-10
3---00-10--0

Generation = 6, Population = 81.
3-01-0-3-01-
---12-------
10-00--150-1
20---011--0-
-13--1-2--32
1-010110-13-
-1-21---1--2
1-305225-0-0
-212-1-----0
10-2322-00-3
3321--301-21
-00---12-0-1

Generation = 7, Population = 60.
--1-0----120
-0-2----0-10
---------11-
-1-1---2--10
1-------0-43
---212--02-0
2--322-1-1-3
----63-60---
2-23--201-2-
-1-3-3-0-11-
--3---41--32
-----0--0-12

Generation = 8, Population = 52.
---1-0---23-
0-2----0--2-
-------1-221
----1-1---2-
----01--11-4
--0-2-1---3-
-12--3-2-2-4
--30--27--50
-23--13--130
---4----022-
-----05---4-
--0-0-------

Generation = 9, Population = 72.
3-----3303-0
-----00100--
1-1-0--2-3-2
---120--3030
--31121222--
--1-3---02-0
223----3---5
-04163--00-1
23-302------
-1--3--0133-
--31-1611-52
-0----1---1-

Generation = 10, Population = 72.
-1-----41---
--2--11-112-
---010-3--23
2-0----2----
-1-2-3---3--
1--24-10---1
334--31-1-1-
11527-2-11-2
343---30--30
-2-443--2---
-3420272-063
3--0--2-002-

Generation = 11, Population = 66.
3----0-5--3-
------2-----
1-11--24---4
-1-12-133030
1-331---2-44
20--5--1-2--
44-3242322-5
2---83-7-2-3
---3---11-4-
----5-20----
----1383--74
---1--3211--

*** Life<FredkinCell> 6x5 ***

Generation = 0, Population = 16.
-0---
-00-0
--00-
000-0
0--0-
000-0

Generation = 6, Population = 16.
-----
3-122
31-6-
--3-0
25--3
11-21

Generation = 12, Population = 13.
----2
--5-6
351-5
-3---
-6115
2----

Generation = 18, Population = 12.
4-44-
-38--
-----
-463-
-61--
3--3-

Generation = 24, Population = 15.
6--+-
6-+-+
4-2--
--8-6
27-69
34---

Generation = 30, Population = 13.
-+4--
-6-5+
---+8
8--4-
29-+-
---5-

Generation = 36, Population = 15.
++-+-
-9+-+
--3++
+7---
-+--+
--5-7

Generation = 42, Population = 16.
++--9
+9+--
-+3--
+-+6+
---++
-76--

*** Life<FredkinCell> 12x4 ***

Generation = 0, Population = 16.
0---
0---
-00-
-0--
----
----
00--
0-0-
-0-0
-000
---0
---0

Generation = 17, Population = 20.
-68-
--63
3-7-
4---
-7-4
--5-
--13
----
2--7
5-1-
16-3
+---

*** Life<FredkinCell> 8x11 ***

Generation = 0, Population = 17.
----0---00-
00-----00--
----000----
-----0-----
------0----
----------0
---00---0--
------0----

Generation = 3, Population = 47.
001-021--3-
--2-0-11-1-
---21---010
110--10--0-
000--1-0---
-000-12---1
0121--20-0-
-000-01---1

Generation = 6, Population = 43.
31-1--1004-
--300--4--0
02-3-22-3--
-41-12-1---
11---21----
03-1--2----
3124--311--
-11013-----

Generation = 9, Population = 46.
-----4-1153
-1--1---321
-3--2-5--33
17-025-----
2210-31-2-1
3--2-2-23-1
4--71331--2
---1-41--01

Generation = 12, Population = 46.
-524--342-3
--6041--422
------50--4
-8----310--
---3044--2-
3523-------
5-6-2-42--2
222435-2332

Generation = 15, Population = 49.
7-5-0-64394
437---4-42-
2--5225-53-
-9224-6----
64-4-55---2
--3-2-32-2-
5-695-52---
2-34----333

Generation = 18, Population = 37.
--85---4-+-
--7--34-7--
-44--2--54-
----5------
9-1--6604--
3-63----32-
817+5-5-4-6
-----81-4-6

Generation = 21, Population = 48.
968-26---+-
63736-7-+-4
---74----7-
4----76315-
+4-5--6----
3-9-4--363-
-2-+--8---7
62545+13549

Generation = 24, Population = 42.
-9-9----5+-
-68-7--+--4
4-4------+7
-+----7--50
+-5-089--33
47+-4---662
--9+8----1+
7-5-5--355-

Generation = 27, Population = 47.
+++------+-
7797-57++3-
5-5----35+8
--2-----3--
--651-+04--
-8-5-46-7-5
---+93-4---
74668+34-69

*** Life<FredkinCell> 6x10 ***

Generation = 0, Population = 19.
--0-0----0
------00--
-00---00-0
--00-0-0--
-00-----0-
-0---0----

Generation = 2, Population = 33.
010------0
--001--010
12-000-2-0
0--2001--1
10000--0-1
-200------

Generation = 4, Population = 28.
-----0---2
-102-010-2
14-20-14--
0--4-232--
1----00--3
--20--0--1

Generation = 6, Population = 33.
12--1201--
-1-2-0301-
-4-42---11
0-2612--12
-22---2015
-34-----1-

Generation = 8, Population = 32.
---03-----
0104-052--
16-62--53-
-02-3-32-4
22--1040-5
-3---02--2

Generation = 10, Population = 26.
3-0--3220-
----1-5-1-
-----037--
-----43-36
-4-1-240--
--5--0-034

Generation = 12, Population = 35.
3--1-542-4
--1-115--4
170-20-9-2
--38-6-35-
-4--146-25
0-5112-0--

Generation = 14, Population = 29.
3-----6-0-
0----153-4
37-7-24+5-
-2--3-----
34---4-02-
05-1--3036

Generation = 16, Population = 34.
530145840-
0226-1--2-
3-1-32--73
-24--75-5-
-642----26
-56------8

Generation = 18, Population = 29.
---3--8-0-
----1--32-
5--8-45+--
---9-773-8
-844--812-
1--122414-

Generation = 20, Population = 28.
54--4-85--
--27--63--
5--+5---85
13--377-6-
-+---5-126
-5-1---3--

Generation = 22, Population = 36.
76--46-5--
----226--5
-7--5-6+8-
136-3-956-
3--617+-48
27--33654+

Generation = 24, Population = 31.
-------526
23-8---4-5
-91-558+--
15-+-9-7-8
3--8-9+1-8
2-7-3---6+

Generation = 26, Population = 30.
-81-4--526
--4--4---7
--3+---+-6
1--+4--77-
3--+-9+16-
-872-4--8+

Generation = 28, Population = 27.
9+1--6-72-
-------427
--3+-79+-8
3--+----79
5+--2-+-8-
--7---75--

*** Life<FredkinCell> 5x12 ***

Generation = 0, Population = 19.
0----0-0---0
-00-0---0---
--0----0----
-0---0-----0
--0-0-00-0-0

Generation = 44, Population = 28.
--9+9-+86--+
6+-+----4-4-
+-+--++-9+-+
-+---+-+-+--
+----+++-+--

*** Life<FredkinCell> 9x8 ***

Generation = 0, Population = 17.
--0-0--0
---0----
---00---
0-------
0-----0-
----0--0
0-0----0
--0-0---
0-------

Generation = 3, Population = 39.
1-02-220
1-010--0
2------1
3012--0-
---100--
-00--213
-03--1-3
1-300--2
100----1

Generation = 6, Population = 26.
---2-53-
-01--00-
----4---
4--220--
----0-2-
---01-24
--610--4
2----10-
------0-

Generation = 9, Population = 32.
2-020-4-
-1--3--2
20-1-3--
--3--1--
200-----
--1---2-
-29--2--
30---2-2
10-110-5

*** Life<FredkinCell> 5x11 ***

Generation = 0, Population = 15.
----------0
-----00----
0--000000--
----0---00-
00---------

Generation = 8, Population = 33.
-311-3203--
11---11-13-
1-23---6-2-
502-202-011
6--43--3-12

*** Life<FredkinCell> 7x12 ***

Generation = 0, Population = 15.
0--0-0------
---0-------0
--00----0--0
-0----------
-------0---0
--0--------0
-----0------

Generation = 8, Population = 23.
-2-4--0-6---
-----2-----5
0---53--0-22
-----1---0--
---2-3---1--
---213----1-
-3---------2

Generation = 16, Population = 24.
---6-5--6336
-2-6-5-----8
45-6-6-----3
-------0---2
---5---3----
-5-6--4-----
---1-----3--

Generation = 24, Population = 28.
2-2--936+---
-5-------4--
-7----7-15--
---2-3---4--
---9-----8-6
5--8-7---549
-+-3---4---4

Generation = 32, Population = 26.
-8--4-3--8-7
-6---+-5-7--
-8---9-738+-
---3---4----
-6---7-+---+
--6--8-77---
-----------6

Generation = 40, Population = 32.
++5+---+-+3-
-----+-8---+
+-9--+++6--+
---4-----6-7
-6-+-------+
9+--7---+96+
---6-8------

*** Life<FredkinCell> 9x11 ***

Generation = 0, Population = 17.
00---0---0-
---0-------
-----------
-0-0----0--
0--0-------
------0---0
-----------
0--0-------
-------000-

Generation = 21, Population = 42.
6-+6-5-40-4
40-8-4-5---
-----7-5---
-4-5-8--363
-8--6-3----
-----0-----
542----+--2
---6--7-254
--6-379+548

*** Life<FredkinCell> 5x9 ***

Generation = 0, Population = 13.
-0-000---
--0-----0
--------0
--0--0-00
--0-0----

Generation = 4, Population = 27.
1-1-02-2-
0-0-1---2
-200032--
212302--1
-1-1102--

Generation = 8, Population = 22.
-0-22-222
2---2----
02-4-5---
63-30--6-
-512-44--

Generation = 12, Population = 13.
-2-436---
--1-----3
--------0
--6--5-61
--3-4----

Generation = 16, Population = 27.
5-3-38-5-
3-1-5---5
-505085--
868927--2
-6-3579--

Generation = 20, Population = 22.
-2-65-757
5---6----
35-9-+---
+8-92--+-
-+44-++--

Generation = 24, Population = 13.
-4-86+---
--2-----6
--------0
--+--+-+2
--6-8----

Generation = 28, Population = 27.
9-5-6+-8-
6-2-9---8
-80+0+8--
++++4+--3
-+-59++--

Generation = 32, Population = 22.
-4-+8-+8+
8---+----
68-+-+---
++-+4--+-
-+76-++--

Generation = 36, Population = 13.
-6-+9+---
--3-----9
--------0
--+--+-+3
--9-+----

Generation = 40, Population = 27.
+-7-9+-+-
9-3-+---+
-+0+0++--
++++6+--4
-+-7+++--

Generation = 44, Population = 22.
-6-++-+++
+---+----
9+-+-+---
++-+6--+-
-++8-++--

Generation = 48, Population = 13.
-8-+++---
--4-----+
--------0
--+--+-+4
--+-+----

*** Life<FredkinCell> 11x5 ***

Generation = 0, Population = 16.
-----
--000
---0-
---00
-0-0-
0----
----0
-----
-0---
00-0-
--0-0

Generation = 10, Population = 24.
---32
---44
0--1-
3-4-3
--033
---35
---20
-----
0-26-
6-42-
2--0-

Generation = 20, Population = 26.
043--
65---
44---
-----
-72-9
05---
737--
5-3-4
444--
-54-4
87---

Generation = 30, Population = 24.
---8+
+-29-
--666
-----
1--8-
---8+
+-97-
7-5-6
---+7
---75
+--5-

Generation = 40, Population = 26.
-9--+
-+2-8
-98-+
+-+-+
-+8-+
0+---
+8+--
-----
-9--+
++---
-+8-1

*** Life<FredkinCell> 10x12 ***

Generation = 0, Population = 19.
---0-0------
-0----------
------------
---00-0-----
-----------0
-----0000---
-------0-0--
--0-0-------
---------00-
-0------0---

Generation = 16, Population = 44.
---3-0-6----
--24--43---1
---------10-
--3-42----42
-2---3------
3-01--25-8--
-3-0---2-75-
-37---4---3-
2---2+-3-6--
4--4232-9--3

Generation = 32, Population = 52.
-6--------98
-6+74--6+---
-------7--3-
-49-93+8694-
-----9---2-1
5567+7-++-8-
-9-6-----+--
28+5+-7-7-+-
----4+--6+--
-3++---9--5-

*** Life<FredkinCell> 5x6 ***

Generation = 0, Population = 15.
--0-00
0--00-
-000-0
0-000-
--0---

Generation = 1, Population = 18.
00-0-1
--0--0
0111--
-0111-
001-0-

Generation = 2, Population = 21.
110--2
-01001
12---0
01-2-0
11-010

Generation = 3, Population = 12.
22---3
012--2
-3----
12-31-
------

*** Life<FredkinCell> 10x11 ***

Generation = 0, Population = 17.
--0----00--
-0-0-------
----0------
---0---0---
0-0-------0
-----------
---0-------
----0------
0----------
0-0-0------

Generation = 31, Population = 70.
3--+74+5---
-3966-7-8-2
527---6+-3-
-266++-39-3
--5656++65-
5---++74-4-
-8+4-36+664
73+---89-4-
4-6----+95+
99-7+-74-8+

*** Life<FredkinCell> 11x9 ***

Generation = 0, Population = 17.
-0-0----0
000---0-0
--00-0---
---------
-----00--
0--------
---00----
---------
---------
--0------
---------

Generation = 7, Population = 46.
-----2---
3-3--102-
4--100212
0---21---
21-----20
0--1-0002
-33--1-3-
----10--2
-0220-0--
1---10-0-
-1--40--0

Generation = 14, Population = 46.
--23533-4
--633--4-
4--632--6
1---324-2
--2-232--
1-3------
-5732-342
-0--20---
----2512-
4-----50-
----61--1

*** Life<FredkinCell> 7x7 ***

Generation = 0, Population = 13.
--0----
000----
-------
-0-00-0
---0---
-0--0-0
-----0-

Generation = 2, Population = 18.
1-2-0--
-00---0
--11---
10-0-00
-0-----
-01---0
-----0-

Generation = 4, Population = 20.
1--0--1
-2---1-
--1--1-
301-122
--0--1-
-0---0-
-1-0-0-

Generation = 6, Population = 26.
-0-01--
121-130
--3-010
-------
112-0--
122-101
--00-2-

Generation = 8, Population = 0.
-------
-------
-------
-------
-------
-------
-------

Generation = 10, Population = 0.
-------
-------
-------
-------
-------
-------
-------

Generation = 12, Population = 0.
-------
-------
-------
-------
-------
-------
-------

Generation = 14, Population = 0.
-------
-------
-------
-------
-------
-------
-------

Generation = 16, Population = 0.
-------
-------
-------
-------
-------
-------
-------

Generation = 18, Population = 0.
-------
-------
-------
-------
-------
-------
-------
