20

6 5
14
2 4
0 0
4 0
1 0
0 0
3 0
1 0
0 0
2 4
2 4
0 0
3 0
3 0
4 4
63 10

9 4
30
0 2
2 1
1 2
0 2
3 2
6 0
5 0
0 1
1 0
5 0
7 1
1 2
2 3
1 1
2 2
6 3
4 1
0 2
3 0
4 2
3 3
6 0
7 2
6 0
3 3
0 2
4 2
4 2
1 1
3 0
99 10

9 7
40
2 6
6 4
0 2
4 2
5 2
3 4
1 0
5 4
4 4
6 0
7 2
6 0
7 0
5 2
3 4
3 4
3 0
3 2
3 6
6 0
1 2
5 2
3 2
6 0
0 4
0 6
6 6
0 6
0 4
1 2
1 4
1 4
5 4
0 0
3 6
1 4
1 6
7 4
1 4
4 0
22 10

5 9
18
0 0
2 8
3 8
0 0
3 0
1 0
1 0
1 8
1 8
0 8
1 8
2 0
1 8
0 0
0 8
3 8
3 0
0 0
97 10

6 8
46
4 4
0 2
1 6
0 7
1 7
1 2
2 7
2 3
2 2
4 2
4 2
2 6
2 7
4 5
1 3
0 1
4 0
0 1
2 6
1 7
1 5
3 7
4 7
1 3
2 1
1 1
0 0
2 7
4 4
4 2
0 7
2 6
1 7
1 6
3 7
1 2
1 7
4 0
2 4
1 0
0 1
0 1
3 1
0 0
2 6
1 4
17 10

6 6
18
1 1
2 0
0 0
3 4
3 5
0 5
2 0
3 0
4 1
4 0
4 0
1 5
2 4
2 4
3 5
3 5
2 4
0 4
50 10

7 6
7
5 4
3 5
0 5
3 5
0 4
5 0
1 1
79 10

7 8
35
3 2
1 2
2 5
4 3
1 7
3 5
1 4
3 3
5 2
4 6
1 6
4 3
0 5
2 5
1 6
5 6
1 6
1 3
1 1
0 6
4 7
1 6
1 6
3 4
0 1
0 2
3 7
5 5
0 3
2 3
0 1
4 3
3 3
0 2
2 4
50 10

5 8
28
3 7
1 4
0 2
1 6
0 4
1 1
1 2
0 3
1 6
0 7
1 3
2 7
1 7
0 5
0 0
0 7
3 1
3 3
3 0
2 7
0 7
0 5
1 5
0 7
3 4
2 5
3 1
0 4
32 10

6 7
31
4 0
4 0
0 6
0 6
2 4
0 2
3 6
0 6
3 6
1 6
0 4
4 2
2 0
2 4
3 6
2 0
0 4
4 2
0 4
3 0
4 6
1 6
1 0
0 6
0 2
4 2
4 0
4 4
3 2
2 0
4 2
98 10

6 4
20
3 0
3 1
1 2
0 2
1 3
0 2
4 3
2 3
1 0
1 3
4 1
3 1
0 0
0 1
0 1
0 2
3 1
2 1
2 2
0 0
5 10

8 8
44
0 0
4 3
1 3
3 5
4 4
6 0
5 2
4 6
2 6
0 5
0 0
3 2
5 2
4 4
2 1
6 2
6 7
3 1
1 4
1 3
5 1
2 5
0 5
3 2
0 0
2 7
5 2
1 0
6 4
5 0
1 4
0 6
3 0
5 6
2 6
3 4
6 5
0 2
2 5
4 5
3 4
1 6
2 6
4 2
86 10

9 4
8
7 1
5 3
5 0
1 1
2 2
5 1
7 3
3 1
60 10

4 9
10
0 8
2 8
0 8
2 0
0 8
0 8
0 0
2 8
2 8
2 0
35 10

7 8
40
4 3
4 2
1 7
3 7
3 3
1 4
2 5
0 3
4 2
4 7
0 0
2 6
3 1
4 5
2 4
2 6
4 4
4 3
0 4
3 7
1 4
1 1
0 3
5 6
4 1
3 0
2 5
2 7
3 2
2 7
1 0
2 7
3 6
4 1
4 5
4 2
2 3
5 4
3 0
4 5
86 10

9 5
33
5 0
3 4
5 0
3 4
0 0
3 4
0 4
6 0
3 4
4 4
2 0
1 0
0 0
6 0
3 0
6 0
6 0
4 0
2 4
0 0
1 0
0 0
1 4
3 4
5 0
2 4
0 4
0 0
7 4
3 0
1 0
2 4
3 4
18 10

7 8
3
2 7
0 0
0 7
74 10

9 6
22
3 5
2 1
3 0
4 0
0 5
5 1
0 5
0 4
6 1
1 4
5 1
3 1
1 1
3 0
6 5
3 0
6 4
5 1
0 1
4 1
0 1
2 1
12 10

7 5
3
0 4
0 0
0 4
31 10

5 6
23
1 5
1 5
1 0
3 4
1 1
0 5
0 0
2 5
1 5
2 4
1 0
1 0
3 5
1 0
2 4
0 0
1 4
1 4
2 0
0 5
3 4
1 0
1 1
51 10
