28

6 5
3
0 3
3 1
4 1
5 2

11 8
14
2 7
9 6
9 4
9 0
0 3
10 3
0 3
4 0
7 0
3 4
7 3
3 5
5 0
5 3
6 3

3 7
9
2 1
0 5
0 3
1 6
0 2
0 0
0 2
2 4
1 0
5 2

7 9
2
1 7
5 7
4 2

5 4
9
4 1
4 3
0 2
1 3
4 1
0 2
0 3
3 2
3 3
17 7

5 8
9
1 6
2 4
1 4
3 2
4 3
2 1
2 6
4 0
0 0
9 6

5 3
6
3 1
1 2
4 2
2 0
0 0
0 0
10 7

4 10
3
3 4
3 8
0 9
19 6

3 5
5
1 0
1 4
2 1
1 0
1 4
10 7

3 8
6
0 4
0 4
2 4
1 4
1 3
2 0
6 5

12 12
41
1 7
8 9
4 6
8 1
9 4
9 6
10 10
5 3
1 0
2 3
4 11
0 10
5 2
5 7
3 6
0 6
4 8
6 6
0 7
6 11
0 4
8 11
11 3
9 5
11 3
7 9
2 8
2 2
10 7
6 9
10 5
4 2
11 3
8 9
2 3
7 8
3 5
0 4
11 3
6 10
7 11
14 1

9 12
29
7 2
3 11
0 2
5 3
4 7
1 4
7 8
1 7
6 0
8 7
5 5
5 3
8 0
7 3
8 3
8 4
6 6
3 0
3 4
8 3
5 2
7 2
7 2
5 4
2 11
2 2
3 4
1 0
8 10
8 6

4 12
4
0 3
3 3
3 4
2 10
7 1

5 5
12
2 1
1 4
2 4
2 1
4 2
2 3
2 3
0 3
0 4
1 0
3 1
0 0
13 10

8 10
37
2 0
5 4
7 8
4 1
4 0
7 7
7 5
5 8
6 1
3 8
1 2
6 9
3 8
6 5
4 4
7 5
5 1
3 8
6 9
4 8
4 1
3 7
0 4
0 7
7 9
4 3
6 8
3 1
6 8
1 8
4 8
1 0
2 9
4 5
4 4
4 7
3 1
5 2

6 4
5
2 2
4 3
0 0
3 0
3 0
8 6

6 8
22
3 1
4 2
1 4
3 3
5 0
0 5
5 6
2 4
0 1
3 0
4 2
3 4
1 4
5 5
0 4
3 2
5 7
5 5
3 0
0 0
3 4
1 0
4 1

7 4
12
0 2
5 0
3 0
0 2
4 1
1 1
5 3
3 1
2 3
0 2
0 3
1 1
15 11

5 11
12
3 6
3 0
0 10
3 10
4 7
3 3
3 1
0 7
4 3
0 7
0 3
3 9
19 10

10 10
46
7 0
6 9
3 3
3 5
0 3
8 9
1 8
4 3
6 5
2 9
4 4
2 3
8 2
9 7
3 7
5 7
3 7
5 6
7 7
4 1
4 6
0 3
9 7
0 6
9 5
2 1
9 4
3 3
9 3
5 2
5 5
6 4
7 8
1 5
1 1
1 2
7 1
0 9
6 9
4 1
3 3
5 0
2 7
0 6
3 6
3 3
11 2

5 6
13
4 0
3 3
3 3
2 5
3 3
2 4
3 1
1 1
3 4
0 4
4 4
3 2
0 4
12 3

4 11
16
0 5
1 2
2 3
3 7
1 2
1 1
2 9
3 0
2 8
2 9
0 0
2 9
1 2
0 5
0 3
1 2
17 11

8 3
4
5 0
0 2
2 2
4 0
3 1

4 9
12
3 1
0 7
1 2
0 3
1 6
0 8
0 8
0 3
3 6
2 4
1 8
2 8
19 16

10 8
32
2 6
1 1
7 2
2 1
0 4
3 7
3 1
1 5
1 5
1 2
8 6
3 2
4 1
2 5
6 3
3 1
0 5
3 1
2 3
9 4
5 7
1 7
2 5
8 7
6 4
2 7
2 1
5 5
1 4
1 3
3 7
7 0
4 3

6 3
5
0 1
3 0
3 2
3 2
3 0
8 7

11 12
10
8 5
6 1
6 8
10 2
5 10
4 7
6 2
10 11
8 4
5 5
12 8

5 9
15
1 6
1 0
4 2
2 4
2 4
4 3
3 4
4 7
3 0
2 0
1 5
0 0
2 4
3 0
2 4
5 1
