*** Life<ConwayCell> 12x13 ***

Generation = 0, Population = 17.
.............
...*.........
*....*.......
....*......**
.............
....*........
.............
...........*.
.......*.....
.........*.**
.*........*..
...*.*....*..

Generation = 1, Population = 8.
.............
.............
....*........
.............
.............
.............
.............
.............
..........***
..........**.
.........**..
.............

Generation = 2, Population = 7.
.............
.............
.............
.............
.............
.............
.............
...........*.
..........*.*
............*
.........***.
.............

Generation = 3, Population = 7.
.............
.............
.............
.............
.............
.............
.............
...........*.
............*
.........*..*
..........**.
..........*..

Generation = 4, Population = 9.
.............
.............
.............
.............
.............
.............
.............
.............
...........**
..........*.*
.........***.
..........**.

Generation = 5, Population = 8.
.............
.............
.............
.............
.............
.............
.............
.............
...........**
.........*..*
.........*..*
.........*.*.

*** Life<ConwayCell> 17x19 ***

Generation = 0, Population = 15.
.......*...........
..............**...
............*....*.
.*.................
...................
..........*........
...*..*............
...................
.................*.
...................
...................
...................
.....*.............
.....*............*
...........*.......
.............*.....
...................

Generation = 1, Population = 0.
...................
...................
...................
...................
...................
...................
...................
...................
...................
...................
...................
...................
...................
...................
...................
...................
...................

Generation = 2, Population = 0.
...................
...................
...................
...................
...................
...................
...................
...................
...................
...................
...................
...................
...................
...................
...................
...................
...................

Generation = 3, Population = 0.
...................
...................
...................
...................
...................
...................
...................
...................
...................
...................
...................
...................
...................
...................
...................
...................
...................

Generation = 4, Population = 0.
...................
...................
...................
...................
...................
...................
...................
...................
...................
...................
...................
...................
...................
...................
...................
...................
...................

Generation = 5, Population = 0.
...................
...................
...................
...................
...................
...................
...................
...................
...................
...................
...................
...................
...................
...................
...................
...................
...................

*** Life<ConwayCell> 3x12 ***

Generation = 0, Population = 13.
*....*..*.**
.*..........
*.***..*.**.

Generation = 1, Population = 10.
............
*****...*..*
.***........

Generation = 2, Population = 7.
.***........
*...*.......
*...*.......

Generation = 3, Population = 6.
.***........
*.*.*.......
............

Generation = 4, Population = 4.
.***........
..*.........
............

Generation = 5, Population = 6.
.***........
.***........
............

*** Life<ConwayCell> 2x13 ***

Generation = 0, Population = 12.
*.....**.***.
.*.***...*.*.

Generation = 1, Population = 12.
....***.**.*.
....***.**.*.

Generation = 2, Population = 8.
....*.*.**...
....*.*.**...

Generation = 3, Population = 4.
........**...
........**...

Generation = 4, Population = 4.
........**...
........**...

Generation = 5, Population = 4.
........**...
........**...

*** Life<ConwayCell> 5x8 ***

Generation = 0, Population = 15.
*.......
..**.**.
**...*.*
**..**..
.*..*...

Generation = 1, Population = 15.
........
*.*.***.
*..*....
..*.***.
**..**..

Generation = 2, Population = 13.
.....*..
.*.***..
..*.....
*.*...*.
.*.**.*.

Generation = 3, Population = 14.
.....*..
..****..
..*.**..
..*..*..
.***.*..

Generation = 4, Population = 13.
...*.*..
..*...*.
.**...*.
.....**.
.****...

Generation = 5, Population = 16.
........
.***.**.
.**...**
....***.
..****..

*** Life<ConwayCell> 14x2 ***

Generation = 0, Population = 14.
.*
**
*.
*.
**
**
..
*.
..
..
..
**
..
**

Generation = 1, Population = 10.
**
**
*.
*.
..
**
**
..
..
..
..
..
..
..

Generation = 2, Population = 9.
**
..
*.
..
**
**
**
..
..
..
..
..
..
..

Generation = 3, Population = 8.
..
**
..
**
**
..
**
..
..
..
..
..
..
..

Generation = 4, Population = 4.
..
..
..
**
**
..
..
..
..
..
..
..
..
..

Generation = 5, Population = 4.
..
..
..
**
**
..
..
..
..
..
..
..
..
..

*** Life<ConwayCell> 12x11 ***

Generation = 0, Population = 14.
...........
*..........
..*..*.*...
...........
.......**..
.......*...
...**......
..*........
.......*...
.......*...
.....*.....
...*.......

Generation = 1, Population = 10.
...........
...........
...........
......***..
.......**..
.......**..
...*.......
...*.......
...........
......*....
...........
...........

Generation = 2, Population = 6.
...........
...........
.......*...
......*.*..
.........*.
.......**..
...........
...........
...........
...........
...........
...........

Generation = 3, Population = 5.
...........
...........
.......*...
.......**..
.........*.
........*..
...........
...........
...........
...........
...........
...........

Generation = 4, Population = 6.
...........
...........
.......**..
.......**..
.......*.*.
...........
...........
...........
...........
...........
...........
...........

Generation = 5, Population = 5.
...........
...........
.......**..
......*..*.
.......*...
...........
...........
...........
...........
...........
...........
...........

*** Life<ConwayCell> 20x13 ***

Generation = 0, Population = 16.
.............
*............
.............
.............
...*.*.......
....*........
.............
.............
...*.........
.......*.....
........*....
.....*..*...*
.............
..*..........
........*....
.**..........
.......*.....
.............
.............
.........*...

Generation = 1, Population = 6.
.............
.............
.............
.............
....*........
....*........
.............
.............
.............
.............
.......**....
.............
.............
.............
.**..........
.............
.............
.............
.............
.............

Generation = 2, Population = 0.
.............
.............
.............
.............
.............
.............
.............
.............
.............
.............
.............
.............
.............
.............
.............
.............
.............
.............
.............
.............

Generation = 3, Population = 0.
.............
.............
.............
.............
.............
.............
.............
.............
.............
.............
.............
.............
.............
.............
.............
.............
.............
.............
.............
.............

Generation = 4, Population = 0.
.............
.............
.............
.............
.............
.............
.............
.............
.............
.............
.............
.............
.............
.............
.............
.............
.............
.............
.............
.............

Generation = 5, Population = 0.
.............
.............
.............
.............
.............
.............
.............
.............
.............
.............
.............
.............
.............
.............
.............
.............
.............
.............
.............
.............

*** Life<ConwayCell> 13x11 ***

Generation = 0, Population = 16.
......***..
...........
........*..
...........
*...*....*.
....*......
.......*..*
...*.......
.........*.
......**...
.*.........
..*........
...........

Generation = 1, Population = 2.
.......*...
........*..
...........
...........
...........
...........
...........
...........
...........
...........
...........
...........
...........

Generation = 2, Population = 0.
...........
...........
...........
...........
...........
...........
...........
...........
...........
...........
...........
...........
...........

Generation = 3, Population = 0.
...........
...........
...........
...........
...........
...........
...........
...........
...........
...........
...........
...........
...........

Generation = 4, Population = 0.
...........
...........
...........
...........
...........
...........
...........
...........
...........
...........
...........
...........
...........

Generation = 5, Population = 0.
...........
...........
...........
...........
...........
...........
...........
...........
...........
...........
...........
...........
...........

*** Life<ConwayCell> 4x10 ***

Generation = 0, Population = 14.
.*..*.**..
..*...*.*.
..*.*.*...
*...*..**.

Generation = 1, Population = 12.
.....***..
.**...*...
.*....*.*.
...*.*.*..

Generation = 2, Population = 10.
.....***..
.**.......
.*...**...
......**..

Generation = 3, Population = 12.
......*...
.**....*..
.**..***..
.....***..

Generation = 4, Population = 10.
..........
.**..*.*..
.**..*..*.
.....*.*..

Generation = 5, Population = 10.
..........
.**...*...
.**.**.**.
......*...

*** Life<ConwayCell> 11x8 ***

Generation = 0, Population = 17.
...**...
...*.*..
...*...*
........
........
.*......
........
....**..
.**..*..
...**...
.***....

Generation = 1, Population = 13.
...**...
..**....
....*...
........
........
........
........
....**..
..*..*..
....*...
..***...

Generation = 2, Population = 14.
..***...
..*.....
...*....
........
........
........
........
....**..
...*.*..
..*.**..
...**...

Generation = 3, Population = 13.
..**....
..*.*...
........
........
........
........
........
....**..
...*..*.
..*..*..
...***..

Generation = 4, Population = 13.
..**....
..*.....
........
........
........
........
........
....**..
...*..*.
..*..**.
...***..

Generation = 5, Population = 14.
..**....
..**....
........
........
........
........
........
....**..
...*..*.
..*...*.
...****.

*** Life<ConwayCell> 4x12 ***

Generation = 0, Population = 11.
..*..*.....*
.....**.*.*.
..*.....*...
......*.*...

Generation = 1, Population = 10.
.....**.....
.....***.*..
.....**.*...
.......*....

Generation = 2, Population = 8.
.....*.*....
....*...*...
.....*..*...
......**....

Generation = 3, Population = 10.
............
....*****...
.....**.*...
......**....

Generation = 4, Population = 10.
.....***....
....*...*...
....*...*...
.....***....

Generation = 5, Population = 12.
.....***....
....*.*.*...
....*.*.*...
.....***....

*** Life<ConwayCell> 15x11 ***

Generation = 0, Population = 16.
.......*..*
....*......
......*....
......*..*.
.......*.*.
...........
......*....
........*..
......*....
..*......*.
.....*.....
......*....
...........
...........
........*..

Generation = 1, Population = 6.
...........
...........
.....*.....
......***..
........*..
...........
...........
.......*...
...........
...........
...........
...........
...........
...........
...........

Generation = 2, Population = 6.
...........
...........
......**...
......***..
........*..
...........
...........
...........
...........
...........
...........
...........
...........
...........
...........

Generation = 3, Population = 5.
...........
...........
......*.*..
......*.*..
........*..
...........
...........
...........
...........
...........
...........
...........
...........
...........
...........

Generation = 4, Population = 3.
...........
...........
...........
........**.
.......*...
...........
...........
...........
...........
...........
...........
...........
...........
...........
...........

Generation = 5, Population = 2.
...........
...........
...........
........*..
........*..
...........
...........
...........
...........
...........
...........
...........
...........
...........
...........

*** Life<ConwayCell> 6x16 ***

Generation = 0, Population = 16.
.*.*.*..........
.*...*......*...
**..............
....*....**....*
.*..*....*.....*
................

Generation = 1, Population = 12.
..*.*...........
.*..*...........
**..............
**.......**.....
.........**.....
................

Generation = 2, Population = 12.
...*............
****............
..*.............
**.......**.....
.........**.....
................

Generation = 3, Population = 10.
.*.*............
.*.*............
...*............
.*.......**.....
.........**.....
................

Generation = 4, Population = 6.
................
...**...........
................
.........**.....
.........**.....
................

Generation = 5, Population = 4.
................
................
................
.........**.....
.........**.....
................

*** Life<ConwayCell> 3x16 ***

Generation = 0, Population = 15.
.*..*.***.*.....
.....*..*....*..
...***....*..**.

Generation = 1, Population = 13.
.....*****......
...*....*....**.
....**.......**.

Generation = 2, Population = 11.
......****......
........**...**.
....*........**.

Generation = 3, Population = 7.
.......*.*......
.........*...**.
.............**.

Generation = 4, Population = 6.
........*.......
........*....**.
.............**.

Generation = 5, Population = 4.
................
.............**.
.............**.

*** Life<ConwayCell> 6x12 ***

Generation = 0, Population = 16.
....*.......
..*......*.*
......**...*
.*.*...*....
.......*....
.*.**.*..*..

Generation = 1, Population = 13.
............
..........*.
..*...***.*.
.......**...
...**.***...
............

Generation = 2, Population = 9.
............
.......*.*..
......*.*...
...*.*......
......*.*...
.......*....

Generation = 3, Population = 10.
............
.......**...
......***...
.....**.....
......**....
.......*....

Generation = 4, Population = 10.
............
......*.*...
.....*..*...
.....*..*...
.....*.*....
......**....

Generation = 5, Population = 14.
............
.......*....
.....**.**..
....**.**...
.....*.**...
......**....

*** Life<ConwayCell> 18x2 ***

Generation = 0, Population = 15.
..
.*
..
**
.*
*.
.*
..
*.
..
.*
**
..
**
.*
..
*.
*.

Generation = 1, Population = 15.
..
..
**
**
.*
**
..
..
..
..
**
**
..
**
**
..
..
..

Generation = 2, Population = 12.
..
..
**
..
..
**
..
..
..
..
**
**
..
**
**
..
..
..

Generation = 3, Population = 8.
..
..
..
..
..
..
..
..
..
..
**
**
..
**
**
..
..
..

Generation = 4, Population = 8.
..
..
..
..
..
..
..
..
..
..
**
**
..
**
**
..
..
..

Generation = 5, Population = 8.
..
..
..
..
..
..
..
..
..
..
**
**
..
**
**
..
..
..

*** Life<ConwayCell> 11x14 ***

Generation = 0, Population = 17.
..........**..
.......*......
.......*......
......*..**.*.
.......*...*..
*..........*..
.*............
*.............
......*.....*.
..............
...*..........

Generation = 1, Population = 12.
..............
..............
......***.....
......***.**..
...........**.
..............
**............
..............
..............
..............
..............

Generation = 2, Population = 14.
..............
.......*......
......*.**....
......*.*****.
.......*..***.
..............
..............
..............
..............
..............
..............

Generation = 3, Population = 10.
..............
.......**.....
......*....*..
......*.....*.
.......**...*.
...........*..
..............
..............
..............
..............
..............

Generation = 4, Population = 8.
..............
.......*......
......*.......
......*....**.
.......*...**.
..............
..............
..............
..............
..............
..............

Generation = 5, Population = 8.
..............
..............
......**......
......**...**.
...........**.
..............
..............
..............
..............
..............
..............

*** Life<ConwayCell> 18x3 ***

Generation = 0, Population = 13.
..*
...
...
..*
..*
...
**.
...
..*
.**
.**
...
*..
...
..*
*..
...
...

Generation = 1, Population = 7.
...
...
...
...
...
.*.
...
.*.
.**
...
.**
.*.
...
...
...
...
...
...

Generation = 2, Population = 8.
...
...
...
...
...
...
...
.**
.**
...
.**
.**
...
...
...
...
...
...

Generation = 3, Population = 8.
...
...
...
...
...
...
...
.**
.**
...
.**
.**
...
...
...
...
...
...

Generation = 4, Population = 8.
...
...
...
...
...
...
...
.**
.**
...
.**
.**
...
...
...
...
...
...

Generation = 5, Population = 8.
...
...
...
...
...
...
...
.**
.**
...
.**
.**
...
...
...
...
...
...

*** Life<ConwayCell> 19x4 ***

Generation = 0, Population = 17.
..*.
*.*.
*...
...*
....
*...
****
....
...*
*...
.*..
...*
...*
*...
....
....
..*.
....
....

Generation = 1, Population = 10.
.*..
....
.*..
....
....
*.*.
***.
.*.*
....
....
....
..*.
....
....
....
....
....
....
....

Generation = 2, Population = 6.
....
....
....
....
....
*.*.
*..*
**..
....
....
....
....
....
....
....
....
....
....
....

Generation = 3, Population = 5.
....
....
....
....
....
.*..
*.*.
**..
....
....
....
....
....
....
....
....
....
....
....

Generation = 4, Population = 5.
....
....
....
....
....
.*..
*.*.
**..
....
....
....
....
....
....
....
....
....
....
....

Generation = 5, Population = 5.
....
....
....
....
....
.*..
*.*.
**..
....
....
....
....
....
....
....
....
....
....
....
