26

10 2
18
5 1
9 1
2 1
7 1
3 0
4 1
8 0
7 1
3 0
0 0
0 0
6 0
1 0
9 1
4 1
5 1
2 1
9 1
8 5

15 1
18
4 0
2 0
3 0
8 0
6 0
7 0
10 0
12 0
3 0
9 0
10 0
13 0
1 0
13 0
4 0
8 0
0 0
2 0
40 5

7 5
17
2 3
1 2
6 2
2 2
4 1
6 0
2 1
0 1
0 4
4 4
0 0
5 1
2 0
0 4
1 1
1 1
2 0
28 2

5 4
17
0 1
2 0
2 2
2 0
4 0
3 1
0 2
2 0
3 0
0 2
4 2
0 2
0 0
4 1
0 1
0 1
0 2
49 3

15 19
17
7 11
14 14
9 1
0 1
7 9
3 3
4 13
8 0
3 2
3 7
13 9
2 8
6 8
7 9
10 17
7 2
7 12
34 3

6 15
18
4 3
0 14
5 1
0 12
4 13
3 2
5 4
5 1
0 3
2 5
3 2
5 7
5 7
3 8
2 13
4 2
2 13
4 1
31 4

9 1
17
5 0
0 0
1 0
7 0
0 0
8 0
1 0
8 0
3 0
6 0
4 0
6 0
5 0
6 0
3 0
1 0
1 0
12 2

17 3
18
0 2
6 0
10 1
2 0
2 0
9 1
11 1
5 1
7 0
11 0
13 1
6 2
4 1
7 1
11 0
9 2
8 0
10 0
19 1

6 17
18
5 7
5 9
3 14
2 2
2 8
4 14
2 12
1 1
3 1
0 0
0 13
0 1
1 12
4 8
5 15
3 5
0 13
1 14
23 5

18 2
17
1 1
5 0
0 0
12 1
8 1
12 0
10 0
4 1
17 0
2 1
14 1
9 1
17 0
17 0
7 1
5 1
14 0
5 4

17 4
17
2 1
16 2
12 3
0 0
9 2
16 2
13 3
11 0
15 3
6 0
11 1
4 0
15 3
15 2
16 0
6 3
3 1
2 5

19 12
18
6 9
9 11
18 10
14 9
18 11
4 6
10 3
12 10
5 11
7 5
13 2
11 7
0 11
0 11
16 4
0 5
2 8
13 6
32 1

11 16
18
9 11
8 3
9 3
2 14
7 1
1 4
8 1
0 11
2 4
10 3
8 0
9 12
7 1
3 2
2 9
1 7
7 13
2 14
50 1

18 3
17
0 1
15 1
11 0
7 1
5 0
13 1
4 1
14 1
17 0
4 2
11 0
16 0
13 1
0 1
0 2
4 2
12 2
8 1

11 5
17
3 1
9 4
9 0
0 1
4 0
3 0
9 1
3 4
0 3
9 2
7 0
6 0
10 2
3 2
4 1
3 2
1 2
22 4

15 11
18
2 2
0 8
2 1
11 8
4 3
10 9
7 2
11 9
12 5
9 2
7 2
2 9
9 9
3 3
8 9
14 5
4 5
5 4
41 3

4 10
17
2 5
0 5
2 6
2 2
1 2
3 6
0 2
3 2
1 4
0 9
2 1
3 1
2 5
0 1
2 4
1 6
0 9
8 3

5 17
18
1 15
1 3
2 7
0 3
1 0
2 3
4 3
2 2
0 11
3 5
4 16
2 9
2 5
0 10
0 1
3 11
1 8
3 12
46 3

7 14
18
4 0
4 0
1 6
0 0
2 6
5 8
6 0
1 12
1 8
1 8
1 9
5 7
6 9
4 11
3 11
4 7
5 4
0 13
26 2

5 15
17
1 13
3 7
2 6
3 10
2 1
4 3
2 6
4 0
3 2
0 12
0 2
4 11
0 1
3 9
4 1
2 0
3 14
48 1

6 5
17
5 0
0 1
0 4
1 0
5 0
4 2
2 3
1 3
3 0
2 4
3 1
4 4
4 4
2 4
0 4
5 0
4 4
8 4

16 17
18
5 3
9 12
9 6
1 14
8 10
5 16
0 13
5 1
9 2
7 1
10 10
9 15
3 15
11 10
13 4
10 4
9 1
15 13
29 4

17 2
18
4 0
15 1
15 0
11 1
8 1
12 1
0 0
15 0
8 1
10 0
10 1
7 1
2 0
0 0
12 1
1 0
13 0
1 1
39 1

7 1
17
0 0
5 0
0 0
2 0
3 0
6 0
6 0
4 0
3 0
2 0
1 0
4 0
1 0
3 0
6 0
5 0
3 0
46 5

11 5
18
8 2
1 1
4 2
2 0
8 3
3 1
5 1
9 3
1 1
9 3
9 1
8 1
3 4
3 2
5 3
7 1
7 1
8 1
8 2

12 6
18
6 0
0 0
11 4
5 5
5 4
6 0
5 3
1 2
10 2
10 1
8 5
8 3
1 1
5 1
3 4
0 3
10 0
3 0
29 2
