*** Life<FredkinCell> 11x11 ***

Generation = 0, Population = 25.
----0------
----0------
00--0------
---------0-
-0----00---
--0--00---0
-0-0----0--
-----------
-----------
--00---00--
-0---00-00-

Generation = 2, Population = 51.
000---0----
--0---0--0-
22-12--0---
--0-1011--1
1----0---1-
0--0---0-10
---0-1-1--1
---1-0001-0
---1-00--0-
00--1-0--00
-0--12---21

Generation = 4, Population = 51.
----1-210--
0-2-112-1-1
4-03-0-----
-----2---0-
-11102----1
21-21--2-10
10----11001
---------1-
-----0-002-
2---30--1--
-2111---1--

Generation = 6, Population = 60.
2--1--21-11
---1-3-1-0-
----3-0-1-1
-10--22110-
2--32----3-
23-2-104112
10---33-0-1
-1-1-2--311
1-0-02-2---
2--1---1-10
0------1-31

Generation = 8, Population = 47.
-113----0-3
--43-3233--
--1---21--1
-3---4---0-
----4-01---
43-42--4-32
1--0153--0-
-----------
-1-22---1--
2-11-1-1---
2---1--32--

Generation = 10, Population = 72.
3---31-1---
1--3-5453-1
5334312120-
131-144-301
4--3--211-3
4--4-1262-4
3---35-2---
-30-03---21
-11---13130
-1313--3-1-
-4-1-3-3-41

Generation = 12, Population = 55.
532--1-31--
---5-7-53-1
-5-6512--0-
-----------
4--55---3--
-5164--623-
-11--754---
-3---3---2-
-3--3235--0
4--3-113--1
-623-31--43

Generation = 14, Population = 72.
7--3-3--1-4
-0-7--6532-
---6--422--
-51-16---21
411553-2-33
4-3841-6--6
-3-0--5--11
130-032-421
--32525----
4-4553-3--1
382313-4-63

Generation = 16, Population = 47.
-345----3-4
--57-7673--
--4---44--2
-5---6---2-
----5-34---
65-86--8-56
5--2487--1-
-----------
-4-45---2--
6-65-5-5---
3---3--63--

Generation = 18, Population = 72.
8---54-3---
1--7-9893-1
6567534420-
351-166-521
5--6--545-5
6--8-14+3-8
7---68-4---
-50-05---41
-45---55241
-3855--7-1-
-9-4-3-6-83

Generation = 20, Population = 55.
+55--4-54--
---9-+-93-1
-7-9734--0-
-----------
5--86---7--
-74+8--+35-
-42--+96---
-5---5---4-
-6--6277--1
8--7-517--3
-+46-31--85

*** Life<FredkinCell> 9x3 ***

Generation = 0, Population = 11.
00-
---
---
-00
-0-
-00
0--
-00
--0

Generation = 1, Population = 15.
110
00-
-00
0-1
0-0
--1
-0-
-1-
--1

Generation = 2, Population = 14.
-21
-10
0--
10-
1--
0-2
01-
02-
---

Generation = 3, Population = 13.
1--
---
100
211
--0
-0-
1--
--0
00-

Generation = 4, Population = 12.
-2-
-10
-1-
-22
101
---
--0
---
11-

Generation = 5, Population = 19.
13-
021
1-0
-3-
21-
00-
-1-
020
221

Generation = 6, Population = 12.
---
13-
2-1
24-
-21
-12
1--
---
-3-

Generation = 7, Population = 10.
13-
-4-
---
--2
-3-
---
--0
02-
2-1

Generation = 8, Population = 14.
2-1
-51
-11
---
2--
-12
1--
-30
33-

Generation = 9, Population = 15.
-32
--2
2--
242
--1
023
-1-
0-1
4--

Generation = 10, Population = 16.
24-
1-3
3--
---
-3-
13-
120
13-
531

*** Life<FredkinCell> 12x6 ***

Generation = 0, Population = 23.
--00-0
-00-0-
0-0---
--0--0
---0-0
--0---
0---0-
------
---00-
-000--
0--0--
-0----

Generation = 1, Population = 36.
---10-
-110--
-0-000
001-01
--0--1
00--00
-000-0
0--0--
-0--10
-1-1--
-0-10-
--00--

Generation = 2, Population = 41.
-0--10
0--100
----1-
11-0-2
-0100-
1-0-11
0---01
-0-1--
-10021
0--200
010210
--1---

Generation = 3, Population = 38.
--0---
--12--
-0-020
2-11--
0-21-1
20102-
1-0---
-1020-
----3-
1103-1
--132-
0-2-00

Generation = 4, Population = 31.
-01---
-----0
---1-1
31-2--
-0320-
3--13-
2--0--
-21--0
0--04-
2-1---
--24-0
--30-1

*** Life<FredkinCell> 3x9 ***

Generation = 0, Population = 3.
---------
---------
-0----0-0

Generation = 5, Population = 11.
---------
-00-000-0
011-3-1--

*** Life<FredkinCell> 7x5 ***

Generation = 0, Population = 10.
0---0
-----
----0
--0--
-0---
00-0-
-0--0

Generation = 13, Population = 14.
1--22
-33-3
-----
5-43-
05--2
--4-5
-----

*** Life<FredkinCell> 11x12 ***

Generation = 0, Population = 5.
-----0------
------------
------------
-0----0-----
------------
------------
-----------0
------------
------------
------------
-0----------

Generation = 7, Population = 59.
020--1------
02100-0-----
-20-03-1----
-1-1-00-1---
--0-03-0--0-
-0-00-1--0-0
0-01-0--0-0-
-1011--0-0--
-1010-0-0---
0-00-0-0---0
-0--0-0---0-

Generation = 14, Population = 41.
-4-0---0----
----0-1--1-0
---0---1---1
--3-3-2121--
-4-0---0---3
12--03----11
-------0----
2-1-2------1
-------0-2-0
01---10--00-
-----------0

*** Life<FredkinCell> 8x3 ***

Generation = 0, Population = 8.
---
00-
00-
--0
--0
-0-
--0
---

Generation = 9, Population = 7.
---
3--
--1
---
--3
2--
22-
--1

*** Life<FredkinCell> 3x4 ***

Generation = 0, Population = 4.
0-0-
--0-
---0

Generation = 7, Population = 9.
32-1
203-
111-

Generation = 14, Population = 6.
4--4
5---
121-

*** Life<FredkinCell> 10x9 ***

Generation = 0, Population = 22.
----0---0
------0--
00-----0-
---0-0-0-
0-----0--
0---0-0--
-----0--0
-000--00-
---------
-------0-

Generation = 2, Population = 49.
000-0--1-
---011-01
--11010-1
01-00--2-
-10-10-0-
210-01--1
1--1---00
-2-21-220
-----0--0
-000-01--

*** Life<FredkinCell> 8x11 ***

Generation = 0, Population = 35.
000-0-0--00
---0-0---00
-00-----0-0
-0--0--000-
---00-00-0-
0-----0--00
-0-0-------
-----000--0

Generation = 5, Population = 50.
2-3-0022-1-
2---110-1--
03-22---5-2
22112--3--1
-4-5--3-2-0
---122212-2
-311-4-2-21
-0-42-030--

*** Life<FredkinCell> 4x6 ***

Generation = 0, Population = 4.
--0---
------
-00---
---0--

Generation = 10, Population = 8.
47--02
-----1
---11-
-2----

*** Life<FredkinCell> 12x10 ***

Generation = 0, Population = 9.
----------
-----0-0--
------0---
----------
-0--------
----------
-0--------
----------
-----0----
-----0--0-
----------
---------0

Generation = 7, Population = 57.
--2-1--0--
------0-0-
-02-10--00
--0-0100-0
--2--1-00-
-000----10
01002--1--
02001-0---
-001-2--0-
-22-11---2
-1-1-20---
0-0-1--5-2

Generation = 14, Population = 59.
-53220---0
-21--1112-
4--1-22---
02---31-53
-0-----1-0
12--22-1--
03-0--3---
-5---2-0--
1-0-1-2-14
67--63-5-3
0--2--221-
341----8-2

*** Life<FredkinCell> 4x12 ***

Generation = 0, Population = 9.
---0-0---0--
------0---0-
0----0------
0-------0---

Generation = 1, Population = 17.
--0-----0---
0--0-0-0---0
10--0---0-0-
10---0-0-0--

Generation = 2, Population = 15.
00---0---0-0
1---0---0---
2-0--0-0-0--
--0-----0---

Generation = 3, Population = 17.
-10---0-----
--00-0---0-0
3-10------0-
1010-0------

Generation = 4, Population = 17.
02-----0-0-0
1-1-----0-0-
40210-------
--2---0---0-

Generation = 5, Population = 18.
-3----0-0-0-
--2-0----0--
----100-0---
1-3-00-0-0-0

Generation = 6, Population = 17.
0---00---0-0
----1---0---
4--12110-0-0
------0-0---

Generation = 7, Population = 19.
-3-0-10-----
-----00--0--
-0223-21----
1--00-10---0

Generation = 8, Population = 16.
0------0-0--
--2---1-0-0-
-1-3-13-00-0
--------0-0-

Generation = 9, Population = 19.
-30-----0---
1-----201---
4-2--2--11--
-0-0-01010--

Generation = 10, Population = 20.
-410--0-10--
2-----3-2---
51--33312-0-
--3-----2-0-

Generation = 11, Population = 29.
-5-1011--10-
30201--0--0-
-2-34-4-3-10
1--0001-3-10

*** Life<FredkinCell> 9x12 ***

Generation = 0, Population = 26.
-0--------0-
--00------00
--0---000---
-----00--0--
-0-------0-0
----0-------
0-0----0----
-------0-0--
0-0---0-0---

Generation = 7, Population = 49.
2--20-0-04-0
-0-220-0----
--2-1----00-
1110--01022-
--10-----41-
-0-11---42-2
1-11-0-11--5
-22---250-2-
-----2------

Generation = 14, Population = 46.
3-5-----5--1
12---34033--
-27-------3-
-2--0---13-3
--174---5-42
40----04--2-
--134-71-10-
05--16--2---
---11--5-4--

*** Life<FredkinCell> 11x8 ***

Generation = 0, Population = 18.
0--0-0--
-0--0--0
-------0
--0-----
-0---0--
--------
--0-----
0------0
-------0
-0---0--
-0-----0

Generation = 16, Population = 31.
43-4-7--
-336--16
--------
4-2-3---
-2-----3
----84-4
---983-7
--7--3--
6-35---6
-3--2---
-4-4----

*** Life<FredkinCell> 12x7 ***

Generation = 0, Population = 19.
-0-0---
-------
--00--0
---0---
-00----
-----0-
---0---
0------
---0-0-
--0--0-
-00-0--
------0

Generation = 13, Population = 34.
-14---5
20-3---
4---283
-3--3-1
--6--2-
2--0-1-
----8--
21132--
2-----4
313----
525--33
-------

*** Life<FredkinCell> 11x7 ***

Generation = 0, Population = 13.
-----0-
0--0-0-
-------
----0--
-------
----0--
--0-0--
-0-----
-000---
------0
-------

Generation = 5, Population = 41.
-2-20-0
3223---
-01022-
1-0112-
-----1-
-0-2-11
-0-03--
-2022--
4------
01--0-1
0-03100

*** Life<FredkinCell> 4x12 ***

Generation = 0, Population = 14.
---0-0-----0
-------000-0
--00----00--
------00--0-

Generation = 12, Population = 24.
-----21-5202
-710-1-3--5-
---44-372---
-514-4-65-1-

*** Life<FredkinCell> 11x9 ***

Generation = 0, Population = 27.
-0----0--
---0-----
--0-----0
-0-0-----
0--0--0--
-----0--0
00-----0-
-0---0---
-0--0-0-0
--------0
00--0-0-0

Generation = 6, Population = 51.
--15----1
-1-2--0-3
01012--21
-1--1-00-
0--23----
--0-3--1-
-2--222--
---1---31
0-5-13-12
-11-02001
22-3201-4

Generation = 12, Population = 46.
43462-2--
1-04---24
4313-01-2
---1---2-
-1-6-00-0
-----5--5
3-3-3263-
-----3-4-
--75-72--
2-1----3-
62-64----

*** Life<FredkinCell> 9x9 ***

Generation = 0, Population = 31.
---0-----
--0-00--0
-000-0-0-
------000
--00---0-
-----0---
00---0-00
0000-0---
000---0--

Generation = 2, Population = 39.
--0----0-
0-202-1--
122-1----
--0--02-2
-1221---0
111--21-1
-001-0--2
-02-0--1-
---0-001-

Generation = 4, Population = 33.
-1---0-0-
-14------
-2----011
11--12404
-12------
-13-02--1
0-0------
-0-10---0
--001-0--

Generation = 6, Population = 42.
------001
-3-1-1201
--313-03-
3------24
-3232-120
--50243-1
-122--0--
---10----
-12211--1

Generation = 8, Population = 47.
--11-00-1
23--3-2-1
2--35-0-2
32--22644
0-452--4-
-27-44--3
13-4--224
-0-30---1
132---12-

Generation = 10, Population = 33.
-2331-01-
-5-3-3201
-3----052
--0-4-86-
------16-
--70464-5
3-4------
---32----
-----3---

Generation = 12, Population = 42.
12--3-0--
-56------
-54--12--
43--42+84
144-3036-
33---64--
--6-0242-
-0-54---2
2-34-3-3-

*** Life<FredkinCell> 5x5 ***

Generation = 0, Population = 4.
-----
-----
--0--
00---
-0---

Generation = 1, Population = 6.
-----
--0--
0--0-
1----
-10--

Generation = 2, Population = 12.
--0--
00---
10--0
2-00-
-210-

Generation = 3, Population = 8.
0--0-
----0
2----
3----
-32-0

Generation = 4, Population = 10.
-00--
-----
30--0
4-0-0
-43--

Generation = 5, Population = 16.
0110-
0-0-0
-1-01
5-1-1
-5-00

*** Life<FredkinCell> 7x5 ***

Generation = 0, Population = 8.
-0-0-
-----
0----
--0--
--0--
-0--0
--0--

Generation = 3, Population = 14.
-00--
-----
--0-0
---00
0--02
0--21
-0--2

Generation = 6, Population = 18.
33-2-
0-01-
-302-
-22-1
--4--
3---2
-120-

Generation = 9, Population = 22.
3---0
-0021
03--3
4230-
--515
4-12-
1-21-

Generation = 12, Population = 17.
4614-
100--
0422-
5---1
-0-2-
-----
--3-4

Generation = 15, Population = 15.
-9474
4--42
-----
6-70-
4-62-
-----
-4-2-

Generation = 18, Population = 18.
--4-5
4---3
-7347
-58-1
--7-9
8-45-
5---4

*** Life<FredkinCell> 5x4 ***

Generation = 0, Population = 5.
---0
-00-
-0--
--0-
----

Generation = 1, Population = 8.
-0--
0-1-
010-
---0
--0-

Generation = 2, Population = 7.
----
1-20
----
000-
-0--

Generation = 3, Population = 12.
0-00
--31
-1-0
1110
-1--

Generation = 4, Population = 6.
----
1--2
-2--
2---
-2-0

Generation = 5, Population = 8.
0--0
--3-
0-00
-1-0
----

Generation = 6, Population = 9.
-0--
-042
-2--
--11
-2-0

Generation = 7, Population = 14.
01-0
11-3
030-
-12-
0-01

*** Life<FredkinCell> 10x3 ***

Generation = 0, Population = 8.
--0
0--
---
-0-
-00
0--
---
-00
---
---

Generation = 3, Population = 16.
2-0
-22
-2-
010
1--
1--
-2-
--3
-0-
011

*** Life<FredkinCell> 7x9 ***

Generation = 0, Population = 16.
--0------
---0--0--
----00-0-
--------0
0000-0---
0---00---
---0-----

Generation = 3, Population = 35.
-0-0-1--0
01001----
-11--121-
200--1---
01-3-100-
3-02102-1
2-----000

Generation = 6, Population = 32.
-32-0----
-1-34-20-
02-01-3-0
211---211
11----1--
40--11-1-
--322--0-

Generation = 9, Population = 28.
0---31---
---------
054-124--
--4121-1-
-4-53344-
4-34---2-
-1--200--

Generation = 12, Population = 36.
1-4--2010
-1---1-3-
3-42135--
4-4-3-4--
350-64-72
-145---53
--5350-2-

Generation = 15, Population = 31.
145--3-2-
--537-3-0
4-4-46--2
425--3---
---677--3
-25613---
--64--3--

*** Life<FredkinCell> 4x8 ***

Generation = 0, Population = 6.
-0--0---
-0--0---
------0-
-----0--

Generation = 13, Population = 21.
1-2345-2
313-7245
-8723---
-5---331

*** Life<FredkinCell> 7x4 ***

Generation = 0, Population = 8.
0--0
----
----
0---
--0-
00--
-00-

Generation = 8, Population = 12.
2430
----
----
3-5-
1---
3-22
3--4

Generation = 16, Population = 12.
-45-
----
----
--8-
1-2-
-255
7865

*** Life<FredkinCell> 4x10 ***

Generation = 0, Population = 5.
---0------
0---------
-0--------
----0-0---

Generation = 12, Population = 12.
-0-0-0-0-0
0-0-0-----
---0-----0
------0-0-
