*** Life<Cell> 17x20 ***

Generation = 0, Population = 13.
---------0----------
--------------------
--------------------
--------------------
-------00-----------
-----------0--------
--------------------
--------------------
---------0--------0-
------------------0-
---------------0----
-0------------------
--------------------
-----------0--------
--------------------
-0------------------
---0------------0---

Generation = 3, Population = 117.
------0-----0-------
--------0--0--------
------01-100--------
-----0000---0-------
----01*11-1--0------
-----000----0-0---0-
------01--00-0---010
--------00010--000*0
-0----0-0-010-01-01-
0-0----0-0-0-0--1-1-
-0-0----0-000-0--1-0
--0-0----00-00-0--10
---0-----0-0-00-0-0-
---0----0-0-0-000---
--010----0-0-0-0-0--
-00-00----0-0-0---0-
0--1--0----0-0-----0

Generation = 6, Population = 108.
---0--0-*-01-0-0----
---------1---1------
---000--1.--00----0-
-------0---1---0--1-
-01-.**---*--1010---
-0---0---0---0--11.-
---000-*0--00-1--0*-
---0---1------11-0*0
---0-00*.10-1----1.-
-0---1------0-----*-
---0-1-00-----1-01-1
---1----------00----
-0-1-1-1------00--.1
-0---0---1---0-.11--
-1-.-1-1-0--001-*1--
---------------1--0-
---1-1-0-00-0-000---

Generation = 9, Population = 136.
0-0-----.--.0---01-0
-0-----0010.0--0--*0
-0--010**.00--0-0-1-
--0-*--00-------0-.-
--**...-1-.*1-0.1010
0-0----.-01-0--1--*-
-0-00-1..1-1--.1-*.-
0100---11-0---1.--.*
0*-.001....1.1*.**.*
-0---1-1*-*0-0*0*0.-
-00.-.-*-00---.0..1-
0-010-0---0------0--
-1-.0.-**-------**.*
--0-0--00.----0*1-.-
-.-.0.0--1----.-.-1-
0.0-0*0--100---*----
-1---1-01*--0-1..--0

*** Life<Cell> 18x13 ***

Generation = 0, Population = 15.
-------0-----
---------0---
-----0----0--
--0----------
-----0-------
0----------0-
-------------
--------0----
-----0-------
-------------
-----------0-
--0----------
-------------
-------------
--0------0---
0------------
-------------
-------------

Generation = 3, Population = 86.
--0---01-*1--
-0---00*-0---
----0-0----0-
---0-0-0--0--
0-0-0----0---
-0-0-0--11---
------0-0000-
-0-0-0---01-0
0---0------10
-0---0-----0-
0-0---0---0--
-000-------0-
-0*00---0---0
1-*00--0-0---
-0-0-00-0-0-0
1-*00--0-0-0-
-010----0-0--
-00------0---

*** Life<Cell> 20x19 ***

Generation = 0, Population = 12.
---------------0---
-------------------
-------------------
------0------------
---------------0---
-------------------
0------------------
-0--0---------0----
-------------------
----0------0-------
-------------------
-------------------
------------------0
-------------------
-------------------
-------------------
-------------------
--------------0----
---------0---------
-------------------

Generation = 3, Population = 98.
------0-----0-----0
-----0-0-----0-0-0-
----0-0-0----------
0--0-0-0-0---0---0-
------0-0---0---0-0
0--0---0---------0-
-01--------00------
-0--1--0--0110---0-
---0-----0-0000-0--
-11----00-0-0110--0
-00---0--0-0-00--0-
---0-0----0-0---0--
----0------0---0---
----------------0--
--------------0--0-
---------0---0-0--0
--------0-0-0-0-0--
-------0-0---0-0-0-
------0-0-0---0-0--
-------0---0-0-0---

*** Life<Cell> 16x14 ***

Generation = 0, Population = 19.
0-0------0----
---0-----0----
------0-------
-------0------
----------0---
-------0------
--------------
----------0---
00---0--------
------0--0----
--------------
--------------
------------0-
-------------0
----------0---
-0------------

Generation = 2, Population = 56.
0---0-00-*-0--
-0---0-----0--
0-0-0---010---
---0-0-0------
------0-0---0-
-----0-0-01---
00---0----1---
------0001--0-
*-1----0------
----0--11-10--
00---0------0-
------0--0---0
--------------
-0---------0-0
--------0-----
-0-0---------0

Generation = 4, Population = 51.
0-0-01---.0--0
---0-0---1---0
0--------1*---
---0------10--
-00--10--0----
------1----1--
------0---.---
------**-.----
.-1-10---11-1-
--1--0-1.-.---
----------1---
-1--------1---
01---0--0---0-
-0----0----0--
------0---0---
-0---0-------0

Generation = 6, Population = 102.
--01-1*10*-*1-
-0---*---*11-*
-10-0-00*1.001
-1-0--1-0--*1-
-----.0-1000--
---00-110**1-0
-1------00.-0-
--1-10**-.10--
.-.0*-0--..01-
01.10*01.1.1--
1*1-0---01.-0-
-.10-1001-.11-
*.1----1------
---000--100---
00--00--0-----
-----000------

Generation = 8, Population = 88.
0--*11.1-*-**-
-*-10*1--*-.-*
1.---1-0*1*-*-
-.---1-101-.10
--1-1*0-.*-*0-
---*----0*.1--
----0-0100*-0-
00111-.*-.*-1-
.-.0.-0-0*.-.1
-1.-0***....10
-.1---0-01.1*-
-*.*-.---0..-1
.*.-1--*--1-1-
-----0----*---
--1-------1---
-----00---0---

*** Life<Cell> 10x14 ***

Generation = 0, Population = 13.
--------------
------0-------
-----00-0-0---
--------------
--------------
--------------
--0-0---------
-------0-----0
------0----0--
------0--0----

Generation = 3, Population = 51.
-----1*-1--0--
----1---*0--0-
--01---1-0---0
--00----0---0-
-0--1--0---0-0
0----0----000-
------00--010-
0----110000*-1
-0-000-0--0-0-
--00--.------1

*** Life<Cell> 20x14 ***

Generation = 0, Population = 10.
---------0----
--------------
--------------
--------------
--------------
--------------
--------------
--------------
--------------
----------0---
00---------0--
--------------
--0-----0-----
--------------
--------------
--0-----------
------0-------
--------------
--------------
-------0------

Generation = 2, Population = 35.
-------0-0-0--
--------------
---------0----
--------------
--------------
--------------
--------------
----------0---
00---------0--
--------0---0-
*--0----00---0
----------0---
-1--0-0---00--
--1-----------
--1---0-0-----
0---0---------
----0---0-----
--0----0------
------0-------
-----0-0-0----

*** Life<Cell> 19x12 ***

Generation = 0, Population = 12.
-------0----
---------0--
--------0---
------------
------------
------------
------------
--0---------
-----00-0---
------------
-----0------
------------
0-----------
--0-0-------
------------
------------
------------
---------0--
------------

*** Life<Cell> 14x19 ***

Generation = 0, Population = 15.
---0---------------
------0-------0----
-------------------
-------------------
-------------------
---------0---------
-------------------
------0------------
---0-0-------------
-----0------------0
-------------0-----
--0-------------0--
-------0-----------
-------0------0----

*** Life<Cell> 16x12 ***

Generation = 0, Population = 15.
------------
-0---00-----
------------
------------
------0-----
-00---------
-0-----0-0--
-0-0--------
------------
------------
--------0---
------------
----------0-
------00----
------------
------------

Generation = 1, Population = 50.
-0---00-----
0-0-0110----
-0---00-----
------0-----
-00--0-0----
0-10--00-0--
0--0--0---0-
01--0--0-0--
-0-0--------
--------0---
-------0-0--
--------0-0-
------00-0-0
-----0110-0-
------00----
------------

Generation = 2, Population = 40.
------------
----1--10---
------1-----
--0--01-----
-1--0--100--
10--0-------
---1-010-0-0
--00-0------
-1-----000--
-0-0--------
------0-----
------00----
------------
----01--10--
----------0-
------00----

Generation = 3, Population = 82.
----0--00---
---0-1-*10--
--0-0-*-0---
---0-1--00--
-*-01--*-10-
*-1-1-0-0--0
00-*0--1----
--1--1--0--0
0*---001-10-
01--0-0000--
-0-0-01-----
-----0-10---
----000000--
---01*11*1--
----00000--0
-----0110-0-

Generation = 4, Population = 41.
------0-----
------1.-10-
-0----*0-0--
-0-1--------
-*0----*--1-
*-----------
-1-.----0---
-1---*-0----
-.----1---1-
-*0---11----
-1--0--0-0--
-0-0--------
------1---0-
--01-.--.-00
--------1---
------**----

*** Life<Cell> 16x19 ***

Generation = 0, Population = 18.
-------------------
--0----------------
-----------0-------
-----------0-------
------------0---000
-------------------
-------------------
-------------0-----
-----0-0---------0-
0------------------
-------------------
--------------0----
------0------------
------0--0--------0
-----------0-------
-------------------

Generation = 3, Population = 120.
0---0-----010------
-0-0-0---00*-0--000
0-0-0---010-*-001-1
-0-0----01-1-100-00
--0-------1-0-0*.0-
-----0-0---10-00--0
0---0---0--0-------
-0-0-----00---01--0
----------00-0-10--
------0--0--011--0-
--0-011100--000----
-0--0-*---0--0-0-0-
0--0101-1-01--0----
---010-*--0*0------
----00*--*000---0--
-----010010--0---0-

Generation = 6, Population = 140.
-------0-0-**1---0*
--0----00-0*10-11--
-------*11--*-1.10-
-----11--1-1-.11-01
---0-00--1--.-..*.*
--0-0--1-0-*-1-1-01
-0-0-0000--.-01-11-
0---0-10-.-000-*--0
-0-001-1100--*-*1--
0-0---.11.1--*1-11-
-010-1*1--001---000
0---01.101.01110---
1--1*.-**1-*0------
--*1*.-.-1..1*-10-0
--1---.-1.-1-------
0-0-01*-1*1101--0--

*** Life<Cell> 11x18 ***

Generation = 0, Population = 12.
------------------
0-----------00----
------------------
----------0------0
------------------
------------------
-----0------------
-----------------0
------------------
--0--0-0-----0----
---------------0--

Generation = 1, Population = 42.
0-----------00----
-0---------0110---
0---------0-00---0
---------0-0----0-
----------0------0
-----0------------
----0-0----------0
-----0----------0-
--0--0-0-----0---0
-0-00---0---0-00--
--0--0-0-----00-0-

Generation = 2, Population = 35.
------------------
0-0--------1--10-0
------------------
0-------0----0-0-0
-----0------------
----------0-------
---0---0----------
--0--1-0-----0-0-0
-----1---------0--
0--110-0-0-0---1-0
-------------1-0-0

Generation = 3, Population = 77.
0-0--------0--00-0
---0------0-11*1--
--0-----0--0-00---
-0---0-0-0--0-----
0---0-0-0-0--0-0-0
---0-0-0-0-0------
----00010-0--0-0-0
-0--0*-10---0--1--
0-00--0--0-0-00-0-
-00*--------000--1
0--000-0-0-00--1-1

Generation = 4, Population = 40.
------------------
0-0-0---00--**.-00
-----0------------
------0------000-0
------------------
0-0--1-1----0-----
-0-------0-----1--
-----.----0--0-*-0
---------------0--
011.-000---0-1---*
-----1-----1-----*

*** Life<Cell> 13x11 ***

Generation = 0, Population = 11.
--------0--
-----------
0----------
-----------
-----------
--------0--
-----------
------0----
----------0
-0-0----0--
-----------
--0------0-
-------0---

Generation = 1, Population = 38.
-------0-0-
0-------0--
-0---------
0----------
--------0--
-------0-0-
------0-0--
-----0-0--0
-0-0--0-00-
0---0--0-00
-000----00-
-0-0---00-0
--0---0-00-

Generation = 2, Population = 34.
0-----0-0-0
-----------
0-0-----0--
--------0--
0----------
----------0
----------0
-0-00---0--
--------1-0
-000-0---11
-------0--0
01-10--11--
-----0-0-1-

Generation = 3, Population = 67.
-0---0-----
--0---0---0
---0---010-
--0----010-
-0------0-0
0--------01
-0-00---001
0--110-010-
--0-00-0*01
01-1--00-**
0-0-0001--1
1*-*1-0**-0
00-0---10-0

Generation = 4, Population = 31.
0---0-----0
--------0--
--0-0---*--
------0----
--------1-1
-0-00---0-*
0----------
---------10
------01.--
-*--00-10..
-------*---
*.0.-0-..--
---1------1

Generation = 5, Population = 69.
-0-0-0--00-
0-0----0100
-0---000.0-
--0-00-0--0
-0-00-00*-*
---110-01-.
---00---00-
0-----001*1
-0--0-1-.01
0.01110*1..
000-0-0*---
..-.1-0..-0
0---00---1-

*** Life<Cell> 18x16 ***

Generation = 0, Population = 15.
----------------
--------0----0-0
--0-------------
----------0-----
--------0-------
----------------
----------------
-0---0----------
----------------
0---------------
----------------
-----------0----
-0--------------
----------------
----------------
--0-------------
-------0--0---0-
----------------

Generation = 1, Population = 56.
--------0----0-0
--0----0-0--0---
-0-0----0-0--0-0
--0-----00-0----
-------0-00-----
--------0-------
-0---0----------
0-0-0-0---------
00---0----------
-0--------------
0----------0----
-0--------0-0---
0-0--------0----
-0--------------
--0-------------
-0-0---0--0---0-
--0---0-00-0-0-0
-------0--0---0-

Generation = 2, Population = 41.
--0-------------
------0----0-0--
0---0---1-------
------------00-0
--0---0---1-----
-0---0----0-----
--------0-------
1------0--------
----------------
010--0-----0----
-0--------------
0--------0---0--
---0------------
--0--------0----
-0-----0--0---0-
0---0-----------
-----0--11------
--0-------------

Generation = 3, Population = 108.
-0-0--0----0-0--
0-0-00-00-0---0-
-0-0-000-0-00--0
0-0-0-0-0-0011--
---0---0-0*000-0
0---0---0010----
00---0---00-----
-0----0---------
-00--0-0---0----
1*100-0---0-0---
01---0---0-0-0--
---0----0-0-0-0-
0---0----0-0-0--
-------0----0-0-
----0-0-00---0-0
---0---0000---0-
0-0---00**0-----
-0-0-0--00------

*** Life<Cell> 20x16 ***

Generation = 0, Population = 11.
----------------
----------------
----------------
---------00-----
----------0--0-0
----------------
-----------0----
--0-------------
----------------
------0-0---0---
----------------
----------------
----------------
----------------
----------------
--0-------------
----------------
----------------
----------------
----------------

Generation = 1, Population = 35.
----------------
----------------
---------00-----
--------01-0-0-0
----------100---
----------00-0-0
--0-------0-0---
-0-0-------0----
--0---0-0---0---
-----0---0-0-0--
------0-0---0---
----------------
----------------
----------------
--0-------------
-0-0------------
--0-------------
----------------
----------------
----------------

Generation = 2, Population = 36.
----------------
---------00-----
----------1--0-0
-------01--10---
--------0---10--
--0------01-----
---------01----0
0---0-0-0---0---
-----------0----
--0-0-0-0-----0-
----------------
------0-0---0---
----------------
--0-------------
----------------
0---0-----------
----------------
--0-------------
----------------
----------------

Generation = 3, Population = 74.
---------00-----
--------01-0-0-0
-------00-*-----
------01-1-*-0-0
--0-----1-1--10-
-0-0-------000-0
0-0-0-0----00-0-
-0-0------0--0-0
0-0-------0---0-
-0-------0-0-0-0
--0-0-------0-0-
-----0---0-0-0--
--0---0-0---0---
-0-0------------
0-0-0-----------
-0-0-0----------
0-0-0-----------
-0-0------------
--0-------------
----------------

Generation = 4, Population = 40.
----------1--0-0
----------------
----------.0----
--0--01----*-10-
------0--0-0-*10
------0-0---1---
-------0-------0
0-----0--01-----
----------1--0-0
--0-0---0-0-0---
-----------0----
----------------
----------------
------0-0---0---
----------------
0-----0---------
----------------
----------------
----------------
--0-------------

Generation = 5, Population = 78.
---------0-00---
----------00-0-0
--0--00---.1000-
-0-001-1-10*----
--0----0---11.*1
-----010------0-
0-----0--01-0-0-
-0---0--01-0-0--
0-0-0-0-0--0----
-0---0-0--10---0
--0-0---0-------
-----------0----
------0-0---0---
-----0---0-0-0--
0-------0---0---
-0---0-0--------
0-----0---------
----------------
--0-------------
-0-0------------

Generation = 6, Population = 90.
--------0-1-1--0
--0--00---11-10-
------1--0.*-11-
0--1--1*-*-.01-0
----0---10--****
0-0-01*-0010-0--
-----01---*0-010
0-----00--110---
-------01---00-0
--0-0-0-00*-0-0-
---------00----0
--0-0-0---0-----
-----------0----
0---0---0-----0-
----------------
0-0-0-0-----0---
----------------
0-0---0---------
----------------
0-0-0-----------

Generation = 7, Population = 103.
--0--000--*0----
-0-001-00---0---
0-00----01.*0*--
-00--1-*1*0*-*-1
--0-1----1--...*
-----**--1*-1-0-
--0---*-0-.10--1
-0-------1-*-00-
0-0-0-0-----110-
-0-----0-1*-10-0
----------100---
-0-----0--1----0
0-0---0-0---0-0-
-0-0-0-0-0-0-0-0
--0---0-0---0-0-
-------0---0-0--
----0-------0---
---0-0-0--------
----0-0---------
-----0----------

Generation = 8, Population = 64.
---------0.1----
------0---111---
-------01-..1*10
-11----**.-*0*-*
--1--000--11**.*
-----**0--*0*--0
---0--*--0.---1-
--0-0------*----
----------1-----
----0----**0*-0-
----------*-----
---------0*-----
----------0--0-0
----------------
-----------0----
--0-0-----0-----
----------------
--0---0-0---0---
----------------
----------------

*** Life<Cell> 10x16 ***

Generation = 0, Population = 18.
------00----0--0
----------------
------0---0----0
-0------------00
-0---0----------
----------------
----0-----0-----
00--------------
--------------0-
-0--------------

Generation = 1, Population = 53.
-----0110--0-00-
-------0--0-0---
-0---0-0-0-0---1
010--00---0--01-
010-0-0-------00
-0--00----0-----
00-0-0---0-0----
110-0-----0---0-
0------------0-0
0-0-----------0-

Generation = 2, Population = 45.
----01-*10--0110
-0------------00
-1--0101-----0--
---0--------01-0
----1-10-------1
0-------------00
-10--10-0---0-0-
**10------------
----0-----0-0---
1--0------------

Generation = 3, Population = 69.
-0-01*-.-1001-*-
010---0-00--00--
0*0-1--*0----1--
-10-00-----01--1
0-----*10---00--
--0-00-00---00--
0---0*1--0-0--1-
*.*1-00-0-0---0-
-000-0---0---0--
-00-------0-0---

Generation = 4, Population = 43.
-101-*-.-----1.0
-------0--------
-.1-*--*---00*01
0----1----01-11-
-----0.*-0--1-01
-0--------------
11---.--0-0---*0
*..-01--------10
-----1----0-----
1----0----------

Generation = 5, Population = 65.
0*-*-.1.----1-.-
-1-000010--00-0-
0.--.-0.0----.1*
-10--*0---1---*1
01--11*.-----0-*
-10--0-0000-0---
--0-0.-0---0-0*-
**.11-0-0----0--
------0--0-0--00
-0--010---0-----

Generation = 6, Population = 83.
1*-*-.*.1---*1.-
0*-------001--1-
-.10.1-.10000.*.
0-10-.1000-1--.*
1*00*-..00----0*
---0010---10-000
11101.-100--0-*0
.***--10----0110
0--0---0--0-0-11
1-001--0------00

Generation = 7, Population = 72.
-*-.1...--0-**.-
-.---00-0-1-0-*0
-.--*--.--1-1***
11*1-**--11*--.*
-.1-.-..-------.
--01--1--0*101-1
***--.1--1--1-.1
....-1*1-0001--1
1-0-----00--10**
*-11*1010-0-00--

Generation = 8, Population = 77.
1.0.-*..111-***0
-.--011-------.-
0*1-*1-*1--0-...
*-**0*.00***-1.*
1.-0*1*.----10-.
0-1*01*00-*-1*-*
.**--.--0-00--.-
*.*.1***01--*---
*-1-0--0--0-*1.*
.---*----0-----0

Generation = 9, Population = 73.
-.-.-**.*-*-.**1
-.-0--*--01100*0
-.-0.*0.---11...
*1..-..-1***1**.
-.11.-..-0---10.
11-.1*.---*1-*-.
*..--.-1-1-110.1
*.*.-**.1*0-*--1
.-*----1-0--***.
.-11.1-10---0001

*** Life<Cell> 10x11 ***

Generation = 0, Population = 12.
-------0---
-----------
-------0--0
---0-------
-0---0-----
-------0---
---0--0----
0----------
-----------
----0-0----

Generation = 2, Population = 31.
-----0---00
---0-------
-0-----0110
-1---1-1---
---1--1---0
0--1-1---0-
----1---0--
0-0-0-10---
---0--1----
0-0-----0--

Generation = 4, Population = 25.
-0-1-0-0--*
-------1---
-------01--
1.-----*---
---.-1-0-0-
---.1-0----
--1-.------
--01--1----
-0---1.----
--0----10-0

Generation = 6, Population = 48.
---1-0-*-*.
0----1-1-0-
---0-01*.--
-.--0*-.01-
-00.-1--00-
0-1.1--00--
01*-*0-0-0-
000.-0-*--0
--1--1.----
0--1011.-00

Generation = 8, Population = 52.
-0-1---.-..
0-001---0*1
-11-1*1..1-
1.1--.0*011
---.1.---01
*0-*.*-00--
-.*0*-001--
---*1--*1--
-0.--1*--1-
0-0.-.*****

Generation = 10, Population = 49.
-01*0-0.-.*
000-111-*.*
1*.11.1..-*
1..11.-*--1
0--.-*-1-01
.*-*..10---
*..-.-*-.1-
-*-.-0*.---
-0*1-*.-1.-
0--.0*....*

*** Life<Cell> 15x18 ***

Generation = 0, Population = 16.
------------------
------------------
------------------
------------------
-----------0------
-------------0----
----------------0-
---------0--------
----------------0-
---0--------------
-------0----0---0-
------------------
--0-------0-------
----0-----------0-
-0-0---------0----

Generation = 2, Population = 45.
------------------
------------------
-----------0------
-------------0----
---------0---1--0-
---------0-1---0--
-----------0--0-0-
---0---0---0-0----
-------0----0-0---
-0---0---0--------
--0--0---0------0-
---00-----------1-
01-11--00----0--1-
--1---0-------0---
--0--0----00-0-0--

Generation = 4, Population = 46.
-----------0------
-------------0----
----------------0-
---------1--------
-------0-----.-00-
---0-----*-.-----0
-------1----------
-----0-------0----
--0-------000---0-
----1--1-----0--1-
-0------1--000--*-
---------1--------
*.-1---------00-.-
1-.01---1---0-----
-1*--0---1*-0---10

Generation = 6, Population = 96.
---------0-0-1--0-
---------0-1---0--
-------0---0--010-
---0---1-1-0-1---0
-----0-0-1---.1-*0
-0-----0-.-.-0-1-0
--0--1-1-1000--0--
----1----0-*-0-010
01--1--*-1*0----*-
--1---1----0-*111-
1-1---0--11-0-1-.1
-1-1----0--110----
*.1*----*10-0*-1.0
.-.-.0---01---1---
-*.000--0.*--101.-

Generation = 8, Population = 81.
------------------
---0---------1----
-------*---010-.*-
---------.-*----1-
--01-----.11-*--.-
----00-01.1.-0-.--
-0-1---*01--*-----
-1--.----0-.----**
-.-1.--.0-*-*0-1*0
00.1*-.----*-..-1-
-1.00---1..-*0*0.1
-10.----*-1.--0---
**..*---..---.*1*0
*1.-.---*0.-*1.---
-..-0--1-****.***1

*** Life<Cell> 18x13 ***

Generation = 0, Population = 12.
----------0--
-------------
-------------
-------------
-----0-------
-------------
-------------
-------------
-------------
-------0-----
-------------
-------------
0--0---------
----------0--
-----0-------
---------0---
0-----0--0---
0------------

Generation = 2, Population = 37.
--------0-0-0
-------------
-----0----0--
-------------
---0---0-----
-------------
-----0-------
-------0-----
-------------
-----0---0---
0--0---------
-------0--0--
011----------
--------01--0
------10-1---
1------0--10-
*-0-01-11--0-
--0------1---

Generation = 4, Population = 41.
-----00-----0
-------------
----------0--
-------------
-0-------00--
-------1-----
-------------
-------------
0--0-1-------
---1------10-
-----1-------
---------1---
*-.-0-01-1---
1-----10----0
-0----*--.---
*----1----*--
.0-0*.0-.10--
*-*-1----11--

*** Life<Cell> 18x20 ***

Generation = 0, Population = 12.
---------0----------
-0------------------
-----0--------------
------------0-------
------0-------------
--------------------
--------------------
--------------------
--------------------
------0-------------
------------------00
---0----------0-----
--------------------
-----------0--0-----
--------------------
--------------------
--------------------
--------------------

Generation = 1, Population = 44.
-0------0-0---------
0-0--0---0----------
-0--0-0-----0-------
-----00----0-0------
-----0-0----0-------
------0-------------
--------------------
--------------------
------0-------------
-----0-0----------00
---0--0-------0--011
--0-0--------0-0--00
---0-------0--------
----------0-00-0----
-----------0--0-----
--------------------
--------------------
--------------------

Generation = 2, Population = 45.
-----0-0-0-0--------
---0--------0-------
---0--10-0----------
-0--------0---0-----
----01--0-----------
------------0-------
------0-------------
------0-------------
------------------00
---00---0-----0-----
----------------01-*
-0---00----00-0-0---
------------------00
---0-----0--110-0---
--------------------
-----------0--0-----
--------------------
--------------------

Generation = 3, Population = 125.
---00---------------
--01000------0------
-00100*1----0-0-----
0-0000000--0-0-0----
-0-01*00-00-0-0-----
----000-0--0-0------
-----010----0-------
-----010----------00
---00-0-0-----0--011
--0110-0-0---0-0000-
-0-0000-0--00--0-*-.
0-0-0110--011---1-0-
-0-0-00--0-0-0---011
--0-0---0-00*-1--000
---0-----0-000--0---
----------0-00-0----
-----------0--0-----
--------------------

Generation = 4, Population = 39.
------0------0------
-----1--------------
-1----.-------------
--------1-------0---
--0--.---11---------
-0----1-------------
-----1------------00
---0--------0-0-----
------1-------------
--1-------00--0-----
--------------01-.1.
-------1--1-------1-
--------------------
------00--1-.--0--1-
------------------00
---0----------0-----
--------------------
-----------0--0-----

Generation = 5, Population = 110.
-------0----0-0-----
-0--0--------0------
0-0--0.-0-------0---
-00----0--0----0-0--
---0-.0--**0----0---
0------0-00-------00
-0-00-------0-0--011
--0-001----0---0--00
--00-0-0--000-------
-0-1--0--011001---0-
--0----0---0-0-*0.*.
------1-00-1--00-0*0
------0--------0----
-----01100-0.-1-00*-
---0--00--0---00-0-1
--0-0--------0-0--00
---0-------0--------
----------0-00-0----

Generation = 6, Population = 123.
-0--0-0-0--0-0-0----
---1---00-------0---
--11--.--00--0------
-1---0----1---0---0-
00--1.-00..10-----00
----0-------0-0-0---
--01--10-00-----01-*
--1--1*----10---0---
----01--0-----00---1
0--*1--001*-11*-0010
------0-----01-.1...
--0--1*111-*1-1111*1
--------------01---1
---001-*-11-.1*-11*-
----------------01-*
-0---000--000-010-1-
------------------00
---0-----0-011--0---

Generation = 7, Population = 178.
0-0----0100---------
-0-*---1--00-----0--
--*-00.1-1-00---0-0-
-*-0--001-*-0--0-01-
1-00**011..*-0--00-1
000-101-000-1---1-0-
-0-*---1-11---001*-.
-0*---.-00-*100-1---
0-0-----1-00---100-*
-01*---11-.--*.0----
0-000-10--0-1-0.-...
-0-00**--*-*-0-**-*-
--000-0-0-000-1-0-1*
--01-*-.-**0.**0-*.0
-0-00-0--0-000--1--*
0-0-01-1001-1-1--0*0
-0-0-000-00--000-0-1
--0-0---0--1-*00-000

Generation = 8, Population = 81.
-0----0----------0--
---*-10--0----------
-1.-11.-0----0----10
-*-100---0*-1-0-----
*--1..-**...--0-----
-1---1---1-0--0-----
---*-1---*-------.-.
--.---.----.-----0-0
---------01-----11-.
01-.-----1*1-*.1-0-0
-----0-----0---.1...
---1-..--*-.---.*-*-
------1-----1-*-10-*
---*-.1*-..1...1-*.-
------------1-0--1-*
-----------0*-*---.1
--------------------
---0--0------*1-----

Generation = 9, Population = 144.
0-00--10-0------0-0-
--0.0--1--0--0---000
0*.1-*.1-10------0*1
-*--1-0011.--010--10
*00*.*0.*..*00-0----
--0-1*10-*--1010----
-00.-*1-0.10--0--.-.
--.0-1.---0.-----1--
00------1----0--**1.
1*1.-0--1-.--..--1--
00-00-1----111-**.*.
--0-0..-1.1.1-1.*1*-
-----0*--0----.1--1.
--0.0.-*0..-*.*-1*.-
---0--00---0*-1-1*-.
----------11*-.1-0**
---0--0----000-----1
--0-00-0----1.*0----

Generation = 10, Population = 147.
---1-0*------0-0-01-
--1.----00100-0-----
1*.--*.-0--0--000-.*
0.-1---1*-.0----0---
*11...1...**11--0-01
01-0*.-1-*-0-1*-1---
01-.-.-1-.-1--1--.-.
0-.--**--01*-00--*--
---0---0*01-0-01*.*.
*.**---1*1.11**10*1-
---1-0-0---***0*..*.
0--11.*1-*-.*0-..-*1
----01*-0-----*-10*.
-0-*-.1.1..-*.*1-.*-
-----01-----.-*0-.-.
-------1-0*-.-*-0-.*
-------------1---0-*
-0-0110-0---*.*10--0

*** Life<Cell> 11x16 ***

Generation = 0, Population = 20.
--0---0--0------
--0----0--------
-----0---0--0---
----------0-00--
----------------
----------------
--0-0-----------
0--0------------
0-0---0---------
0---------------
-----0----------

Generation = 1, Population = 45.
-010-0--0-0-----
-010-0--0---0---
--0-0-000--01---
-----0-------10-
----------0-00--
--0-0-----------
00-0-0----------
100---0---------
-----0-0--------
100--00---------
0---0-0---------

Generation = 2, Population = 55.
0-*--1001--00---
0---01---00-10--
--10--1--001--0-
--0----00-000-10
--0-00---0--1---
0--0------0-00--
----0-----------
-11--0----------
----01--0-------
--10------------
1-00-010--------

Generation = 3, Population = 65.
1-.0----*--1----
10--1-00-----1--
00-1--------1-1-
-0--00-11--1---1
00101100--0---00
-0--00-------10-
000-------0-00--
1**0010-0-------
-0--1-00-0------
10----000-------
-----1-10-------

Generation = 4, Population = 52.
*-.---0-.00-00--
*-10--11---0----
-1--001-0----0--
0--0--0-*0----1*
1--------0------
0-0----0--------
------0-00--1---
-..-1--0--0-00--
0---*11---0-----
*-1-0-----------
10--0-1--0------

Generation = 5, Population = 80.
.0.0-11-.111110-
*0*1--**-0------
0--11-*01--11--0
1-0---1-*-0---*.
-010--00-10---00
1--0--------0---
0-0-00--11-0*---
1..0*-0---1--10-
1000*-*--01000--
*0-------00-----
-1-01--10-0-----

Generation = 6, Population = 96.
*1.1-*--*-----10
*1.*--..01---100
--1-*-.1---**0--
*01000--.01-01*.
11*-11-10*-010-1
*-01-0000-0-1100
-----1-0**01*-0-
-..-.11000*00-10
*1-1*-.00-------
.1----00--1-00--
-*-1*11*1010----

Generation = 7, Population = 78.
*-.*-.10*-------
*-.*-1.*-*00--1-
-1*-.-.----*.110
*1----1-.-*-1-..
**.--*0-1.-1-1-*
*0-*01--1-1-**1-
0-000--1..-*.0-0
1..0.----1.1---1
*--**-.1---0-000
.-1----10-*0110-
1.-**-*.--*1-0--

*** Life<Cell> 15x13 ***

Generation = 0, Population = 10.
-----0-------
-------------
-------------
---0----0---0
-------------
-------0-----
0------------
--------0----
-------------
----0--------
-------------
-------------
--0----------
-------------
------------0

Generation = 2, Population = 34.
---0-0-0-----
---0----0---0
-----0-------
-0---001----0
0------------
---0-0---0--0
0-0----------
----0-01--0--
0------------
--0---0-0----
--0----------
----0--------
0---0-------0
-------------
--0-------0--

Generation = 4, Population = 31.
-0-------0---
-------0-----
0----*-------
----1--.--0-0
-----0-------
---00------1-
--0-1--------
---10--.1----
--1----------
1------00----
0-----------0
--------0----
0-----0-----0
----1--------
--0-----0-0--

Generation = 6, Population = 79.
10-1-0-1-0-0-
----01---10-0
0100-.-1-0---
--011-0*0-00-
0-0110-0-----
-00*-00-001-1
0---1100-----
001*011.--00-
--1----1----0
.-*0001--10--
------0---0--
0---1-110-0--
----*--------
--1---1-1----
--0-1--------

Generation = 8, Population = 55.
.*---*-------
----*1-0-.---
---01.0.-----
0--111*.*-*-1
--*-*0-*-----
---.--00*-.1-
------0-01--1
--*.**-*-1---
--1------1--0
*1.0--11*.--1
-------0-----
0--1.---*---0
---1.1----1--
--.----0-----
0---1-1------

*** Life<Cell> 10x14 ***

Generation = 0, Population = 10.
-------0------
------0------0
--------------
-------------0
-0-----------0
-------0------
--------------
---------0----
--------------
-0-----0------

Generation = 3, Population = 56.
--------0-00--
-0-0---0--0-00
0-0-0--1----0-
-0-0-01-0-010-
--0-0000--01-.
-0-00-0----00-
010--0-0---001
010---0-0-0-00
---0-0-----0--
0-------0-----

Generation = 6, Population = 45.
-----0-1-1-.-*
0----1-1---00.
---0---*----00
-100------1.-1
-----1-*--0.-.
-.-110.01--.--
-1---1-0-0-101
1.1---00------
-0-1-------1-0
-*-0-----0---1

*** Life<Cell> 18x18 ***

Generation = 0, Population = 20.
------------------
------------------
----0-------------
-------0----------
------------------
--------0---------
------------0-----
------------0-----
-----------0-0----
-----------------0
0-----------00----
0-----------------
---------------0--
-----------0------
----0-------------
---0----0---------
----------0-------
------0--0--------

Generation = 1, Population = 59.
------------------
----0-------------
---0-0-0----------
----0-0-0---------
-------00---------
-------0-0--0-----
--------0--010----
------------1-----
----------0-0-0--0
0----------00---0-
10---------0110--0
10----------00-0--
0----------0--0-0-
----0-----0-0--0--
-----0--0--0------
--0----0-00-------
---0--0-0--0------
-----0-00---------

Generation = 2, Population = 65.
----0-------------
-------0----------
--0---0-----------
-----0--10--------
----0-------0-----
------01--0-1-----
----------01-10---
--------0-0---0--0
0--------0-0---0--
1-----------1--0-0
*-0-------0--*1---
*-0--------0-----0
1---0-------0----0
0--0----00---0----
--0---0---0----0--
-0---0---110------
----0---1---0-----
---00-01-0-0------

Generation = 3, Population = 117.
---0-0-0----------
--0-0---0---------
-0-0----00--------
--0----0*10-0-----
---0--00000010----
----001*0010*-0---
------00001*1*-0-0
0------0-010--1-0-
10--------0----10-
-00------00----1--
*-10-----0---**---
*-100--------00-01
-00--0--00------01
10----0011----00-0
0------0001--00-0-
0--------**1---0--
-0--1-0--000-0----
--01--1*0---------

Generation = 4, Population = 74.
----0-------------
--------1---------
0-------1---0-----
---0----.--01-----
-----------1-1----
----1--.----.----0
0---0---1--.*.--0-
1------10-------1-
-------0-0-------0
1-------0--0-0-*--
*0*-----01--1*.-00
*0*11---0---0-----
1---------0--0---*
------11-*-----1-1
--------1---01----
1---0-00-..-0-----
------1---1---00--
--1*-0-*1-00-0----

*** Life<Cell> 20x17 ***

Generation = 0, Population = 11.
-----------------
-----0----0------
-----------------
-----------------
---0---------0---
-----------------
-----------------
-----------------
-----------------
-----------0-0--0
-----------------
-----------------
-----------------
-------------0---
-----------------
-----------------
-------------0---
-----------------
-----------------
----------0-----0

Generation = 2, Population = 38.
-----------------
---0---00---0----
---0---------0---
-----0----0------
-0---0-----0---0-
-----------------
---0---------0---
-----------0-0--0
-----------------
---------0-0-0110
-----------------
-----------0----0
-----------------
-----------0---0-
-------------1---
-------------1---
-----------0---0-
----------0-----0
-------------0---
--------0-0-0-0--

Generation = 4, Population = 36.
---1---------0---
-0---01--10---0--
-----------------
-----------------
-------0-0-------
-----1----01-1--0
-----------------
-----------------
---0---------0---
-------0-0--0*11-
-----------------
-----------------
-------------0---
---------0-0-1--1
-------------.---
----------0--.--0
---------0-------
----------0--1--0
-----------------
------0-----0----

Generation = 6, Population = 97.
-1-1-1-----0-0-0-
----1-.--.-1----0
---1---0-1---0---
-0----0--1-0-00-0
-----*-0-0-1-----
---0---100-.01110
---0---0-0---*---
-----0-0-0000-000
-0---0-----0---1-
-----0-0-01-*.1.*
---0-------------
-------0---00-000
-----------1---0-
-------0-00--.11-
---------1--0.0--
--------00010.0-0
-------0---0-----
------0-0-01--11-
---------0-------
----0-0-0---010-0

Generation = 8, Population = 55.
---------0-------
-10---.-1.*.-----
---1-----*---*---
-----------*-----
---1-.-----*-0---
-----*-.-**.-*---
------------1.1--
-----------*---*-
-------------1-.-
---1----0-.1..-..
-----------------
----------1----**
---0-------.0-1--
-----0----*0-*-1*
----------10*.001
-----------*-.---
-----0------000--
-----------1-*..1
-----------------
--0-----0-0--1--0

Generation = 10, Population = 119.
---1---0--0--0---
1.-11-.-1.**-----
-1-1-0-00*-1-.-0-
-00-----0*1.1----
-0-11*0--1-.0-10-
---*-.-.-..*-*---
---1-----11-1*1-0
---0-1--0-1*-*-.-
----------01-1-.0
-0---10---*1..1*.
---1------1---0-1
---1-0----1-*-1*.
-0---1----0*---1-
---1---00-*0-*11*
---0-1--0*--.*--1
-----1---1-*1.11-
---0---0---1-**1-
--0-----00*--...1
-----0------00-0-
0-0-0-0-----*-*10

*** Life<Cell> 16x10 ***

Generation = 0, Population = 17.
------0--0
----------
----------
-000------
-0------0-
--------0-
----------
0---------
----------
-------0--
---------0
----0-----
-----0-0--
-0------0-
---------0
----------

Generation = 2, Population = 53.
----0-011-
-000------
-1----0-00
10-*10--1-
---1--0---
0100--0---
-0------1-
0-0----00-
---------0
0---00---1
-----0---0
-00---010-
---0-0-0-0
---00-0---
-----0---0
-0------0-

Generation = 4, Population = 51.
-11--0-1*-
--------0-
---0--0--*
.00.1*11.-
-1-100*-*0
-.--1--1*-
--------.1
-1-1------
-0---1-10-
-1-1-----1
-----*-1-*
-------.*-
-1-*------
-0--*0-00-
-----0-0--
-0--0---0-

*** Life<Cell> 11x19 ***

Generation = 0, Population = 16.
-------------------
-------0------0-0--
0------------------
---------------0---
-------0----0------
---------------0---
-----00-------0----
----------0--------
--0------------0---
-------------------
----------0-0------

Generation = 3, Population = 114.
-0---0---0--0-000-0
--0-0-000-001-1-1--
---0-00*00-01----00
--0----*000--1---10
-0---0--01-0--0-0--
0-000-0-0-100--10-0
-01-*1-0100-00011--
0-00-00010001--*-0-
-0-01-1000*---*-0-0
0-0-000-00*000-0-0-
-0-0---0-00--0110--

*** Life<Cell> 18x15 ***

Generation = 0, Population = 16.
-----0---------
-----------0--0
---------------
---------0-0---
--------------0
----0-------0--
-------0-------
---------------
---------------
-----0------0--
-------------0-
-------0-------
---0-----------
---------------
---------------
-------------0-
----------0----
---------------

Generation = 1, Population = 53.
----0-0----0--0
-----0----0-00-
---------0----0
--------0---0-0
----0----0-000-
---0-0-0---0-00
----0-0-0---0--
-------0-------
-----0------0--
----0-0----0---
-----0-0------0
---0--0-0----0-
--0-0--0-------
---0-----------
-------------0-
----------0-0-0
---------0-0-0-
----------0----

Generation = 2, Population = 49.
---0-0-0-------
-----------0110
-----0--------1
----0--0-0--101
-------0----1-0
--0---0--001--1
-----0---0----0
----00---------
-------0-----0-
---0------0---0
---0-------0---
---------0--0--
-0---0-------0-
-------0-----0-
---0------0----
-----------0---
--------0---0--
-------------0-

Generation = 3, Population = 97.
--0-----0--0000
---0---0--01---
------00-0-0-0-
---0--01--00--*
--0-0--10-0-*0-
-0-0----0--*-0-
--0--1--01-0-01
---01-00-0---00
---0000-0-0-0--
--010--0-0-----
--010----0----0
-0-0-0--0-0----
0-0-0-00-0---10
-0-0-00-0-0-010
--0-0--0-0---0-
---0----0------
-------0-0-----
--------0-----0

Generation = 4, Population = 53.
-0-------0----1
----0--1--1*--0
-----0-1-------
-----0-*-----0*
-----0----1-.--
0----0-----*0--
---0-------1-1-
-------1-1-0---
---1----------0
-0--1---01--0-0
-------0-1---0-
---1-------0-0-
-------1--0----
-----1------1--
-------------1-
-------0-0---0-
---0--0---0---0
-------------0-
