21

10 10
6
f 0 0 e
h 3 3 n
h 3 4 e
h 4 4 s
h 4 3 w
f 7 7 n
5 1

12 9
4
t 0 0 s
h 3 2 e
r 5 4 n
t 6 8 w
5 1

12 12
6
f 4 6 e
h 9 10 n
r 3 7 s
t 9 3 w
f 2 1 s
r 11 0 n
10 3

12 90
10
r 4 70 n
r 2 63 s
r 6 75 e
r 2 32 s
r 8 86 w
t 4 23 w
t 8 64 n
t 0 32 e
t 0 12 w
f 5 85 s
1000 100

5 5
5
t 3 2 n
h 0 0 w
h 0 1 e
h 0 2 s
t 4 4 w
10 2

8 10
6
r 1 2 n
r 7 4 s
h 3 7 w
r 5 3 e
r 2 2 s
r 7 3 n
50 10

20 20
10
t 12 16 s
t 6 1 e
t 4 4 n
r 1 16 w
r 16 3 e
h 17 5 s
h 7 19 e
h 0 1 s
h 9 10 w
f 14 14 s
20 4

40 3
10
h 10 1 s
h 20 2 s
h 30 1 n
h 25 0 s
h 0 0 s
t 0 1 s
t 10 2 s
t 30 2 n
h 35 2 s
h 15 1 n
30 5

2 2
2
f 1 0 e
h 0 0 e
5 1

5 5
7
f 0 0 s
f 0 1 s
f 0 2 s
h 0 3 s
r 4 0 w
r 4 1 e
r 4 2 w
10 5

40 40
7
t 10 10 s
r 29 23 w
h 1 38 e
h 5 26 s
t 31 24 e
r 1 2 n
f 4 36 n
20 10

20 20
5
r 8 4 e
h 7 7 n
t 3 2 w
r 19 17 n
f 5 8 n
10 2

10 10
5
r 0 0 n
r 2 2 w
t 4 4 e
h 6 6 n
h 8 8 s
10 2

3 3
4
f 1 1 e
h 0 2 n
r 2 1 w
t 0 0 s
6 1

6 8
6
f 0 1 e
h 2 3 s
r 3 4 e
h 2 4 w
t 4 3 s
f 1 7 n
6 2

20 15
6
t 0 10 s
h 3 12 e
r 7 4 n
t 11 8 w
r 5 9 n
t 16 8 w
100 20

10 10
4
h 3 1 s
h 2 0 n
h 2 1 w
t 1 0 s
8 3

90 90
3
h 82 32 e
h 71 30 w
r 62 12 s
321 123

12 8
6
r 11 7 e
f 3 2 s
f 6 1 n
t 10 3 e
h 8 5 w
h 5 6 s
10 2

20 20
12
f 14 7 s
f 9 3 e
h 6 2 e
h 8 17 s
f 17 5 n
f 8 16 n
h 3 3 w
r 8 5 w
t 0 5 s
r 14 18 w
t 9 9 n
r 1 0 n
20 5

7 7
2
h 5 1 s
h 4 6 w
200 100
