20

5 5
7
f 0 0 e
h 4 4 s
t 3 2 n
h 1 1 s
r 3 3 s
f 3 4 e
h 1 4 n
1 1

8 8
12
t 0 4 s
r 2 5 s
h 3 3 e
f 5 2 w
t 3 2 s
f 0 5 w
h 0 3 s
h 0 7 e
t 7 4 w
f 5 6 n
r 2 1 n
h 7 6 s
30 2

10 10
15
r 0 6 e
t 4 3 s
f 7 5 n
f 5 9 w
r 8 5 w
r 6 1 n
f 2 2 s
h 7 6 e
h 3 4 e
t 7 9 n
r 3 5 e
h 5 8 s
t 1 4 s
f 3 2 w
f 6 6 n
8 3

12 9
7
r 11 7 n
t 10 8 e
f 9 4 w
f 7 6 s
r 4 2 s
h 6 4 e
h 2 6 n
10 2

8 10
8
r 0 0 e
t 6 9 n
f 4 4 s
h 7 6 w
h 4 3 w
r 3 6 n
t 6 7 s
t 5 4 e
10 4

3 3
3
r 0 0 n
t 1 1 e
h 2 2 n
5 1

6 4
5
f 1 1 n
f 5 3 e
f 3 0 s
r 0 2 n
r 2 3 w
4 2

7 8
10
r 6 3 e
t 5 5 n
f 3 3 e
t 5 1 s
h 3 6 w
t 2 2 s
r 4 7 n
h 5 4 s
f 2 1 w
r 1 4 e
7 1

9 9
7
r 8 1 e
t 8 2 s
f 8 3 w
h 8 4 w
t 8 5 w
f 8 6 e
r 8 7 n
10 3

10 10
10
h 0 1 s
h 0 2 s
h 0 3 s
h 0 4 s
h 0 5 s
h 0 6 s
h 0 7 s
h 0 8 s
h 0 9 s
h 0 0 s
10 5

7 4
5
h 0 1 n
t 2 3 e
f 3 2 s
r 1 1 e
f 0 3 w
8 4

5 5
7
h 0 4 e
f 4 3 s
t 3 0 w
r 4 1 n
h 2 4 n
h 1 3 e
f 2 0 s
5 1

2 2
2
f 0 0 n
f 1 1 n
2 1

3 3
3
h 0 0 e
h 0 1 w
h 2 2 n
5 3

7 7
7
h 6 4 n
t 5 2 e
r 3 5 s
h 4 4 w
f 1 1 w
f 0 3 e
t 4 0 n
4 1

3 5
5
h 1 3 e
r 0 4 n
f 2 2 e
f 2 1 s
t 0 0 w
5 5

6 6
4
h 0 0 e
r 0 5 w
t 5 0 n
f 5 5 s
12 1

5 7
3
h 2 1 n
r 3 4 e
r 4 2 s
5 3

4 4
3
r 1 0 n
t 3 1 e
r 2 2 s
7 1

7 7
8
r 1 3 n
t 2 5 n
h 0 2 s
f 1 1 e
r 6 6 e
h 3 4 w
t 6 2 n
f 5 0 w
8 2
