25

20 11
7
f 1 7 s
f 18 3 e
h 6 1 e
r 1 5 e
r 4 4 s
h 18 2 e
f 15 10 s
16 2

3 19
4
h 0 8 w
t 2 12 n
h 2 16 w
r 0 4 e
9 2

17 17
6
h 13 3 e
r 10 5 s
f 9 2 e
h 11 4 e
h 12 8 w
h 1 1 w
24 1

10 8
5
r 8 2 e
f 5 6 s
h 4 4 w
f 0 6 w
h 1 2 w
14 4

18 2
11
h 12 0 s
r 17 0 e
f 3 0 e
f 0 1 s
r 12 1 e
t 8 1 w
t 13 0 w
h 15 1 n
r 10 0 w
f 9 0 e
t 16 1 s
23 2

7 17
8
t 6 10 n
h 1 14 s
t 0 11 n
r 2 12 e
h 2 16 n
r 1 10 w
r 4 1 n
t 0 6 s
8 4

16 19
7
f 8 3 n
h 14 0 e
f 11 13 s
t 5 12 w
f 7 12 w
f 11 18 w
f 1 18 w
8 3

8 19
2
r 5 14 s
r 3 10 w
27 4

20 17
9
t 9 4 w
t 0 14 w
t 6 1 w
t 17 7 e
r 18 14 s
r 9 14 w
r 3 1 n
t 7 1 s
f 12 12 w
27 4

6 14
6
f 3 3 n
f 5 4 w
r 0 9 n
r 1 9 n
f 5 11 s
r 5 5 s
12 3

4 9
11
h 2 3 e
t 3 5 e
r 0 2 s
h 3 3 e
r 3 6 w
t 3 4 w
h 1 7 w
h 2 0 n
h 2 6 e
h 0 0 w
f 2 1 e
16 1

21 17
10
f 6 16 n
r 2 7 e
t 0 16 w
t 1 13 e
f 4 0 s
r 0 9 w
t 0 8 n
f 0 7 n
h 15 14 e
f 1 5 n
12 2

11 22
5
r 10 11 n
h 5 19 w
t 10 9 n
h 6 0 w
h 6 1 w
23 1

18 19
2
r 11 7 e
r 17 14 n
21 1

22 18
6
t 2 3 s
h 15 13 w
r 16 9 w
t 5 3 n
r 18 9 s
f 21 7 n
13 1

9 21
4
r 1 13 e
f 1 18 w
r 4 18 w
h 7 5 w
9 3

24 25
7
f 14 11 n
h 7 18 e
t 15 6 w
h 18 22 s
t 8 24 s
t 15 14 e
t 15 1 n
19 3

18 13
7
f 17 3 w
f 5 1 s
t 5 8 s
h 3 5 n
h 5 12 w
h 7 3 n
t 13 5 s
10 4

22 22
7
r 16 12 n
r 9 6 w
h 19 5 s
h 21 5 s
h 4 6 e
r 14 0 e
t 9 18 s
21 2

21 7
8
t 1 1 w
r 19 6 s
h 4 0 n
t 5 5 n
f 1 3 n
f 4 2 n
h 1 0 w
t 12 1 s
22 2

17 19
4
t 8 18 e
h 0 11 w
r 15 17 e
t 5 15 e
17 4

11 1
2
f 4 0 e
h 7 0 n
24 2

22 19
12
f 1 6 w
t 17 10 e
f 1 5 s
h 5 8 n
r 12 4 e
r 9 14 n
f 14 1 w
f 8 14 w
t 4 2 s
t 5 7 s
t 19 0 e
h 12 13 n
20 2

24 9
8
r 15 2 w
r 15 1 e
f 12 2 e
f 17 6 s
f 10 7 e
r 7 1 e
t 20 1 n
f 19 7 n
17 4

5 22
3
t 2 3 e
r 3 5 e
h 1 9 s
19 1
