*** Darwin 21x43 ***
Turn = 0.
  0123456789012345678901234567890123456789012
0 ...........................................
1 ...........................................
2 ...........................................
3 ...........................................
4 ..............r...........t................
5 ...........................................
6 ...........................................
7 ...........................................
8 ...........................................
9 ...........................................
0 ...........................................
1 .h.........................................
2 ...........................................
3 ......................h....................
4 ...........................................
5 ...........................................
6 ...........................................
7 ...........................................
8 ...........................................
9 ...............................t...........
0 .............................ff............

Turn = 111.
  0123456789012345678901234567890123456789012
0 ...........................................
1 ...........................................
2 ...........................................
3 ...........................................
4 ..........................t................
5 ...........................................
6 ...........................................
7 ..............................r............
8 ...........................................
9 ...........................................
0 ...........................................
1 h..........................................
2 ...........................................
3 ..........................................r
4 ...........................................
5 ...........................................
6 ...........................................
7 ...........................................
8 ...........................................
9 ...............................t...........
0 ..................rr.......................

Turn = 222.
  0123456789012345678901234567890123456789012
0 ...........................................
1 ...........................................
2 ...........................................
3 ...........................................
4 ..........................t................
5 ...........................................
6 ...........................................
7 r..........................................
8 ...........................................
9 ...........................................
0 ...........................................
1 ...........................................
2 ............................r..............
3 ...........................r...............
4 ...........................................
5 ...........................................
6 ...........................................
7 ...........................................
8 ...........................................
9 ...............................t...........
0 .......................................r.r.

Turn = 333.
  0123456789012345678901234567890123456789012
0 .............................r.....r.......
1 .............................r.............
2 ...................r.......................
3 ...................r.......................
4 ..........................t................
5 ...........................................
6 ...........................................
7 ...........................................
8 ...........................................
9 ...........................................
0 ...........................................
1 ...........................................
2 ...........................................
3 ...........................................
4 ...........................................
5 ...........................................
6 ...........................................
7 ...........................................
8 ...........................................
9 ...........................................
0 ..................r........................

Turn = 444.
  0123456789012345678901234567890123456789012
0 .........r...........................r.....
1 ..........................................r
2 ...........................................
3 ...........................................
4 ..........................t................
5 ...........................................
6 ...........................................
7 ...........................................
8 ...........................................
9 ...........................................
0 ...........................................
1 ...........................................
2 ...........................................
3 ...........................................
4 ...........................................
5 ...........................................
6 ...........................................
7 ...................r.......................
8 ...........................................
9 ...........................................
0 ....r.r....................................

Turn = 555.
  0123456789012345678901234567890123456789012
0 r..............r...........................
1 ...........................................
2 ...........................................
3 ...........................................
4 ..........................t................
5 ...........................................
6 .........................................r.
7 ..........................................r
8 ...........................................
9 ...........................................
0 ...........................................
1 ...........................................
2 ...........................................
3 ...........................................
4 ...........................................
5 ...........................................
6 ...........................................
7 ...........................................
8 ...........................................
9 ...........................................
0 .r........r................................

Turn = 666.
  0123456789012345678901234567890123456789012
0 r.....................r....................
1 ...........................................
2 ....................................r......
3 ...........................................
4 ..........................t................
5 ...........................................
6 ..........................................r
7 ...........................................
8 ...........................................
9 ...........................................
0 ...........................................
1 ...........................................
2 ...........................................
3 ...........................................
4 ...........................................
5 ...........................................
6 ...........................................
7 ...........................................
8 ...........................................
9 ............r..............................
0 .............r.............................

Turn = 777.
  0123456789012345678901234567890123456789012
0 ..........................................r
1 ...................rr......................
2 ...........................................
3 ...........................................
4 ..........................t................
5 ...........................................
6 ...........................................
7 ...........................................
8 ...........................................
9 ...........................................
0 ...........................................
1 ...........................................
2 ...........................................
3 ...........................................
4 ...........................................
5 ...........................................
6 ...........................................
7 ...........................................
8 ...........................................
9 ...........................................
0 r...r..........................r...........

Turn = 888.
  0123456789012345678901234567890123456789012
0 ...........................................
1 r..........................................
2 ...rr......................................
3 ...........................................
4 ..........................t................
5 ...........................................
6 ......rr...................................
7 ...........................................
8 ...........................................
9 ...........................................
0 ...........................................
1 ...........................................
2 ...........................................
3 ...........................................
4 ...........................................
5 ...........................................
6 ...........................................
7 ...........................................
8 ...........................................
9 ..................................r........
0 ...........................................

Turn = 999.
  0123456789012345678901234567890123456789012
0 .........r..r..............................
1 .....r......r..............................
2 ...........................................
3 ...........................................
4 ..........................t................
5 ...........................................
6 ...........................................
7 ...........................................
8 ...........................................
9 ...........................................
0 ...........................................
1 ..........................................r
2 ...........................................
3 ...........................................
4 ...........................................
5 ...........................................
6 ...........................................
7 ...........................................
8 ...........................................
9 ...........................................
0 .....r.....................................

Turn = 1110.
  0123456789012345678901234567890123456789012
0 ..................................r........
1 ...........................................
2 ...........................................
3 ...........................................
4 ..........................t................
5 ...........................................
6 ...........................................
7 ...........................................
8 ...........................................
9 ...........................................
0 ...........................................
1 ...........................................
2 ...........................................
3 ...........................................
4 ...........................................
5 ...........................................
6 .......r...................................
7 ......r....................................
8 ........r..r...............................
9 .......r...................................
0 ...........................................

Turn = 1221.
  0123456789012345678901234567890123456789012
0 .r...r.....................................
1 .r.........................................
2 ...........................................
3 ...........................................
4 ..........................t................
5 ...........................................
6 ..........................................r
7 ...........................................
8 ...........................................
9 ...........................................
0 ...........................................
1 ...........................................
2 ...........................................
3 ...........................................
4 ...........................................
5 ...........................................
6 ...........................................
7 ..........................................r
8 ...........................................
9 ...........................................
0 ....................................r......

*** Darwin 12x3 ***
Turn = 0.
  012
0 .f.
1 ...
2 ...
3 ...
4 ...
5 ...
6 ...
7 ...
8 ..h
9 h..
0 ...
1 ...

Turn = 187.
  012
0 .f.
1 ...
2 ...
3 ...
4 ...
5 ...
6 ...
7 ...
8 h..
9 ...
0 ...
1 h..

Turn = 374.
  012
0 .f.
1 ...
2 ...
3 ...
4 ...
5 ...
6 ...
7 ...
8 h..
9 ...
0 ...
1 h..

Turn = 561.
  012
0 .f.
1 ...
2 ...
3 ...
4 ...
5 ...
6 ...
7 ...
8 h..
9 ...
0 ...
1 h..

Turn = 748.
  012
0 .f.
1 ...
2 ...
3 ...
4 ...
5 ...
6 ...
7 ...
8 h..
9 ...
0 ...
1 h..

Turn = 935.
  012
0 .f.
1 ...
2 ...
3 ...
4 ...
5 ...
6 ...
7 ...
8 h..
9 ...
0 ...
1 h..

*** Darwin 65x12 ***
Turn = 0.
  012345678901
0 ............
1 ............
2 ............
3 ............
4 ............
5 ............
6 ............
7 ....h.......
8 ............
9 ..........t.
0 .t..........
1 ............
2 ........h...
3 t...........
4 ........t...
5 ............
6 ...........t
7 ............
8 ............
9 .........f..
0 ............
1 ............
2 ........f...
3 ............
4 ............
5 ............
6 ............
7 ............
8 ............
9 ............
0 ............
1 ............
2 ............
3 ............
4 .......t....
5 ............
6 ............
7 ............
8 ............
9 ............
0 ............
1 ............
2 ............
3 ........r...
4 ............
5 ............
6 ............
7 ............
8 ............
9 ............
0 ............
1 ............
2 ............
3 ............
4 ............
5 ............
6 ...f........
7 ............
8 ............
9 ............
0 ............
1 ............
2 ............
3 ......r.....
4 ............

Turn = 34.
  012345678901
0 ............
1 ............
2 ............
3 ............
4 ............
5 ............
6 ............
7 ............
8 ............
9 ..........t.
0 .t..........
1 ............
2 ............
3 t.......t...
4 ........t...
5 ............
6 ...........t
7 ............
8 ............
9 .........f..
0 ............
1 ............
2 ........f...
3 ............
4 ............
5 ............
6 ............
7 ............
8 ............
9 ............
0 ............
1 ............
2 ............
3 ............
4 .......t....
5 ............
6 ............
7 ............
8 ............
9 ............
0 ............
1 r...h.......
2 ............
3 ............
4 ............
5 ............
6 ............
7 ............
8 ............
9 ............
0 ............
1 ............
2 ............
3 ............
4 ............
5 ............
6 ...f........
7 ............
8 ............
9 ............
0 ............
1 r...........
2 ............
3 ............
4 ............

Turn = 68.
  012345678901
0 ............
1 ............
2 ............
3 ............
4 ............
5 ............
6 ............
7 r...........
8 r...........
9 ..........t.
0 .t..........
1 ............
2 ............
3 ........t...
4 ........t...
5 ............
6 ...........t
7 ............
8 ............
9 .........f..
0 ............
1 ............
2 ........f...
3 ............
4 ............
5 ............
6 ............
7 r...........
8 ............
9 ............
0 ............
1 ............
2 ............
3 ............
4 .......t....
5 ............
6 ............
7 ............
8 ............
9 ............
0 ............
1 ............
2 ............
3 ............
4 ............
5 ............
6 ............
7 ............
8 ............
9 ............
0 ............
1 ............
2 ............
3 ............
4 ............
5 ............
6 ...f........
7 ............
8 ............
9 ............
0 ............
1 ............
2 ............
3 ............
4 ....h.......

Turn = 102.
  012345678901
0 .r..........
1 ............
2 ............
3 ............
4 ............
5 ............
6 ............
7 ............
8 ............
9 .t........t.
0 .t..........
1 ............
2 ............
3 ........t...
4 ........t...
5 ............
6 ...........t
7 ............
8 ............
9 .........f..
0 ............
1 r...........
2 ........f...
3 ............
4 ............
5 ............
6 ............
7 ............
8 ............
9 ............
0 ............
1 ............
2 ............
3 ............
4 .......t....
5 ............
6 ............
7 ............
8 ............
9 ............
0 ............
1 ............
2 ............
3 ............
4 ............
5 ............
6 ............
7 ............
8 ............
9 ............
0 ............
1 ............
2 ............
3 ............
4 ............
5 ............
6 ...f........
7 ............
8 ............
9 ............
0 ............
1 ............
2 ............
3 ............
4 ....h.......

Turn = 136.
  012345678901
0 ............
1 ............
2 ............
3 ............
4 ............
5 ............
6 ............
7 ............
8 ............
9 .t........t.
0 tt..........
1 ............
2 ............
3 ........t...
4 ........t...
5 ............
6 ...........t
7 ............
8 ............
9 .........f..
0 ............
1 ............
2 ........f...
3 ............
4 ............
5 ............
6 ............
7 ............
8 ............
9 ............
0 ............
1 ............
2 ............
3 ............
4 .......t....
5 ............
6 ............
7 ............
8 ............
9 ............
0 ............
1 ............
2 ............
3 ............
4 ............
5 ............
6 ............
7 ............
8 ............
9 ............
0 ............
1 ............
2 ............
3 ............
4 ............
5 r...........
6 ...f........
7 ............
8 ............
9 ............
0 ............
1 ............
2 ............
3 ............
4 ....h.......

Turn = 170.
  012345678901
0 ............
1 ............
2 ............
3 ............
4 ............
5 ............
6 ............
7 ............
8 ............
9 .t........t.
0 tt..........
1 ............
2 ............
3 ........t...
4 ........t...
5 ............
6 ...........t
7 ............
8 ............
9 .........f..
0 ............
1 ............
2 ........f...
3 ............
4 ............
5 ............
6 ............
7 ............
8 ............
9 ............
0 ............
1 ............
2 ............
3 ............
4 .......t....
5 ............
6 ............
7 ............
8 ............
9 ............
0 ............
1 ............
2 ............
3 ............
4 ............
5 ...rr.......
6 ...r........
7 ............
8 ............
9 ............
0 ............
1 ............
2 ............
3 ............
4 ............
5 ............
6 ............
7 ............
8 ............
9 ............
0 ............
1 ............
2 ............
3 ............
4 ............

Turn = 204.
  012345678901
0 ............
1 ............
2 ............
3 ............
4 ............
5 ............
6 ............
7 ............
8 ............
9 .t........t.
0 tt..........
1 ...rr.......
2 ...r........
3 ........t...
4 ........t...
5 ............
6 ...........t
7 ............
8 ............
9 .........f..
0 ............
1 ............
2 ........f...
3 ............
4 ............
5 ............
6 ............
7 ............
8 ............
9 ............
0 ............
1 ............
2 ............
3 ............
4 .......t....
5 ............
6 ............
7 ............
8 ............
9 ............
0 ............
1 ............
2 ............
3 ............
4 ............
5 ............
6 ............
7 ............
8 ............
9 ............
0 ............
1 ............
2 ............
3 ............
4 ............
5 ............
6 ............
7 ............
8 ............
9 ............
0 ............
1 ............
2 ............
3 ............
4 ............

Turn = 238.
  012345678901
0 r...........
1 ............
2 r...........
3 ............
4 ............
5 r...........
6 ............
7 ............
8 ............
9 ..........t.
0 ....r.......
1 ............
2 ............
3 ........t...
4 ........t...
5 ............
6 ...........t
7 r...........
8 ............
9 ...r.....f..
0 ............
1 ............
2 ........f...
3 ............
4 ............
5 ............
6 ............
7 ............
8 ............
9 ............
0 ............
1 ............
2 ............
3 ............
4 .......t....
5 ............
6 ............
7 ............
8 ............
9 ............
0 ............
1 ............
2 ............
3 ............
4 ............
5 ............
6 ............
7 ............
8 ............
9 ............
0 ............
1 ............
2 ............
3 ............
4 ............
5 ............
6 ............
7 ............
8 ............
9 ............
0 ............
1 ............
2 ............
3 ............
4 ............

Turn = 272.
  012345678901
0 ...r........
1 ............
2 ............
3 ............
4 ............
5 ............
6 ............
7 ............
8 ............
9 ..........t.
0 ..........t.
1 ............
2 ............
3 ........t...
4 ........t...
5 ...........r
6 ...........r
7 ............
8 ............
9 .........f..
0 ............
1 ............
2 ........f...
3 ............
4 ............
5 r...........
6 ............
7 ............
8 ............
9 ............
0 ............
1 ............
2 ............
3 ............
4 .......t....
5 ............
6 ............
7 ............
8 ............
9 ............
0 ............
1 ............
2 ............
3 ............
4 ............
5 ............
6 ............
7 ............
8 ............
9 ............
0 ............
1 r...........
2 ............
3 ...r........
4 ............
5 ............
6 ............
7 ............
8 ............
9 ............
0 ............
1 ............
2 ............
3 ............
4 ............

Turn = 306.
  012345678901
0 r...........
1 ............
2 ............
3 r...........
4 ............
5 ............
6 ............
7 ............
8 ............
9 ..........tt
0 ..........t.
1 ............
2 ............
3 ........t...
4 ........t...
5 ............
6 ............
7 ............
8 ............
9 .........f..
0 ............
1 ............
2 ........f...
3 ............
4 ............
5 ............
6 ............
7 ............
8 ............
9 ............
0 ............
1 ............
2 ............
3 ............
4 .......t....
5 ............
6 ............
7 ............
8 ............
9 ............
0 ............
1 ............
2 ............
3 ............
4 ............
5 ............
6 ............
7 ............
8 ............
9 ............
0 ............
1 ...........r
2 ............
3 ............
4 ............
5 ............
6 ............
7 ............
8 ............
9 r...........
0 ............
1 ............
2 ............
3 ............
4 ........r...

Turn = 340.
  012345678901
0 ............
1 ............
2 ............
3 ............
4 ............
5 ............
6 ............
7 ............
8 ............
9 ..........tt
0 ..........t.
1 ............
2 ............
3 ........t...
4 ........t...
5 ............
6 ............
7 ...........r
8 ............
9 .........f..
0 ............
1 ............
2 ........f...
3 ............
4 ............
5 ............
6 ............
7 ............
8 ............
9 ............
0 ............
1 ............
2 ............
3 ............
4 r......t...r
5 ............
6 ............
7 r...........
8 ............
9 ............
0 ............
1 ............
2 ............
3 ............
4 ............
5 ............
6 ............
7 ............
8 ............
9 ............
0 ...........r
1 ............
2 ............
3 ............
4 ............
5 ............
6 ............
7 ............
8 ............
9 ............
0 ............
1 ............
2 ............
3 ............
4 ............

Turn = 374.
  012345678901
0 ...........r
1 ............
2 ............
3 ............
4 r...........
5 ............
6 ............
7 ............
8 ............
9 ..........t.
0 ..........tt
1 ............
2 ............
3 ........t...
4 ........t...
5 ............
6 ...........r
7 ............
8 ............
9 .........f..
0 ............
1 ............
2 ........f...
3 ............
4 ............
5 ............
6 ............
7 ............
8 ............
9 ............
0 ............
1 ............
2 ............
3 ............
4 .......t....
5 ............
6 ............
7 ............
8 ............
9 ............
0 ............
1 ............
2 ............
3 ............
4 ............
5 ............
6 ............
7 ............
8 ............
9 ............
0 ............
1 ............
2 ............
3 ............
4 ............
5 ............
6 ............
7 ............
8 ............
9 ............
0 ............
1 r...........
2 ............
3 ....r.......
4 ............

Turn = 408.
  012345678901
0 ............
1 ............
2 ............
3 ............
4 ............
5 ............
6 ............
7 ............
8 ............
9 ..........tt
0 ..........tt
1 ...........t
2 ............
3 ........t...
4 ........t...
5 ............
6 ............
7 ............
8 ............
9 .........f..
0 ............
1 ............
2 ........f...
3 ............
4 ............
5 ............
6 ............
7 ............
8 ............
9 r...........
0 ............
1 ............
2 .....r......
3 ............
4 .......t....
5 ............
6 ............
7 ...........r
8 ............
9 ............
0 ............
1 ............
2 ............
3 ............
4 ............
5 ............
6 ............
7 ............
8 ............
9 ............
0 ............
1 ............
2 ............
3 ............
4 ............
5 ............
6 ............
7 ............
8 ............
9 ............
0 ............
1 ............
2 ............
3 ............
4 ............

Turn = 442.
  012345678901
0 ....r.......
1 ............
2 ............
3 ............
4 ..........r.
5 ..........r.
6 ............
7 ............
8 ............
9 ...........t
0 ...........t
1 .....r.....t
2 ...........t
3 ........t...
4 ........t...
5 ............
6 ............
7 ............
8 ............
9 .........f..
0 ............
1 ............
2 ........f...
3 ............
4 ............
5 ............
6 ............
7 ............
8 ............
9 ............
0 ............
1 ............
2 ............
3 ............
4 .......t....
5 ............
6 ............
7 ............
8 ............
9 ............
0 ............
1 ............
2 ............
3 ............
4 ............
5 ............
6 ............
7 ............
8 ............
9 ............
0 ............
1 ............
2 ............
3 ............
4 ............
5 ............
6 ............
7 ............
8 ............
9 ............
0 ............
1 ............
2 ............
3 ............
4 ............

Turn = 476.
  012345678901
0 ...........r
1 ............
2 ............
3 ............
4 ............
5 ............
6 .r..........
7 .r..........
8 r...........
9 ............
0 ............
1 ............
2 r..........t
3 ........t...
4 ..r.....t...
5 r...........
6 ............
7 ............
8 ............
9 .........f..
0 ............
1 ............
2 ........f...
3 ............
4 ............
5 ............
6 ............
7 ............
8 ............
9 ............
0 ............
1 ............
2 ............
3 ............
4 .......t....
5 ............
6 ............
7 ............
8 ............
9 ............
0 ............
1 ............
2 ............
3 ............
4 ............
5 ............
6 ............
7 ............
8 ............
9 ............
0 ............
1 ............
2 ............
3 ............
4 ............
5 ............
6 ............
7 ............
8 ............
9 ............
0 ............
1 ............
2 ............
3 ............
4 ............

Turn = 510.
  012345678901
0 ............
1 ............
2 ............
3 ............
4 ............
5 ............
6 ............
7 ............
8 ............
9 ............
0 ............
1 ............
2 ...........r
3 ........t...
4 ........t...
5 ............
6 ............
7 ...........r
8 ............
9 .........f..
0 ............
1 ............
2 ........f...
3 ............
4 ............
5 ............
6 r...........
7 ............
8 ............
9 ............
0 ............
1 ............
2 ............
3 ...........r
4 .......t....
5 ...........r
6 ............
7 ............
8 ............
9 ............
0 ............
1 ............
2 ............
3 ............
4 ............
5 ............
6 r...........
7 ............
8 ..r.........
9 r...........
0 ............
1 ............
2 ............
3 ............
4 ............
5 ............
6 ............
7 ............
8 ............
9 ............
0 ............
1 ............
2 ............
3 ............
4 ............

Turn = 544.
  012345678901
0 ............
1 ............
2 ............
3 ............
4 ............
5 ............
6 ............
7 ............
8 ............
9 ............
0 ............
1 ............
2 ............
3 ........t...
4 ........t...
5 ............
6 ............
7 ............
8 ............
9 .........f..
0 ............
1 ............
2 ........f...
3 ............
4 ............
5 ............
6 ............
7 ............
8 ............
9 ............
0 ............
1 ............
2 ............
3 ............
4 .......t....
5 ............
6 ............
7 ............
8 ............
9 ............
0 ............
1 ............
2 ............
3 ............
4 ............
5 ............
6 ...........r
7 ............
8 ............
9 ............
0 ............
1 ...........r
2 ............
3 ............
4 ............
5 ............
6 ............
7 ............
8 ..........r.
9 ............
0 r...........
1 .........r..
2 ............
3 ......r.....
4 ......r....r

Turn = 578.
  012345678901
0 ............
1 ............
2 ............
3 ............
4 ............
5 ............
6 ............
7 ............
8 ............
9 ............
0 ............
1 ............
2 ............
3 ........t...
4 ........t...
5 ............
6 ............
7 ............
8 ............
9 .........f..
0 ............
1 ............
2 ........f...
3 ............
4 ..........r.
5 ............
6 ............
7 .........r..
8 ............
9 ............
0 ............
1 ............
2 ............
3 ............
4 .......t....
5 ............
6 rr..........
7 ............
8 r...........
9 ............
0 ............
1 ............
2 r...........
3 ............
4 ............
5 ............
6 ............
7 ............
8 ............
9 ............
0 ............
1 ............
2 ............
3 ............
4 ............
5 ............
6 ............
7 ............
8 ............
9 r...........
0 r...........
1 ............
2 ............
3 ............
4 ............

Turn = 612.
  012345678901
0 .r......r...
1 ............
2 rr..........
3 ..........r.
4 r...........
5 ............
6 ............
7 ............
8 r...........
9 ............
0 ............
1 ............
2 ............
3 ........t...
4 ........t...
5 ............
6 ............
7 ............
8 ............
9 ............
0 ............
1 ............
2 ........f...
3 ............
4 ............
5 r...........
6 r...........
7 ............
8 ............
9 ............
0 ............
1 ............
2 ............
3 ............
4 .......t....
5 ............
6 ............
7 ............
8 ............
9 ............
0 ............
1 ............
2 ............
3 ............
4 ............
5 ............
6 ............
7 ............
8 ............
9 ............
0 ............
1 ............
2 ............
3 ............
4 ............
5 ............
6 ............
7 ............
8 ............
9 ............
0 ............
1 ............
2 ............
3 ............
4 ............

Turn = 646.
  012345678901
0 ............
1 r...r.......
2 ............
3 ...........r
4 ............
5 ............
6 ............
7 ............
8 ............
9 ...........r
0 ............
1 ............
2 ............
3 ........t...
4 ........t...
5 ............
6 ............
7 ............
8 ...........r
9 ............
0 ............
1 ............
2 ........f...
3 .r..........
4 ............
5 ............
6 ............
7 ............
8 ............
9 ...rr.......
0 ............
1 ............
2 ............
3 ............
4 .......t....
5 ............
6 ............
7 ..........r.
8 ............
9 ............
0 ............
1 ............
2 ............
3 ............
4 ............
5 ............
6 ............
7 ............
8 ............
9 ............
0 ............
1 ............
2 ............
3 ............
4 ............
5 ............
6 ............
7 ............
8 ............
9 ............
0 ............
1 ............
2 ............
3 ............
4 ............

Turn = 680.
  012345678901
0 ............
1 ............
2 ............
3 ............
4 ............
5 ............
6 ............
7 ............
8 ............
9 ............
0 ............
1 ............
2 ............
3 ........t...
4 ........t...
5 ............
6 ............
7 ............
8 r...........
9 ............
0 ............
1 ............
2 ........f...
3 ...........r
4 ............
5 ............
6 ............
7 ............
8 ............
9 ............
0 ............
1 ............
2 ............
3 ............
4 .......t....
5 r...........
6 ............
7 ............
8 ............
9 ............
0 ............
1 ............
2 ............
3 ...........r
4 ............
5 ............
6 ............
7 ............
8 ............
9 ............
0 ............
1 ............
2 ...........r
3 ............
4 ............
5 ............
6 ............
7 .r..........
8 ............
9 ............
0 ...........r
1 ............
2 ............
3 ...rr.......
4 ............

*** Darwin 68x30 ***
Turn = 0.
  012345678901234567890123456789
0 ..............................
1 ..............................
2 ..............................
3 ..............................
4 ..............................
5 ..............................
6 ..............................
7 ..............................
8 ..............................
9 ..............................
0 ..............................
1 ..............................
2 ..............................
3 ..............................
4 ..............................
5 ..............................
6 ..............................
7 ..............................
8 ..............................
9 ..............................
0 ..............................
1 ..............................
2 ..............................
3 ..............................
4 ..............................
5 ..............................
6 ..............................
7 ..............................
8 ..............................
9 ..............................
0 ..............................
1 ..............................
2 ..............................
3 ..............................
4 ..............................
5 ..............................
6 ..............................
7 ..............................
8 ..............................
9 ..............................
0 ..............................
1 ..............................
2 ..............................
3 ..............................
4 ..............................
5 ..............................
6 ..............................
7 ..............................
8 ..............................
9 ..............................
0 ..............................
1 ..............................
2 ..............................
3 ..............................
4 .....................f........
5 ..............................
6 ..............................
7 ..............................
8 ..............................
9 ..............................
0 ..............................
1 ..............................
2 ..............................
3 .............................f
4 ..............................
5 ..............................
6 ..............................
7 ..............................

Turn = 95.
  012345678901234567890123456789
0 ..............................
1 ..............................
2 ..............................
3 ..............................
4 ..............................
5 ..............................
6 ..............................
7 ..............................
8 ..............................
9 ..............................
0 ..............................
1 ..............................
2 ..............................
3 ..............................
4 ..............................
5 ..............................
6 ..............................
7 ..............................
8 ..............................
9 ..............................
0 ..............................
1 ..............................
2 ..............................
3 ..............................
4 ..............................
5 ..............................
6 ..............................
7 ..............................
8 ..............................
9 ..............................
0 ..............................
1 ..............................
2 ..............................
3 ..............................
4 ..............................
5 ..............................
6 ..............................
7 ..............................
8 ..............................
9 ..............................
0 ..............................
1 ..............................
2 ..............................
3 ..............................
4 ..............................
5 ..............................
6 ..............................
7 ..............................
8 ..............................
9 ..............................
0 ..............................
1 ..............................
2 ..............................
3 ..............................
4 .....................f........
5 ..............................
6 ..............................
7 ..............................
8 ..............................
9 ..............................
0 ..............................
1 ..............................
2 ..............................
3 .............................f
4 ..............................
5 ..............................
6 ..............................
7 ..............................

Turn = 190.
  012345678901234567890123456789
0 ..............................
1 ..............................
2 ..............................
3 ..............................
4 ..............................
5 ..............................
6 ..............................
7 ..............................
8 ..............................
9 ..............................
0 ..............................
1 ..............................
2 ..............................
3 ..............................
4 ..............................
5 ..............................
6 ..............................
7 ..............................
8 ..............................
9 ..............................
0 ..............................
1 ..............................
2 ..............................
3 ..............................
4 ..............................
5 ..............................
6 ..............................
7 ..............................
8 ..............................
9 ..............................
0 ..............................
1 ..............................
2 ..............................
3 ..............................
4 ..............................
5 ..............................
6 ..............................
7 ..............................
8 ..............................
9 ..............................
0 ..............................
1 ..............................
2 ..............................
3 ..............................
4 ..............................
5 ..............................
6 ..............................
7 ..............................
8 ..............................
9 ..............................
0 ..............................
1 ..............................
2 ..............................
3 ..............................
4 .....................f........
5 ..............................
6 ..............................
7 ..............................
8 ..............................
9 ..............................
0 ..............................
1 ..............................
2 ..............................
3 .............................f
4 ..............................
5 ..............................
6 ..............................
7 ..............................

Turn = 285.
  012345678901234567890123456789
0 ..............................
1 ..............................
2 ..............................
3 ..............................
4 ..............................
5 ..............................
6 ..............................
7 ..............................
8 ..............................
9 ..............................
0 ..............................
1 ..............................
2 ..............................
3 ..............................
4 ..............................
5 ..............................
6 ..............................
7 ..............................
8 ..............................
9 ..............................
0 ..............................
1 ..............................
2 ..............................
3 ..............................
4 ..............................
5 ..............................
6 ..............................
7 ..............................
8 ..............................
9 ..............................
0 ..............................
1 ..............................
2 ..............................
3 ..............................
4 ..............................
5 ..............................
6 ..............................
7 ..............................
8 ..............................
9 ..............................
0 ..............................
1 ..............................
2 ..............................
3 ..............................
4 ..............................
5 ..............................
6 ..............................
7 ..............................
8 ..............................
9 ..............................
0 ..............................
1 ..............................
2 ..............................
3 ..............................
4 .....................f........
5 ..............................
6 ..............................
7 ..............................
8 ..............................
9 ..............................
0 ..............................
1 ..............................
2 ..............................
3 .............................f
4 ..............................
5 ..............................
6 ..............................
7 ..............................

Turn = 380.
  012345678901234567890123456789
0 ..............................
1 ..............................
2 ..............................
3 ..............................
4 ..............................
5 ..............................
6 ..............................
7 ..............................
8 ..............................
9 ..............................
0 ..............................
1 ..............................
2 ..............................
3 ..............................
4 ..............................
5 ..............................
6 ..............................
7 ..............................
8 ..............................
9 ..............................
0 ..............................
1 ..............................
2 ..............................
3 ..............................
4 ..............................
5 ..............................
6 ..............................
7 ..............................
8 ..............................
9 ..............................
0 ..............................
1 ..............................
2 ..............................
3 ..............................
4 ..............................
5 ..............................
6 ..............................
7 ..............................
8 ..............................
9 ..............................
0 ..............................
1 ..............................
2 ..............................
3 ..............................
4 ..............................
5 ..............................
6 ..............................
7 ..............................
8 ..............................
9 ..............................
0 ..............................
1 ..............................
2 ..............................
3 ..............................
4 .....................f........
5 ..............................
6 ..............................
7 ..............................
8 ..............................
9 ..............................
0 ..............................
1 ..............................
2 ..............................
3 .............................f
4 ..............................
5 ..............................
6 ..............................
7 ..............................

Turn = 475.
  012345678901234567890123456789
0 ..............................
1 ..............................
2 ..............................
3 ..............................
4 ..............................
5 ..............................
6 ..............................
7 ..............................
8 ..............................
9 ..............................
0 ..............................
1 ..............................
2 ..............................
3 ..............................
4 ..............................
5 ..............................
6 ..............................
7 ..............................
8 ..............................
9 ..............................
0 ..............................
1 ..............................
2 ..............................
3 ..............................
4 ..............................
5 ..............................
6 ..............................
7 ..............................
8 ..............................
9 ..............................
0 ..............................
1 ..............................
2 ..............................
3 ..............................
4 ..............................
5 ..............................
6 ..............................
7 ..............................
8 ..............................
9 ..............................
0 ..............................
1 ..............................
2 ..............................
3 ..............................
4 ..............................
5 ..............................
6 ..............................
7 ..............................
8 ..............................
9 ..............................
0 ..............................
1 ..............................
2 ..............................
3 ..............................
4 .....................f........
5 ..............................
6 ..............................
7 ..............................
8 ..............................
9 ..............................
0 ..............................
1 ..............................
2 ..............................
3 .............................f
4 ..............................
5 ..............................
6 ..............................
7 ..............................

Turn = 570.
  012345678901234567890123456789
0 ..............................
1 ..............................
2 ..............................
3 ..............................
4 ..............................
5 ..............................
6 ..............................
7 ..............................
8 ..............................
9 ..............................
0 ..............................
1 ..............................
2 ..............................
3 ..............................
4 ..............................
5 ..............................
6 ..............................
7 ..............................
8 ..............................
9 ..............................
0 ..............................
1 ..............................
2 ..............................
3 ..............................
4 ..............................
5 ..............................
6 ..............................
7 ..............................
8 ..............................
9 ..............................
0 ..............................
1 ..............................
2 ..............................
3 ..............................
4 ..............................
5 ..............................
6 ..............................
7 ..............................
8 ..............................
9 ..............................
0 ..............................
1 ..............................
2 ..............................
3 ..............................
4 ..............................
5 ..............................
6 ..............................
7 ..............................
8 ..............................
9 ..............................
0 ..............................
1 ..............................
2 ..............................
3 ..............................
4 .....................f........
5 ..............................
6 ..............................
7 ..............................
8 ..............................
9 ..............................
0 ..............................
1 ..............................
2 ..............................
3 .............................f
4 ..............................
5 ..............................
6 ..............................
7 ..............................

Turn = 665.
  012345678901234567890123456789
0 ..............................
1 ..............................
2 ..............................
3 ..............................
4 ..............................
5 ..............................
6 ..............................
7 ..............................
8 ..............................
9 ..............................
0 ..............................
1 ..............................
2 ..............................
3 ..............................
4 ..............................
5 ..............................
6 ..............................
7 ..............................
8 ..............................
9 ..............................
0 ..............................
1 ..............................
2 ..............................
3 ..............................
4 ..............................
5 ..............................
6 ..............................
7 ..............................
8 ..............................
9 ..............................
0 ..............................
1 ..............................
2 ..............................
3 ..............................
4 ..............................
5 ..............................
6 ..............................
7 ..............................
8 ..............................
9 ..............................
0 ..............................
1 ..............................
2 ..............................
3 ..............................
4 ..............................
5 ..............................
6 ..............................
7 ..............................
8 ..............................
9 ..............................
0 ..............................
1 ..............................
2 ..............................
3 ..............................
4 .....................f........
5 ..............................
6 ..............................
7 ..............................
8 ..............................
9 ..............................
0 ..............................
1 ..............................
2 ..............................
3 .............................f
4 ..............................
5 ..............................
6 ..............................
7 ..............................

Turn = 760.
  012345678901234567890123456789
0 ..............................
1 ..............................
2 ..............................
3 ..............................
4 ..............................
5 ..............................
6 ..............................
7 ..............................
8 ..............................
9 ..............................
0 ..............................
1 ..............................
2 ..............................
3 ..............................
4 ..............................
5 ..............................
6 ..............................
7 ..............................
8 ..............................
9 ..............................
0 ..............................
1 ..............................
2 ..............................
3 ..............................
4 ..............................
5 ..............................
6 ..............................
7 ..............................
8 ..............................
9 ..............................
0 ..............................
1 ..............................
2 ..............................
3 ..............................
4 ..............................
5 ..............................
6 ..............................
7 ..............................
8 ..............................
9 ..............................
0 ..............................
1 ..............................
2 ..............................
3 ..............................
4 ..............................
5 ..............................
6 ..............................
7 ..............................
8 ..............................
9 ..............................
0 ..............................
1 ..............................
2 ..............................
3 ..............................
4 .....................f........
5 ..............................
6 ..............................
7 ..............................
8 ..............................
9 ..............................
0 ..............................
1 ..............................
2 ..............................
3 .............................f
4 ..............................
5 ..............................
6 ..............................
7 ..............................

Turn = 855.
  012345678901234567890123456789
0 ..............................
1 ..............................
2 ..............................
3 ..............................
4 ..............................
5 ..............................
6 ..............................
7 ..............................
8 ..............................
9 ..............................
0 ..............................
1 ..............................
2 ..............................
3 ..............................
4 ..............................
5 ..............................
6 ..............................
7 ..............................
8 ..............................
9 ..............................
0 ..............................
1 ..............................
2 ..............................
3 ..............................
4 ..............................
5 ..............................
6 ..............................
7 ..............................
8 ..............................
9 ..............................
0 ..............................
1 ..............................
2 ..............................
3 ..............................
4 ..............................
5 ..............................
6 ..............................
7 ..............................
8 ..............................
9 ..............................
0 ..............................
1 ..............................
2 ..............................
3 ..............................
4 ..............................
5 ..............................
6 ..............................
7 ..............................
8 ..............................
9 ..............................
0 ..............................
1 ..............................
2 ..............................
3 ..............................
4 .....................f........
5 ..............................
6 ..............................
7 ..............................
8 ..............................
9 ..............................
0 ..............................
1 ..............................
2 ..............................
3 .............................f
4 ..............................
5 ..............................
6 ..............................
7 ..............................

Turn = 950.
  012345678901234567890123456789
0 ..............................
1 ..............................
2 ..............................
3 ..............................
4 ..............................
5 ..............................
6 ..............................
7 ..............................
8 ..............................
9 ..............................
0 ..............................
1 ..............................
2 ..............................
3 ..............................
4 ..............................
5 ..............................
6 ..............................
7 ..............................
8 ..............................
9 ..............................
0 ..............................
1 ..............................
2 ..............................
3 ..............................
4 ..............................
5 ..............................
6 ..............................
7 ..............................
8 ..............................
9 ..............................
0 ..............................
1 ..............................
2 ..............................
3 ..............................
4 ..............................
5 ..............................
6 ..............................
7 ..............................
8 ..............................
9 ..............................
0 ..............................
1 ..............................
2 ..............................
3 ..............................
4 ..............................
5 ..............................
6 ..............................
7 ..............................
8 ..............................
9 ..............................
0 ..............................
1 ..............................
2 ..............................
3 ..............................
4 .....................f........
5 ..............................
6 ..............................
7 ..............................
8 ..............................
9 ..............................
0 ..............................
1 ..............................
2 ..............................
3 .............................f
4 ..............................
5 ..............................
6 ..............................
7 ..............................

Turn = 1045.
  012345678901234567890123456789
0 ..............................
1 ..............................
2 ..............................
3 ..............................
4 ..............................
5 ..............................
6 ..............................
7 ..............................
8 ..............................
9 ..............................
0 ..............................
1 ..............................
2 ..............................
3 ..............................
4 ..............................
5 ..............................
6 ..............................
7 ..............................
8 ..............................
9 ..............................
0 ..............................
1 ..............................
2 ..............................
3 ..............................
4 ..............................
5 ..............................
6 ..............................
7 ..............................
8 ..............................
9 ..............................
0 ..............................
1 ..............................
2 ..............................
3 ..............................
4 ..............................
5 ..............................
6 ..............................
7 ..............................
8 ..............................
9 ..............................
0 ..............................
1 ..............................
2 ..............................
3 ..............................
4 ..............................
5 ..............................
6 ..............................
7 ..............................
8 ..............................
9 ..............................
0 ..............................
1 ..............................
2 ..............................
3 ..............................
4 .....................f........
5 ..............................
6 ..............................
7 ..............................
8 ..............................
9 ..............................
0 ..............................
1 ..............................
2 ..............................
3 .............................f
4 ..............................
5 ..............................
6 ..............................
7 ..............................

Turn = 1140.
  012345678901234567890123456789
0 ..............................
1 ..............................
2 ..............................
3 ..............................
4 ..............................
5 ..............................
6 ..............................
7 ..............................
8 ..............................
9 ..............................
0 ..............................
1 ..............................
2 ..............................
3 ..............................
4 ..............................
5 ..............................
6 ..............................
7 ..............................
8 ..............................
9 ..............................
0 ..............................
1 ..............................
2 ..............................
3 ..............................
4 ..............................
5 ..............................
6 ..............................
7 ..............................
8 ..............................
9 ..............................
0 ..............................
1 ..............................
2 ..............................
3 ..............................
4 ..............................
5 ..............................
6 ..............................
7 ..............................
8 ..............................
9 ..............................
0 ..............................
1 ..............................
2 ..............................
3 ..............................
4 ..............................
5 ..............................
6 ..............................
7 ..............................
8 ..............................
9 ..............................
0 ..............................
1 ..............................
2 ..............................
3 ..............................
4 .....................f........
5 ..............................
6 ..............................
7 ..............................
8 ..............................
9 ..............................
0 ..............................
1 ..............................
2 ..............................
3 .............................f
4 ..............................
5 ..............................
6 ..............................
7 ..............................

Turn = 1235.
  012345678901234567890123456789
0 ..............................
1 ..............................
2 ..............................
3 ..............................
4 ..............................
5 ..............................
6 ..............................
7 ..............................
8 ..............................
9 ..............................
0 ..............................
1 ..............................
2 ..............................
3 ..............................
4 ..............................
5 ..............................
6 ..............................
7 ..............................
8 ..............................
9 ..............................
0 ..............................
1 ..............................
2 ..............................
3 ..............................
4 ..............................
5 ..............................
6 ..............................
7 ..............................
8 ..............................
9 ..............................
0 ..............................
1 ..............................
2 ..............................
3 ..............................
4 ..............................
5 ..............................
6 ..............................
7 ..............................
8 ..............................
9 ..............................
0 ..............................
1 ..............................
2 ..............................
3 ..............................
4 ..............................
5 ..............................
6 ..............................
7 ..............................
8 ..............................
9 ..............................
0 ..............................
1 ..............................
2 ..............................
3 ..............................
4 .....................f........
5 ..............................
6 ..............................
7 ..............................
8 ..............................
9 ..............................
0 ..............................
1 ..............................
2 ..............................
3 .............................f
4 ..............................
5 ..............................
6 ..............................
7 ..............................

Turn = 1330.
  012345678901234567890123456789
0 ..............................
1 ..............................
2 ..............................
3 ..............................
4 ..............................
5 ..............................
6 ..............................
7 ..............................
8 ..............................
9 ..............................
0 ..............................
1 ..............................
2 ..............................
3 ..............................
4 ..............................
5 ..............................
6 ..............................
7 ..............................
8 ..............................
9 ..............................
0 ..............................
1 ..............................
2 ..............................
3 ..............................
4 ..............................
5 ..............................
6 ..............................
7 ..............................
8 ..............................
9 ..............................
0 ..............................
1 ..............................
2 ..............................
3 ..............................
4 ..............................
5 ..............................
6 ..............................
7 ..............................
8 ..............................
9 ..............................
0 ..............................
1 ..............................
2 ..............................
3 ..............................
4 ..............................
5 ..............................
6 ..............................
7 ..............................
8 ..............................
9 ..............................
0 ..............................
1 ..............................
2 ..............................
3 ..............................
4 .....................f........
5 ..............................
6 ..............................
7 ..............................
8 ..............................
9 ..............................
0 ..............................
1 ..............................
2 ..............................
3 .............................f
4 ..............................
5 ..............................
6 ..............................
7 ..............................

*** Darwin 46x7 ***
Turn = 0.
  0123456
0 .......
1 .......
2 .......
3 .......
4 .......
5 .......
6 .......
7 .....f.
8 .......
9 .......
0 .......
1 .......
2 .......
3 .......
4 .......
5 .......
6 .......
7 .......
8 .......
9 .......
0 .......
1 .......
2 .......
3 .......
4 .......
5 .......
6 .......
7 .......
8 .......
9 .......
0 .......
1 .......
2 .......
3 .......
4 ....t..
5 .......
6 .......
7 .......
8 .......
9 .......
0 .......
1 .......
2 .......
3 .......
4 .......
5 .......

Turn = 40.
  0123456
0 .......
1 .......
2 .......
3 .......
4 .......
5 .......
6 .......
7 .....f.
8 .......
9 .......
0 .......
1 .......
2 .......
3 .......
4 .......
5 .......
6 .......
7 .......
8 .......
9 .......
0 .......
1 .......
2 .......
3 .......
4 .......
5 .......
6 .......
7 .......
8 .......
9 .......
0 .......
1 .......
2 .......
3 .......
4 ....t..
5 .......
6 .......
7 .......
8 .......
9 .......
0 .......
1 .......
2 .......
3 .......
4 .......
5 .......

Turn = 80.
  0123456
0 .......
1 .......
2 .......
3 .......
4 .......
5 .......
6 .......
7 .....f.
8 .......
9 .......
0 .......
1 .......
2 .......
3 .......
4 .......
5 .......
6 .......
7 .......
8 .......
9 .......
0 .......
1 .......
2 .......
3 .......
4 .......
5 .......
6 .......
7 .......
8 .......
9 .......
0 .......
1 .......
2 .......
3 .......
4 ....t..
5 .......
6 .......
7 .......
8 .......
9 .......
0 .......
1 .......
2 .......
3 .......
4 .......
5 .......

Turn = 120.
  0123456
0 .......
1 .......
2 .......
3 .......
4 .......
5 .......
6 .......
7 .....f.
8 .......
9 .......
0 .......
1 .......
2 .......
3 .......
4 .......
5 .......
6 .......
7 .......
8 .......
9 .......
0 .......
1 .......
2 .......
3 .......
4 .......
5 .......
6 .......
7 .......
8 .......
9 .......
0 .......
1 .......
2 .......
3 .......
4 ....t..
5 .......
6 .......
7 .......
8 .......
9 .......
0 .......
1 .......
2 .......
3 .......
4 .......
5 .......

Turn = 160.
  0123456
0 .......
1 .......
2 .......
3 .......
4 .......
5 .......
6 .......
7 .....f.
8 .......
9 .......
0 .......
1 .......
2 .......
3 .......
4 .......
5 .......
6 .......
7 .......
8 .......
9 .......
0 .......
1 .......
2 .......
3 .......
4 .......
5 .......
6 .......
7 .......
8 .......
9 .......
0 .......
1 .......
2 .......
3 .......
4 ....t..
5 .......
6 .......
7 .......
8 .......
9 .......
0 .......
1 .......
2 .......
3 .......
4 .......
5 .......

Turn = 200.
  0123456
0 .......
1 .......
2 .......
3 .......
4 .......
5 .......
6 .......
7 .....f.
8 .......
9 .......
0 .......
1 .......
2 .......
3 .......
4 .......
5 .......
6 .......
7 .......
8 .......
9 .......
0 .......
1 .......
2 .......
3 .......
4 .......
5 .......
6 .......
7 .......
8 .......
9 .......
0 .......
1 .......
2 .......
3 .......
4 ....t..
5 .......
6 .......
7 .......
8 .......
9 .......
0 .......
1 .......
2 .......
3 .......
4 .......
5 .......

Turn = 240.
  0123456
0 .......
1 .......
2 .......
3 .......
4 .......
5 .......
6 .......
7 .....f.
8 .......
9 .......
0 .......
1 .......
2 .......
3 .......
4 .......
5 .......
6 .......
7 .......
8 .......
9 .......
0 .......
1 .......
2 .......
3 .......
4 .......
5 .......
6 .......
7 .......
8 .......
9 .......
0 .......
1 .......
2 .......
3 .......
4 ....t..
5 .......
6 .......
7 .......
8 .......
9 .......
0 .......
1 .......
2 .......
3 .......
4 .......
5 .......

Turn = 280.
  0123456
0 .......
1 .......
2 .......
3 .......
4 .......
5 .......
6 .......
7 .....f.
8 .......
9 .......
0 .......
1 .......
2 .......
3 .......
4 .......
5 .......
6 .......
7 .......
8 .......
9 .......
0 .......
1 .......
2 .......
3 .......
4 .......
5 .......
6 .......
7 .......
8 .......
9 .......
0 .......
1 .......
2 .......
3 .......
4 ....t..
5 .......
6 .......
7 .......
8 .......
9 .......
0 .......
1 .......
2 .......
3 .......
4 .......
5 .......

Turn = 320.
  0123456
0 .......
1 .......
2 .......
3 .......
4 .......
5 .......
6 .......
7 .....f.
8 .......
9 .......
0 .......
1 .......
2 .......
3 .......
4 .......
5 .......
6 .......
7 .......
8 .......
9 .......
0 .......
1 .......
2 .......
3 .......
4 .......
5 .......
6 .......
7 .......
8 .......
9 .......
0 .......
1 .......
2 .......
3 .......
4 ....t..
5 .......
6 .......
7 .......
8 .......
9 .......
0 .......
1 .......
2 .......
3 .......
4 .......
5 .......

Turn = 360.
  0123456
0 .......
1 .......
2 .......
3 .......
4 .......
5 .......
6 .......
7 .....f.
8 .......
9 .......
0 .......
1 .......
2 .......
3 .......
4 .......
5 .......
6 .......
7 .......
8 .......
9 .......
0 .......
1 .......
2 .......
3 .......
4 .......
5 .......
6 .......
7 .......
8 .......
9 .......
0 .......
1 .......
2 .......
3 .......
4 ....t..
5 .......
6 .......
7 .......
8 .......
9 .......
0 .......
1 .......
2 .......
3 .......
4 .......
5 .......

Turn = 400.
  0123456
0 .......
1 .......
2 .......
3 .......
4 .......
5 .......
6 .......
7 .....f.
8 .......
9 .......
0 .......
1 .......
2 .......
3 .......
4 .......
5 .......
6 .......
7 .......
8 .......
9 .......
0 .......
1 .......
2 .......
3 .......
4 .......
5 .......
6 .......
7 .......
8 .......
9 .......
0 .......
1 .......
2 .......
3 .......
4 ....t..
5 .......
6 .......
7 .......
8 .......
9 .......
0 .......
1 .......
2 .......
3 .......
4 .......
5 .......

Turn = 440.
  0123456
0 .......
1 .......
2 .......
3 .......
4 .......
5 .......
6 .......
7 .....f.
8 .......
9 .......
0 .......
1 .......
2 .......
3 .......
4 .......
5 .......
6 .......
7 .......
8 .......
9 .......
0 .......
1 .......
2 .......
3 .......
4 .......
5 .......
6 .......
7 .......
8 .......
9 .......
0 .......
1 .......
2 .......
3 .......
4 ....t..
5 .......
6 .......
7 .......
8 .......
9 .......
0 .......
1 .......
2 .......
3 .......
4 .......
5 .......

Turn = 480.
  0123456
0 .......
1 .......
2 .......
3 .......
4 .......
5 .......
6 .......
7 .....f.
8 .......
9 .......
0 .......
1 .......
2 .......
3 .......
4 .......
5 .......
6 .......
7 .......
8 .......
9 .......
0 .......
1 .......
2 .......
3 .......
4 .......
5 .......
6 .......
7 .......
8 .......
9 .......
0 .......
1 .......
2 .......
3 .......
4 ....t..
5 .......
6 .......
7 .......
8 .......
9 .......
0 .......
1 .......
2 .......
3 .......
4 .......
5 .......

Turn = 520.
  0123456
0 .......
1 .......
2 .......
3 .......
4 .......
5 .......
6 .......
7 .....f.
8 .......
9 .......
0 .......
1 .......
2 .......
3 .......
4 .......
5 .......
6 .......
7 .......
8 .......
9 .......
0 .......
1 .......
2 .......
3 .......
4 .......
5 .......
6 .......
7 .......
8 .......
9 .......
0 .......
1 .......
2 .......
3 .......
4 ....t..
5 .......
6 .......
7 .......
8 .......
9 .......
0 .......
1 .......
2 .......
3 .......
4 .......
5 .......

Turn = 560.
  0123456
0 .......
1 .......
2 .......
3 .......
4 .......
5 .......
6 .......
7 .....f.
8 .......
9 .......
0 .......
1 .......
2 .......
3 .......
4 .......
5 .......
6 .......
7 .......
8 .......
9 .......
0 .......
1 .......
2 .......
3 .......
4 .......
5 .......
6 .......
7 .......
8 .......
9 .......
0 .......
1 .......
2 .......
3 .......
4 ....t..
5 .......
6 .......
7 .......
8 .......
9 .......
0 .......
1 .......
2 .......
3 .......
4 .......
5 .......

Turn = 600.
  0123456
0 .......
1 .......
2 .......
3 .......
4 .......
5 .......
6 .......
7 .....f.
8 .......
9 .......
0 .......
1 .......
2 .......
3 .......
4 .......
5 .......
6 .......
7 .......
8 .......
9 .......
0 .......
1 .......
2 .......
3 .......
4 .......
5 .......
6 .......
7 .......
8 .......
9 .......
0 .......
1 .......
2 .......
3 .......
4 ....t..
5 .......
6 .......
7 .......
8 .......
9 .......
0 .......
1 .......
2 .......
3 .......
4 .......
5 .......

Turn = 640.
  0123456
0 .......
1 .......
2 .......
3 .......
4 .......
5 .......
6 .......
7 .....f.
8 .......
9 .......
0 .......
1 .......
2 .......
3 .......
4 .......
5 .......
6 .......
7 .......
8 .......
9 .......
0 .......
1 .......
2 .......
3 .......
4 .......
5 .......
6 .......
7 .......
8 .......
9 .......
0 .......
1 .......
2 .......
3 .......
4 ....t..
5 .......
6 .......
7 .......
8 .......
9 .......
0 .......
1 .......
2 .......
3 .......
4 .......
5 .......

Turn = 680.
  0123456
0 .......
1 .......
2 .......
3 .......
4 .......
5 .......
6 .......
7 .....f.
8 .......
9 .......
0 .......
1 .......
2 .......
3 .......
4 .......
5 .......
6 .......
7 .......
8 .......
9 .......
0 .......
1 .......
2 .......
3 .......
4 .......
5 .......
6 .......
7 .......
8 .......
9 .......
0 .......
1 .......
2 .......
3 .......
4 ....t..
5 .......
6 .......
7 .......
8 .......
9 .......
0 .......
1 .......
2 .......
3 .......
4 .......
5 .......

Turn = 720.
  0123456
0 .......
1 .......
2 .......
3 .......
4 .......
5 .......
6 .......
7 .....f.
8 .......
9 .......
0 .......
1 .......
2 .......
3 .......
4 .......
5 .......
6 .......
7 .......
8 .......
9 .......
0 .......
1 .......
2 .......
3 .......
4 .......
5 .......
6 .......
7 .......
8 .......
9 .......
0 .......
1 .......
2 .......
3 .......
4 ....t..
5 .......
6 .......
7 .......
8 .......
9 .......
0 .......
1 .......
2 .......
3 .......
4 .......
5 .......

Turn = 760.
  0123456
0 .......
1 .......
2 .......
3 .......
4 .......
5 .......
6 .......
7 .....f.
8 .......
9 .......
0 .......
1 .......
2 .......
3 .......
4 .......
5 .......
6 .......
7 .......
8 .......
9 .......
0 .......
1 .......
2 .......
3 .......
4 .......
5 .......
6 .......
7 .......
8 .......
9 .......
0 .......
1 .......
2 .......
3 .......
4 ....t..
5 .......
6 .......
7 .......
8 .......
9 .......
0 .......
1 .......
2 .......
3 .......
4 .......
5 .......

Turn = 800.
  0123456
0 .......
1 .......
2 .......
3 .......
4 .......
5 .......
6 .......
7 .....f.
8 .......
9 .......
0 .......
1 .......
2 .......
3 .......
4 .......
5 .......
6 .......
7 .......
8 .......
9 .......
0 .......
1 .......
2 .......
3 .......
4 .......
5 .......
6 .......
7 .......
8 .......
9 .......
0 .......
1 .......
2 .......
3 .......
4 ....t..
5 .......
6 .......
7 .......
8 .......
9 .......
0 .......
1 .......
2 .......
3 .......
4 .......
5 .......

Turn = 840.
  0123456
0 .......
1 .......
2 .......
3 .......
4 .......
5 .......
6 .......
7 .....f.
8 .......
9 .......
0 .......
1 .......
2 .......
3 .......
4 .......
5 .......
6 .......
7 .......
8 .......
9 .......
0 .......
1 .......
2 .......
3 .......
4 .......
5 .......
6 .......
7 .......
8 .......
9 .......
0 .......
1 .......
2 .......
3 .......
4 ....t..
5 .......
6 .......
7 .......
8 .......
9 .......
0 .......
1 .......
2 .......
3 .......
4 .......
5 .......

Turn = 880.
  0123456
0 .......
1 .......
2 .......
3 .......
4 .......
5 .......
6 .......
7 .....f.
8 .......
9 .......
0 .......
1 .......
2 .......
3 .......
4 .......
5 .......
6 .......
7 .......
8 .......
9 .......
0 .......
1 .......
2 .......
3 .......
4 .......
5 .......
6 .......
7 .......
8 .......
9 .......
0 .......
1 .......
2 .......
3 .......
4 ....t..
5 .......
6 .......
7 .......
8 .......
9 .......
0 .......
1 .......
2 .......
3 .......
4 .......
5 .......

Turn = 920.
  0123456
0 .......
1 .......
2 .......
3 .......
4 .......
5 .......
6 .......
7 .....f.
8 .......
9 .......
0 .......
1 .......
2 .......
3 .......
4 .......
5 .......
6 .......
7 .......
8 .......
9 .......
0 .......
1 .......
2 .......
3 .......
4 .......
5 .......
6 .......
7 .......
8 .......
9 .......
0 .......
1 .......
2 .......
3 .......
4 ....t..
5 .......
6 .......
7 .......
8 .......
9 .......
0 .......
1 .......
2 .......
3 .......
4 .......
5 .......

Turn = 960.
  0123456
0 .......
1 .......
2 .......
3 .......
4 .......
5 .......
6 .......
7 .....f.
8 .......
9 .......
0 .......
1 .......
2 .......
3 .......
4 .......
5 .......
6 .......
7 .......
8 .......
9 .......
0 .......
1 .......
2 .......
3 .......
4 .......
5 .......
6 .......
7 .......
8 .......
9 .......
0 .......
1 .......
2 .......
3 .......
4 ....t..
5 .......
6 .......
7 .......
8 .......
9 .......
0 .......
1 .......
2 .......
3 .......
4 .......
5 .......

Turn = 1000.
  0123456
0 .......
1 .......
2 .......
3 .......
4 .......
5 .......
6 .......
7 .....f.
8 .......
9 .......
0 .......
1 .......
2 .......
3 .......
4 .......
5 .......
6 .......
7 .......
8 .......
9 .......
0 .......
1 .......
2 .......
3 .......
4 .......
5 .......
6 .......
7 .......
8 .......
9 .......
0 .......
1 .......
2 .......
3 .......
4 ....t..
5 .......
6 .......
7 .......
8 .......
9 .......
0 .......
1 .......
2 .......
3 .......
4 .......
5 .......

Turn = 1040.
  0123456
0 .......
1 .......
2 .......
3 .......
4 .......
5 .......
6 .......
7 .....f.
8 .......
9 .......
0 .......
1 .......
2 .......
3 .......
4 .......
5 .......
6 .......
7 .......
8 .......
9 .......
0 .......
1 .......
2 .......
3 .......
4 .......
5 .......
6 .......
7 .......
8 .......
9 .......
0 .......
1 .......
2 .......
3 .......
4 ....t..
5 .......
6 .......
7 .......
8 .......
9 .......
0 .......
1 .......
2 .......
3 .......
4 .......
5 .......

Turn = 1080.
  0123456
0 .......
1 .......
2 .......
3 .......
4 .......
5 .......
6 .......
7 .....f.
8 .......
9 .......
0 .......
1 .......
2 .......
3 .......
4 .......
5 .......
6 .......
7 .......
8 .......
9 .......
0 .......
1 .......
2 .......
3 .......
4 .......
5 .......
6 .......
7 .......
8 .......
9 .......
0 .......
1 .......
2 .......
3 .......
4 ....t..
5 .......
6 .......
7 .......
8 .......
9 .......
0 .......
1 .......
2 .......
3 .......
4 .......
5 .......

Turn = 1120.
  0123456
0 .......
1 .......
2 .......
3 .......
4 .......
5 .......
6 .......
7 .....f.
8 .......
9 .......
0 .......
1 .......
2 .......
3 .......
4 .......
5 .......
6 .......
7 .......
8 .......
9 .......
0 .......
1 .......
2 .......
3 .......
4 .......
5 .......
6 .......
7 .......
8 .......
9 .......
0 .......
1 .......
2 .......
3 .......
4 ....t..
5 .......
6 .......
7 .......
8 .......
9 .......
0 .......
1 .......
2 .......
3 .......
4 .......
5 .......

Turn = 1160.
  0123456
0 .......
1 .......
2 .......
3 .......
4 .......
5 .......
6 .......
7 .....f.
8 .......
9 .......
0 .......
1 .......
2 .......
3 .......
4 .......
5 .......
6 .......
7 .......
8 .......
9 .......
0 .......
1 .......
2 .......
3 .......
4 .......
5 .......
6 .......
7 .......
8 .......
9 .......
0 .......
1 .......
2 .......
3 .......
4 ....t..
5 .......
6 .......
7 .......
8 .......
9 .......
0 .......
1 .......
2 .......
3 .......
4 .......
5 .......

Turn = 1200.
  0123456
0 .......
1 .......
2 .......
3 .......
4 .......
5 .......
6 .......
7 .....f.
8 .......
9 .......
0 .......
1 .......
2 .......
3 .......
4 .......
5 .......
6 .......
7 .......
8 .......
9 .......
0 .......
1 .......
2 .......
3 .......
4 .......
5 .......
6 .......
7 .......
8 .......
9 .......
0 .......
1 .......
2 .......
3 .......
4 ....t..
5 .......
6 .......
7 .......
8 .......
9 .......
0 .......
1 .......
2 .......
3 .......
4 .......
5 .......

Turn = 1240.
  0123456
0 .......
1 .......
2 .......
3 .......
4 .......
5 .......
6 .......
7 .....f.
8 .......
9 .......
0 .......
1 .......
2 .......
3 .......
4 .......
5 .......
6 .......
7 .......
8 .......
9 .......
0 .......
1 .......
2 .......
3 .......
4 .......
5 .......
6 .......
7 .......
8 .......
9 .......
0 .......
1 .......
2 .......
3 .......
4 ....t..
5 .......
6 .......
7 .......
8 .......
9 .......
0 .......
1 .......
2 .......
3 .......
4 .......
5 .......

Turn = 1280.
  0123456
0 .......
1 .......
2 .......
3 .......
4 .......
5 .......
6 .......
7 .....f.
8 .......
9 .......
0 .......
1 .......
2 .......
3 .......
4 .......
5 .......
6 .......
7 .......
8 .......
9 .......
0 .......
1 .......
2 .......
3 .......
4 .......
5 .......
6 .......
7 .......
8 .......
9 .......
0 .......
1 .......
2 .......
3 .......
4 ....t..
5 .......
6 .......
7 .......
8 .......
9 .......
0 .......
1 .......
2 .......
3 .......
4 .......
5 .......

Turn = 1320.
  0123456
0 .......
1 .......
2 .......
3 .......
4 .......
5 .......
6 .......
7 .....f.
8 .......
9 .......
0 .......
1 .......
2 .......
3 .......
4 .......
5 .......
6 .......
7 .......
8 .......
9 .......
0 .......
1 .......
2 .......
3 .......
4 .......
5 .......
6 .......
7 .......
8 .......
9 .......
0 .......
1 .......
2 .......
3 .......
4 ....t..
5 .......
6 .......
7 .......
8 .......
9 .......
0 .......
1 .......
2 .......
3 .......
4 .......
5 .......

Turn = 1360.
  0123456
0 .......
1 .......
2 .......
3 .......
4 .......
5 .......
6 .......
7 .....f.
8 .......
9 .......
0 .......
1 .......
2 .......
3 .......
4 .......
5 .......
6 .......
7 .......
8 .......
9 .......
0 .......
1 .......
2 .......
3 .......
4 .......
5 .......
6 .......
7 .......
8 .......
9 .......
0 .......
1 .......
2 .......
3 .......
4 ....t..
5 .......
6 .......
7 .......
8 .......
9 .......
0 .......
1 .......
2 .......
3 .......
4 .......
5 .......

Turn = 1400.
  0123456
0 .......
1 .......
2 .......
3 .......
4 .......
5 .......
6 .......
7 .....f.
8 .......
9 .......
0 .......
1 .......
2 .......
3 .......
4 .......
5 .......
6 .......
7 .......
8 .......
9 .......
0 .......
1 .......
2 .......
3 .......
4 .......
5 .......
6 .......
7 .......
8 .......
9 .......
0 .......
1 .......
2 .......
3 .......
4 ....t..
5 .......
6 .......
7 .......
8 .......
9 .......
0 .......
1 .......
2 .......
3 .......
4 .......
5 .......

Turn = 1440.
  0123456
0 .......
1 .......
2 .......
3 .......
4 .......
5 .......
6 .......
7 .....f.
8 .......
9 .......
0 .......
1 .......
2 .......
3 .......
4 .......
5 .......
6 .......
7 .......
8 .......
9 .......
0 .......
1 .......
2 .......
3 .......
4 .......
5 .......
6 .......
7 .......
8 .......
9 .......
0 .......
1 .......
2 .......
3 .......
4 ....t..
5 .......
6 .......
7 .......
8 .......
9 .......
0 .......
1 .......
2 .......
3 .......
4 .......
5 .......

Turn = 1480.
  0123456
0 .......
1 .......
2 .......
3 .......
4 .......
5 .......
6 .......
7 .....f.
8 .......
9 .......
0 .......
1 .......
2 .......
3 .......
4 .......
5 .......
6 .......
7 .......
8 .......
9 .......
0 .......
1 .......
2 .......
3 .......
4 .......
5 .......
6 .......
7 .......
8 .......
9 .......
0 .......
1 .......
2 .......
3 .......
4 ....t..
5 .......
6 .......
7 .......
8 .......
9 .......
0 .......
1 .......
2 .......
3 .......
4 .......
5 .......

Turn = 1520.
  0123456
0 .......
1 .......
2 .......
3 .......
4 .......
5 .......
6 .......
7 .....f.
8 .......
9 .......
0 .......
1 .......
2 .......
3 .......
4 .......
5 .......
6 .......
7 .......
8 .......
9 .......
0 .......
1 .......
2 .......
3 .......
4 .......
5 .......
6 .......
7 .......
8 .......
9 .......
0 .......
1 .......
2 .......
3 .......
4 ....t..
5 .......
6 .......
7 .......
8 .......
9 .......
0 .......
1 .......
2 .......
3 .......
4 .......
5 .......

Turn = 1560.
  0123456
0 .......
1 .......
2 .......
3 .......
4 .......
5 .......
6 .......
7 .....f.
8 .......
9 .......
0 .......
1 .......
2 .......
3 .......
4 .......
5 .......
6 .......
7 .......
8 .......
9 .......
0 .......
1 .......
2 .......
3 .......
4 .......
5 .......
6 .......
7 .......
8 .......
9 .......
0 .......
1 .......
2 .......
3 .......
4 ....t..
5 .......
6 .......
7 .......
8 .......
9 .......
0 .......
1 .......
2 .......
3 .......
4 .......
5 .......

Turn = 1600.
  0123456
0 .......
1 .......
2 .......
3 .......
4 .......
5 .......
6 .......
7 .....f.
8 .......
9 .......
0 .......
1 .......
2 .......
3 .......
4 .......
5 .......
6 .......
7 .......
8 .......
9 .......
0 .......
1 .......
2 .......
3 .......
4 .......
5 .......
6 .......
7 .......
8 .......
9 .......
0 .......
1 .......
2 .......
3 .......
4 ....t..
5 .......
6 .......
7 .......
8 .......
9 .......
0 .......
1 .......
2 .......
3 .......
4 .......
5 .......

Turn = 1640.
  0123456
0 .......
1 .......
2 .......
3 .......
4 .......
5 .......
6 .......
7 .....f.
8 .......
9 .......
0 .......
1 .......
2 .......
3 .......
4 .......
5 .......
6 .......
7 .......
8 .......
9 .......
0 .......
1 .......
2 .......
3 .......
4 .......
5 .......
6 .......
7 .......
8 .......
9 .......
0 .......
1 .......
2 .......
3 .......
4 ....t..
5 .......
6 .......
7 .......
8 .......
9 .......
0 .......
1 .......
2 .......
3 .......
4 .......
5 .......

Turn = 1680.
  0123456
0 .......
1 .......
2 .......
3 .......
4 .......
5 .......
6 .......
7 .....f.
8 .......
9 .......
0 .......
1 .......
2 .......
3 .......
4 .......
5 .......
6 .......
7 .......
8 .......
9 .......
0 .......
1 .......
2 .......
3 .......
4 .......
5 .......
6 .......
7 .......
8 .......
9 .......
0 .......
1 .......
2 .......
3 .......
4 ....t..
5 .......
6 .......
7 .......
8 .......
9 .......
0 .......
1 .......
2 .......
3 .......
4 .......
5 .......

Turn = 1720.
  0123456
0 .......
1 .......
2 .......
3 .......
4 .......
5 .......
6 .......
7 .....f.
8 .......
9 .......
0 .......
1 .......
2 .......
3 .......
4 .......
5 .......
6 .......
7 .......
8 .......
9 .......
0 .......
1 .......
2 .......
3 .......
4 .......
5 .......
6 .......
7 .......
8 .......
9 .......
0 .......
1 .......
2 .......
3 .......
4 ....t..
5 .......
6 .......
7 .......
8 .......
9 .......
0 .......
1 .......
2 .......
3 .......
4 .......
5 .......

*** Darwin 16x10 ***
Turn = 0.
  0123456789
0 ..........
1 ..........
2 ..........
3 ......r...
4 ..........
5 .....t....
6 ..r.t.....
7 ..r..t...f
8 ..........
9 ...r......
0 ..........
1 ..........
2 ..r.r.....
3 ..........
4 .f........
5 .........f

Turn = 1.
  0123456789
0 ..........
1 ..........
2 ..........
3 .....r....
4 ..........
5 .....t....
6 .rr.t.....
7 .....t...f
8 ..........
9 ..........
0 ...r......
1 ..r.......
2 ..........
3 ....r.....
4 .f........
5 .........f

Turn = 2.
  0123456789
0 ..........
1 ..........
2 ..........
3 ....r.....
4 ..........
5 ..r..t....
6 r...t.....
7 .....t...f
8 ..........
9 ..........
0 ..r.......
1 ...r......
2 ..........
3 ..........
4 .f..r.....
5 .........f

Turn = 3.
  0123456789
0 ..........
1 ..........
2 ..........
3 ...r......
4 ..r.......
5 .....t....
6 r...t.....
7 .....t...f
8 ..........
9 ..r.......
0 ..........
1 ..........
2 ...r......
3 ..........
4 .f........
5 ....r....f

Turn = 4.
  0123456789
0 ..........
1 ..........
2 ..........
3 ..r.......
4 ..r.......
5 r....t....
6 ....t.....
7 .....t...f
8 ..r.......
9 ..........
0 ..........
1 ..........
2 ..........
3 ...r......
4 .f........
5 ....r....f

Turn = 5.
  0123456789
0 ..........
1 ..........
2 ..........
3 .r........
4 rr........
5 .....t....
6 ....t.....
7 ..r..t...f
8 ..........
9 ..........
0 ..........
1 ..........
2 ..........
3 ..........
4 .f.r......
5 ...r.....f

Turn = 6.
  0123456789
0 ..........
1 ..........
2 ..........
3 r.........
4 rr........
5 .....t....
6 ..r.t.....
7 .....t...f
8 ..........
9 ..........
0 ..........
1 ..........
2 ..........
3 ..........
4 .f.r......
5 ..r......f

Turn = 7.
  0123456789
0 ..........
1 ..........
2 ..........
3 rr........
4 r.........
5 ..r..t....
6 ....t.....
7 .....t...f
8 ..........
9 ..........
0 ..........
1 ..........
2 ..........
3 ..........
4 .fr.......
5 .r.......f

Turn = 8.
  0123456789
0 ..........
1 ..........
2 .r........
3 r.........
4 r.r.......
5 .....t....
6 ....t.....
7 .....t...f
8 ..........
9 ..........
0 ..........
1 ..........
2 ..........
3 ..........
4 .rr.......
5 r........f

Turn = 9.
  0123456789
0 ..........
1 .r........
2 ..........
3 r.r.......
4 .r........
5 .....t....
6 ....t.....
7 .....t...f
8 ..........
9 ..........
0 ..........
1 ..........
2 ..........
3 ..........
4 .r........
5 rr.......f

Turn = 10.
  0123456789
0 .r........
1 ..........
2 ..r.......
3 ..........
4 r.r.......
5 .....t....
6 ....t.....
7 .....t...f
8 ..........
9 ..........
0 ..........
1 ..........
2 ..........
3 ..........
4 r.........
5 rr.......f

Turn = 11.
  0123456789
0 .r........
1 ..r.......
2 ..........
3 ..........
4 ...r......
5 r....t....
6 ....t.....
7 .....t...f
8 ..........
9 ..........
0 ..........
1 ..........
2 ..........
3 ..........
4 r.........
5 rr.......f

Turn = 12.
  0123456789
0 ..r.......
1 ..r.......
2 ..........
3 ..........
4 ....r.....
5 .....t....
6 r...t.....
7 .....t...f
8 ..........
9 ..........
0 ..........
1 ..........
2 ..........
3 ..........
4 r.........
5 rr.......f

Turn = 13.
  0123456789
0 ...r......
1 .r........
2 ..........
3 ..........
4 .....r....
5 .....t....
6 ....t.....
7 r....t...f
8 ..........
9 ..........
0 ..........
1 ..........
2 ..........
3 ..........
4 .r........
5 r.r......f

Turn = 14.
  0123456789
0 ....r.....
1 r.........
2 ..........
3 ..........
4 ......r...
5 .....t....
6 ....t.....
7 .....t...f
8 r.........
9 ..........
0 ..........
1 ..........
2 ..........
3 ..........
4 r.r.......
5 ...r.....f

*** Darwin 16x5 ***
Turn = 0.
  01234
0 f....
1 .....
2 .h...
3 ....h
4 .....
5 .....
6 .....
7 .....
8 .....
9 ...hr
0 t....
1 .....
2 ht...
3 .....
4 .....
5 ..h..

Turn = 50.
  01234
0 .....
1 .....
2 .r...
3 .....
4 .....
5 ..r..
6 .....
7 r..r.
8 .....
9 .....
0 .....
1 ....r
2 r....
3 r....
4 .....
5 ...rr

*** Darwin 1x12 ***
Turn = 0.
  012345678901
0 h......ht...

Turn = 19.
  012345678901
0 h......tt...

Turn = 38.
  012345678901
0 h......tt...

Turn = 57.
  012345678901
0 h......tt...

*** Darwin 10x14 ***
Turn = 0.
  01234567890123
0 ..............
1 ...r..........
2 .....r........
3 ..............
4 ..............
5 ...r..........
6 ..............
7 ..............
8 ..............
9 ..............

Turn = 60.
  01234567890123
0 ..............
1 ..............
2 ..............
3 ..............
4 ......r......r
5 ......r.......
6 ..............
7 ..............
8 ..............
9 ..............

*** Darwin 8x16 ***
Turn = 0.
  0123456789012345
0 r..............t
1 ............r...
2 .......f........
3 ..............r.
4 ................
5 ............t...
6 ................
7 ................

Turn = 18.
  0123456789012345
0 ..............r.
1 ................
2 .......f......r.
3 ................
4 ............t...
5 ............t...
6 ................
7 ......r.........

*** Darwin 4x17 ***
Turn = 0.
  01234567890123456
0 .................
1 .................
2 ..t..............
3 .................

Turn = 51.
  01234567890123456
0 .................
1 .................
2 ..t..............
3 .................

*** Darwin 11x10 ***
Turn = 0.
  0123456789
0 ..........
1 ..........
2 ..........
3 .......f.f
4 .......r..
5 ..........
6 .f........
7 ........t.
8 .....ft...
9 t.....t...
0 ...t......

Turn = 21.
  0123456789
0 ..........
1 ..........
2 r.........
3 ..........
4 ..........
5 ..........
6 .f........
7 ........t.
8 r....tt...
9 ......t...
0 r..t.....r

*** Darwin 19x3 ***
Turn = 0.
  012
0 ...
1 ...
2 ...
3 tf.
4 ...
5 ...
6 ...
7 ...
8 ...
9 ...
0 r..
1 ...
2 ...
3 tth
4 ...
5 ...
6 ..r
7 ..r
8 .r.

Turn = 22.
  012
0 ...
1 ...
2 ...
3 tt.
4 .r.
5 .r.
6 ...
7 ..r
8 ...
9 ...
0 ...
1 ...
2 ...
3 t..
4 t..
5 t..
6 t..
7 ...
8 ...

*** Darwin 7x5 ***
Turn = 0.
  01234
0 .....
1 .f...
2 .....
3 .h..h
4 ...r.
5 .....
6 .....

Turn = 30.
  01234
0 ...rr
1 .f...
2 .....
3 ....r
4 .....
5 .....
6 .....

*** Darwin 14x5 ***
Turn = 0.
  01234
0 .....
1 .r...
2 ...h.
3 .....
4 .....
5 f....
6 .t...
7 ....h
8 ...h.
9 .....
0 .....
1 h....
2 .t...
3 .f...

Turn = 32.
  01234
0 .....
1 .....
2 .....
3 .....
4 .....
5 tt.h.
6 .t.h.
7 ....h
8 .....
9 .....
0 .....
1 ....h
2 .t...
3 .t...

*** Darwin 17x9 ***
Turn = 0.
  012345678
0 .........
1 f........
2 ..f......
3 .........
4 .........
5 ...f.....
6 ....h...h
7 .........
8 ....h....
9 .t.t.....
0 .....h...
1 .........
2 ......h..
3 .........
4 ........f
5 .........
6 .........

Turn = 12.
  012345678
0 ....h....
1 f........
2 ..f......
3 .........
4 .........
5 ...f.....
6 hh.......
7 .........
8 .........
9 .t.t.....
0 .........
1 .........
2 ........h
3 .........
4 ........f
5 .........
6 .....h...

*** Darwin 4x5 ***
Turn = 0.
  01234
0 .....
1 .....
2 ...f.
3 .....

Turn = 47.
  01234
0 .....
1 .....
2 ...f.
3 .....

*** Darwin 16x10 ***
Turn = 0.
  0123456789
0 ..........
1 ..........
2 ..........
3 .......t..
4 ..........
5 ....t.....
6 ..........
7 ..........
8 .....h....
9 ..........
0 ..........
1 ..........
2 ..........
3 ..........
4 ..........
5 ..........

Turn = 54.
  0123456789
0 ..........
1 ..........
2 ..........
3 .......t..
4 ..........
5 ....t.....
6 ..........
7 ..........
8 h.........
9 ..........
0 ..........
1 ..........
2 ..........
3 ..........
4 ..........
5 ..........

*** Darwin 1x4 ***
Turn = 0.
  0123
0 h.tt

Turn = 3.
  0123
0 .ttt

Turn = 6.
  0123
0 .ttt

Turn = 9.
  0123
0 .ttt

Turn = 12.
  0123
0 .ttt

*** Darwin 10x5 ***
Turn = 0.
  01234
0 ..fr.
1 .f...
2 .....
3 t....
4 ffh.h
5 ..rf.
6 .h.h.
7 ...r.
8 ...ff
9 ...t.

Turn = 5.
  01234
0 .....
1 .f...
2 .....
3 t.rr.
4 tt.hr
5 .h.fr
6 h....
7 r....
8 .....
9 ..ttr

Turn = 10.
  01234
0 .....
1 .f..r
2 .....
3 rt...
4 tt..r
5 .tt.r
6 r....
7 .....
8 r.rr.
9 ..tt.

Turn = 15.
  01234
0 .....
1 rf...
2 r...r
3 .t...
4 .t.r.
5 trr..
6 .....
7 rr..r
8 .r...
9 .r..r

Turn = 20.
  01234
0 ..rr.
1 .f...
2 r....
3 rt...
4 tr...
5 .tt..
6 ...r.
7 ....r
8 .rr..
9 ..rr.

Turn = 25.
  01234
0 r....
1 rf..r
2 ....r
3 ....r
4 tt.r.
5 .tt..
6 .....
7 .rr..
8 ....r
9 r...r
