{
	"ulid": "01DC1J74VSA631ZAH3SY7CRM5V",
	"minTime": 1559016000000,
	"maxTime": 1559023200000,
	"stats": {
		"numSamples": 317627,
		"numSeries": 317,
		"numChunks": 2536,
		"numBytes": 689490
	},
	"compaction": {
		"level": 1,
		"sources": [
			"01DC1J74VSA631ZAH3SY7CRM5V"
		]
	},
	"version": 1
}
