com\accenture\service\LoginServiceImpl.class
com\accenture\controller\LoginController.class
com\accenture\model\ResponseModel$ResponseModelBuilder.class
com\accenture\model\ResponseModel.class
com\accenture\dao\LoginDAOImpl.class
com\accenture\service\LoginService.class
com\accenture\dao\LoginDAO.class
