[
  {
    "id": "TASK-8780",
    "thumb": "placeholder.svg",
    "productName": "برد هوشمند Smart IR Board interactive whiteboard",
    "unitPrice": 21500000,
    "stock": "available",
    "commentCount": 569,
    "order": "IE-5466421-G",
    "special": true,
    "release": "1403/02/12",
    "operator": {
      "operatorName": "محمدرضا محمد طاهری",
      "phoneNumber": "09909703001"
    },
    "status": "done"
  },
  {
    "id": "TASK-8781",
    "thumb": "placeholder.svg",
    "productName": "مانیتور ایسوس ASUS ProArt Display PA278QV",
    "unitPrice": 47000000,
    "stock": "soon",
    "commentCount": 568,
    "order": "IE-5466421-G",
    "special": false,
    "release": "1403/02/12",
    "operator": {
      "operatorName": "محمدرضا محمد طاهری",
      "phoneNumber": "09909703001"
    },
    "status": "done"
  },
  {
    "id": "TASK-8782",
    "thumb": "placeholder.svg",
    "productName": "مانیتور گیمینگ ایسوس ASUS ROG Swift PG259QN",
    "unitPrice": 39500000,
    "stock": "order",
    "commentCount": 387,
    "order": "IE-5466421-G",
    "special": true,
    "release": "1403/02/12",
    "operator": {
      "operatorName": "محمدرضا محمد طاهری",
      "phoneNumber": "09909703001"
    },
    "status": "done"
  },
  {
    "id": "TASK-8783",
    "thumb": "placeholder.svg",
    "productName": "برد هوشمند Smart IR Board interactive whiteboard",
    "unitPrice": 21500000,
    "stock": "stopproduction",
    "commentCount": 569,
    "order": "IE-5466421-G",
    "special": true,
    "release": "1403/02/12",
    "operator": {
      "operatorName": "محمدرضا محمد طاهری",
      "phoneNumber": "09909703001"
    },
    "status": "done"
  },
  {
    "id": "TASK-8784",
    "thumb": "placeholder.svg",
    "productName": "برد هوشمند Smart IR Board interactive whiteboard",
    "unitPrice": 21500000,
    "stock": "stopproduction",
    "commentCount": 569,
    "order": "IE-5466421-G",
    "special": true,
    "release": "1403/02/12",
    "operator": {
      "operatorName": "محمدرضا محمد طاهری",
      "phoneNumber": "09909703001"
    },
    "status": "done"
  },
  {
    "id": "TASK-8785",
    "thumb": "placeholder.svg",
    "productName": "برد هوشمند Smart IR Board interactive whiteboard",
    "unitPrice": 21500000,
    "stock": "stopproduction",
    "commentCount": 569,
    "order": "IE-5466421-G",
    "special": true,
    "release": "1403/02/12",
    "operator": {
      "operatorName": "محمدرضا محمد طاهری",
      "phoneNumber": "09909703001"
    },
    "status": "done"
  },
  {
    "id": "TASK-8786",
    "thumb": "placeholder.svg",
    "productName": "برد هوشمند Smart IR Board interactive whiteboard",
    "unitPrice": 21500000,
    "stock": "stopproduction",
    "commentCount": 569,
    "order": "IE-5466421-G",
    "special": true,
    "release": "1403/02/12",
    "operator": {
      "operatorName": "محمدرضا محمد طاهری",
      "phoneNumber": "09909703001"
    },
    "status": "done"
  },
  {
    "id": "TASK-8787",
    "thumb": "placeholder.svg",
    "productName": "برد هوشمند Smart IR Board interactive whiteboard",
    "unitPrice": 21500000,
    "stock": "stopproduction",
    "commentCount": 569,
    "order": "IE-5466421-G",
    "special": true,
    "release": "1403/02/12",
    "operator": {
      "operatorName": "محمدرضا محمد طاهری",
      "phoneNumber": "09909703001"
    },
    "status": "done"
  },
  {
    "id": "TASK-8788",
    "thumb": "placeholder.svg",
    "productName": "برد هوشمند Smart IR Board interactive whiteboard",
    "unitPrice": 21500000,
    "stock": "stopproduction",
    "commentCount": 569,
    "order": "IE-5466421-G",
    "special": true,
    "release": "1403/02/12",
    "operator": {
      "operatorName": "محمدرضا محمد طاهری",
      "phoneNumber": "09909703001"
    },
    "status": "done"
  },
  {
    "id": "TASK-8789",
    "thumb": "placeholder.svg",
    "productName": "برد هوشمند Smart IR Board interactive whiteboard",
    "unitPrice": 21500000,
    "stock": "stopproduction",
    "commentCount": 569,
    "order": "IE-5466421-G",
    "special": true,
    "release": "1403/02/12",
    "operator": {
      "operatorName": "محمدرضا محمد طاهری",
      "phoneNumber": "09909703001"
    },
    "status": "done"
  },
  {
    "id": "TASK-8790",
    "thumb": "placeholder.svg",
    "productName": "برد هوشمند Smart IR Board interactive whiteboard",
    "unitPrice": 21500000,
    "stock": "stopproduction",
    "commentCount": 569,
    "order": "IE-5466421-G",
    "special": true,
    "release": "1403/02/12",
    "operator": {
      "operatorName": "محمدرضا محمد طاهری",
      "phoneNumber": "09909703001"
    },
    "status": "done"
  },
  {
    "id": "TASK-8791",
    "thumb": "placeholder.svg",
    "productName": "برد هوشمند Smart IR Board interactive whiteboard",
    "unitPrice": 21500000,
    "stock": "stopproduction",
    "commentCount": 569,
    "order": "IE-5466421-G",
    "special": true,
    "release": "1403/02/12",
    "operator": {
      "operatorName": "محمدرضا محمد طاهری",
      "phoneNumber": "09909703001"
    },
    "status": "done"
  },
  {
    "id": "TASK-8792",
    "thumb": "placeholder.svg",
    "productName": "برد هوشمند Smart IR Board interactive whiteboard",
    "unitPrice": 21500000,
    "stock": "stopproduction",
    "commentCount": 569,
    "order": "IE-5466421-G",
    "special": true,
    "release": "1403/02/12",
    "operator": {
      "operatorName": "محمدرضا محمد طاهری",
      "phoneNumber": "09909703001"
    },
    "status": "done"
  },
  {
    "id": "TASK-8793",
    "thumb": "placeholder.svg",
    "productName": "برد هوشمند Smart IR Board interactive whiteboard",
    "unitPrice": 21500000,
    "stock": "stopproduction",
    "commentCount": 569,
    "order": "IE-5466421-G",
    "special": true,
    "release": "1403/02/12",
    "operator": {
      "operatorName": "محمدرضا محمد طاهری",
      "phoneNumber": "09909703001"
    },
    "status": "done"
  },
  {
    "id": "TASK-8794",
    "thumb": "placeholder.svg",
    "productName": "برد هوشمند Smart IR Board interactive whiteboard",
    "unitPrice": 21500000,
    "stock": "stopproduction",
    "commentCount": 569,
    "order": "IE-5466421-G",
    "special": true,
    "release": "1403/02/12",
    "operator": {
      "operatorName": "محمدرضا محمد طاهری",
      "phoneNumber": "09909703001"
    },
    "status": "done"
  },
  {
    "id": "TASK-8795",
    "thumb": "placeholder.svg",
    "productName": "برد هوشمند Smart IR Board interactive whiteboard",
    "unitPrice": 21500000,
    "stock": "stopproduction",
    "commentCount": 569,
    "order": "IE-5466421-G",
    "special": true,
    "release": "1403/02/12",
    "operator": {
      "operatorName": "محمدرضا محمد طاهری",
      "phoneNumber": "09909703001"
    },
    "status": "done"
  },
  {
    "id": "TASK-8796",
    "thumb": "placeholder.svg",
    "productName": "برد هوشمند Smart IR Board interactive whiteboard",
    "unitPrice": 21500000,
    "stock": "stopproduction",
    "commentCount": 569,
    "order": "IE-5466421-G",
    "special": true,
    "release": "1403/02/12",
    "operator": {
      "operatorName": "محمدرضا محمد طاهری",
      "phoneNumber": "09909703001"
    },
    "status": "done"
  },
  {
    "id": "TASK-8797",
    "thumb": "placeholder.svg",
    "productName": "برد هوشمند Smart IR Board interactive whiteboard",
    "unitPrice": 21500000,
    "stock": "stopproduction",
    "commentCount": 569,
    "order": "IE-5466421-G",
    "special": true,
    "release": "1403/02/12",
    "operator": {
      "operatorName": "محمدرضا محمد طاهری",
      "phoneNumber": "09909703001"
    },
    "status": "done"
  },
  {
    "id": "TASK-8798",
    "thumb": "placeholder.svg",
    "productName": "برد هوشمند Smart IR Board interactive whiteboard",
    "unitPrice": 21500000,
    "stock": "stopproduction",
    "commentCount": 569,
    "order": "IE-5466421-G",
    "special": true,
    "release": "1403/02/12",
    "operator": {
      "operatorName": "محمدرضا محمد طاهری",
      "phoneNumber": "09909703001"
    },
    "status": "done"
  },
  {
    "id": "TASK-8799",
    "thumb": "placeholder.svg",
    "productName": "برد هوشمند Smart IR Board interactive whiteboard",
    "unitPrice": 21500000,
    "stock": "stopproduction",
    "commentCount": 569,
    "order": "IE-5466421-G",
    "special": true,
    "release": "1403/02/12",
    "operator": {
      "operatorName": "محمدرضا محمد طاهری",
      "phoneNumber": "09909703001"
    },
    "status": "done"
  },
  {
    "id": "TASK-87100",
    "thumb": "placeholder.svg",
    "productName": "برد هوشمند Smart IR Board interactive whiteboard",
    "unitPrice": 21500000,
    "stock": "stopproduction",
    "commentCount": 569,
    "order": "IE-5466421-G",
    "special": true,
    "release": "1403/02/12",
    "operator": {
      "operatorName": "محمدرضا محمد طاهری",
      "phoneNumber": "09909703001"
    },
    "status": "done"
  },
  {
    "id": "TASK-87101",
    "thumb": "placeholder.svg",
    "productName": "برد هوشمند Smart IR Board interactive whiteboard",
    "unitPrice": 21500000,
    "stock": "stopproduction",
    "commentCount": 569,
    "order": "IE-5466421-G",
    "special": true,
    "release": "1403/02/12",
    "operator": {
      "operatorName": "محمدرضا محمد طاهری",
      "phoneNumber": "09909703001"
    },
    "status": "done"
  },
  {
    "id": "TASK-87102",
    "thumb": "placeholder.svg",
    "productName": "برد هوشمند Smart IR Board interactive whiteboard",
    "unitPrice": 21500000,
    "stock": "stopproduction",
    "commentCount": 569,
    "order": "IE-5466421-G",
    "special": true,
    "release": "1403/02/12",
    "operator": {
      "operatorName": "محمدرضا محمد طاهری",
      "phoneNumber": "09909703001"
    },
    "status": "done"
  },
  {
    "id": "TASK-87103",
    "thumb": "placeholder.svg",
    "productName": "برد هوشمند Smart IR Board interactive whiteboard",
    "unitPrice": 21500000,
    "stock": "stopproduction",
    "commentCount": 569,
    "order": "IE-5466421-G",
    "special": true,
    "release": "1403/02/12",
    "operator": {
      "operatorName": "محمدرضا محمد طاهری",
      "phoneNumber": "09909703001"
    },
    "status": "done"
  },
  {
    "id": "TASK-87104",
    "thumb": "placeholder.svg",
    "productName": "برد هوشمند Smart IR Board interactive whiteboard",
    "unitPrice": 21500000,
    "stock": "stopproduction",
    "commentCount": 569,
    "order": "IE-5466421-G",
    "special": true,
    "release": "1403/02/12",
    "operator": {
      "operatorName": "محمدرضا محمد طاهری",
      "phoneNumber": "09909703001"
    },
    "status": "done"
  },
  {
    "id": "TASK-87105",
    "thumb": "placeholder.svg",
    "productName": "برد هوشمند Smart IR Board interactive whiteboard",
    "unitPrice": 21500000,
    "stock": "stopproduction",
    "commentCount": 569,
    "order": "IE-5466421-G",
    "special": true,
    "release": "1403/02/12",
    "operator": {
      "operatorName": "محمدرضا محمد طاهری",
      "phoneNumber": "09909703001"
    },
    "status": "done"
  },
  {
    "id": "TASK-87106",
    "thumb": "placeholder.svg",
    "productName": "برد هوشمند Smart IR Board interactive whiteboard",
    "unitPrice": 21500000,
    "stock": "stopproduction",
    "commentCount": 569,
    "order": "IE-5466421-G",
    "special": true,
    "release": "1403/02/12",
    "operator": {
      "operatorName": "محمدرضا محمد طاهری",
      "phoneNumber": "09909703001"
    },
    "status": "done"
  },
  {
    "id": "TASK-87107",
    "thumb": "placeholder.svg",
    "productName": "برد هوشمند Smart IR Board interactive whiteboard",
    "unitPrice": 21500000,
    "stock": "stopproduction",
    "commentCount": 569,
    "order": "IE-5466421-G",
    "special": true,
    "release": "1403/02/12",
    "operator": {
      "operatorName": "محمدرضا محمد طاهری",
      "phoneNumber": "09909703001"
    },
    "status": "done"
  },
  {
    "id": "TASK-87108",
    "thumb": "placeholder.svg",
    "productName": "برد هوشمند Smart IR Board interactive whiteboard",
    "unitPrice": 21500000,
    "stock": "stopproduction",
    "commentCount": 569,
    "order": "IE-5466421-G",
    "special": true,
    "release": "1403/02/12",
    "operator": {
      "operatorName": "محمدرضا محمد طاهری",
      "phoneNumber": "09909703001"
    },
    "status": "done"
  },
  {
    "id": "TASK-87109",
    "thumb": "placeholder.svg",
    "productName": "برد هوشمند Smart IR Board interactive whiteboard",
    "unitPrice": 21500000,
    "stock": "stopproduction",
    "commentCount": 569,
    "order": "IE-5466421-G",
    "special": true,
    "release": "1403/02/12",
    "operator": {
      "operatorName": "محمدرضا محمد طاهری",
      "phoneNumber": "09909703001"
    },
    "status": "done"
  },
  {
    "id": "TASK-87110",
    "thumb": "placeholder.svg",
    "productName": "برد هوشمند Smart IR Board interactive whiteboard",
    "unitPrice": 21500000,
    "stock": "stopproduction",
    "commentCount": 569,
    "order": "IE-5466421-G",
    "special": true,
    "release": "1403/02/12",
    "operator": {
      "operatorName": "محمدرضا محمد طاهری",
      "phoneNumber": "09909703001"
    },
    "status": "done"
  }
]