NAME : portmgen-100-17
COMMENT : portmgen N=100, seed=17
TYPE : TSP
DIMENSION : 100
EDGE_WEIGHT_TYPE : EXPLICIT
EDGE_WEIGHT_FORMAT : UPPER_DIAG_ROW
EDGE_WEIGHT_SECTION
0
4091
2295
127
2827
4389
329
743
2412
3518
3268
2379
3785
3861
939
1754
1688
3569
961
3420
481
4025
3410
701
2289
4391
1887
81
1541
2939
823
216
1299
2266
649
2038
2118
4196
2268
4064
779
721
954
3264
4214
4233
3641
1361
1337
2463
1556
4073
4265
356
4255
1915
3755
2673
171
3943
967
4406
910
907
2358
1881
4376
1164
1853
338
2943
3224
2002
3986
1365
3090
1853
1949
54
3980
1141
1307
1498
1777
1308
2974
3910
2675
73
24
966
2291
2492
4469
1130
3309
980
1162
925
3425
0
2580
2747
3122
3368
771
743
3660
4344
1474
1089
1366
1990
2479
3586
377
1613
3778
2680
3372
3533
285
2690
56
754
1075
2548
2527
4440
3455
4232
4448
1369
3813
3479
3707
3922
3799
930
2224
779
3662
2765
3138
3922
1592
1089
3220
2373
793
2242
552
2074
2123
4050
3006
4030
2920
1783
2979
1800
4011
4253
3215
4413
192
2626
3286
1896
2309
1676
1775
90
1020
2009
645
1914
794
3684
3985
2811
1506
2865
677
3223
1880
1773
3973
793
1925
2500
145
2160
3780
1146
4313
2645
2156
37
0
1899
200
2679
1291
2608
2728
1356
3118
2724
1403
4070
1024
1756
1439
3164
2069
2004
3769
1308
112
2400
1809
3487
4339
1453
934
1313
3278
1677
273
1273
2338
2261
1219
1914
2194
1769
10
875
374
636
1657
170
1885
1215
3107
1735
1343
375
2385
46
1024
1232
2524
2973
1787
669
1350
1333
2510
2296
817
2992
1115
1389
2586
945
2047
3533
2517
2008
798
1048
2327
99
3603
3169
108
4440
2578
4318
2171
324
3139
786
1945
107
786
2919
162
1202
1749
2658
3899
244
623
3427
0
266
125
4238
4417
1505
1219
3888
3659
1967
3045
1625
428
464
4154
2786
2201
3764
3941
1432
336
2028
3599
669
3169
909
2139
2323
15
4367
1144
4353
2455
969
4412
4229
861
3688
75
1862
3460
667
1207
4085
2896
1617
4108
3605
2850
2785
2836
151
1075
933
1728
1052
1489
396
2916
3787
1151
3820
4328
231
838
4291
3902
1827
4005
718
1946
759
2254
3271
3522
4135
4377
1078
1246
2727
1945
2100
1139
3646
2759
179
1308
2323
951
454
1243
385
2193
1422
1463
922
3675
0
1599
145
3884
3074
3644
4391
3016
511
2124
1763
1450
4020
1947
435
737
1746
3109
1599
2090
2074
2585
2728
3617
1060
1390
2133
3827
1339
379
3647
3488
3008
2808
4019
3896
463
3863
4016
1441
1635
3966
4329
4372
3179
858
3113
1825
2756
2352
1759
2368
4248
1686
2047
2912
2030
3085
3571
329
1665
246
3294
1176
724
2185
2709
2811
3870
1596
2064
695
184
422
2826
2223
2245
3563
2134
2401
2616
643
3950
2755
3603
2342
1569
3452
553
1887
1560
3583
444
1053
4171
962
0
1059
3544
2716
2456
2188
3937
930
2024
4334
667
4098
1954
967
3019
1360
2029
2376
4311
3424
1995
1331
1789
4376
176
851
1646
4221
2222
132
100
737
3908
1148
284
1324
2981
1473
4140
405
3315
2937
4162
2798
585
2285
3026
149
2680
1303
984
80
3120
536
2330
4131
3427
603
1361
4116
1751
3083
2234
436
306
3067
3091
1540
3591
3941
2108
2719
4337
954
3798
1940
1526
1745
1659
1428
3052
475
903
4220
2895
539
1914
2624
2149
1658
3260
3283
4229
1201
3304
0
674
818
1021
3133
1844
2190
1311
32
1705
3994
1943
4343
3928
3205
272
1666
3132
180
4361
2083
3136
679
2505
3595
3890
4185
4398
4097
559
2129
2478
2853
907
3752
678
2215
1954
228
180
2049
1115
3798
4096
1523
3735
1813
4105
208
285
596
2163
1651
2572
1431
2316
1311
1908
2611
3358
1915
2874
2598
2695
932
2145
437
161
1476
3242
115
1924
94
3361
1739
2855
2290
946
4166
3858
3662
3507
4260
1001
2724
2672
1406
673
3875
3622
374
2836
4065
936
0
4029
742
4102
2045
4102
718
1850
2904
4375
1174
801
1753
1255
1525
4151
4218
66
731
168
291
2700
3455
2325
1777
4281
1290
3269
2824
61
2242
3167
725
19
1255
1849
2615
1639
1212
2312
1915
1187
1252
3836
2982
249
1595
3699
2636
3747
2166
2104
3563
1919
1098
658
1807
2426
379
3838
129
371
695
3766
1648
1047
2135
3764
2693
257
285
4182
1900
3534
11
2728
2130
555
2201
220
1448
970
2164
2217
1149
3348
3901
1548
70
594
1038
2317
1463
0
1224
1128
3428
1534
2893
3332
2224
1190
2261
3674
2801
3161
1703
2215
2927
1599
269
2393
129
2870
1037
2215
1487
2113
3568
1008
2594
4222
3745
2214
3915
3258
2823
4459
3274
2802
4380
334
1698
2825
920
4237
11
3004
946
524
914
142
2350
535
2304
3533
1684
1795
515
1120
2390
1907
1325
1951
1936
1048
2666
4018
2600
2493
3621
3559
3752
725
3836
2927
864
1723
2752
1280
4423
2394
1942
880
1090
1358
3486
1367
457
3825
185
3990
4041
798
2176
0
803
2866
2018
4429
1706
2425
2640
2625
1050
3248
351
3119
4021
4099
2063
3176
1591
2712
1972
2709
1190
3150
1257
4326
383
3624
4360
1708
2529
4041
3236
4464
1375
2737
1302
4179
647
4170
2464
2900
3209
1885
1505
314
4369
3746
3840
857
267
2429
3694
560
53
2687
1439
3373
3481
676
3522
1238
1218
758
3457
725
1861
1601
1997
67
445
965
3873
1559
3616
4095
3548
1676
126
886
3281
3920
498
1063
1632
2315
4186
1100
3398
292
1402
2928
0
2427
619
2693
3161
4225
2659
3088
4458
3659
4282
1316
93
748
1946
3680
621
240
2781
238
2559
603
2465
2864
1605
1258
2976
1141
4321
319
4212
28
4348
2982
2065
2455
293
122
2163
266
2202
1553
1406
140
2732
35
3502
1500
1445
3463
1444
829
999
1689
2120
1731
476
2960
2509
1952
1701
3242
1928
3895
2968
2504
3852
3225
2892
903
4418
978
3861
4105
2400
2670
3161
1755
236
1785
4226
778
3006
1914
873
2903
3200
4325
874
4150
0
3224
3028
4128
4044
2383
1282
1268
4029
1744
4095
1291
2828
612
2333
1649
2097
802
58
2013
286
958
1958
2327
835
3574
3334
4075
2571
2412
3814
1722
2866
1279
2647
3816
3962
2961
2820
2229
136
3102
3352
4107
1751
1100
1950
1820
1184
1971
1209
3698
3302
470
125
4217
1004
3897
810
460
153
4271
1453
2007
1736
2333
2734
1467
195
3774
2008
1989
3790
4222
1421
1703
2993
576
298
2137
3508
2178
2149
3264
1878
1377
1341
78
157
0
138
712
1747
47
1393
2821
3613
3536
874
528
2878
1149
3347
281
271
4344
3097
1187
3173
1446
1853
1110
2579
2884
4010
4280
776
3622
711
672
4045
3124
1798
3251
940
1395
971
2644
1739
2261
2168
1934
1203
1693
3785
2257
91
1875
3484
1452
4386
4337
2422
1600
2149
121
1348
3470
4198
1231
759
2287
1553
2098
1612
3349
207
2007
3157
756
787
2694
832
2252
1908
3557
1161
1631
4304
2987
3088
1845
1844
1341
78
662
1406
0
1032
2456
3023
964
3906
3457
1563
1801
127
1122
889
611
3554
747
3165
3712
2745
3938
164
2832
848
153
3412
2057
644
4090
1555
2190
737
3010
3907
1423
1952
1992
833
3065
667
1774
631
3207
2627
1543
4246
1904
1805
407
3697
3732
2027
2522
3463
3995
1454
3001
1431
3614
4308
993
513
661
4467
4137
2571
306
2845
664
3797
363
4224
84
4189
2103
1663
3296
3536
322
1617
2969
963
3376
1177
126
650
318
794
1954
0
1160
743
3236
2631
2149
2766
3612
1565
3818
347
1422
4425
2120
4257
1223
4336
3752
1261
1553
4304
3062
2389
705
2312
345
1407
2028
1558
4191
2437
299
3758
1282
1752
1337
3826
530
2154
1988
2225
3241
1956
2082
603
1078
3733
2485
4014
2526
368
2292
3282
2689
761
771
1388
3301
1779
2993
3386
1226
27
1690
2734
2594
2903
639
436
484
236
686
3240
2687
1783
2350
3174
612
1675
99
2216
2649
4347
1712
2261
1992
0
1174
1894
4116
4089
2288
3155
4065
613
3776
3158
330
3631
1086
3708
4446
1666
3891
2634
1446
3027
4162
646
3843
1811
2509
1734
729
1358
1150
1736
3106
4358
325
2920
1031
3713
3689
1476
2993
1546
629
829
3277
1352
2757
4108
2720
413
1020
86
1825
3074
3148
2300
541
4308
3901
408
3329
1182
1574
1358
2563
1860
737
860
500
886
2724
1685
2717
3114
961
1491
2171
789
3014
283
4469
1792
569
4204
2904
4129
0
1785
4377
1567
126
1084
1638
3305
1357
210
2511
2761
2407
1210
3159
2803
1454
3366
928
3084
337
3631
2310
233
2356
4145
1939
3103
3274
101
2896
528
950
2223
3187
1461
2208
2169
3416
1446
3668
668
1279
3396
272
1996
3584
3674
3759
2179
1969
1342
1866
2853
962
221
1190
3754
3291
4024
4318
1763
352
3391
3076
481
1519
2224
2166
367
100
2643
1445
2392
1423
2089
2240
3086
2650
3149
3104
3807
1889
2064
0
789
1657
1460
4265
1066
2090
2791
169
1826
894
3182
1911
3897
4169
2762
2982
523
1677
2382
1666
762
2176
2032
1251
2510
2171
1980
3141
3327
2172
3967
2439
2331
1019
3301
4004
4080
2274
1336
3754
2984
2837
4268
1566
3628
2763
176
1284
1222
2053
4014
569
4357
2036
3228
4001
3743
524
3248
3803
3812
2954
2518
1294
2192
3566
150
2748
66
3493
3090
3073
3808
2796
4322
1256
749
2358
4447
1673
2854
943
0
2214
3460
2235
3368
2356
3743
2463
423
185
2946
1739
1439
1584
3567
2525
1459
684
405
1207
3715
2097
3709
1297
4428
3829
3987
3531
2117
4280
4140
2618
2760
2462
3864
1996
742
4317
1354
4144
1548
3264
2357
2411
377
644
1736
948
788
3350
503
2587
3458
2519
2270
4019
1524
4432
968
2583
4374
506
3980
284
2875
156
1526
2908
632
445
3058
611
2837
2642
4330
3213
567
893
825
1746
293
1890
0
977
4270
3825
3418
2598
4124
2243
3710
1106
2920
4061
1302
2881
2295
378
1717
3463
3692
2889
4348
91
4434
4013
445
3999
403
162
1640
4316
1668
1947
3015
1291
4100
1055
3483
847
3407
799
3478
3533
600
2930
4268
2806
4362
3037
3728
509
2446
3975
2136
806
1456
753
1066
463
3732
4112
1056
57
1555
4289
3975
1325
4150
4002
1838
1372
1122
2704
588
430
3601
768
4047
3019
1209
1692
4059
0
2435
2583
4242
810
15
807
1390
1368
3903
3277
3649
965
3232
3775
4017
84
4342
1083
2494
1217
624
1824
3770
484
4459
2970
4139
3062
2322
1465
4084
823
4034
1706
3349
4242
2432
2805
3265
3354
3891
4087
657
1824
1211
410
2609
3365
3702
3278
3841
346
3450
2287
2227
1189
4347
767
3298
819
3779
2615
288
1847
85
1992
2354
435
711
1324
2110
234
4007
4393
699
1766
715
757
3298
0
2619
3517
1842
618
1083
2637
2314
744
1085
3547
3256
3919
4221
2487
1361
2070
910
117
1664
1612
1275
4344
413
1704
259
1500
3329
495
3074
3822
1144
3465
1333
2162
2607
4123
3275
68
4148
1525
1770
4400
1815
3547
1216
4045
710
755
2849
1325
2827
284
440
1897
42
3546
3763
2829
3130
2807
964
27
468
132
650
2536
4333
883
1246
1322
239
2122
3764
2646
1506
1705
49
3127
0
779
865
1588
3056
3271
222
3068
82
429
3276
3283
3706
3287
1029
2891
3598
1014
2188
3865
3202
1243
3768
92
178
2186
65
360
176
3268
3627
460
3694
1935
1808
2654
3827
1048
698
954
3904
4430
729
2277
124
4422
1107
1969
837
4399
1252
2674
1597
1487
720
1657
3472
1090
2881
1139
4031
1864
1382
1089
4207
3197
2627
2822
829
3086
3713
4042
820
178
2226
2723
4037
1267
0
4444
3539
2815
2283
654
704
2183
4021
3878
537
1126
3481
2668
2386
2881
416
720
4143
3018
1108
3399
247
3639
3508
730
35
214
3649
252
4226
3663
2743
3127
3874
1749
1054
4263
2114
3856
2582
1107
2854
3908
800
1213
3983
2692
3703
4164
4014
3354
2184
2753
1388
3912
1901
1279
932
2356
2244
197
148
2884
3864
1821
1869
963
190
1049
1993
2968
1101
3382
4340
689
537
0
3472
1228
3739
2916
2372
2698
2236
2101
2649
32
3329
578
2853
751
3795
801
1829
4037
1478
4134
4159
2011
1451
3851
4466
2150
3281
921
2328
2577
106
637
2467
3930
455
392
406
4445
3319
178
1593
3022
3180
1291
417
4128
2815
3799
1573
4043
2673
3509
1768
3442
1909
3483
2701
1446
3951
556
2582
4079
2048
2093
2227
2256
4227
1530
3235
966
3148
1691
411
765
722
0
3473
142
2678
1913
2235
2825
3200
3869
2774
355
3273
1939
239
1670
695
2768
1321
2201
3391
622
4243
700
2144
3240
3962
3491
2661
3906
959
2716
4340
1102
1300
3675
3885
4234
2478
964
955
4118
2535
866
1898
2
4121
4181
2247
935
3670
4324
511
2683
3750
289
425
1585
3742
3254
2879
1401
1471
331
4302
2432
1098
1402
1816
116
268
1804
5
904
3543
2986
0
2367
1544
2976
3051
4435
4189
1118
3392
2329
1307
1883
1431
104
1065
810
3814
965
449
2281
3499
4173
523
45
2556
2661
2160
2393
958
3718
2833
2701
4238
3391
464
3091
1288
2114
4257
1441
3558
3605
2182
214
488
689
2618
52
2009
2926
2846
1369
2395
4041
3985
2513
4006
344
131
4425
3379
1208
3347
3723
1881
2174
3811
2623
3244
2269
2601
1740
3426
3642
0
1507
988
4324
3889
1970
3291
483
1892
2285
3846
1791
2284
1603
1165
2592
3388
3630
2634
2885
188
1134
1283
3674
3988
3763
2567
3118
2096
2182
1344
1737
1428
2805
466
3733
4059
3792
287
2672
535
3263
172
2399
2739
1541
641
3388
2146
2051
3932
4465
2466
1683
3760
1266
910
2064
262
3567
633
1118
3688
95
2915
3388
2984
2095
1897
3790
3947
1425
3650
0
3195
1984
4375
2065
457
472
2307
1979
917
3960
2134
1066
78
4419
3554
3862
2497
132
577
5
694
732
4247
244
3149
3077
274
3373
3007
1179
311
1109
376
1120
2059
4010
2185
1411
1876
4265
3207
3271
322
3984
152
572
369
1987
1199
4161
96
1185
1671
1184
3428
3450
2301
507
3683
854
617
4066
2644
215
3507
3830
3525
329
3153
2028
177
0
3545
3575
1146
26
870
856
846
2621
4168
1420
3782
2811
2516
1757
4414
3059
1047
2121
3098
2952
3658
2408
3629
418
2963
3831
262
481
1819
2146
2295
3298
1450
1869
3548
1267
3698
3979
896
893
1269
1563
4100
717
614
1168
3801
1285
621
2960
2763
2247
747
2768
4015
3714
2258
3855
188
293
296
4184
3359
1602
240
1004
850
2481
2831
2045
0
1243
3697
30
1104
2777
3474
1633
4054
198
1588
697
1438
1467
4202
1373
2283
3171
561
758
1177
2677
144
2277
1403
533
2288
2925
2209
4435
1847
159
3029
1090
1831
4377
1186
1994
1805
564
3467
3195
91
2343
2351
1463
679
2670
386
1850
1647
1170
4240
1822
4033
595
1190
1085
162
2146
4415
3884
1952
4125
3532
2479
3853
2825
1692
2805
0
3653
2655
3104
4094
324
2580
567
2894
3321
291
1449
3614
4039
1910
1252
1695
754
3849
3985
1884
2091
4124
3699
4375
1874
1189
1154
2587
397
691
2885
3359
1854
3778
896
1464
3054
4370
445
1919
2418
259
1463
2227
2975
3671
3801
2060
1375
3381
466
1451
2725
2254
2917
2363
3845
1966
3809
1085
1037
340
4041
1171
743
2514
3168
3803
0
871
880
708
695
341
397
4090
2120
2692
988
3679
1184
3960
2229
461
3464
304
90
1750
4294
3974
4418
3279
2588
1130
1321
3277
3813
1593
3867
1255
2747
1558
2013
3599
2340
2816
1983
1407
2215
2529
155
2547
3055
3625
2252
2995
2220
1918
2710
1548
3418
1903
2406
1939
4392
1500
3815
4395
3027
1814
1652
878
1651
1790
2740
3554
0
2016
355
331
2436
1862
4146
2033
2202
3336
1360
277
4126
1195
3652
4352
2442
2926
2777
3904
822
608
2737
2263
4098
4309
1608
377
452
2596
1982
2291
408
3236
1416
1767
178
4179
3246
1804
2971
3719
1350
2208
351
703
1148
554
2501
2960
2328
3201
2002
2606
3611
4452
3757
1615
904
4092
3170
1611
518
3988
1690
1596
330
0
4049
3502
1386
4283
1438
2956
1270
3802
2149
3839
3442
2111
1877
2498
1995
620
434
3894
4287
2100
204
378
2401
1021
3578
666
2551
4331
318
4399
55
1192
1553
1667
1759
3682
3491
1710
2148
1970
2092
3140
3340
2695
808
530
2018
1661
798
3006
425
1226
1748
3119
2530
693
3989
1121
261
780
238
3969
1699
3381
2431
0
1799
121
4391
4372
4045
700
2051
2579
4074
4357
1655
4184
2814
4453
872
791
2423
2516
545
4449
686
419
3294
2393
168
4079
702
3731
1718
3110
2277
473
3453
1487
1397
1986
2594
470
2128
52
906
2036
2290
3783
1903
395
2610
2673
361
3624
3134
2190
1290
1430
2357
1981
4236
3006
2589
2272
2104
127
2985
1367
0
1832
2759
3929
1263
1191
2072
2176
435
497
716
949
3261
3261
840
2616
1076
2449
2276
3042
2437
4227
2878
3263
2626
2687
949
37
3980
2366
544
290
4108
1522
2976
1422
3979
1273
1680
244
3012
757
2455
1162
3306
1139
724
3025
1601
1513
3085
2867
2861
3776
1193
182
3440
4045
3342
1758
2558
1275
2913
3729
0
3802
651
2899
761
429
1093
1291
1940
736
2707
417
1673
244
976
1176
1679
210
4390
4241
1990
3790
4077
2348
4105
2102
4396
1740
2087
1264
1100
1806
3082
2041
1080
2443
4026
657
3492
279
4143
1038
231
1752
904
3917
3631
4223
1351
3244
1564
1857
3476
3405
16
759
913
678
3916
1528
1915
235
2370
0
2009
3281
3300
3883
3986
303
2963
1221
937
2374
2445
698
3949
1624
2411
4283
755
601
2033
2693
3551
1105
2806
4388
2603
3192
1777
226
4029
1831
1501
3565
2109
2179
395
1764
268
279
23
88
3609
3504
822
959
4089
1731
4190
3611
2828
1887
1258
3454
1160
3392
2065
1420
53
3203
3441
4381
1511
0
1038
299
2765
4327
2107
3983
945
874
3864
2425
570
1069
544
1921
3297
1403
1524
268
2853
1577
627
1904
169
4369
4275
144
2116
3297
3568
4260
275
917
1946
3764
1291
1965
3533
2031
325
639
1693
4144
2649
2033
722
1700
1935
1890
1614
4137
2967
3013
3748
3427
2617
743
3291
1341
2030
1540
0
504
1265
4256
236
2013
4197
3767
2721
423
1604
4377
1826
1196
4419
4265
2235
1549
3435
2519
1342
2078
2082
1702
1731
1473
3848
825
2435
2912
1027
4454
3483
54
4342
2446
196
597
1123
3909
2733
1897
2233
4095
2961
1207
3008
256
48
3678
4165
1624
876
2449
2681
2229
3139
1323
751
1941
0
3869
1490
603
2463
3244
2691
2352
1074
1012
3910
1597
2636
2845
653
2231
4009
3786
1791
3536
3219
1922
1085
3652
187
2527
4260
806
1456
1052
1694
3582
3477
4452
221
218
4359
4371
769
4390
2354
146
3906
2064
371
3956
2473
3519
2298
941
2961
2255
3273
1982
1149
3012
4335
2001
573
0
4008
1477
4146
3416
3727
1191
1969
4376
1192
2616
3404
2575
607
1747
1939
1041
3502
3460
4401
2035
533
1235
4469
4140
2827
24
2769
1297
2987
375
3934
2563
2563
1223
1656
1281
4272
352
2325
301
824
743
1726
393
4240
2875
840
90
1827
2530
1381
3869
2598
3095
3416
2833
3875
0
2619
43
71
3248
3622
2412
1620
248
730
3542
2856
472
1514
2008
3417
4216
1781
3684
3058
4088
1408
1462
3515
4372
1130
3347
1663
1730
3096
1388
1736
985
1373
388
2568
4121
3370
527
268
3951
1334
2462
1880
4001
4418
3396
1804
1237
4120
3295
867
2164
58
3454
3566
2386
0
3729
2435
1009
1839
2404
79
2009
3412
931
1559
1857
125
2163
3376
2160
204
1103
2426
2779
1527
4094
3787
2075
3144
4416
1192
4274
3094
2939
601
713
1833
2625
1817
172
4048
3431
2558
2764
2950
504
241
2353
614
2468
567
4240
4367
3573
1103
3269
4409
1646
1015
438
0
247
4022
1591
2999
3759
4023
2476
4051
69
18
2891
1185
386
1772
718
884
678
2128
2784
3048
3315
2445
890
3119
273
1582
2153
1473
3578
2864
3312
3501
2777
135
1734
1722
4328
4438
923
723
2424
2772
2284
2523
3285
2151
3218
4207
571
3263
2290
945
1518
4086
0
3893
2180
588
3179
3272
4016
3460
1162
2180
499
803
2609
3942
2260
948
595
799
2007
1561
748
3705
1136
2522
3120
165
2906
3275
1584
1146
3520
3505
3649
112
465
4273
4459
1761
3991
331
1390
3450
2894
1350
3811
716
1652
3848
2565
1121
909
3119
3263
1875
0
4037
553
3487
1445
1160
2922
2581
2496
1276
1082
3222
1209
2372
4045
2449
4400
4031
4324
2821
881
612
2936
3075
3417
787
4437
451
1360
2080
2150
3219
3146
3667
4025
2705
2451
970
2620
4414
937
2026
522
2584
898
1313
722
1181
1848
621
4366
4021
4086
0
2552
3520
2081
3237
713
273
2850
2195
212
4050
951
1395
1074
3201
4246
1207
3054
2171
906
2750
1320
1569
2260
3272
817
3951
206
3894
220
1665
1585
1691
2063
2997
2392
4258
2984
2857
2978
3548
3795
3384
1841
3031
2585
3301
4188
4006
216
3927
1134
0
2416
3973
3359
2677
3594
3206
265
4121
4004
3036
2421
1411
2844
4468
4207
377
4329
27
4043
1086
3569
2782
3648
1024
2863
2103
1612
2255
2523
81
1762
3665
1871
3184
3753
829
3426
2364
3148
2051
2142
4196
528
1372
4421
3643
3010
2571
4039
2975
0
224
1594
630
3964
4249
2949
3750
1817
4044
1877
3368
1143
3385
1621
1329
769
3867
148
3630
2807
3171
1173
2195
91
3735
3924
3569
3053
398
1421
2034
2260
3662
3348
1473
223
1936
4390
944
1049
1987
1580
171
3253
2788
1639
1457
729
2214
0
2026
3278
4202
2742
236
1047
1782
3276
882
3933
2626
3480
2117
4232
3785
4026
712
2601
2786
4295
1275
2149
2860
1391
77
3081
4029
2801
2334
1399
492
2165
1457
2999
995
3478
4168
1849
3983
3088
564
3048
3366
512
749
1576
4247
558
0
292
2002
414
248
4234
3347
433
4100
2787
449
1092
1450
1506
1616
2998
1183
1899
2465
2000
2784
1417
2436
2852
313
231
2001
3470
2754
2390
3811
3611
3117
513
519
450
161
1484
2953
1834
1500
999
2970
3672
2004
2779
1299
1025
0
2704
370
1698
2898
75
1302
4310
486
1995
1247
3441
4434
1562
3667
481
2281
2109
2342
2112
1319
476
2438
557
2832
2521
2821
2212
3789
2827
331
2178
4400
672
3989
1149
4038
2574
2267
4464
1921
1569
1736
2784
4424
1545
3352
0
309
2476
4174
43
1218
1603
375
4284
2075
3498
602
837
3658
2597
1257
663
18
4254
2278
2325
2945
1949
4038
777
2041
2189
2491
3997
801
4188
1585
1276
1423
1651
2413
1939
3893
2638
2203
281
1047
1412
1842
1912
2848
0
3384
2170
3308
3138
810
3171
3847
3808
3525
3387
636
3819
437
1394
1932
74
2521
2633
166
882
923
3385
715
1058
2949
1170
2255
1842
4354
433
2616
1946
3417
383
1045
4200
3116
4195
2091
741
2303
3704
4087
3039
0
3761
2981
1326
1673
439
387
2391
3710
3050
3094
3580
1594
3984
382
4418
3602
1899
3809
2878
1778
800
1957
1240
1384
658
2700
2100
3271
2971
1301
263
73
2273
588
3918
2563
3310
2345
3468
2300
445
2860
2597
0
4449
3638
3358
186
808
82
1549
840
3174
2329
1673
2948
2801
1204
2913
2815
189
221
1127
4104
3617
3145
3356
289
1565
3835
443
4195
3155
2991
416
1316
2846
4043
3802
3
3565
1630
2720
2631
319
1104
0
600
3097
870
4109
4343
3804
3037
2784
2611
2164
524
1457
477
1704
3468
3188
1209
3032
3027
3714
421
3568
1054
2706
573
2012
1883
148
4129
1250
3345
4153
3442
3881
4454
124
2735
1571
100
3095
4400
0
557
137
968
4170
871
971
1338
2780
2499
490
4103
326
2858
3590
2430
3076
577
1409
2474
1847
2781
3949
569
2387
27
3379
4463
3383
3965
1637
1091
2740
3556
1529
3635
592
1418
109
4280
1006
0
2432
565
2500
3508
3439
1757
245
2676
948
1478
4402
2645
1726
235
544
558
1277
1953
924
2337
1234
2451
3505
4187
4147
3558
1995
964
391
1750
3112
1485
1665
1642
4356
647
4469
2227
4390
0
2540
1469
363
3632
3280
2725
4352
153
2359
431
3002
3825
3014
3597
1365
260
2125
2042
2859
1492
871
2463
3564
3911
1669
873
1426
1374
4465
953
1364
3764
3921
3362
1828
431
1255
2685
0
3642
3708
1208
2233
1177
1496
3340
3517
2550
470
1260
185
961
2621
2327
687
2034
2099
3340
147
3600
260
3697
1877
4326
339
3641
1716
4045
3580
2676
2652
3947
2792
817
332
2804
0
2759
1163
3721
3655
270
918
2516
786
4227
1415
2508
2466
3257
2301
1229
839
1522
284
2205
2228
3848
256
974
512
4337
3090
1246
4
1986
872
269
552
3600
355
4304
2098
0
2354
2566
4303
1796
4060
2367
3187
2486
2298
2825
4255
2585
1976
3014
4449
57
3218
98
2606
3700
3993
4395
3380
3602
2445
4419
693
3017
1342
399
3908
639
259
2650
1279
0
328
4263
1550
2030
377
3527
3779
15
996
2193
3788
3559
2803
4310
2238
1904
3608
3920
537
294
2784
1739
3034
3945
796
3018
1963
528
1610
329
3185
4229
610
111
0
649
4442
3431
1364
1907
2940
3694
1205
250
3034
3363
2786
1605
2733
1767
1590
1653
1786
141
2138
2716
3521
930
3004
1648
3200
3138
3474
1642
2743
2332
1013
4011
0
2544
2925
1426
2831
900
2891
3727
2630
930
1483
1880
4113
1022
3700
2919
2500
1161
580
826
3128
4160
2763
315
1279
2459
1417
3430
4170
3392
1449
2644
1112
0
485
2426
593
1200
4243
3140
2157
827
1849
2855
1195
3538
901
2934
1457
3698
900
3466
119
203
265
2696
3639
1580
1067
4048
2408
2714
3039
1649
3739
0
3050
2128
1792
4150
777
3499
2143
2350
1275
1349
4203
2983
566
1840
1924
961
4021
2112
3334
2359
853
2395
1674
568
3288
2044
293
124
648
974
0
108
3197
3280
937
2843
2839
433
4346
4158
3882
3250
2138
2014
3173
1013
523
292
781
3969
3285
369
1820
1369
4080
3126
1106
965
2166
3530
0
3189
3781
1401
3463
971
4447
1125
2024
1169
755
2773
2281
2207
4092
2604
3637
3450
3312
4098
1485
3130
316
944
310
1037
3418
2845
1688
0
4106
875
3754
3323
4333
3874
1697
213
3554
2803
3602
2861
3096
1467
4251
1186
1343
388
488
3316
4286
3575
3200
1658
1520
2641
2366
0
1723
2811
3942
1665
846
3704
706
2446
4048
2071
2209
1876
2148
3936
832
76
292
85
3437
1402
554
1603
1332
2141
3534
1822
0
103
411
4130
3499
2531
160
1825
385
4022
1603
2438
2644
3196
460
2659
1628
355
4134
42
3174
3585
2816
1463
2444
696
0
2885
2499
1589
2222
1973
4224
818
1532
931
3962
4046
3744
3701
631
4410
4174
814
2841
798
3965
1445
2680
2714
29
0
1309
4053
2896
412
4272
4018
2785
1688
2268
1390
3769
842
1550
1541
487
6
2013
4075
3193
177
1946
2573
2491
0
1170
2865
3200
4187
2931
3546
2488
374
3311
4279
780
3556
1693
428
3375
148
1733
1655
850
3142
2821
567
0
3334
2677
1640
4264
677
3240
428
3727
3590
616
2272
2840
1432
2114
4402
3028
28
1186
964
2369
3603
0
2647
4088
2841
3002
1718
1346
4359
2352
150
4220
3456
3858
3025
1785
1143
1114
2165
2672
592
1583
0
2391
185
1389
235
344
4053
2832
3798
466
4218
1606
410
772
2882
1075
3353
2224
1161
711
0
1103
4324
1109
1747
1690
307
1384
1986
585
2343
4358
3279
3063
2541
3420
4364
1384
655
0
3297
3763
1532
2401
2958
2613
1830
844
1670
1477
2171
119
300
3752
3090
1734
711
0
2579
2856
3296
4179
3561
1272
3894
70
2548
1796
3854
1398
2179
1970
3742
91
0
1046
4043
1088
57
891
1792
3814
189
3473
3798
3836
1808
2144
2944
1863
0
4245
1864
6
1470
2771
2907
1135
1965
737
1258
3683
1530
1361
624
0
3638
999
557
706
3841
137
1256
1666
4148
3657
1355
1696
19
0
1103
2275
3778
733
1175
652
3052
1147
3106
1284
1094
2410
0
634
595
2172
4293
472
3445
3357
701
4400
1130
2883
0
1836
2526
4454
839
1566
2929
102
3240
605
2768
0
4344
2876
3159
2573
370
4322
651
2609
2342
0
1727
1041
2124
1773
1837
207
1715
2472
0
2018
1160
4112
1928
817
2638
2535
0
2669
3872
3707
1446
3350
997
0
1757
2577
2497
2829
1351
0
4437
1076
4039
867
0
3290
1888
2224
0
3371
4275
0
2172
0
