NAME : portmgen-100-15
COMMENT : portmgen N=100, seed=15
TYPE : TSP
DIMENSION : 100
EDGE_WEIGHT_TYPE : EXPLICIT
EDGE_WEIGHT_FORMAT : UPPER_DIAG_ROW
EDGE_WEIGHT_SECTION
0
1408
1981
2987
2139
2609
828
3767
3879
2189
1682
3429
1508
3838
3443
509
4292
3458
3091
3954
3248
1873
816
1501
855
600
1399
3350
2509
2852
3283
3658
1268
3191
2276
2288
526
2048
112
1574
1479
859
2684
3229
2913
2580
1741
1085
1545
4104
853
1369
2218
1013
489
1679
4236
3495
1700
2497
3000
1796
3040
2559
2783
875
52
2312
288
207
3920
4404
285
519
3598
4001
746
2026
194
228
142
373
2850
1645
195
2800
803
3834
2515
967
3598
1023
70
2792
1417
4274
2477
1599
2722
4028
0
192
2845
126
2133
3064
3820
1295
111
2771
1525
401
2634
2294
1576
3415
2065
2732
735
2006
2652
1625
1633
3862
1805
1704
3691
2729
202
1137
936
3705
3053
1479
1743
2943
2737
3735
1539
3377
3015
1914
4289
400
2970
3520
2200
506
2569
3053
231
3184
4313
2134
2983
2079
3475
3948
1132
3004
3347
454
2966
3013
138
1044
4005
2971
267
138
3046
2325
2685
1759
3754
2320
2549
166
772
2467
3358
583
2242
3407
3722
4283
2890
874
3357
2112
3058
1266
1632
2640
1623
2927
1743
1870
1796
0
2258
961
4353
1164
4105
648
2102
1353
4381
2238
4017
763
3264
1345
474
2965
931
3935
2863
3076
1425
413
1396
1457
1953
3390
2397
4401
2245
1848
543
2990
2354
1300
2772
1286
4402
533
4354
454
460
835
3918
2984
3542
4427
4068
1627
1236
1695
2328
3287
1119
2142
1248
255
1371
1776
2472
3214
239
2619
338
1045
2456
3989
2326
1301
1993
843
1246
4387
3489
2626
128
485
2777
2377
3836
1073
3660
170
3366
1416
3441
2034
3931
2209
2467
4071
2022
2690
2222
1380
3555
4053
2688
0
3820
1648
3884
200
1904
2801
668
1001
3464
389
3351
3590
2410
3498
4010
3246
1954
1652
1286
3521
892
2012
1414
1177
3658
780
4213
154
2764
2310
865
1481
3538
2329
1013
2518
4468
2001
1513
869
3849
2998
4398
1948
4225
31
2923
269
205
4212
4123
2225
2523
1942
3138
105
392
4351
506
1945
2577
2470
516
4088
2363
3369
3292
2752
1428
3214
2930
2076
153
2588
3440
1209
3535
2734
1114
3200
1081
2414
404
4254
2967
2171
2591
2569
70
2598
166
1470
879
3920
2994
1061
0
1479
3575
969
3440
2776
4187
2632
3855
2035
151
1711
177
326
1447
2958
1971
3950
1019
923
662
1885
842
1167
1807
939
2270
3374
1996
378
558
2865
2786
79
2181
909
4012
736
4300
2166
1728
379
1614
4037
3337
2628
913
2044
1711
4393
3289
1478
2704
1545
297
1183
764
39
2374
2876
744
3010
3275
3215
3527
500
4238
2580
2272
3513
4334
1758
3995
834
600
752
4454
2462
2434
2873
164
2017
3222
564
3328
2390
1172
4030
4016
3822
3254
4022
1920
3012
3419
2464
0
2281
1823
639
3324
338
2591
1574
420
1785
416
2515
3651
3870
2627
1704
3968
4019
946
129
2707
3208
838
3909
622
2137
3304
4095
4218
3905
1038
2719
1700
1568
2899
1376
1309
211
2619
2753
1382
1778
1017
4467
3089
1219
4008
4109
3075
2160
2622
1352
3558
153
2211
3080
1428
2127
529
2298
3602
2866
2385
4321
1589
923
3775
297
1990
3219
286
3650
1914
3164
261
1448
4104
2437
994
657
1169
328
3049
2667
1458
1603
3986
268
2592
1065
3830
1587
2884
3984
377
0
3044
4197
833
3358
1043
1744
1904
76
1113
369
1195
3892
134
2319
4324
4258
3736
2987
3922
3536
3260
4277
2058
3529
3265
2278
1092
3928
3903
1933
3840
529
2649
2189
3766
419
3677
397
766
1662
3726
2627
3683
1140
3522
1104
1855
2324
2108
1786
1299
3064
869
2617
2096
2620
1592
3029
786
4259
1326
643
1308
799
3334
3632
719
1725
4200
4318
1220
1432
1417
1597
4445
3602
734
3786
4420
4336
2221
750
4154
1452
2897
1052
2498
3025
1206
4034
4393
4422
1917
0
4247
1487
1066
402
2227
228
2579
448
1733
7
3201
628
2099
4256
2649
874
3704
3646
3774
398
773
977
907
4043
2528
2370
1747
810
317
2247
1092
1997
1105
3981
2239
384
4210
1238
1874
2494
868
3566
519
608
2516
1096
3546
27
703
3162
2762
2439
134
174
3617
638
4380
4148
350
4346
2309
1923
2161
2828
1455
1206
370
492
4179
3044
3455
341
2428
4069
2733
2926
4422
1701
1490
2355
930
3896
3558
2155
3264
4130
183
1552
4229
953
1242
3818
0
1762
2570
1838
3396
1316
755
758
1488
1210
91
2194
1156
1890
4082
4210
1011
258
4101
186
3045
2003
3443
4439
2977
1702
2716
1759
349
3169
1073
2511
4047
638
4098
454
387
701
2854
2710
1079
3478
2761
3356
2263
3143
3459
3385
1998
3944
4131
2570
3862
774
2474
2779
3768
825
3860
2045
2492
627
1892
2614
2595
734
3801
2232
3051
4221
2130
77
544
4066
2700
227
1795
583
181
4176
3943
2301
761
3406
366
4447
3156
2186
305
2533
2698
4173
0
2974
2374
2812
1296
3910
883
2876
3267
2663
1760
594
2593
138
932
1424
1391
1707
1551
183
1332
2283
3428
3502
1517
307
4047
1678
1899
1578
3840
2699
3599
3485
2233
3185
3756
784
3788
1093
860
609
3008
2609
498
3624
2459
3973
4421
370
1442
2056
3825
144
2904
3530
1591
203
1732
2174
4221
1206
1068
2435
611
4394
4218
324
1361
3359
1756
2551
877
2133
271
3683
1160
2270
2610
1798
2020
1385
2173
4311
517
3205
1898
3644
2109
1244
3676
0
4118
1199
1174
662
1337
4025
2774
4337
1125
661
2056
4003
1930
660
2978
3798
4083
405
251
4118
972
743
65
3787
826
3133
4101
311
3064
441
4026
3344
2335
1221
1921
4130
2448
3060
2668
1546
2205
2156
3729
3485
1619
4069
2928
3976
2693
389
603
2721
2971
2640
2487
2023
235
26
3493
1207
3077
2773
617
655
1442
267
2849
243
1232
3748
3140
2248
2101
2758
4066
1837
3055
2940
3742
3899
3311
1280
3055
1380
607
3421
2288
3530
60
0
1426
1998
1290
1141
2727
2804
556
3723
1755
3393
3108
1754
2250
121
4139
4269
2491
4126
910
1466
2543
1487
3684
1313
3428
1509
3458
748
103
3767
4386
1583
3016
3369
4303
4109
2814
1466
2232
2830
3645
4032
636
3871
3930
2209
1750
683
3922
3844
3154
4071
2498
1177
106
1297
3752
948
4283
703
3685
1187
2328
532
1900
2547
1423
4459
2181
273
3434
2615
1564
681
4422
965
197
2479
2930
802
2069
2646
2400
3992
540
1718
3280
151
0
415
2551
2014
1985
3518
3845
1033
635
4318
1596
720
1842
3553
4181
1816
2962
3156
1128
1163
3099
1831
2464
2292
851
2182
754
818
1461
596
284
2201
4275
635
2943
913
2457
1092
1526
1055
1608
1798
3729
3698
3528
1370
1602
2419
2551
2087
3125
1742
4231
2661
4131
1274
3488
3692
1113
2219
3426
74
3646
4394
3144
2400
121
3514
2968
4327
1271
3190
1797
2482
2566
2278
2823
2263
310
3696
705
2153
489
2793
1053
826
2575
847
0
3380
1480
3355
1715
2763
512
352
1335
1455
2081
3909
997
98
666
578
2068
3947
1445
1090
519
4459
712
1025
1135
3369
4116
1779
2372
4170
3094
3693
4305
946
3882
2379
401
315
3340
135
2593
542
2284
1569
2400
652
3818
556
606
2001
2158
1782
3060
3561
1826
3834
3046
1112
2326
207
2410
2746
1607
3777
1080
429
3079
2183
1011
3638
1990
1577
824
2072
2023
796
2168
2363
41
709
2258
2883
4183
2311
2241
2161
2229
0
2488
2914
4035
3425
964
74
1805
1034
1754
3463
548
1294
4032
960
1986
3573
4363
1181
3210
1405
2891
408
628
2096
371
3393
122
3274
2834
1927
800
2822
1194
3290
321
346
3475
2385
1913
50
3519
1600
363
3873
3312
3705
1092
1122
4179
3709
1060
3827
3563
519
2415
97
862
1475
1482
228
2609
1631
2046
2504
3347
594
1031
1828
4309
1096
2558
1204
453
991
3639
4354
2979
3953
3736
2105
2271
412
3440
1928
772
0
1787
2589
3758
2181
1574
80
534
2530
1168
2962
3078
4047
3346
2341
2964
4348
3548
1547
3501
1651
1206
1842
3008
198
731
1443
771
3141
2631
4152
4391
117
1937
2405
2730
306
3524
195
2862
3249
781
2144
2894
3733
284
3065
4094
3242
913
3834
67
1193
4171
2064
2710
979
2944
336
3985
3227
2350
4004
949
2385
434
2193
2721
1421
1121
3165
700
1675
845
1861
3373
3780
3433
3870
1250
4365
1928
3088
4414
2625
0
4083
2772
841
541
591
1915
1686
2522
2704
4099
1390
4347
2452
4183
2587
2050
2247
419
1390
2229
4272
1046
763
495
1341
2407
1275
946
3859
2983
6
2994
1955
3316
507
1715
145
1651
1542
2277
2232
4274
3902
2664
3735
3556
2590
3444
2399
3917
3556
724
3960
41
3879
3717
3099
685
1107
1718
2787
719
128
1108
3559
1236
3668
2745
1386
1650
2636
2368
3639
2167
522
1431
2601
2125
3619
1498
1457
1727
3530
0
2980
2981
3207
2566
3861
1462
1484
856
2058
2258
230
2349
166
3641
48
2345
4407
4422
803
1391
1367
1349
2488
272
1249
2218
1312
2626
4239
653
1910
3118
3293
4272
1526
4330
3125
3365
911
3075
106
3941
243
1550
803
4276
1898
3041
1489
1093
1805
2496
2034
2746
731
702
2438
2911
2168
1329
2328
3864
1911
761
87
2661
4376
3697
656
2249
3402
2551
3549
1595
2745
3200
966
1735
3419
826
3474
2661
0
3901
2003
3520
463
4095
4186
174
3909
298
3402
1644
835
2421
2236
1880
1201
3083
872
3211
1191
3521
4464
2869
2888
3702
1054
118
418
867
2988
1644
187
95
4103
3054
1724
985
1742
1426
4447
4118
2534
2900
3255
3249
610
3832
2572
3445
45
356
137
1496
875
2136
2975
1593
1442
3465
6
1338
1819
141
2784
3671
411
3963
1709
2960
2985
3825
3598
1431
3975
2190
575
4446
3937
2090
2529
4173
0
3567
1067
1227
1279
1058
1394
3343
371
1408
1021
3596
3121
1
4189
793
3692
3001
1028
1308
114
613
1180
124
529
2483
4375
367
982
3819
1791
2294
2740
3858
4348
3075
1844
2807
370
2871
252
3137
3852
1846
4081
2043
2891
4311
1756
1123
324
3695
4397
883
1339
4091
1758
2990
1291
1137
2915
3999
3304
4010
1633
2118
2123
1503
495
1459
4001
4399
2525
831
1338
4351
2224
4428
2548
4167
285
0
3376
4134
661
3529
2237
2599
1151
3856
2415
960
700
3644
2765
3946
968
4285
896
3430
4315
939
3468
3856
765
1604
2350
1846
2352
3957
1013
3088
3887
3918
1862
2749
3473
2035
3822
1469
1869
4470
3806
1628
638
1479
2266
3769
2756
3410
1309
3037
3421
502
2549
3139
4349
2870
3606
4024
66
3380
3794
3073
3137
3506
2117
905
2958
3238
2698
49
4386
3327
2745
3025
516
361
226
4076
2568
0
4254
3766
168
3268
1151
3496
173
4036
2031
4234
393
1761
2325
782
3156
4087
1985
4398
2002
906
4343
2321
165
1067
2234
2744
1919
4189
1453
4309
3508
1291
2893
3847
907
1489
3584
1975
798
4092
4381
437
4052
287
3467
4221
1497
3717
4413
1350
2574
1197
1795
186
2151
4138
130
3864
3557
1409
160
2177
91
998
4251
1372
408
1126
2276
2793
3916
3183
3149
2828
1193
889
4443
42
0
3506
2739
2964
1003
1269
2961
888
3803
3432
4280
3436
1455
1771
3392
3906
2914
2732
722
508
3750
3915
55
3491
350
2628
717
1991
63
43
246
1902
112
3983
1528
3716
4052
1471
2039
3660
925
3904
243
3093
3253
2349
2835
1667
4270
938
1322
1149
1393
2311
2353
3526
420
3853
1142
3902
2586
260
4348
454
850
1554
205
15
1998
1276
3704
1
2499
1203
3392
266
3606
3507
0
4330
2092
1310
1936
1622
2740
2610
1472
3125
914
3619
3073
1186
983
4225
130
3306
3710
1086
1804
2137
2071
3708
1106
2622
593
1905
2676
2434
945
2417
4136
2494
3588
231
3651
1550
2714
1285
4414
1990
1107
1786
2180
2591
1367
4089
4124
3330
244
1687
4000
1144
1208
263
4291
3123
2716
4051
508
717
226
4403
2798
3427
3071
2712
1667
1128
4114
4322
3818
4079
3123
877
2607
0
967
3347
552
1803
2768
1367
676
24
4125
2135
2843
1846
1223
2293
3483
3011
4383
2800
10
3857
2451
2088
3886
1588
1920
3267
249
3073
2350
3319
868
2522
3340
2894
2151
1694
2662
3119
3541
2853
3596
4207
4084
762
376
3740
2905
3279
2966
3353
2323
3846
1756
2977
3314
1683
3326
1500
2010
4014
1669
1077
1842
2683
2184
2057
3476
1902
3747
1256
4361
4249
2318
4031
2101
0
3999
3252
1975
652
3403
1385
4312
225
2752
3303
1432
1146
2968
2031
284
3774
3616
3588
4429
354
2161
452
2459
3223
4002
278
1820
1236
1246
3806
2583
3045
172
370
3924
1104
3799
1619
3830
3410
4114
2604
2788
1624
960
3313
2582
2978
3317
1144
807
2005
2383
1576
1396
2023
3857
1422
560
921
510
3298
1042
664
2492
1373
2206
3025
4101
3423
4248
3335
3852
2509
0
1644
2526
3179
1896
1385
1172
1
1524
19
4067
2309
3688
2204
2567
537
3682
1645
1498
741
4260
500
659
829
1254
2311
3774
768
1770
1852
657
3823
1206
3563
1707
129
3645
289
2836
414
485
2450
934
3415
4457
4152
1853
4265
2027
33
501
3957
1912
2533
2467
964
1422
1577
1931
1125
4164
215
1140
2526
2580
3231
626
855
1491
189
459
1434
3836
2837
0
3927
3518
1487
3269
2908
2775
1561
3932
93
3316
527
2633
290
516
2964
4158
2362
338
4180
4099
2044
452
779
2588
3016
2115
2651
1131
777
392
2095
2495
3225
1559
351
1845
1199
376
2610
826
601
568
76
30
2589
2371
757
2471
3748
2374
622
2103
4389
3986
1350
3679
316
3624
1213
599
2803
2213
2216
1341
3823
491
698
2490
81
1611
528
1314
0
2033
3039
2048
1374
3634
1730
467
857
3729
4427
3296
410
217
1420
2090
2725
2998
3263
2573
3065
1020
968
1551
1671
2251
294
776
4437
3045
4187
3511
4349
492
1973
2137
158
2349
1533
3422
4059
2525
901
657
2941
3324
3994
932
2988
1854
3665
2590
2589
3031
2506
1920
621
1416
2302
1341
4374
2114
1449
2023
462
385
1299
3489
1842
2
3129
474
0
3414
2326
177
301
3466
2191
2761
2859
1992
4018
562
2347
3050
828
3304
3532
685
2609
4109
2510
2925
171
2156
547
3993
823
3589
3939
2168
2341
1801
2449
4390
2369
3683
3236
3031
1330
3354
1194
1727
1952
4148
1889
3246
2937
4323
3620
4008
1826
455
1138
4045
2776
4021
492
4360
3246
3124
3923
4271
3893
2682
637
4152
2584
2163
2856
1191
1684
0
864
1583
3030
2326
4434
3470
3054
3980
2184
2096
3023
2107
1108
4014
1377
242
492
3651
3492
1626
1550
4103
472
1227
1774
2868
2561
571
2699
4336
4202
3266
1426
3761
966
1870
3900
2614
3783
479
1485
4010
645
2934
3323
3516
3266
1714
1309
2084
1421
2188
3083
1592
1182
2972
2080
1112
226
4412
1974
704
808
3079
3129
747
1488
60
2596
0
775
1402
1261
2854
2942
3300
4384
603
3007
1331
4107
2756
2331
238
4215
1311
4025
3852
2467
2900
3501
4047
1595
788
4110
3893
811
2560
1183
85
2570
3538
3055
3661
3286
2611
428
2810
4012
4327
185
3391
431
3783
1522
2824
4173
2580
2523
3352
1415
1628
3811
157
2666
3692
1960
1937
935
3582
2983
4153
3715
2017
1969
505
3590
1816
0
3425
2721
1334
4222
3659
2365
2391
239
3387
575
3171
862
3131
4219
2289
3348
2356
1921
3607
3136
2710
4299
1840
860
1749
3525
480
4376
511
164
4421
3950
3779
1170
3171
606
56
597
979
1421
2342
1389
2338
1350
3268
2948
1309
4249
499
240
4412
3979
3046
3814
2179
913
2071
2873
2704
3859
3734
3107
4060
2419
3145
642
687
0
2493
1790
4051
912
2826
1224
4441
4308
2255
1709
1338
4029
4061
1371
3097
880
2852
582
2439
3304
1926
4052
1574
754
1874
2285
4227
708
3283
3199
1421
3690
977
2986
3416
3300
426
2579
4124
336
3634
89
1539
3182
3891
666
2382
3179
3024
698
3117
2636
1574
2378
777
4434
2744
2580
1703
549
5
3209
874
419
2787
4134
0
3649
7
3449
3537
1051
3262
88
632
1193
1263
3414
2360
2471
3522
348
3365
2133
1753
3362
884
4467
1772
3835
1812
3963
1798
1975
2887
2244
1115
680
96
2123
2071
1507
3526
3005
3696
1638
3664
4037
2189
4116
1482
2906
2946
351
1732
643
1602
123
1607
564
1464
4297
1591
1284
2208
28
697
2612
2189
911
1392
2368
0
4176
142
786
4045
1002
2272
2428
2614
1426
2608
2155
2751
3119
451
1709
4054
4275
759
3428
1726
55
3365
1970
3533
1107
1185
3128
4270
3292
1296
4187
1805
1987
590
4038
4084
1647
1169
4010
732
2227
844
944
3284
3471
1494
3421
1006
3447
3472
2829
1114
4310
1910
658
4205
113
2453
1638
402
2955
3345
3405
2161
0
718
856
367
2913
2413
3889
3407
1713
813
2858
3719
650
889
4169
3234
26
2620
2862
1601
3926
3606
4038
6
575
113
3754
2725
2319
1967
3419
3489
263
1268
3094
2979
1285
3736
1193
3058
654
3961
19
3198
2515
1443
912
1811
3727
1197
327
4143
1089
661
1073
1521
2385
3765
2820
4025
2841
468
2534
3415
0
4191
3693
1050
2654
3014
2482
4401
1391
953
3009
2482
561
1318
3648
4277
2367
144
2038
1573
813
1248
3522
3840
137
1206
3447
1787
1224
3020
3335
3237
1820
166
2037
2026
3611
3235
4338
1626
4216
2671
3806
2568
4153
1274
62
3371
1175
4156
643
1180
4117
1325
3740
1534
3911
2246
3765
1748
2882
4241
2866
0
3751
3139
4239
1603
281
836
1931
1288
2902
2907
886
3316
3181
3576
2968
2203
4309
4431
1247
1382
3838
2878
3606
3202
3622
4296
3561
1907
3880
796
2686
1124
3819
633
3599
3074
3443
1002
4106
3945
1928
1186
290
4162
824
3269
2447
2361
3511
3867
737
2858
4286
3804
4466
4443
3648
4347
2548
3073
1292
0
4429
1432
3581
1208
666
1563
4338
3627
1476
2675
1204
3585
1514
3190
24
525
1957
2185
672
1478
735
821
1037
3109
456
598
3331
276
2898
419
4457
357
2299
3909
4189
2461
228
2840
213
3880
3047
352
1658
4181
2122
4359
2877
2033
1542
4411
4003
979
684
2563
2392
1719
2945
1849
4132
1142
0
2550
2781
4224
730
953
91
567
2679
4435
901
2281
1437
4341
727
1310
3373
102
448
3395
124
2045
2461
466
1545
4219
413
1308
2222
296
1662
624
4190
3585
3317
2023
1078
2478
3941
757
2829
1885
4020
2200
2291
2115
1179
981
657
160
487
3173
4055
2773
1539
160
1885
4060
2974
3424
0
394
64
1458
3922
2798
3397
2509
3584
2137
3515
1214
3397
2010
3253
3104
1676
2495
4121
796
3953
1246
198
1341
1367
3254
658
2284
1634
1616
1219
2410
2690
673
4436
1663
572
3902
2965
1599
3421
2963
2520
1958
4244
3647
2045
403
1736
314
4249
2181
2928
2839
2594
2325
1859
3684
2920
0
3593
1916
4403
1378
2346
3127
1371
1557
1113
1857
2828
1061
1648
1049
2033
4249
3832
2252
2894
4189
2697
2294
3190
2994
4298
4380
2335
2041
1993
2482
1228
2186
4058
1825
3583
3193
3732
1738
1708
3455
3783
3788
2549
2426
1819
1182
326
530
3081
2256
2714
4176
1070
4454
616
2865
226
0
825
1648
1265
1808
2502
124
2152
84
733
3607
3014
3982
1995
686
2581
811
2420
1388
1868
1743
1304
3935
4115
60
3664
1104
397
2874
2705
2312
1474
1161
2247
1691
1621
625
2833
3335
1509
56
2759
1285
2453
752
285
967
3950
2116
2784
2042
3856
2136
3113
1286
796
1146
0
3461
1874
4135
2354
3401
398
3594
3856
3514
174
1169
2205
152
3066
118
1091
3921
3202
856
235
3146
3699
968
4448
2922
225
1012
4269
447
677
2996
1919
3615
4308
4033
3101
3774
2971
3042
313
2175
2872
2538
2169
3195
2243
4442
3279
3697
3193
516
4044
3818
3301
3036
0
2236
681
2401
544
2618
1765
2392
698
626
3235
1427
1008
485
401
4332
1769
2559
2080
2699
395
3718
3693
913
420
2011
1734
1352
2484
1252
2169
625
3100
3757
3783
2301
1024
1430
73
4440
1792
896
3219
2176
1584
776
3519
1793
3216
3914
3719
653
4262
2230
637
0
2553
2022
1857
3529
1891
288
1730
1636
3644
966
2365
3824
1522
4468
429
555
653
1461
1290
3581
3898
2782
1264
3749
3845
1221
3430
2523
1047
430
2809
2537
2237
3079
10
113
1243
3547
1676
528
1901
3071
2526
1908
3736
1645
360
474
3100
568
473
3660
4422
0
1173
1663
4167
4269
2921
1969
697
1741
371
4082
3787
2242
2339
1029
3650
2126
2503
99
2869
3261
1738
1995
2260
4339
915
582
3320
2757
525
1526
3905
2888
1012
1037
543
3295
3999
548
2627
3737
3451
3664
2754
1314
1291
2900
1587
4415
2497
108
1550
3649
0
449
3883
4450
253
39
2293
887
2601
1707
1833
2278
1934
1284
2204
3517
126
2293
3320
2892
2033
1255
3859
1536
4052
1885
2896
879
1523
2999
2789
2479
797
741
2826
2017
398
432
2828
97
2605
3647
1941
3814
3207
1778
1889
2475
2958
76
1393
871
0
2098
3723
2373
4032
1333
3253
1921
2168
2426
2355
1906
4010
2998
1697
128
18
81
1971
719
376
90
1167
347
3228
193
1151
595
2128
889
1975
2950
1971
100
2428
3416
2019
1725
666
258
2968
3298
2902
1059
2957
2594
3831
3010
2492
3405
1679
0
2179
2479
87
3338
2597
1194
2144
1691
3868
4058
2787
4164
525
71
1588
668
2414
3187
1957
2524
318
633
2384
2748
2885
1817
3008
1118
1762
1952
1026
1914
2610
380
3618
2432
1202
3319
1490
4187
3098
2165
2569
2454
1119
1555
946
2035
1542
0
2085
3369
2854
3644
3181
4272
215
2947
1526
4345
1171
1533
2920
2596
1389
2670
3031
1902
2103
3446
2970
2004
1036
3
2232
602
2033
3834
4094
3062
2822
2272
2648
3654
1836
1753
3610
3497
1168
3198
856
4144
3592
2545
2494
3329
1014
4283
0
1096
496
4139
3212
1007
2237
2720
3195
3060
1420
1938
492
1193
3139
3009
4160
783
1153
55
4142
831
1688
2256
1407
1423
3398
215
4403
652
1763
1447
4463
1892
2034
4427
1356
583
4409
2317
4070
947
556
332
998
2604
668
1158
0
3935
999
3767
4143
2231
1508
1684
3380
2832
3294
3010
1108
4162
802
399
167
719
4323
3415
3389
1944
3143
2703
4105
2210
939
377
917
260
2894
2032
383
2926
1279
3988
4375
79
34
3234
4259
3563
1529
2150
2280
4037
1730
0
2076
3990
3446
226
1757
1551
2040
1517
2407
1030
2783
1629
3018
3884
3387
849
2605
2719
3867
69
2147
2432
2067
968
3593
1665
1964
1842
3907
1065
1950
3386
1568
2498
2021
3450
2106
3061
4032
2613
1445
765
3558
2097
3450
0
3864
306
2979
1667
3623
1158
1658
89
2238
465
1102
708
3574
3352
3324
3799
1441
1603
2760
3191
1644
3511
1696
4354
423
2838
2680
546
3203
1588
2158
4213
1784
3959
3193
1602
1524
1558
2809
1872
1322
2579
2309
3380
0
1380
1179
1195
1664
2210
4469
3299
146
3143
252
2849
4120
761
293
86
2640
4216
926
2226
3830
3417
2073
3431
3468
2831
326
2724
1579
922
1885
1269
2667
4104
1623
2930
4342
634
2648
1555
1869
3224
3991
1131
0
3230
3609
561
579
2877
1250
2665
209
2415
1917
1381
1210
3065
1188
2478
491
440
2048
2893
3702
478
3163
2919
1493
3504
1118
2670
3534
1982
1440
458
4260
3594
2497
544
2543
543
1875
907
1042
3975
1916
0
3773
3609
190
862
3617
3137
3372
3749
3492
3178
3904
2092
3247
3637
1321
4143
893
3571
4203
1619
4014
3764
3597
3474
2532
583
2494
1616
917
1937
3030
568
2212
3384
2256
1457
3687
706
4390
1000
1008
0
1590
1277
2262
3446
4073
4243
4117
3716
100
521
2912
519
4173
118
2162
125
522
3565
3751
1879
3796
2252
4372
2951
176
430
912
2537
1942
1775
2411
3163
1401
194
1613
696
60
1714
784
1348
0
1581
1205
1232
721
4280
1740
934
3
481
4298
776
1737
3792
3423
2979
3259
4278
1183
1640
4237
1202
1725
4208
4327
3021
1391
2869
1123
2551
2525
1026
883
3906
2925
976
3022
1802
1363
3043
0
3804
3936
3496
3352
1623
2673
4128
3506
2176
1006
1310
2563
11
3440
3360
675
3679
4029
4211
265
1924
3917
2555
4307
871
948
491
330
1287
3810
854
234
43
3252
148
1354
4030
2436
0
2837
3425
2096
505
3013
2339
3243
12
3657
3316
3658
4263
2139
1567
862
931
2600
4118
1480
585
1681
875
1466
67
369
784
1323
1409
1581
272
73
3608
2113
1480
3034
2570
1970
0
2770
1869
2786
1977
241
1324
3601
1912
4400
3343
2102
1954
3111
282
2716
2905
3399
262
1228
3549
374
3235
1978
3010
1555
1048
1520
4232
1358
431
621
3951
4043
759
3424
2570
0
406
2465
3639
4449
1304
2425
3845
1137
3063
2571
3541
3035
3529
3913
2428
1560
4308
227
3980
1724
4173
4334
3548
4098
557
2770
3977
3492
3460
2229
2483
2526
762
815
2728
0
3124
747
1167
281
1334
971
932
668
1751
3875
2755
683
3233
815
1543
1073
3497
2170
4219
2082
404
4164
1033
380
2133
4072
125
2177
4393
3394
248
27
4289
3938
0
3628
3663
2563
2563
3934
2236
2042
589
4265
2846
2049
3961
108
330
419
1241
1302
1217
233
672
2532
3581
3212
231
3545
3771
518
1560
608
3157
73
1430
2868
0
4292
2269
3731
393
1827
968
3734
1471
1854
101
2584
4297
1641
2245
579
4117
2030
3528
3731
2466
98
2484
2576
189
2264
3091
1428
1703
2388
2500
3522
2074
0
2068
2447
1592
581
988
2415
3919
3796
3234
877
2088
2689
1661
3449
3210
2434
1810
607
1892
4143
3603
3461
772
2876
924
1622
256
2242
4450
1819
2517
0
3060
623
3692
2344
775
3709
3690
3595
875
889
4435
2472
4167
4445
664
1313
2481
362
2815
3803
443
4367
3726
4198
2264
1869
3958
428
91
4134
0
1804
2138
1106
2109
3264
2081
1031
1943
4451
866
507
672
1015
3569
909
1295
438
3008
1705
2961
2723
164
744
1823
351
1381
1869
3490
4167
0
499
1734
3295
1163
1787
2147
211
3302
2841
2939
896
161
4402
892
3292
3826
1712
2389
843
1947
1959
1585
1456
2996
3543
1792
3448
4102
0
1917
3543
2481
1663
460
2791
3334
354
3523
3246
2719
1683
1502
2770
2458
760
617
1939
4232
2425
3102
3917
2370
3238
2795
3789
2565
0
3003
523
1586
2960
149
2579
2884
2154
2968
4119
1655
3734
3414
3754
531
4274
3945
1251
1785
3519
2516
4424
1544
1724
4404
2381
0
2650
1545
4034
3151
2649
3133
978
3897
4333
2058
4165
2857
4396
3127
3306
2229
2785
766
3829
3678
2089
1277
3953
387
2926
0
2752
1827
2176
3139
2544
4071
3579
2550
3623
187
3393
3982
2769
3134
4374
3969
3645
1935
2120
2024
3284
2557
3433
2949
0
3229
2225
3081
923
2962
4065
2520
405
574
3703
4026
1243
35
3582
773
1760
2042
1900
3552
2807
14
3337
1177
0
3341
1203
657
1844
69
108
2905
4251
536
3255
4025
146
1964
3223
3672
4191
3365
1305
487
451
2709
20
0
2815
171
1112
4031
1389
3733
526
1926
3326
3721
465
962
3068
921
150
2991
2778
2226
446
2233
800
0
1920
3137
3770
2714
2683
2223
1910
3620
2824
1772
1895
1890
1960
2430
3822
677
3636
4403
3222
1678
0
2608
4117
3972
2385
2199
751
1970
717
3829
3457
3820
1068
3999
2990
791
1691
3961
106
1589
0
1964
4263
3494
2035
4263
2686
929
2474
1976
1820
4469
2703
2596
1335
626
3725
1116
4172
0
3961
493
1022
1387
2790
282
240
4365
1804
336
1191
2888
2969
215
1070
2531
1943
0
1535
1379
1695
1337
197
678
1196
3420
3273
90
3693
1183
2649
1309
3765
1613
0
1200
390
4097
3229
3494
4032
2378
1085
2895
337
3399
3880
123
1744
4174
0
4392
1300
1637
2183
2374
307
1730
3105
848
1727
4222
1562
4416
2385
0
3585
63
4184
2821
2319
4358
317
1862
534
2750
858
1362
2247
0
4299
444
447
3514
4043
3502
4089
1718
3148
3338
1039
2947
0
2494
1097
1650
290
2788
1572
3918
623
3115
3249
1063
0
2353
3367
1942
2550
1348
4349
2268
3885
175
3814
0
1631
2288
3918
3018
2116
2152
3109
4209
1092
0
2843
3992
4002
1605
406
3296
70
2409
0
1189
29
216
189
2408
784
879
0
2192
679
317
285
1074
4438
0
2890
3203
1222
3123
2837
0
3044
1437
2597
3422
0
1973
2339
63
0
3018
2515
0
195
0
