street/service/VehicleTypeService.class
street/simulation/Lane.class
street/simulation/StreetSimulation.class
street/model/StreetDescription.class
street/executor/ExecutorFactory.class
street/model/VehicleDescription.class
street/executor/Executor.class
street/model/StreetConfiguration.class
street/service/VehicleService.class
street/service/RedirectsService.class
street/executor/AccelerateExecutor.class
street/executor/SkipExecutor.class
street/controller/StreetController.class
street/model/Vehicle.class
street/controller/VehicleController.class
street/executor/BrakeExecutor.class
street/service/StreetService.class
street/Application.class
