config/model/Street.class
config/model/AgentModel.class
config/model/ServiceFactory.class
config/model/Service.class
config/model/Registration.class
config/model/Junction.class
config/Application.class
config/model/StreetService.class
config/model/JunctionService.class
config/model/AgentService.class
config/model/Linker.class
