[
    {
       "geometry":{
          "disposed":false,
          "pendingRemovals_":null,
          "dispatching_":null,
          "listeners_":{
             "change":[
                null
             ]
          },
          "revision_":1,
          "ol_uid":"736",
          "values_":null,
          "extent_":[
             null,
             null,
             null,
             null
          ],
          "extentRevision_":-1,
          "simplifiedGeometryMaxMinSquaredTolerance":0,
          "simplifiedGeometryRevision":0,
          "layout":"XY",
          "stride":2,
          "flatCoordinates":[
             -693094.6862495554,
             7040089.459624766,
             -693091.7140191513,
             7040072.487469024,
             -693091.8476025403,
             7040053.484659244,
             -693101.220703665,
             7040005.1208501365,
             -693117.0280713578,
             7039957.89376254,
             -693125.5774082507,
             7039936.860566049,
             -693131.1545147394,
             7039906.810577557,
             -693130.675840929,
             7039878.754088175,
             -693122.8389487771,
             7039853.734340809,
             -693109.0798597151,
             7039829.441228801,
             -693102.5788014528,
             7039824.485741133,
             -693089.6212127245,
             7039814.612034317,
             -693054.4219897357,
             7039800.080940907,
             -693014.7365912679,
             7039796.61583794,
             -692968.316363607,
             7039799.671089943,
             -692936.612572629,
             7039796.634467522,
             -692920.2820033297,
             7039792.834033735,
             -692909.5285405192,
             7039790.319041783,
             -692890.5263034407,
             7039784.096768823,
             -692889.5244280235,
             7039783.947732408,
             -692857.442150777,
             7039762.877736853,
             -692835.5010791415,
             7039746.949527918,
             -692817.5675091748,
             7039725.9168892065,
             -692799.9678976804,
             7039709.523019825,
             -692781.2439593289,
             7039692.085941294,
             -692746.7126532849,
             7039663.4527018815,
             -692713.1832226579,
             7039641.488822963,
             -692669.9912602301,
             7039619.487746356,
             -692645.0556942924,
             7039606.242419669,
             -692640.2912200865,
             7039603.708857587,
             -692633.4339394536,
             7039600.076178062,
             -692629.9496393917,
             7039598.231895248,
             -692596.019458598,
             7039580.29207563,
             -692561.7775832299,
             7039554.230042164
          ],
          "flatMidpoint_":null,
          "flatMidpointRevision_":-1,
          "maxDelta_":-1,
          "maxDeltaRevision_":-1
       },
       "highway":"unclassified",
       "lanes":"2",
       "maxspeed":"30",
       "surface":"asphalt"
    },
    {
       "geometry":{
          "disposed":false,
          "pendingRemovals_":null,
          "dispatching_":null,
          "listeners_":{
             "change":[
                null
             ]
          },
          "revision_":1,
          "ol_uid":"790",
          "values_":null,
          "extent_":[
             null,
             null,
             null,
             null
          ],
          "extentRevision_":-1,
          "simplifiedGeometryMaxMinSquaredTolerance":0,
          "simplifiedGeometryRevision":0,
          "layout":"XY",
          "stride":2,
          "flatCoordinates":[
             -692139.9101089706,
             7039753.19040131,
             -692134.4777178199,
             7039763.231697417,
             -692128.8115557386,
             7039774.129964491,
             -692126.2623393993,
             7039779.178568491,
             -692121.0414552813,
             7039782.103406958,
             -692106.6701090197,
             7039787.319682056
          ],
          "flatMidpoint_":null,
          "flatMidpointRevision_":-1,
          "maxDelta_":-1,
          "maxDeltaRevision_":-1
       },
       "highway":"unclassified",
       "lanes":"2",
       "maxspeed":"30",
       "surface":"asphalt"
    },
    {
       "geometry":{
          "disposed":false,
          "pendingRemovals_":null,
          "dispatching_":null,
          "listeners_":{
             "change":[
                null
             ]
          },
          "revision_":1,
          "ol_uid":"854",
          "values_":null,
          "extent_":[
             null,
             null,
             null,
             null
          ],
          "extentRevision_":-1,
          "simplifiedGeometryMaxMinSquaredTolerance":0,
          "simplifiedGeometryRevision":0,
          "layout":"XY",
          "stride":2,
          "flatCoordinates":[
             -693542.9030472855,
             7040146.636121748,
             -693517.4554116902,
             7040148.480531719,
             -693498.197139783,
             7040148.294227665,
             -693490.0040252606,
             7040148.145184421,
             -693393.8796449606,
             7040144.92212499,
             -693340.1345948057,
             7040142.239348192,
             -693290.0853517449,
             7040136.762015033,
             -693222.1248026156,
             7040124.9317335095,
             -693159.5743807389,
             7040115.318478329,
             -693152.2829540919,
             7040114.070246437,
             -693139.3253653636,
             7040111.871868349,
             -693123.9966714814,
             7040107.2701806035,
             -693110.7273881788,
             7040098.905176081,
             -693094.6862495554,
             7040089.459624766
          ],
          "flatMidpoint_":null,
          "flatMidpointRevision_":-1,
          "maxDelta_":-1,
          "maxDeltaRevision_":-1
       },
       "highway":"unclassified",
       "lanes":"2",
       "lit":"yes",
       "maxspeed":"30",
       "name":"Wynnsward Drive",
       "name:en":"Wynnsward Drive",
       "name:ga":"Slí Na Báinsí",
       "surface":"asphalt"
    },
    {
       "geometry":{
          "disposed":false,
          "pendingRemovals_":null,
          "dispatching_":null,
          "listeners_":{
             "change":[
                null
             ]
          },
          "revision_":1,
          "ol_uid":"1076",
          "values_":null,
          "extent_":[
             null,
             null,
             null,
             null
          ],
          "extentRevision_":-1,
          "simplifiedGeometryMaxMinSquaredTolerance":0,
          "simplifiedGeometryRevision":0,
          "layout":"XY",
          "stride":2,
          "flatCoordinates":[
             -692106.6701090197,
             7039787.319682056,
             -692100.9148913457,
             7039777.166578322,
             -692093.1113950412,
             7039766.268307082,
             -692062.5319309202,
             7039744.04333184,
             -692025.9412142965,
             7039719.452484404,
             -691996.953618894,
             7039699.146463141
          ],
          "flatMidpoint_":null,
          "flatMidpointRevision_":-1,
          "maxDelta_":-1,
          "maxDeltaRevision_":-1
       },
       "highway":"unclassified",
       "lanes":"2",
       "maxspeed":"30",
       "surface":"asphalt"
    },
    {
       "geometry":{
          "disposed":false,
          "pendingRemovals_":null,
          "dispatching_":null,
          "listeners_":{
             "change":[
                null
             ]
          },
          "revision_":1,
          "ol_uid":"1310",
          "values_":null,
          "extent_":[
             null,
             null,
             null,
             null
          ],
          "extentRevision_":-1,
          "simplifiedGeometryMaxMinSquaredTolerance":0,
          "simplifiedGeometryRevision":0,
          "layout":"XY",
          "stride":2,
          "flatCoordinates":[
             -692106.6701090197,
             7039787.319682056,
             -692107.9280192659,
             7039803.639193375,
             -692106.1023796168,
             7039812.600035186,
             -692100.2469744011,
             7039825.137778807,
             -692080.1426743638,
             7039868.246902485,
             -692070.1573160397,
             7039889.8947009295,
             -692066.6284881814,
             7039900.960809979,
             -692063.9902162497,
             7039940.921887524,
             -692065.3594459865,
             7039971.3073447095,
             -692069.1554406225,
             7039997.445264942,
             -692073.0850186475,
             7040012.312060461,
             -692080.2873897018,
             7040035.282990876,
             -692089.7829422664,
             7040058.347138598
          ],
          "flatMidpoint_":null,
          "flatMidpointRevision_":-1,
          "maxDelta_":-1,
          "maxDeltaRevision_":-1
       },
       "highway":"unclassified",
       "lanes":"2",
       "maxspeed":"30",
       "surface":"asphalt"
    },
    {
       "geometry":{
          "disposed":false,
          "pendingRemovals_":null,
          "dispatching_":null,
          "listeners_":{
             "change":[
                null
             ]
          },
          "revision_":1,
          "ol_uid":"1370",
          "values_":null,
          "extent_":[
             null,
             null,
             null,
             null
          ],
          "extentRevision_":-1,
          "simplifiedGeometryMaxMinSquaredTolerance":0,
          "simplifiedGeometryRevision":0,
          "layout":"XY",
          "stride":2,
          "flatCoordinates":[
             -691972.7861574428,
             7039569.524477469,
             -691982.4041614473,
             7039549.926741066,
             -691990.1519980065,
             7039539.941601162,
             -692009.9891312658,
             7039517.065245793,
             -692020.6201426366,
             7039507.91844785,
             -692038.8208793813,
             7039492.251553603,
             -692047.1141814453,
             7039485.731452134,
             -692056.042004607,
             7039478.708377383,
             -692068.387336136,
             7039469.4871082865,
             -692072.038615434,
             7039467.475196442,
             -692091.5974499665,
             7039456.726379785,
             -692102.7516629439,
             7039450.597511616,
             -692150.474328647,
             7039428.8391363425,
             -692171.803143083,
             7039419.748325941,
             -692189.781240846,
             7039411.495816482,
             -692199.9558423045,
             7039409.595691361,
             -692224.4127344319,
             7039405.031667199,
             -692254.468996946,
             7039401.4177070595,
             -692264.2205843396,
             7039400.244101803,
             -692294.176659312,
             7039396.760544361,
             -692305.5201154238,
             7039396.443857396,
             -692321.3274831165,
             7039395.996769933,
             -692361.0240135334,
             7039398.101806939,
             -692401.4997803858,
             7039406.969048562,
             -692418.1197803612,
             7039413.28416995,
             -692437.4671078612,
             7039420.642503557,
             -692467.5678981716,
             7039435.619993483,
             -692490.9672551362,
             7039453.652630719,
             -692514.5558552354,
             7039482.471403401,
             -692527.379860575,
             7039500.150197974,
             -692533.6471479065,
             7039509.762709721,
             -692544.1779717355,
             7039527.273904392,
             -692550.6345022016,
             7039539.848456262,
             -692561.7775832299,
             7039554.230042164
          ],
          "flatMidpoint_":null,
          "flatMidpointRevision_":-1,
          "maxDelta_":-1,
          "maxDeltaRevision_":-1
       },
       "highway":"unclassified",
       "lanes":"2",
       "maxspeed":"30",
       "surface":"asphalt"
    },
    {
       "geometry":{
          "disposed":false,
          "pendingRemovals_":null,
          "dispatching_":null,
          "listeners_":{
             "change":[
                null
             ]
          },
          "revision_":1,
          "ol_uid":"1372",
          "values_":null,
          "extent_":[
             null,
             null,
             null,
             null
          ],
          "extentRevision_":-1,
          "simplifiedGeometryMaxMinSquaredTolerance":0,
          "simplifiedGeometryRevision":0,
          "layout":"XY",
          "stride":2,
          "flatCoordinates":[
             -691996.953618894,
             7039699.146463141,
             -691969.3352532281,
             7039681.6162608,
             -691958.6040543157,
             7039668.911079843,
             -691954.44070536,
             7039659.186600214,
             -691952.481482322,
             7039652.051596854,
             -691955.5761641661,
             7039636.235385083,
             -691964.96039724,
             7039593.164776985,
             -691966.2294394351,
             7039588.656534784,
             -691972.7861574428,
             7039569.524477469
          ],
          "flatMidpoint_":null,
          "flatMidpointRevision_":-1,
          "maxDelta_":-1,
          "maxDeltaRevision_":-1
       },
       "highway":"unclassified",
       "lanes":"2",
       "maxspeed":"30",
       "surface":"asphalt"
    },
    {
       "geometry":{
          "disposed":false,
          "pendingRemovals_":null,
          "dispatching_":null,
          "listeners_":{
             "change":[
                null
             ]
          },
          "revision_":1,
          "ol_uid":"1534",
          "values_":null,
          "extent_":[
             null,
             null,
             null,
             null
          ],
          "extentRevision_":-1,
          "simplifiedGeometryMaxMinSquaredTolerance":0,
          "simplifiedGeometryRevision":0,
          "layout":"XY",
          "stride":2,
          "flatCoordinates":[
             -691966.2294394351,
             7039588.656534784,
             -691963.4353202161,
             7039575.318114118,
             -691962.2887294609,
             7039561.979715822,
             -691976.0255546249,
             7039537.20314147,
             -691988.8606919133,
             7039524.069725466,
             -692009.9891312658,
             7039517.065245793
          ],
          "flatMidpoint_":null,
          "flatMidpointRevision_":-1,
          "maxDelta_":-1,
          "maxDeltaRevision_":-1
       },
       "bus":"yes",
       "highway":"unclassified",
       "lanes":"1",
       "maxspeed":"30",
       "motor_vehicle":"no",
       "oneway":"yes",
       "surface":"asphalt"
    },
    {
       "geometry":{
          "disposed":false,
          "pendingRemovals_":null,
          "dispatching_":null,
          "listeners_":{
             "change":[
                null
             ]
          },
          "revision_":1,
          "ol_uid":"1822",
          "values_":null,
          "extent_":[
             null,
             null,
             null,
             null
          ],
          "extentRevision_":-1,
          "simplifiedGeometryMaxMinSquaredTolerance":0,
          "simplifiedGeometryRevision":0,
          "layout":"XY",
          "stride":2,
          "flatCoordinates":[
             -692095.8721184127,
             7040079.362026097,
             -692105.7461572462,
             7040129.216715335,
             -692116.1433976864,
             7040155.895436729,
             -692137.1271217008,
             7040198.000304774
          ],
          "flatMidpoint_":null,
          "flatMidpointRevision_":-1,
          "maxDelta_":-1,
          "maxDeltaRevision_":-1
       },
       "highway":"unclassified",
       "lanes":"2",
       "maxspeed":"30",
       "surface":"asphalt"
    },
    {
       "geometry":{
          "disposed":false,
          "pendingRemovals_":null,
          "dispatching_":null,
          "listeners_":{
             "change":[
                null
             ]
          },
          "revision_":1,
          "ol_uid":"1824",
          "values_":null,
          "extent_":[
             null,
             null,
             null,
             null
          ],
          "extentRevision_":-1,
          "simplifiedGeometryMaxMinSquaredTolerance":0,
          "simplifiedGeometryRevision":0,
          "layout":"XY",
          "stride":2,
          "flatCoordinates":[
             -692089.7829422664,
             7040058.347138598,
             -692093.7125202914,
             7040057.8254931625,
             -692097.1634245061,
             7040058.496180163,
             -692100.2358424519,
             7040060.228788497,
             -692102.6069476058,
             7040062.818386611,
             -692104.031837088,
             7040066.041412772,
             -692104.1654204769,
             7040067.364157992,
             -692104.3769275094,
             7040069.525263336,
             -692103.6533508194,
             7040072.822813132,
             -692101.9724265083,
             7040075.747759574,
             -692099.4900018637,
             7040078.02064864,
             -692095.8721184127,
             7040079.362026097
          ],
          "flatMidpoint_":null,
          "flatMidpointRevision_":-1,
          "maxDelta_":-1,
          "maxDeltaRevision_":-1
       },
       "highway":"unclassified",
       "lanes":"2",
       "maxspeed":"30",
       "oneway":"yes",
       "surface":"asphalt"
    },
    {
       "geometry":{
          "disposed":false,
          "pendingRemovals_":null,
          "dispatching_":null,
          "listeners_":{
             "change":[
                null
             ]
          },
          "revision_":1,
          "ol_uid":"1826",
          "values_":null,
          "extent_":[
             null,
             null,
             null,
             null
          ],
          "extentRevision_":-1,
          "simplifiedGeometryMaxMinSquaredTolerance":0,
          "simplifiedGeometryRevision":0,
          "layout":"XY",
          "stride":2,
          "flatCoordinates":[
             -692095.8721184127,
             7040079.362026097,
             -692093.3562979209,
             7040079.865042695,
             -692090.2950119241,
             7040079.436547076,
             -692087.467496858,
             7040078.151060324,
             -692085.1186556022,
             7040076.157624773,
             -692083.404335444,
             7040073.568022317,
             -692082.7920782446,
             7040071.332394978,
             -692082.4024600269,
             7040069.916497985,
             -692082.6918907029,
             7040066.153194052,
             -692084.2280996758,
             7040062.706605382,
             -692086.8441077096,
             7040059.967965712,
             -692089.7829422664,
             7040058.347138598
          ],
          "flatMidpoint_":null,
          "flatMidpointRevision_":-1,
          "maxDelta_":-1,
          "maxDeltaRevision_":-1
       },
       "highway":"unclassified",
       "lanes":"2",
       "maxspeed":"30",
       "oneway":"yes",
       "surface":"asphalt"
    }
 ]