/Users/remcollier/Git/gitlab/mams-ucd/examples/hypermats/hypermats-clock/src/main/java/clock/messages/Result.java
/Users/remcollier/Git/gitlab/mams-ucd/examples/hypermats/hypermats-clock/src/main/java/clock/messages/RequestStep.java
/Users/remcollier/Git/gitlab/mams-ucd/examples/hypermats/hypermats-clock/src/main/java/clock/util/WebResponse.java
/Users/remcollier/Git/gitlab/mams-ucd/examples/hypermats/hypermats-clock/src/main/java/clock/messages/Registration.java
/Users/remcollier/Git/gitlab/mams-ucd/examples/hypermats/hypermats-clock/src/main/java/clock/util/RestClient.java
/Users/remcollier/Git/gitlab/mams-ucd/examples/hypermats/hypermats-clock/src/main/java/clock/ClockServer.java
/Users/remcollier/Git/gitlab/mams-ucd/examples/hypermats/hypermats-clock/src/main/java/clock/messages/Init.java
/Users/remcollier/Git/gitlab/mams-ucd/examples/hypermats/hypermats-clock/src/main/java/clock/messages/Unregister.java
/Users/remcollier/Git/gitlab/mams-ucd/examples/hypermats/hypermats-clock/src/main/java/clock/Broker.java
/Users/remcollier/Git/gitlab/mams-ucd/examples/hypermats/hypermats-clock/src/main/java/clock/messages/Step.java
/Users/remcollier/Git/gitlab/mams-ucd/examples/hypermats/hypermats-clock/src/main/java/clock/Clock.java
