/Users/remcollier/Git/gitlab/mams-ucd/examples/hypermats/hypermats-street-continuous/src/main/java/street/service/StreetService.java
/Users/remcollier/Git/gitlab/mams-ucd/examples/hypermats/hypermats-street-continuous/src/main/java/street/executor/AccelerateExecutor.java
/Users/remcollier/Git/gitlab/mams-ucd/examples/hypermats/hypermats-street-continuous/src/main/java/street/controller/VehicleController.java
/Users/remcollier/Git/gitlab/mams-ucd/examples/hypermats/hypermats-street-continuous/src/main/java/street/executor/BrakeExecutor.java
/Users/remcollier/Git/gitlab/mams-ucd/examples/hypermats/hypermats-street-continuous/src/main/java/street/model/VehicleDescription.java
/Users/remcollier/Git/gitlab/mams-ucd/examples/hypermats/hypermats-street-continuous/src/main/java/street/model/StreetConfiguration.java
/Users/remcollier/Git/gitlab/mams-ucd/examples/hypermats/hypermats-street-continuous/src/main/java/street/executor/ExecutorFactory.java
/Users/remcollier/Git/gitlab/mams-ucd/examples/hypermats/hypermats-street-continuous/src/main/java/street/model/Vehicle.java
/Users/remcollier/Git/gitlab/mams-ucd/examples/hypermats/hypermats-street-continuous/src/main/java/street/simulation/Lane.java
/Users/remcollier/Git/gitlab/mams-ucd/examples/hypermats/hypermats-street-continuous/src/main/java/street/controller/StreetController.java
/Users/remcollier/Git/gitlab/mams-ucd/examples/hypermats/hypermats-street-continuous/src/main/java/street/model/StreetDescription.java
/Users/remcollier/Git/gitlab/mams-ucd/examples/hypermats/hypermats-street-continuous/src/main/java/street/service/VehicleTypeService.java
/Users/remcollier/Git/gitlab/mams-ucd/examples/hypermats/hypermats-street-continuous/src/main/java/street/simulation/StreetSimulation.java
/Users/remcollier/Git/gitlab/mams-ucd/examples/hypermats/hypermats-street-continuous/src/main/java/street/executor/SkipExecutor.java
/Users/remcollier/Git/gitlab/mams-ucd/examples/hypermats/hypermats-street-continuous/src/main/java/street/Application.java
/Users/remcollier/Git/gitlab/mams-ucd/examples/hypermats/hypermats-street-continuous/src/main/java/street/service/VehicleService.java
/Users/remcollier/Git/gitlab/mams-ucd/examples/hypermats/hypermats-street-continuous/src/main/java/street/executor/Executor.java
/Users/remcollier/Git/gitlab/mams-ucd/examples/hypermats/hypermats-street-continuous/src/main/java/street/service/RedirectsService.java
