/Users/remcollier/Git/gitlab/mams-ucd/examples/hypermats/hypermats-traffic-config/src/main/java/config/model/Linker.java
/Users/remcollier/Git/gitlab/mams-ucd/examples/hypermats/hypermats-traffic-config/src/main/java/config/model/StreetService.java
/Users/remcollier/Git/gitlab/mams-ucd/examples/hypermats/hypermats-traffic-config/src/main/java/config/model/Service.java
/Users/remcollier/Git/gitlab/mams-ucd/examples/hypermats/hypermats-traffic-config/src/main/java/config/model/JunctionService.java
/Users/remcollier/Git/gitlab/mams-ucd/examples/hypermats/hypermats-traffic-config/src/main/java/config/controller/ConfigurationController.java
/Users/remcollier/Git/gitlab/mams-ucd/examples/hypermats/hypermats-traffic-config/src/main/java/config/model/Registration.java
/Users/remcollier/Git/gitlab/mams-ucd/examples/hypermats/hypermats-traffic-config/src/main/java/config/model/JunctionStreetLinker.java
/Users/remcollier/Git/gitlab/mams-ucd/examples/hypermats/hypermats-traffic-config/src/main/java/config/Application.java
/Users/remcollier/Git/gitlab/mams-ucd/examples/hypermats/hypermats-traffic-config/src/main/java/config/model/StreetJunctionLinker.java
/Users/remcollier/Git/gitlab/mams-ucd/examples/hypermats/hypermats-traffic-config/src/main/java/config/model/AgentService.java
/Users/remcollier/Git/gitlab/mams-ucd/examples/hypermats/hypermats-traffic-config/src/main/java/config/model/AgentModel.java
/Users/remcollier/Git/gitlab/mams-ucd/examples/hypermats/hypermats-traffic-config/src/main/java/config/model/Junction.java
/Users/remcollier/Git/gitlab/mams-ucd/examples/hypermats/hypermats-traffic-config/src/main/java/config/model/ServiceFactory.java
/Users/remcollier/Git/gitlab/mams-ucd/examples/hypermats/hypermats-traffic-config/src/main/java/config/model/Street.java
