case_id,author,ner
36020,Per Curiam.,"[('Curiam', 'PERSON'), ('Laura Cunningham', 'PERSON'), ('Randolph McDonald', 'PERSON'), ('Ark. R. Crim', 'PERSON'), ('24.3(b)(2002', 'CARDINAL'), ('September 11, 2003', 'DATE'), ('McDonald', 'ORG'), ('June 4, 2003', 'DATE'), ('McDonald', 'ORG'), ('November 4,2002', 'DATE'), ('May 7, 2003', 'DATE'), ('the previous November', 'DATE'), ('R. App.', 'PERSON'), ('2(b', 'TIME'), ('2003', 'DATE'), ('June 4', 'DATE'), ('the September 11, 2003', 'EVENT'), ('Cunningham', 'ORG'), ('Ark. R. App.', 'PERSON'), ('2003', 'DATE'), ('Cunningham', 'ORG'), ('1', 'CARDINAL'), ('2', 'CARDINAL'), ('3', 'CARDINAL'), ('4', 'CARDINAL'), ('one', 'CARDINAL'), ('Cunningham', 'PERSON'), ('thirty days', 'DATE'), ('Cunningham', 'ORG'), ('November 20, 2003', 'DATE'), ('9:00 a.m.', 'TIME'), ('the September 11, 2003,', 'EVENT'), ('Brown', 'PERSON'), ('J.', 'ORG')]"
36020,"Robert L. Brown, Justice,","[('Robert L. Brown', 'PERSON'), ('Justice', 'ORG'), ('Cunningham', 'PERSON')]"
36021,"Jim Hannah, Justice.","[('Jim Hannah', 'PERSON'), ('Justice', 'ORG'), ('Clark County', 'GPE'), ('James “Smokey” Smith', 'PERSON'), ('twenty', 'CARDINAL'), ('first', 'ORDINAL'), ('5', 'CARDINAL'), ('five', 'CARDINAL'), ('four-year', 'DATE'), ('one', 'CARDINAL'), ('five', 'CARDINAL'), ('zero-dollar', 'MONEY'), ('fifteen', 'CARDINAL'), ('Smith', 'PERSON'), ('five', 'CARDINAL'), ('four-year', 'DATE'), ('State', 'ORG'), ('Smith', 'PERSON'), ('the Arkadelphia Public Schools', 'ORG'), ('twenty', 'CARDINAL'), ('first', 'ORDINAL'), ('A.C.', 'GPE'), ('April 1999 to October 2000', 'DATE'), ('one', 'CARDINAL'), ('nineteen', 'DATE'), ('Smith', 'PERSON'), ('Goza Junior High School', 'ORG'), ('A.C.’s high school', 'ORG'), ('Smith', 'PERSON'), ('Arkadelphia High School', 'ORG'), ('A.C.', 'PERSON'), ('twenty', 'CARDINAL'), ('Smith', 'PERSON'), ('Smith', 'PERSON'), ('the Arkadelphia Public Schools', 'ORG'), ('Smith', 'PERSON'), ('ten', 'CARDINAL'), ('State', 'ORG'), ('one', 'CARDINAL'), ('Smith', 'PERSON'), ('1', 'CARDINAL'), ('5', 'CARDINAL'), ('the United States Constitution', 'GPE'), ('the Arkansas Constitution', 'LAW'), ('2', 'CARDINAL'), ('3', 'CARDINAL'), ('4', 'CARDINAL'), ('5', 'CARDINAL'), ('Smith', 'PERSON'), ('twenty years ago', 'DATE'), ('6', 'CARDINAL'), ('Smith', 'PERSON'), ('7', 'CARDINAL'), ('Smith', 'PERSON'), ('9', 'CARDINAL'), ('Smith’s', 'ORG'), ('one', 'CARDINAL'), ('10', 'CARDINAL'), ('first', 'ORDINAL'), ('the Arkadelphia Police Department', 'ORG'), ('State', 'ORG'), ('one', 'CARDINAL'), ('State', 'ORG'), ('Smith', 'PERSON'), ('zero dollars', 'MONEY'), ('fifteen', 'CARDINAL'), ('twenty', 'CARDINAL'), ('six', 'CARDINAL'), ('twenty', 'CARDINAL'), ('Ark. S. Ct', 'ORG'), ('Ark. R. App.', 'PERSON'), ('3.Constitutionality', 'CARDINAL'), ('5', 'CARDINAL'), ('first', 'ORDINAL'), ('1997', 'DATE'), ('Section 5-14-120(a) provides:(a', 'LAW'), ('first', 'ORDINAL'), ('more than thirteen', 'CARDINAL'), ('13) years of age', 'DATE'), ('18) years of age', 'DATE'), ('Smith', 'PERSON'), ('The Equal Protection Clause', 'ORG'), ('Seagrave v. Price', 'PERSON'), ('349', 'CARDINAL'), ('Ark. 433', 'DATE'), ('79', 'CARDINAL'), ('2002', 'DATE'), ('McDole v. State', 'PERSON'), ('339', 'CARDINAL'), ('6', 'CARDINAL'), ('Jegley', 'ORG'), ('349', 'CARDINAL'), ('80', 'CARDINAL'), ('2002', 'DATE'), ('Smith', 'PERSON'), ('5', 'CARDINAL'), ('Smith', 'PERSON'), ('day', 'DATE'), ('Smith', 'PERSON'), ('Wal-Mart', 'ORG'), ('Smith', 'PERSON'), ('each month', 'DATE'), ('”The State', 'GPE'), ('the General Assembly', 'ORG'), ('Wal-Mart', 'ORG'), ('State', 'ORG'), ('5', 'CARDINAL'), ('Goza Junior High School', 'ORG'), ('two', 'CARDINAL'), ('the school year', 'DATE'), ('The next school year', 'DATE'), ('1985', 'DATE'), ('326', 'CARDINAL'), ('1', 'CARDINAL'), ('first', 'ORDINAL'), ('first', 'ORDINAL'), ('more than thirteen', 'CARDINAL'), ('13) years of age', 'DATE'), ('18) years of age', 'DATE'), ('1985', 'DATE'), ('326', 'CARDINAL'), ('3', 'CARDINAL'), ('first', 'ORDINAL'), ('second', 'ORDINAL'), ('the General Assembly', 'ORG'), ('1993', 'DATE'), ('1993', 'DATE'), ('265', 'CARDINAL'), ('1', 'CARDINAL'), ('daily', 'DATE'), ('State', 'ORG'), ('Smith', 'PERSON'), ('EvidenceSmith', 'ORG'), ('1', 'CARDINAL'), ('2', 'CARDINAL'), ('five', 'CARDINAL'), ('3', 'CARDINAL'), ('4', 'CARDINAL'), ('5', 'CARDINAL'), ('Valentine’s Day', 'ORG'), ('[A. C.]', 'PERSON'), ('State', 'ORG'), ('Misskelley v. State', 'PERSON'), ('323', 'CARDINAL'), ('449', 'CARDINAL'), ('915', 'CARDINAL'), ('702', 'CARDINAL'), ('519', 'CARDINAL'), ('U.S.', 'GPE'), ('1996', 'DATE'), ('A.C.', 'PERSON'), ('Smith', 'PERSON'), ('Smith', 'PERSON'), ('A.C.’s', 'ORG'), ('Rains v. State', 'PERSON'), ('329', 'CARDINAL'), ('607', 'CARDINAL'), ('953', 'CARDINAL'), ('48 (1997', 'DATE'), ('State', 'ORG'), ('Smith', 'PERSON'), ('A.C.’s', 'ORG'), ('Smith', 'PERSON'), ('A.C.', 'GPE'), ('Smith', 'PERSON'), ('Smith', 'PERSON'), ('Smith', 'PERSON'), ('A.C.', 'GPE'), ('Smith', 'PERSON'), ('A.C.’s', 'ORG'), ('A.C.’s', 'ORG'), ('State', 'ORG'), ('Valentine', 'PERSON'), ('Smith’s', 'ORG'), ('ConAgra, Inc.', 'ORG'), ('340', 'CARDINAL'), ('672', 'DATE'), ('13', 'CARDINAL'), ('150', 'CARDINAL'), ('2000', 'DATE'), ('Nolen v. State', 'PERSON'), ('278', 'CARDINAL'), ('17', 'DATE'), ('643', 'CARDINAL'), ('257', 'CARDINAL'), ('1982', 'DATE'), ('Davis v. State', 'PERSON'), ('325', 'CARDINAL'), ('Ark. 96', 'DATE'), ('925', 'CARDINAL'), ('768', 'CARDINAL'), ('1996', 'DATE'), ('Smith', 'PERSON'), ('403', 'CARDINAL'), ('403', 'CARDINAL'), ('Smith', 'PERSON'), ('One', 'CARDINAL'), ('one', 'CARDINAL'), ('Smith', 'PERSON'), ('Davis', 'PERSON'), ('State', 'ORG'), ('350', 'CARDINAL'), ('Ark. 22, 86', 'DATE'), ('Smith', 'PERSON'), ('Smith', 'PERSON'), ('State', 'ORG'), ('as little as one', 'CARDINAL'), ('State', 'ORG'), ('Davis', 'PERSON'), ('350 Ark.', 'DATE'), ('38', 'CARDINAL'), ('State', 'ORG'), ('347', 'CARDINAL'), ('69', 'CARDINAL'), ('423', 'CARDINAL'), ('2002', 'DATE'), ('Yearbook PhotographSmith', 'WORK_OF_ART'), ('A.C.', 'GPE'), ('a year', 'DATE'), ('A.C.', 'PERSON'), ('State', 'ORG'), ('Smith', 'PERSON'), ('State', 'ORG'), ('Smith', 'PERSON'), ('Smith', 'PERSON'), ('A.C.', 'PERSON'), ('first', 'ORDINAL'), ('Mayes', 'ORG'), ('State', 'ORG'), ('351', 'CARDINAL'), ('Ark. 26', 'DATE'), ('89', 'DATE'), ('2002', 'DATE'), ('State', 'ORG'), ('340', 'CARDINAL'), ('53', 'DATE'), ('8', 'CARDINAL'), ('2000', 'DATE'), ('Smith’s', 'ORG'), ('A.C.', 'GPE'), ('Testimony Concerning PornographySmith', 'ORG'), ('Jimmy Harper', 'PERSON'), ('Henderson State University', 'ORG'), ('Harper', 'PERSON'), ('Smith', 'PERSON'), ('Harper', 'PERSON'), ('Smith’s', 'ORG'), ('A.C.’s', 'ORG'), ('Harper', 'PERSON'), ('Harper', 'PERSON'), ('Harper', 'PERSON'), ('Bethell', 'PERSON'), ('State', 'ORG'), ('State', 'ORG'), ('Smith', 'PERSON'), ('Jimmy Harper', 'PERSON'), ('Williams', 'PERSON'), ('338', 'CARDINAL'), ('Ark. 178', 'DATE'), ('992', 'CARDINAL'), ('89', 'DATE'), ('1999', 'DATE'), ('Brown', 'PERSON'), ('347', 'CARDINAL'), ('308, 65', 'DATE'), ('2001', 'DATE'), ('Extramarital AffairAt', 'ORG'), ('A.C.', 'GPE'), ('Smith', 'PERSON'), ('Smith', 'PERSON'), ('A.C.', 'GPE'), ('Smith', 'PERSON'), ('Smith', 'PERSON'), ('A.C.', 'PERSON'), ('Smith', 'PERSON'), ('twenty years earlier', 'DATE'), ('Smith', 'PERSON'), ('Boyd', 'PERSON'), ('318', 'CARDINAL'), ('889', 'CARDINAL'), ('20', 'CARDINAL'), ('1994).The', 'CARDINAL'), ('State', 'ORG'), ('Smith', 'PERSON'), ('A.C.’s', 'ORG'), ('Smith', 'PERSON'), ('A.C.', 'PERSON'), ('A.C.', 'PERSON'), ('Smith', 'PERSON'), ('twenty years ago', 'DATE'), ('Smith', 'PERSON'), ('A.C.’s', 'ORG'), ('340', 'CARDINAL'), ('99', 'DATE'), ('113', 'CARDINAL'), ('8', 'CARDINAL'), ('2000', 'DATE'), ('Smith', 'PERSON'), ('Smith', 'PERSON'), ('A.C.', 'PERSON'), ('Smith', 'PERSON'), ('Smith', 'PERSON'), ('A.C.', 'PERSON'), ('Smith', 'PERSON'), ('State', 'ORG'), ('Smith’s', 'ORG'), ('A.C.', 'GPE'), ('Donihoo v. State', 'PERSON'), ('325', 'CARDINAL'), ('483', 'CARDINAL'), ('931', 'CARDINAL'), ('69', 'CARDINAL'), ('InstructionSmith', 'ORG'), ('Smith', 'PERSON'), ('proceeding”:The State', 'ORG'), ('State', 'ORG'), ('State', 'ORG'), ('State', 'ORG'), ('McCoy', 'ORG'), ('348', 'CARDINAL'), ('74', 'DATE'), ('2002', 'DATE'), ('Smith', 'PERSON'), ('A.C.’s', 'ORG'), ('Smith’s', 'ORG'), ('Smith', 'PERSON'), ('2001', 'DATE'), ('State', 'ORG'), ('Hill v. State', 'PERSON'), ('318', 'CARDINAL'), ('408', 'DATE'), ('887', 'CARDINAL'), ('275', 'CARDINAL'), ('1994', 'DATE'), ('Smith', 'PERSON'), ('the No Contact Order', 'ORG'), ('Arkansas', 'GPE'), ('Skiver v. State', 'PERSON'), ('336', 'CARDINAL'), ('Ark. 86', 'DATE'), ('99', 'DATE'), ('983', 'CARDINAL'), ('931', 'CARDINAL'), ('1999', 'DATE'), ('16-97-101(2', 'CARDINAL'), ('Marshall', 'PERSON'), ('342', 'CARDINAL'), ('27', 'CARDINAL'), ('392', 'CARDINAL'), ('2000', 'DATE'), ('16-97-103', 'CARDINAL'), ('Walls v. State', 'PERSON'), ('336', 'CARDINAL'), ('986', 'CARDINAL'), ('397', 'CARDINAL'), ('1999', 'DATE'), ('Walls', 'ORG'), ('501', 'CARDINAL'), ('A.C.’s', 'ORG'), ('Smith', 'PERSON'), ('Smith', 'PERSON'), ('A.C. Smith', 'PERSON'), ('Smith', 'PERSON'), ('Smith', 'PERSON'), ('twenty', 'CARDINAL'), ('first', 'ORDINAL'), ('Smith', 'PERSON'), ('A.C.’s', 'ORG'), ('SentencesSmith', 'ORG'), ('one', 'CARDINAL'), ('Smith', 'PERSON'), ('five', 'CARDINAL'), ('four-year', 'DATE'), ('Smith', 'PERSON'), ('more than one', 'CARDINAL'), ('1', 'CARDINAL'), ('5', 'CARDINAL'), ('State', 'ORG'), ('326', 'CARDINAL'), ('935', 'CARDINAL'), ('530', 'CARDINAL'), ('1996', 'DATE'), ('Love v. State', 'PERSON'), ('324', 'CARDINAL'), ('922', 'CARDINAL'), ('701', 'CARDINAL'), ('5', 'CARDINAL'), ('one', 'CARDINAL'), ('Rains', 'GPE'), ('329', 'CARDINAL'), ('612', 'CARDINAL'), ('Tarry v. State', 'PERSON'), ('289', 'CARDINAL'), ('193', 'CARDINAL'), ('195', 'CARDINAL'), ('710', 'CARDINAL'), ('202', 'CARDINAL'), ('1986', 'DATE'), ('While Smith', 'PERSON'), ('first', 'ORDINAL'), ('Jurisdiction of Trial Court', 'ORG'), ('first', 'ORDINAL'), ('the Arkadelphia Police Department', 'ORG'), ('one', 'CARDINAL'), ('State', 'ORG'), ('Smith’s', 'ORG'), ('Smith', 'PERSON'), ('323', 'CARDINAL'), ('583', 'CARDINAL'), ('918', 'CARDINAL'), ('114', 'CARDINAL'), ('October 7, 2002', 'DATE'), ('Smith', 'PERSON'), ('Smith', 'PERSON'), ('thirty days', 'DATE'), ('part:(c', 'GPE'), ('thirty (30) days', 'DATE'), ('thirty (30) days', 'DATE'), ('the 30th day', 'DATE'), ('Smith', 'PERSON'), ('September 24, 2002', 'DATE'), ('October 17, 2002', 'DATE'), ('October 7', 'DATE'), ('Smith’s', 'ORG'), ('September 24', 'DATE'), ('October 24, 2002', 'DATE'), ('the day', 'DATE'), ('October 25, 2002', 'DATE'), ('State', 'ORG'), ('v. Fountain', 'PERSON'), ('348', 'CARDINAL'), ('359, 72', 'DATE'), ('511', 'CARDINAL'), ('Smith’s', 'ORG'), ('Smith', 'PERSON'), ('one', 'CARDINAL'), ('twenty', 'CARDINAL'), ('Brady', 'PERSON'), ('Maryland', 'GPE'), ('373', 'CARDINAL'), ('U.S.', 'GPE'), ('1963', 'DATE'), ('the Arkansas Freedom of Information Act', 'LAW'), ('the Arkadelphia Police Department', 'ORG'), ('1', 'CARDINAL'), ('A.C.', 'GPE'), ('Smith', 'PERSON'), ('about an hour', 'TIME'), ('2', 'CARDINAL'), ('A.C.', 'GPE'), ('Smith', 'PERSON'), ('3', 'CARDINAL'), ('A.C.', 'GPE'), ('Smith', 'PERSON'), ('Smith’s', 'ORG'), ('Smith', 'PERSON'), ('4', 'CARDINAL'), ('at least ten', 'CARDINAL'), ('the months of October, November', 'DATE'), ('December 1999.In', 'DATE'), ('State', 'ORG'), ('v. Larimore', 'PERSON'), ('341', 'CARDINAL'), ('17', 'CARDINAL'), ('87', 'DATE'), ('2000', 'DATE'), ('Strickler v. Greene', 'PERSON'), ('527', 'CARDINAL'), ('U.S.', 'GPE'), ('1999', 'DATE'), ('Brady', 'PERSON'), ('Court', 'ORG'), ('Strickler', 'GPE'), ('three', 'CARDINAL'), ('Brady', 'PERSON'), ('1', 'CARDINAL'), ('2', 'CARDINAL'), ('State', 'ORG'), ('3', 'CARDINAL'), ('Lee v. State', 'PERSON'), ('340', 'CARDINAL'), ('504', 'DATE'), ('511', 'CARDINAL'), ('11', 'CARDINAL'), ('2000', 'DATE'), ('A.C.', 'GPE'), ('Smith', 'PERSON'), ('Smith', 'PERSON'), ('at least ten', 'CARDINAL'), ('the months of October, November', 'DATE'), ('December 1999', 'DATE'), ('Brady', 'PERSON'), ('A.C.', 'PERSON'), ('State', 'ORG'), ('A.C.', 'GPE'), ('Smith', 'PERSON'), ('Smith', 'PERSON'), ('Smith', 'PERSON'), ('A.C.', 'GPE'), ('Smith', 'PERSON'), ('A.C.', 'GPE'), ('Smith', 'PERSON'), ('at least ten', 'CARDINAL'), ('the months of October, November', 'DATE'), ('December 1999', 'DATE'), ('A.C.', 'PERSON'), ('Smith', 'PERSON'), ('five', 'CARDINAL'), ('six', 'CARDINAL'), ('October 1999', 'DATE'), ('at least five', 'CARDINAL'), ('November 1999', 'DATE'), ('at least two', 'CARDINAL'), ('December 1999', 'DATE'), ('State', 'ORG'), ('at least twelve', 'CARDINAL'), ('at least ten', 'CARDINAL'), ('at least ten', 'CARDINAL'), ('A.C.’s', 'ORG'), ('A.C.', 'GPE'), ('A.C.', 'GPE'), ('Smith', 'PERSON'), ('A.C.', 'PERSON'), ('Smith', 'PERSON'), ('around thirty minutes', 'TIME'), ('Smith', 'PERSON'), ('A.C.’s', 'ORG'), ('Smith', 'PERSON'), ('State', 'ORG'), ('Smith', 'PERSON'), ('Cross-AppealThe State', 'ORG'), ('Smith', 'PERSON'), ('zero dollars', 'MONEY'), ('fifteen', 'CARDINAL'), ('twenty', 'CARDINAL'), ('State', 'ORG'), ('Ark. R. App.', 'PERSON'), ('Thomas', 'PERSON'), ('349', 'CARDINAL'), ('79', 'CARDINAL'), ('347', 'CARDINAL'), ('2002', 'DATE'), ('3', 'CARDINAL'), ('State', 'ORG'), ('State', 'ORG'), ('v. Osborn', 'PERSON'), ('345', 'CARDINAL'), ('196', 'DATE'), ('45', 'CARDINAL'), ('2001', 'DATE'), ('State', 'ORG'), ('v. Stephenson', 'PERSON'), ('340', 'CARDINAL'), ('229', 'DATE'), ('9', 'CARDINAL'), ('2000', 'DATE'), ('Accordingly', 'PERSON'), ('State', 'ORG'), ('State', 'ORG'), ('State', 'ORG'), ('first', 'ORDINAL'), ('352', 'CARDINAL'), ('335', 'DATE'), ('101', 'CARDINAL'), ('235', 'CARDINAL'), ('2003', 'DATE'), ('Bangs', 'ORG'), ('310', 'CARDINAL'), ('835', 'CARDINAL'), ('294', 'CARDINAL'), ('1992', 'DATE'), ('Lambert v. State', 'PERSON'), ('286', 'CARDINAL'), ('408', 'DATE'), ('692', 'CARDINAL'), ('238', 'CARDINAL'), ('1985).The', 'CARDINAL'), ('State', 'ORG'), ('v. Fountain', 'PERSON'), ('350', 'CARDINAL'), ('437', 'DATE'), ('88', 'DATE'), ('2002', 'DATE'), ('Smith', 'PERSON'), ('twenty', 'CARDINAL'), ('10,000', 'MONEY'), ('no less than three years', 'DATE'), ('no more than ten years', 'DATE'), ('1997', 'DATE'), ('5', 'CARDINAL'), ('5', 'CARDINAL'), ('4', 'CARDINAL'), ('Smith', 'PERSON'), ('no more than ten years', 'DATE'), ('no less than three years', 'DATE'), ('up to $10,000', 'MONEY'), ('fifteen', 'CARDINAL'), ('twenty', 'CARDINAL'), ('Smith', 'PERSON'), ('zero dollars', 'MONEY'), ('Higgins v. State', 'GPE'), ('326', 'CARDINAL'), ('Ark. 1030', 'DATE'), ('936', 'CARDINAL'), ('740', 'CARDINAL'), ('1996', 'DATE'), ('zero', 'CARDINAL'), ('zero-dollar', 'MONEY'), ('Arkansas', 'GPE'), ('five to twenty years’', 'DATE'), ('15,000', 'MONEY'), ('first', 'ORDINAL'), ('zero years', 'DATE'), ('five to twenty years', 'DATE'), ('zero', 'CARDINAL'), ('zero dollars', 'MONEY'), ('15,000', 'MONEY'), ('1037', 'DATE'), ('Higgins', 'GPE'), ('six', 'CARDINAL'), ('twenty', 'CARDINAL'), ('Arnold', 'PERSON'), ('C.J.', 'PERSON'), ('Thornton', 'PERSON'), ('J.', 'ORG'), ('participating.1The General Assembly', 'ORG'), ('5', 'CARDINAL'), ('2001', 'DATE'), ('1738', 'DATE'), ('Act 1738', 'LAW'), ('August', 'DATE'), ('Smith', 'PERSON'), ('1', 'CARDINAL'), ('2', 'CARDINAL'), ('3', 'CARDINAL'), ('4', 'CARDINAL'), ('5', 'CARDINAL'), ('Smith', 'PERSON'), ('6', 'CARDINAL'), ('7', 'CARDINAL'), ('Smith', 'PERSON'), ('Kelly v. State', 'PERSON'), ('350', 'CARDINAL'), ('238, 85', 'DATE'), ('2002).3Though', 'CARDINAL'), ('Smith’s', 'ORG'), ('Smith’s', 'ORG'), ('the Rape Shield Statute', 'PRODUCT'), ('the Rape Shield Statute', 'PRODUCT'), ('Smith', 'PERSON'), ('Donihoo v. State', 'PERSON'), ('325', 'CARDINAL'), ('483', 'CARDINAL'), ('931', 'CARDINAL'), ('69', 'CARDINAL'), ('1996', 'DATE'), ('Donihoo', 'ORG'), ('the General Assembly', 'ORG'), ('the Rape Shield Statute', 'ORG'), ('1997', 'DATE'), ('970', 'CARDINAL'), ('1', 'CARDINAL'), ('first', 'ORDINAL')]"
36022,Per Curiam.,"[('Curiam', 'PERSON'), ('Randolph McDonald', 'PERSON'), ('Laura Cunningham', 'PERSON'), ('McDonald’s', 'ORG'), ('McDonald', 'ORG'), ('McDonald', 'PERSON'), ('R. Crim', 'PERSON'), ('P. 24.3(b', 'GPE'), ('R. Crim', 'PERSON'), ('P. 24.3(b', 'PERSON'), ('2003', 'DATE'), ('Order', 'ORG'), ('April 14, 2003', 'DATE'), ('McDonald', 'ORG'), ('the April 14, 2003', 'DATE'), ('R. Crim', 'PERSON'), ('P. 24.3(b', 'PERSON'), ('McDonald', 'PERSON'), ('November 4, 2002', 'DATE'), ('June 4, 2003', 'DATE'), ('Slack v. State', 'PERSON'), ('338', 'CARDINAL'), ('643', 'DATE'), ('999', 'CARDINAL'), ('668', 'CARDINAL'), ('1999', 'DATE'), ('Clark', 'PERSON'), ('289', 'CARDINAL'), ('711', 'CARDINAL'), ('162', 'CARDINAL'), ('1986', 'DATE'), ('thirty days', 'DATE'), ('Thornton', 'PERSON'), ('J.', 'ORG')]"
36023,Per Curiam.,"[('Curiam', 'PERSON'), ('Bobby S. Morgan', 'PERSON'), ('Erwin L. Davis', 'PERSON'), ('Davis', 'PERSON'), ('Re Belated Appeals', 'ORG'), ('Criminal Cases', 'ORG'), ('265', 'CARDINAL'), ('1979', 'DATE'), ('the Committee on Professional Conduct', 'ORG')]"
36024,"Donald L. Corbin, Justice.","[('Donald L. Corbin', 'PERSON'), ('Justice', 'ORG'), ('Arkansas Rural Electric Self Insurance Trust', 'ORG'), ('the Nevada County Circuit Court', 'ORG'), ('Richard Buck', 'PERSON'), ('Appellants', 'NORP'), ('Appellee’s', 'ORG'), ('third', 'ORDINAL'), ('Appellee', 'PERSON'), ('Appellee', 'PERSON'), ('Appellants', 'NORP'), ('the Arkansas Court of Appeals', 'ORG'), ('Sup', 'EVENT'), ('R.', 'NORP'), ('Appellee', 'PERSON'), ('Appellant South Central Arkansas Electric Cooperative', 'ORG'), ('Arkansas Rural Electric Self Insurance Trust', 'ORG'), ('Cooperative’s', 'ORG'), ('the evening', 'TIME'), ('April 3, 1999', 'DATE'), ('Appellee', 'PERSON'), ('Nevada County', 'GPE'), ('Appellee', 'PERSON'), ('Garry White', 'PERSON'), ('two', 'CARDINAL'), ('Highway 371', 'FAC'), ('Appellee', 'PERSON'), ('Froozan', 'ORG'), ('Appellee', 'PERSON'), ('two days', 'DATE'), ('4,779.71', 'MONEY'), ('Appellants', 'NORP'), ('Appellee', 'PERSON'), ('Froozan', 'ORG'), ('September 12, 2000', 'DATE'), ('Appellee', 'PERSON'), ('February 14 and 15, 2002', 'DATE'), ('Appellee', 'NORP'), ('23,587', 'MONEY'), ('3,000', 'MONEY'), ('Appellee', 'PERSON'), ('6,000', 'MONEY'), ('Appellee', 'NORP'), ('80,000', 'MONEY'), ('Appellee', 'PERSON'), ('forty percent', 'PERCENT'), ('48,000.Following', 'MONEY'), ('Appellee', 'NORP'), ('17,351.19', 'MONEY'), ('Appellants', 'NORP'), ('two-thirds', 'CARDINAL'), ('Appellee', 'NORP'), ('Appellee', 'NORP'), ('Appellee', 'PERSON'), ('May 10, 2002', 'DATE'), ('Appellants', 'NORP'), ('Appellee', 'NORP'), ('Froozan', 'ORG'), ('July 30, 2002', 'DATE'), ('Appellee', 'PERSON'), ('Appellants', 'NORP'), ('Accident Ins', 'PERSON'), ('Jaynes', 'ORG'), ('343', 'CARDINAL'), ('33', 'DATE'), ('161', 'CARDINAL'), ('2000', 'CARDINAL'), ('pre-1993', 'DATE'), ('Act 796 of 1993', 'LAW'), ('Act', 'PRODUCT'), ('Appellants', 'NORP'), ('Jaynes', 'PERSON'), ('section 11-9-410', 'LAW'), ('September 3, 2002', 'DATE'), ('Appellee', 'PERSON'), ('Froozan', 'ORG'), ('first', 'ORDINAL'), ('Appellants', 'NORP'), ('Jaynes', 'GPE'), ('343', 'CARDINAL'), ('33', 'DATE'), ('161', 'CARDINAL'), ('Jaynes', 'ORG'), ('pre-1993', 'DATE'), ('Appel', 'ORG'), ('section 11-9-410', 'LAW'), ('Appellee', 'NORP'), ('Jaynes', 'ORG'), ('Appellee', 'PERSON'), ('lien', 'PERSON'), ('Appellee', 'PERSON'), ('section 11-9-410', 'LAW'), ('one', 'CARDINAL'), ('Bankers Std', 'ORG'), ('348', 'CARDINAL'), ('75', 'CARDINAL'), ('174', 'CARDINAL'), ('2002', 'DATE'), ('Fewell v. Pickens', 'PERSON'), ('346', 'CARDINAL'), ('57', 'CARDINAL'), ('144', 'CARDINAL'), ('2001', 'DATE'), ('first', 'ORDINAL'), ('Section 11-9-410', 'LAW'), ('third', 'ORDINAL'), ('action.(B', 'GPE'), ('first', 'ORDINAL'), ('two-thirds', 'CARDINAL'), ('2/3', 'CARDINAL'), ('third', 'ORDINAL'), ('third', 'ORDINAL'), ('one-third', 'CARDINAL'), ('1/3', 'CARDINAL'), ('Jaynes', 'GPE'), ('343', 'CARDINAL'), ('33', 'DATE'), ('161', 'CARDINAL'), ('Jaynes', 'GPE'), ('’s lien', 'PERSON'), ('Jaynes', 'PERSON'), ('over $100,000', 'MONEY'), ('third', 'ORDINAL'), ('18,500', 'MONEY'), ('400,000', 'MONEY'), ('Jaynes’s', 'ORG'), ('General Accident', 'ORG'), ('two-thirds', 'CARDINAL'), ('section 11-9-410', 'LAW'), ('Franklin v. Healthsource of Ark.', 'ORG'), ('328', 'CARDINAL'), ('163', 'DATE'), ('942', 'CARDINAL'), ('837', 'CARDINAL'), ('1997', 'DATE'), ('Shelter Mut', 'PERSON'), ('310', 'CARDINAL'), ('21', 'DATE'), ('834', 'CARDINAL'), ('637', 'CARDINAL'), ('1992', 'DATE'), ('lien', 'PERSON'), ('section 11-9-410(a', 'LAW'), ('lien', 'PERSON'), ('third', 'ORDINAL'), ('Bough', 'GPE'), ('310', 'CARDINAL'), ('21', 'DATE'), ('834', 'CARDINAL'), ('637', 'CARDINAL'), ('one', 'CARDINAL'), ('Jaynes', 'GPE'), ('Bough', 'GPE'), ('Bough', 'GPE'), ('Franklin', 'GPE'), ('328', 'CARDINAL'), ('163', 'DATE'), ('942', 'CARDINAL'), ('837', 'CARDINAL'), ('169', 'CARDINAL'), ('942', 'CARDINAL'), ('840', 'CARDINAL'), ('Jaynes', 'GPE'), ('343', 'CARDINAL'), ('33', 'DATE'), ('161', 'CARDINAL'), ('Phillip Morris USA', 'ORG'), ('James', 'PERSON'), ('79', 'DATE'), ('72', 'DATE'), ('83', 'DATE'), ('2002', 'DATE'), ('James', 'PERSON'), ('Jaynes', 'PERSON'), ('Act 796', 'PRODUCT'), ('Jaynes', 'ORG'), ('1992', 'DATE'), ('1996', 'DATE'), ('section 11-9-410', 'LAW'), ('lien', 'PERSON'), ('Jaynes', 'ORG'), ('796', 'CARDINAL'), ('the General Assembly', 'ORG'), ('Jaynes', 'PERSON'), ('James', 'PERSON'), ('1996', 'DATE'), ('section 11', 'LAW'), ('Jaynes', 'GPE'), ('the General Assembly', 'ORG'), ('Jaynes', 'GPE'), ('section 11-9-410', 'LAW'), ('lien', 'PERSON'), ('third', 'ORDINAL'), ('Appellee', 'PERSON'), ('Appellants', 'NORP'), ('Appellee', 'NORP'), ('Appellee', 'PERSON'), ('Appellants', 'NORP'), ('Appellants', 'NORP'), ('Appellee', 'NORP'), ('80,000', 'MONEY'), ('Appellants', 'NORP'), ('Appellee', 'NORP'), ('Appellants', 'NORP'), ('Appellee', 'NORP'), ('Appellee', 'NORP'), ('80,000', 'MONEY'), ('80,000', 'MONEY'), ('J.E. Merit Constructors, Inc.', 'ORG'), ('Cooper', 'ORG'), ('345', 'CARDINAL'), ('136', 'DATE'), ('44', 'DATE'), ('2001', 'DATE'), ('Pearson', 'PERSON'), ('Henrickson', 'PERSON'), ('336', 'CARDINAL'), ('Ark. 12', 'DATE'), ('983', 'CARDINAL'), ('419', 'CARDINAL'), ('1999', 'DATE'), ('Tyson Foods, Inc.', 'ORG'), ('Davis', 'PERSON'), ('347', 'CARDINAL'), ('66', 'CARDINAL'), ('568', 'CARDINAL'), ('2002', 'DATE'), ('Primm', 'ORG'), ('U.S. Fidelity & Guar', 'ORG'), ('324', 'CARDINAL'), ('409', 'DATE'), ('922', 'CARDINAL'), ('319', 'CARDINAL'), ('1996).For', 'CARDINAL'), ('second', 'ORDINAL'), ('Appellee', 'PERSON'), ('Franklin', 'GPE'), ('328', 'CARDINAL'), ('163', 'DATE'), ('942', 'CARDINAL'), ('837', 'CARDINAL'), ('Appellants', 'NORP'), ('Jaynes', 'GPE'), ('343', 'CARDINAL'), ('33', 'DATE'), ('161', 'CARDINAL'), ('Appellee', 'NORP'), ('23,587', 'MONEY'), ('another $3,000', 'MONEY'), ('Appellee', 'PERSON'), ('6,000', 'MONEY'), ('Jaynes', 'GPE'), ('Appellants', 'NORP'), ('over $100,000', 'MONEY'), ('400,000', 'MONEY'), ('18,500', 'MONEY'), ('Jaynes', 'GPE'), ('Appellee', 'PERSON'), ('Appellee', 'PERSON'), ('Franklin', 'ORG'), ('328', 'CARDINAL'), ('163', 'DATE'), ('942', 'CARDINAL'), ('837', 'CARDINAL'), ('third', 'ORDINAL'), ('168', 'CARDINAL'), ('942', 'CARDINAL'), ('839-40', 'CARDINAL'), ('Warren Freedman', 'PERSON'), ('Freedman’s Richards', 'ORG'), ('the Law of Insurance', 'ORG'), ('6th', 'ORDINAL'), ('1990', 'DATE'), ('Franklin', 'ORG'), ('Appellee', 'PERSON'), ('Appellee', 'NORP'), ('80,000', 'MONEY'), ('48,000', 'MONEY'), ('21,973.22', 'MONEY'), ('26,026.78', 'MONEY'), ('21,979.33', 'MONEY'), ('Appellee', 'NORP'), ('48,006.11', 'MONEY'), ('Appellee', 'NORP'), ('21,979.33', 'MONEY'), ('Appellants', 'NORP'), ('Appellee', 'NORP'), ('58,020.67', 'MONEY'), ('48,000', 'MONEY'), ('Appellee', 'NORP'), ('Appellee', 'PERSON'), ('Froozan', 'ORG'), ('Appellants', 'NORP'), ('section 11-9-410', 'LAW'), ('Appellee', 'NORP'), ('Appellants', 'NORP'), ('first', 'ORDINAL'), ('Arkansas Blue Cross & Blue Shield', 'ORG'), ('349', 'CARDINAL'), ('78', 'DATE'), ('2002', 'DATE'), ('Laird v. Shelnut', 'PERSON'), ('348', 'CARDINAL'), ('632, 74', 'DATE'), ('206', 'CARDINAL')]"
36025,"Robert L. Brown, Justice.","[('Robert L. Brown', 'PERSON'), ('Justice', 'ORG'), ('Harold L. “Bud” Ward', 'PERSON'), ('Linda Ward', 'PERSON'), ('Wards', 'WORK_OF_ART'), ('James R. Williams', 'PERSON'), ('Bryant', 'GPE'), ('Wards', 'ORG'), ('three', 'CARDINAL'), ('the Court of Appeals', 'ORG'), ('2', 'CARDINAL'), ('3', 'CARDINAL'), ('Wards', 'ORG'), ('November 1997', 'DATE'), ('Williams', 'PERSON'), ('Bud Ward', 'ORG'), ('Linda Ward', 'PERSON'), ('Wards', 'ORG'), ('Williams', 'PERSON'), ('Williams', 'PERSON'), ('three', 'CARDINAL'), ('Bryant', 'GPE'), ('Bud Ward', 'ORG'), ('Williams', 'PERSON'), ('900,000', 'MONEY'), ('300,000', 'MONEY'), ('600,000', 'MONEY'), ('eight percent', 'PERCENT'), ('twenty years', 'DATE'), ('Williams', 'PERSON'), ('300,000', 'MONEY'), ('April 30, 1997', 'DATE'), ('monthly', 'DATE'), ('May 21, 1994', 'DATE'), ('September 1997', 'DATE'), ('Williams', 'PERSON'), ('January 25, 1999', 'DATE'), ('Williams', 'PERSON'), ('Bud Ward', 'ORG'), ('300,000', 'MONEY'), ('November', 'DATE'), ('900,000', 'MONEY'), ('300,000', 'MONEY'), ('600,000', 'MONEY'), ('20 years', 'DATE'), ('eight percent', 'PERCENT'), ('300,000', 'MONEY'), ('25,000', 'MONEY'), ('25,000', 'CARDINAL'), ('25,000 dollar', 'MONEY'), ('25,000', 'CARDINAL'), ('200,000', 'CARDINAL'), ('the two years', 'DATE'), ('November of 94', 'DATE'), ('an additional year', 'DATE'), ('that to three years', 'DATE'), ('Williams', 'PERSON'), ('Williams', 'PERSON'), ('Bud Ward', 'ORG'), ('Ward', 'ORG'), ('Ward', 'ORG'), ('Williams', 'PERSON'), ('three', 'CARDINAL'), ('Ward', 'ORG'), ('Williams’s', 'ORG'), ('Wards', 'ORG'), ('Wards', 'ORG'), ('January 26, 1999', 'DATE'), ('Williams', 'PERSON'), ('the Court of Appeals', 'ORG'), ('the Court of Appeals', 'ORG'), ('Williams', 'PERSON'), ('Ward', 'PERSON'), ('Feb. 23, 2000', 'DATE'), ('The Court of Appeals', 'ORG'), ('The Court of Appeals', 'ORG'), ('Williams', 'PERSON'), ('The Court of Appeals', 'ORG'), ('Williams', 'PERSON'), ('monthly', 'DATE'), ('the Court of Appeals', 'ORG'), ('Williams', 'PERSON'), ('Bud Ward', 'ORG'), ('Williams’s', 'ORG'), ('The Court of Appeals', 'ORG'), ('second', 'ORDINAL'), ('March 14, 2001', 'DATE'), ('first', 'ORDINAL'), ('Wards', 'ORG'), ('Williams', 'PERSON'), ('Bud Ward', 'ORG'), ('March 25, 1994', 'DATE'), ('Williams', 'PERSON'), ('900,000', 'MONEY'), ('Ward', 'ORG'), ('Williams', 'PERSON'), ('twelve months', 'DATE'), ('Ward', 'ORG'), ('Williams', 'PERSON'), ('Ward', 'PERSON'), ('Williams', 'PERSON'), ('Ward', 'ORG'), ('Williams', 'PERSON'), ('Ward', 'PERSON'), ('Williams', 'PERSON'), ('twelve months', 'DATE'), ('May 23, 2001', 'DATE'), ('January 25, 1998, and March 14, 2001', 'DATE'), ('Pre-Trial and Post Trial Briefs', 'ORG'), ('Post Trial Brief and the Opinion of the Arkansas Court of Appeals', 'WORK_OF_ART'), ('February 23, 2000', 'DATE'), ('The Court of Appeals', 'ORG'), ('monthly', 'DATE'), ('the Court of Appeals', 'ORG'), ('Buford Blackwell', 'ORG'), ('July 17, 2001', 'DATE'), ('May 1994', 'DATE'), ('300,000.00', 'MONEY'), ('600,000.00', 'MONEY'), ('20 years', 'DATE'), ('8 percent', 'PERCENT'), ('3', 'CARDINAL'), ('921,008.00', 'MONEY'), ('315,000.00', 'MONEY'), ('1', 'CARDINAL'), ('550,000.00', 'MONEY'), ('534,000.00', 'MONEY'), ('Metropolitan National Bank', 'ORG'), ('46,518.00', 'MONEY'), ('40', 'CARDINAL'), ('monthly', 'DATE'), ('5,018.64', 'MONEY'), ('9,490.00', 'MONEY'), ('monthly', 'DATE'), ('Blackwell', 'ORG'), ('September 1997', 'DATE'), ('March 1998).5', 'DATE'), ('Wards', 'ORG'), ('two', 'CARDINAL'), ('Williams', 'PERSON'), ('second', 'ORDINAL'), ('Williams', 'PERSON'), ('Wards', 'ORG'), ('the Court of Appeals', 'ORG'), ('Ward v. Williams', 'PERSON'), ('80', 'DATE'), ('91', 'CARDINAL'), ('2002', 'DATE'), ('Ward II', 'PERSON'), ('Court of Appeals', 'ORG'), ('BPS, Inc.', 'ORG'), ('Parker', 'ORG'), ('345', 'CARDINAL'), ('381', 'DATE'), ('47', 'CARDINAL'), ('first', 'ORDINAL'), ('Ward', 'GPE'), ('Wards', 'ORG'), ('the Court of Appeals', 'ORG'), ('the Court of Appeals', 'ORG'), ('Wards', 'ORG'), ('second', 'ORDINAL'), ('Williams', 'PERSON'), ('Wards', 'WORK_OF_ART'), ('Williams', 'PERSON'), ('the Court of Appeals', 'ORG'), ('Ward', 'ORG'), ('Burnette', 'PERSON'), ('343', 'CARDINAL'), ('33', 'DATE'), ('2000', 'DATE'), ('Office of Child Support Enfcm’t', 'ORG'), ('345', 'CARDINAL'), ('47', 'DATE'), ('227', 'CARDINAL'), ('2001', 'DATE'), ('the Court of Appeals', 'ORG'), ('February 23, 2000', 'DATE'), ('Williams', 'PERSON'), ('monthly', 'DATE'), ('appellee', 'PERSON'), ('One', 'CARDINAL'), ('4', 'CARDINAL'), ('the Court of Appeals', 'ORG'), ('Ark. R. Civ', 'PERSON'), ('Woodall', 'PERSON'), ('Chuck Dory Auto Sales, Inc.', 'ORG'), ('347', 'CARDINAL'), ('61', 'CARDINAL'), ('2001).But', 'CARDINAL'), ('the Court of Appeals', 'ORG'), ('Wards', 'ORG'), ('the Court of Appeals', 'ORG'), ('Ward', 'ORG'), ('January 25, 1998, and March 14, 2001', 'DATE'), ('Pre-Trial and Post Trial Briefs', 'ORG'), ('Post Trial Brief and the Opinion of the Arkansas Court of Appeals', 'WORK_OF_ART'), ('February 23', 'DATE'), ('second', 'ORDINAL'), ('Williams', 'PERSON'), ('the Court of Appeals', 'ORG'), ('the Court of Appeals', 'ORG'), ('Williams', 'PERSON'), ('Ward', 'PERSON'), ('Ward', 'PERSON'), ('today', 'DATE'), ('the Court of Appeals', 'ORG'), ('Ward', 'ORG'), ('the Court of Appeals', 'ORG'), ('the Court of Appeals', 'ORG'), ('the Court of Appeals', 'ORG'), ('Ward I.', 'PERSON'), ('second', 'ORDINAL'), ('Ward I. Again', 'PERSON'), ('MindsFor', 'ORG'), ('second', 'ORDINAL'), ('Wards', 'ORG'), ('the Court of Appeals', 'ORG'), ('Ward', 'GPE'), ('Williamson', 'PERSON'), ('Sanofi Winthrop Pharmaceutical, Inc.', 'ORG'), ('347', 'CARDINAL'), ('89', 'DATE'), ('60', 'CARDINAL'), ('2001', 'DATE'), ('Wards', 'ORG'), ('Williamson', 'PERSON'), ('Williams', 'PERSON'), ('Wards', 'WORK_OF_ART'), ('Williamson', 'PERSON'), ('the Court of Appeals', 'ORG'), ('Ward', 'GPE'), ('the Court of Appeals', 'ORG'), ('BPS, Inc.', 'ORG'), ('Parker', 'ORG'), ('Williamson', 'PERSON'), ('Williamson', 'PERSON'), ('347', 'CARDINAL'), ('98, 60', 'DATE'), ('434', 'CARDINAL'), ('more than a decade ago', 'DATE'), ('305', 'CARDINAL'), ('810', 'CARDINAL'), ('910', 'CARDINAL'), ('1991', 'DATE'), ('third', 'ORDINAL'), ('the Court of Appeals', 'ORG'), ('twenty-six', 'CARDINAL'), ('Williams', 'PERSON'), ('Ward', 'ORG'), ('Wards', 'ORG'), ('Williams', 'PERSON'), ('Williamson', 'PERSON'), ('Sanofi Winthrop Pharmaceuticals, Inc.', 'ORG'), ('1', 'CARDINAL'), ('2', 'CARDINAL'), ('3', 'CARDINAL'), ('4', 'CARDINAL'), ('5', 'CARDINAL'), ('two', 'CARDINAL'), ('1', 'CARDINAL'), ('2', 'CARDINAL'), ('Williamson', 'PERSON'), ('Sanofi Pharmaceuticals, Inc.', 'ORG'), ('347', 'CARDINAL'), ('98, 60', 'DATE'), ('434', 'CARDINAL'), ('Carter', 'PERSON'), ('Four', 'CARDINAL'), ('Seasons Funding Corp.', 'ORG'), ('351', 'CARDINAL'), ('653', 'CARDINAL'), ('97', 'CARDINAL'), ('387', 'CARDINAL'), ('395', 'CARDINAL'), ('2003).The', 'CARDINAL'), ('Ark. R. Civ', 'PERSON'), ('Chavers v. Epsco, Inc.', 'ORG'), ('352', 'CARDINAL'), ('Ark. 65', 'DATE'), ('98', 'DATE'), ('2003', 'DATE'), ('Williams', 'PERSON'), ('Wards', 'ORG'), ('monthly', 'DATE'), ('Chavers v. Epsco Inc.', 'ORG'), ('MootnessAppellee Williams', 'PERSON'), ('Supplemental Brief Upon Review', 'ORG'), ('Wards', 'WORK_OF_ART'), ('Williams', 'PERSON'), ('Wards', 'ORG'), ('second', 'ORDINAL'), ('Wards', 'ORG'), ('Williams', 'PERSON'), ('Wards', 'WORK_OF_ART'), ('Williams', 'GPE'), ('Williams', 'PERSON'), ('Williams', 'PERSON'), ('J.', 'ORG'), ('dissents.1The', 'CARDINAL'), ('Metropolitan National Bank', 'ORG'), ('Buford Blackwell', 'ORG'), ('Jim Delgado', 'PERSON'), ('Metropolitan National Bank', 'ORG'), ('Buford Blackwell', 'PERSON'), ('Elizabeth Burrow', 'PERSON'), ('Williams', 'PERSON')]"
36025,"Annabelle Clinton Imber, Justice,","[('Annabelle Clinton', 'PERSON'), ('Imber', 'DATE'), ('Justice', 'ORG'), ('the Court of Appeals', 'ORG'), ('the Court of Appeals', 'ORG'), ('Ward', 'GPE'), ('the Court of Appeals', 'ORG'), ('monthly', 'DATE'), ('appellee', 'PERSON'), ('One', 'CARDINAL'), ('4-5', 'CARDINAL'), ('Dolphin v. Wilson', 'PERSON'), ('328', 'CARDINAL'), ('942', 'CARDINAL'), ('815', 'CARDINAL'), ('1997', 'DATE'), ('Swink v. Giffin', 'PERSON'), ('333', 'CARDINAL'), ('400', 'CARDINAL'), ('970', 'CARDINAL'), ('207', 'CARDINAL'), ('1998', 'DATE'), ('Werbe', 'PERSON'), ('Holt', 'PERSON'), ('217', 'CARDINAL'), ('198', 'DATE'), ('229', 'CARDINAL'), ('225', 'CARDINAL'), ('1950', 'DATE'), ('403', 'CARDINAL'), ('234', 'CARDINAL'), ('812', 'DATE'), ('813', 'CARDINAL'), ('354', 'CARDINAL'), ('726', 'CARDINAL'), ('727', 'CARDINAL'), ('1962', 'DATE'), ('v. Giffin', 'PERSON'), ('333', 'CARDINAL'), ('403-04', 'CARDINAL'), ('Ark. R. Civ', 'PERSON'), ('2003', 'DATE'), ('the Court of Appeals', 'ORG'), ('the Court of Appeals', 'ORG'), ('The Court of Appeals', 'ORG'), ('the Court of Appeals', 'ORG'), ('monthly', 'DATE'), ('the Court of Appeals', 'ORG'), ('the Court of Appeals', 'ORG'), ('Ward', 'ORG'), ('May 23, 2001', 'DATE'), ('the Court of Appeals', 'ORG'), ('Court', 'ORG'), ('Court', 'ORG'), ('Judgment', 'PERSON'), ('the Court of Appeals', 'ORG'), ('234', 'CARDINAL'), ('354', 'CARDINAL'), ('726', 'CARDINAL'), ('1962', 'DATE'), ('Swink', 'GPE'), ('Neely v.', 'DATE'), ('232', 'CARDINAL'), ('337', 'CARDINAL'), ('872', 'CARDINAL'), ('1960', 'DATE'), ('first', 'ORDINAL'), ('first', 'ORDINAL'), ('first', 'ORDINAL'), ('234', 'CARDINAL'), ('813-14', 'CARDINAL'), ('354', 'CARDINAL'), ('726', 'CARDINAL'), ('727', 'CARDINAL'), ('Neely II', 'EVENT'), ('first', 'ORDINAL'), ('Neely II', 'EVENT'), ('May 23', 'DATE'), ('the Court of Appeals', 'ORG'), ('The Court of Appeals', 'ORG'), ('monthly', 'DATE'), ('the Court of Appeals', 'ORG'), ('Emphasis added.]While', 'PERSON'), ('the Court of Appeals', 'ORG'), ('the Court of Appeals', 'ORG'), ('First', 'ORDINAL'), ('the Court of Appeals', 'ORG'), ('the Court of Appeals', 'ORG'), ('the Court of Appeals', 'ORG'), ('the Court of Appeals', 'ORG')]"
36026,"Jim Hannah, Justice.","[('Jim Hannah', 'PERSON'), ('Justice', 'ORG'), ('Elbert Holder', 'PERSON'), ('Holder', 'ORG'), ('1', 'CARDINAL'), ('2', 'CARDINAL'), ('3', 'CARDINAL'), ('4', 'CARDINAL'), ('Batson', 'ORG'), ('5', 'CARDINAL'), ('6', 'CARDINAL'), ('7', 'CARDINAL'), ('first', 'ORDINAL'), ('Batson', 'ORG'), ('Holder', 'ORG'), ('Holder', 'ORG'), ('the evening', 'TIME'), ('June 23, 2001', 'DATE'), ('Highway 85', 'FAC'), ('Oneida', 'GPE'), ('Phillips County', 'GPE'), ('Carla Knowlton Smith', 'PERSON'), ('Ford', 'ORG'), ('Expedition', 'PRODUCT'), ('Elbert Holder', 'PERSON'), ('Carla', 'PERSON'), ('two', 'CARDINAL'), ('Cadillac', 'ORG'), ('Holder', 'ORG'), ('Carla', 'PERSON'), ('Holder', 'ORG'), ('Holder', 'ORG'), ('Holder', 'ORG'), ('Brenda Dixon', 'PERSON'), ('Greg Jenkins', 'PERSON'), ('Carla', 'PERSON'), ('June 23, 2001', 'DATE'), ('Holder’s', 'ORG'), ('May 20, 2002', 'DATE'), ('Holder', 'ORG'), ('EvidenceHolder', 'ORG'), ('first', 'ORDINAL'), ('State', 'ORG'), ('Wilson v. State', 'PERSON'), ('332', 'CARDINAL'), ('Ark. 7', 'DATE'), ('962', 'CARDINAL'), ('805', 'CARDINAL'), ('1998', 'DATE'), ('Carmichael v. State', 'PERSON'), ('340', 'CARDINAL'), ('12', 'CARDINAL'), ('2000', 'DATE'), ('one', 'CARDINAL'), ('349', 'CARDINAL'), ('76', 'DATE'), ('884', 'CARDINAL'), ('Bangs', 'ORG'), ('338', 'CARDINAL'), ('515', 'CARDINAL'), ('998', 'CARDINAL'), ('738', 'CARDINAL'), ('1999', 'DATE'), ('two', 'CARDINAL'), ('Howard v. State', 'PERSON'), ('348', 'CARDINAL'), ('471', 'DATE'), ('79', 'CARDINAL'), ('273', 'CARDINAL'), ('123', 'CARDINAL'), ('606', 'CARDINAL'), ('2002', 'DATE'), ('Gregory', 'PERSON'), ('341', 'CARDINAL'), ('243', 'DATE'), ('15', 'CARDINAL'), ('State', 'ORG'), ('351', 'CARDINAL'), ('501', 'CARDINAL'), ('95', 'CARDINAL'), ('789', 'CARDINAL'), ('2003).With', 'CARDINAL'), ('David Henson', 'PERSON'), ('Holder', 'ORG'), ('Henson', 'PERSON'), ('Carla', 'PERSON'), ('Brenda Dixon', 'PERSON'), ('Holder', 'ORG'), ('Holder', 'ORG'), ('fifteen-year-old', 'DATE'), ('Holder', 'ORG'), ('Carla', 'PERSON'), ('Carla', 'PERSON'), ('Holder', 'ORG'), ('Louisiana', 'GPE'), ('Dixon', 'ORG'), ('Holder', 'ORG'), ('Carla', 'PERSON'), ('at least two', 'CARDINAL'), ('Friday, June 22, 2001', 'DATE'), ('that Friday', 'DATE'), ('Holder', 'ORG'), ('Dixon', 'ORG'), ('Greg Jenkins', 'PERSON'), ('Carla', 'PERSON'), ('Jenkins', 'PERSON'), ('Carla', 'PERSON'), ('Dixon', 'ORG'), ('Saturday', 'DATE'), ('Holder', 'ORG'), ('Dixon', 'ORG'), ('Jenkins', 'PERSON'), ('the Pine Apartments', 'FAC'), ('Holder', 'ORG'), ('Dixon', 'ORG'), ('Jenkins', 'ORG'), ('between 4:30 p.m.', 'TIME'), ('5:30 p.m.', 'TIME'), ('Holder', 'PERSON'), ('Dixon', 'ORG'), ('Jenkins', 'PERSON'), ('Carla', 'PERSON'), ('Oneida', 'GPE'), ('Dixon', 'ORG'), ('Carla', 'PERSON'), ('Holder', 'ORG'), ('Carla', 'PERSON'), ('Carla', 'PERSON'), ('two', 'CARDINAL'), ('Cadillac', 'ORG'), ('Dixon', 'ORG'), ('Jenkins', 'PERSON'), ('Jenkins', 'PERSON'), ('Dixon', 'ORG'), ('Jenkins', 'PERSON'), ('Helena', 'GPE'), ('Holder', 'PERSON'), ('Holder', 'ORG'), ('Holder', 'ORG'), ('Holder', 'ORG'), ('Dixon', 'ORG'), ('Holder', 'ORG'), ('Dixon', 'ORG'), ('Jenkins', 'PERSON'), ('Jenkins', 'PERSON'), ('Dixon', 'ORG'), ('Victoria Chairse', 'PERSON'), ('the night', 'TIME'), ('Dixon', 'ORG'), ('Dixon', 'ORG'), ('Holder', 'ORG'), ('three', 'CARDINAL'), ('Dixon', 'ORG'), ('fourth', 'ORDINAL'), ('first', 'ORDINAL'), ('three', 'CARDINAL'), ('Jenkins', 'PERSON'), ('Jenkins', 'PERSON'), ('Dixon', 'ORG'), ('Jenkins', 'PERSON'), ('Brenda Taylor', 'PERSON'), ('Dixon', 'ORG'), ('Saturday', 'DATE'), ('morning', 'TIME'), ('June 23', 'DATE'), ('Dixon', 'ORG'), ('early Sunday morning', 'TIME'), ('Dixon', 'ORG'), ('Taylor', 'PERSON'), ('Taylor', 'PERSON'), ('that evening', 'TIME'), ('Taylor', 'PERSON'), ('Taylor', 'PERSON'), ('Taylor', 'PERSON'), ('the next morning', 'TIME'), ('Dixon', 'ORG'), ('Dixon', 'ORG'), ('Taylor', 'PERSON'), ('Holder', 'PERSON'), ('Dixon', 'ORG'), ('Holder', 'ORG'), ('Dixon', 'ORG'), ('Holder', 'ORG'), ('Taylor', 'PERSON'), ('Dixon', 'ORG'), ('Holder', 'ORG'), ('Gary Lawrence', 'PERSON'), ('Taylor', 'PERSON'), ('expertjeffrey Taylor', 'PERSON'), ('Carla', 'PERSON'), ('about ten feet', 'QUANTITY'), ('Dixon’s', 'ORG'), ('Holder', 'ORG'), ('Sharenzia Smith', 'PERSON'), ('Carla', 'PERSON'), ('Holder', 'ORG'), ('about 5:00 a.m.', 'TIME'), ('Sunday', 'DATE'), ('morning', 'TIME'), ('Holder', 'ORG'), ('first', 'ORDINAL'), ('Sharenzia', 'GPE'), ('Holder', 'GPE'), ('Sharenzia', 'GPE'), ('Holder', 'GPE'), ('Holder', 'WORK_OF_ART'), ('Carla', 'PERSON'), ('Carla', 'PERSON'), ('Holder', 'ORG'), ('Carla', 'PERSON'), ('Bahamas', 'GPE'), ('Holder', 'ORG'), ('Dixon', 'ORG'), ('Holder', 'ORG'), ('Barnett', 'PERSON'), ('346', 'CARDINAL'), ('11', 'DATE'), ('53', 'DATE'), ('2001', 'DATE'), ('Arkansas', 'GPE'), ('Dixon', 'ORG'), ('Holder', 'ORG'), ('Holder’s', 'ORG'), ('RecusalHolder', 'ORG'), ('Holder', 'ORG'), ('Simes', 'PERSON'), ('Simes’s', 'PERSON'), ('Alvin', 'PERSON'), ('the day', 'DATE'), ('Simes', 'PERSON'), ('Simes', 'PERSON'), ('Holder', 'ORG'), ('Lorri Knowlton', 'PERSON'), ('Carla’s', 'ORG'), ('Holder', 'ORG'), ('Lorri', 'PERSON'), ('Alvin Simes', 'ORG'), ('Simes', 'ORG'), ('the summer of 1987 or 1988', 'DATE'), ('L.T. Simes', 'PERSON'), ('Lorri', 'PERSON'), ('Simes', 'ORG'), ('Carla', 'PERSON'), ('Lorri', 'PERSON'), ('Carla', 'PERSON'), ('Willie Knowlton', 'PERSON'), ('Lorri', 'PERSON'), ('Willie', 'PERSON'), ('Willie', 'PERSON'), ('Carla’s', 'FAC'), ('Holder', 'ORG'), ('Nancy Heard', 'PERSON'), ('Alvin Simes', 'PERSON'), ('Willie Knowlton’s', 'PERSON'), ('the day', 'DATE'), ('Carla', 'PERSON'), ('two', 'CARDINAL'), ('Simes’s', 'PERSON'), ('Alvin', 'PERSON'), ('Simes’s', 'PERSON'), ('Edelma', 'PERSON'), ('Alvin', 'PERSON'), ('Edelma Simes', 'ORG'), ('Holder', 'ORG'), ('16-43-208', 'CARDINAL'), ('1999', 'DATE'), ('the Sixth Amendment', 'LAW'), ('the United States Constitution', 'ORG'), ('2', 'CARDINAL'), ('section 10', 'LAW'), ('the Arkansas Constitution', 'LAW'), ('Ray v. State', 'PERSON'), ('304', 'CARDINAL'), ('803', 'CARDINAL'), ('894', 'CARDINAL'), ('1991', 'DATE'), ('United States', 'GPE'), ('Valenzuela-Bernal', 'ORG'), ('458', 'CARDINAL'), ('U.S.', 'GPE'), ('1982', 'DATE'), ('State', 'ORG'), ('Holder', 'ORG'), ('Simes', 'PERSON'), ('State', 'ORG'), ('Holder', 'ORG'), ('Holder', 'ORG'), ('Lewis', 'PERSON'), ('309', 'CARDINAL'), ('392', 'CARDINAL'), ('831', 'CARDINAL'), ('145', 'CARDINAL'), ('1992', 'DATE'), ('the Arkansas Constitution', 'LAW'), ('7', 'CARDINAL'), ('section 20', 'LAW'), ('the Arkansas Code of Judicial Conduct', 'LAW'), ('Canon 3C', 'CARDINAL'), ('2003', 'DATE'), ('Gates v. State', 'PERSON'), ('338', 'CARDINAL'), ('2', 'CARDINAL'), ('1999', 'DATE'), ('Kail', 'PERSON'), ('341', 'CARDINAL'), ('89', 'DATE'), ('14', 'CARDINAL'), ('State', 'ORG'), ('352', 'CARDINAL'), ('16', 'DATE'), ('98', 'DATE'), ('2003', 'DATE'), ('Ayers v. State', 'PERSON'), ('334', 'CARDINAL'), ('258', 'CARDINAL'), ('975', 'CARDINAL'), ('88', 'DATE'), ('1998', 'DATE'), ('Kail', 'PERSON'), ('Kail', 'PERSON'), ('Irvin v. State', 'PERSON'), ('345', 'CARDINAL'), ('49', 'CARDINAL'), ('2001', 'DATE'), ('Searcy', 'ORG'), ('352', 'CARDINAL'), ('100', 'CARDINAL'), ('2003', 'DATE'), ('Bradford v. State', 'PERSON'), ('328', 'CARDINAL'), ('947', 'CARDINAL'), ('1 (1997', 'DATE'), ('Dover', 'GPE'), ('Russellville', 'GPE'), ('346', 'CARDINAL'), ('57', 'CARDINAL'), ('2001', 'DATE'), ('Irvin', 'PERSON'), ('Reel v. State', 'PERSON'), ('318', 'CARDINAL'), ('565', 'DATE'), ('886', 'CARDINAL'), ('615', 'CARDINAL'), ('1994', 'DATE'), ('Reel', 'PERSON'), ('Canon 3', 'LOC'), ('State', 'ORG'), ('v. Williams', 'PERSON'), ('thirty years before', 'DATE'), ('the Appellate Division', 'ORG'), ('318', 'CARDINAL'), ('569', 'CARDINAL'), ('Holder', 'ORG'), ('Louis Etoch', 'PERSON'), ('three', 'CARDINAL'), ('Simes', 'PERSON'), ('Etoch', 'PERSON'), ('two', 'CARDINAL'), ('Etoch', 'PERSON'), ('Simes', 'PERSON'), ('Etoch', 'PERSON'), ('340', 'CARDINAL'), ('449', 'DATE'), ('10', 'CARDINAL'), ('2000', 'DATE'), ('Etoch v. State', 'PERSON'), ('332', 'CARDINAL'), ('Ark. 83', 'DATE'), ('964', 'CARDINAL'), ('798', 'CARDINAL'), ('1998', 'DATE'), ('Etoch', 'PERSON'), ('a night', 'TIME'), ('Holder', 'ORG'), ('Etoch', 'PERSON'), ('Simes', 'PERSON'), ('Etoch', 'PERSON'), ('Charles E. Halbert', 'PERSON'), ('Simes', 'PERSON'), ('Seeco, Inc.', 'ORG'), ('Hales', 'ORG'), ('334', 'CARDINAL'), ('134', 'CARDINAL'), ('969', 'CARDINAL'), ('193', 'CARDINAL'), ('Kail', 'PERSON'), ('Kail', 'PERSON'), ('Irvin', 'PERSON'), ('Batson Violation/', 'ORG'), ('State', 'ORG'), ('’s Batson', 'PERSON'), ('State', 'ORG'), ('Holder', 'ORG'), ('Batson', 'PERSON'), ('Wooten v. State', 'PERSON'), ('351', 'CARDINAL'), ('91', 'CARDINAL'), ('2002', 'DATE'), ('Georgia', 'GPE'), ('McCollum', 'PERSON'), ('505', 'CARDINAL'), ('U.S.', 'GPE'), ('1992', 'DATE'), ('Hollowell v. State', 'PERSON'), ('59', 'CARDINAL'), ('953', 'CARDINAL'), ('588', 'CARDINAL'), ('seven', 'CARDINAL'), ('Caucasians', 'NORP'), ('seven', 'CARDINAL'), ('Long', 'PERSON'), ('one', 'CARDINAL'), ('three', 'CARDINAL'), ('three', 'CARDINAL'), ('Holder', 'ORG'), ('Batson', 'ORG'), ('The Court: Now', 'ORG'), ('State', 'ORG'), ('Etoch’s', 'PERSON'), ('Caucasian', 'NORP'), ('Etoch', 'PERSON'), ('State', 'ORG'), ('Caucasian', 'NORP'), ('Etoch', 'PERSON'), ('The United States Supreme Court', 'ORG'), ('Batson', 'GPE'), ('Kentucky', 'GPE'), ('476', 'CARDINAL'), ('U.S.', 'GPE'), ('1986', 'DATE'), ('three', 'CARDINAL'), ('the Equal Protection Clause', 'ORG'), ('MacKintrush', 'PERSON'), ('334', 'CARDINAL'), ('978', 'CARDINAL'), ('293', 'CARDINAL'), ('1998', 'DATE'), ('Purkett v. Elem', 'PERSON'), ('514', 'CARDINAL'), ('U.S.', 'GPE'), ('1995', 'DATE'), ('the United States Supreme Court', 'ORG'), ('three', 'CARDINAL'), ('Batson', 'ORG'), ('2', 'CARDINAL'), ('3', 'CARDINAL'), ('Purkett', 'PERSON'), ('U.S.', 'GPE'), ('767.MacKintrush', 'CARDINAL'), ('334', 'CARDINAL'), ('397', 'CARDINAL'), ('Hinkston', 'GPE'), ('340', 'CARDINAL'), ('530', 'DATE'), ('10', 'CARDINAL'), ('2000', 'DATE'), ('Batson', 'ORG'), ('three', 'CARDINAL'), ('Batson', 'ORG'), ('MacKintrush', 'ORG'), ('State', 'ORG'), ('334', 'CARDINAL'), ('978', 'CARDINAL'), ('293', 'CARDINAL'), ('1998', 'DATE'), ('First', 'ORDINAL'), ('Second', 'ORDINAL'), ('aprima facie case', 'PERSON'), ('third', 'ORDINAL'), ('Hinkston', 'PERSON'), ('340 Ark.', 'PERCENT'), ('538', 'CARDINAL'), ('three', 'CARDINAL'), ('Batson', 'ORG'), ('first', 'ORDINAL'), ('1', 'CARDINAL'), ('2', 'CARDINAL'), ('3', 'CARDINAL'), ('Cox v. State', 'PERSON'), ('345', 'CARDINAL'), ('391', 'DATE'), ('47', 'CARDINAL'), ('244', 'CARDINAL'), ('first', 'ORDINAL'), ('first', 'ORDINAL'), ('two', 'CARDINAL'), ('Batson', 'PERSON'), ('State', 'ORG'), ('Holder’s', 'ORG'), ('Caucasian', 'NORP'), ('State', 'ORG'), ('Holder', 'ORG'), ('Caucasians', 'NORP'), ('State', 'ORG'), ('State', 'ORG'), ('State', 'ORG'), ('Etoch', 'PERSON'), ('Caucasians', 'NORP'), ('State', 'ORG'), ('Holder', 'ORG'), ('Caucasian', 'NORP'), ('aprima facie case', 'PERSON'), ('Wooten v. State', 'PERSON'), ('325', 'CARDINAL'), ('510', 'DATE'), ('931', 'CARDINAL'), ('408', 'CARDINAL'), ('1996', 'DATE'), ('Hernandez', 'PERSON'), ('New York', 'GPE'), ('500', 'CARDINAL'), ('U.S.', 'GPE'), ('1991', 'DATE'), ('one', 'CARDINAL'), ('three', 'CARDINAL'), ('Holder', 'ORG'), ('States', 'GPE'), ('Holder', 'ORG'), ('Caucasian', 'NORP'), ('three', 'CARDINAL'), ('third', 'ORDINAL'), ('Batson', 'PERSON'), ('Holder’s', 'ORG'), ('Caucasian', 'NORP'), ('Williams', 'PERSON'), ('338', 'CARDINAL'), ('Ark. 97', 'DATE'), ('991', 'CARDINAL'), ('565', 'CARDINAL'), ('1999', 'DATE'), ('Batson', 'ORG'), ('330', 'CARDINAL'), ('458', 'DATE'), ('956', 'CARDINAL'), ('849', 'CARDINAL'), ('1997', 'DATE'), ('Batson', 'ORG'), ('Sanford v. State', 'PERSON'), ('331', 'CARDINAL'), ('962', 'CARDINAL'), ('335', 'CARDINAL'), ('1998', 'DATE'), ('Roseby v. State', 'PERSON'), ('329', 'CARDINAL'), ('953', 'CARDINAL'), ('32', 'DATE'), ('1997', 'DATE'), ('Hernandez', 'PERSON'), ('New York', 'GPE'), ('500', 'CARDINAL'), ('U.S.', 'GPE'), ('360', 'CARDINAL'), ('111', 'CARDINAL'), ('1859', 'DATE'), ('114', 'CARDINAL'), ('395', 'CARDINAL'), ('1991', 'DATE'), ('State', 'ORG'), ('MacKintrush', 'ORG'), ('Williams', 'PERSON'), ('338', 'CARDINAL'), ('111', 'CARDINAL'), ('three', 'CARDINAL'), ('Batson', 'PERSON'), ('Batson', 'ORG'), ('Hernandez', 'PERSON'), ('500', 'CARDINAL'), ('U.S.', 'GPE'), ('359', 'CARDINAL'), ('the Equal Protection Clause', 'ORG'), ('Purkett v. Elem.', 'PERSON'), ('514', 'CARDINAL'), ('U.S.', 'GPE'), ('768', 'CARDINAL'), ('1995', 'DATE'), ('the United States Supreme Court', 'ORG'), ('Hernandez', 'ORG'), ('500', 'CARDINAL'), ('U.S.', 'GPE'), ('360', 'CARDINAL'), ('three', 'CARDINAL'), ('Batson', 'ORG'), ('State', 'ORG'), ('963', 'CARDINAL'), ('674', 'CARDINAL'), ('1998', 'DATE'), ('one', 'CARDINAL'), ('the Equal Protection Clause', 'ORG'), ('United States', 'GPE'), ('v. Matha', 'PERSON'), ('915', 'CARDINAL'), ('1220', 'DATE'), ('8th Cir', 'PERSON'), ('1990', 'DATE'), ('Batson', 'PERSON'), ('Batson', 'GPE'), ('the United States Supreme Court', 'ORG'), ('Batson', 'ORG'), ('476', 'CARDINAL'), ('U.S.', 'GPE'), ('97', 'CARDINAL'), ('one', 'CARDINAL'), ('one', 'CARDINAL'), ('aprima facie', 'PERSON'), ('United States', 'GPE'), ('v. Wolk', 'PERSON'), ('337', 'CARDINAL'), ('997, 1007', 'DATE'), ('8th Cir', 'PERSON'), ('three', 'CARDINAL'), ('three', 'CARDINAL'), ('Gibson Turley', 'PERSON'), ('Wayne Stevens', 'PERSON'), ('Nicholas Jacks', 'PERSON'), ('Turley', 'ORG'), ('Holder', 'ORG'), ('Turley', 'ORG'), ('Turley', 'ORG'), ('Holder', 'ORG'), ('Turley', 'ORG'), ('Carla', 'PERSON'), ('Stevens', 'PERSON'), ('Holder', 'ORG'), ('Stevens', 'PERSON'), ('Phillips County', 'GPE'), ('Stevens', 'PERSON'), ('Greg Jenkin’s', 'PERSON'), ('Stevens', 'PERSON'), ('Jacks', 'PERSON'), ('Holder', 'ORG'), ('Etoch', 'PRODUCT'), ('Jacks', 'PERSON'), ('Jacks', 'PERSON'), ('Jacks', 'PERSON'), ('Etoch', 'PERSON'), ('Jacks', 'PERSON'), ('Etoch', 'PERSON'), ('three', 'CARDINAL'), ('Batson', 'PERSON'), ('Holder', 'ORG'), ('State', 'ORG'), ('three', 'CARDINAL'), ('Williams', 'PERSON'), ('Batson', 'ORG'), ('Ford', 'ORG'), ('Norris', 'ORG'), ('67', 'CARDINAL'), ('162', 'CARDINAL'), ('8th Cir', 'PERSON'), ('1995', 'DATE'), ('Holder', 'ORG'), ('Holder', 'ORG'), ('two', 'CARDINAL'), ('1', 'CARDINAL'), ('2', 'CARDINAL'), ('Ferguson', 'PERSON'), ('State', 'ORG'), ('343', 'CARDINAL'), ('159, 33', 'DATE'), ('115', 'CARDINAL'), ('2000', 'DATE'), ('Bangs', 'ORG'), ('338', 'CARDINAL'), ('515', 'CARDINAL'), ('998', 'CARDINAL'), ('738', 'CARDINAL'), ('1999', 'DATE'), ('Willis v. State', 'PERSON'), ('334', 'CARDINAL'), ('977', 'CARDINAL'), ('890', 'CARDINAL'), ('State', 'ORG'), ('346', 'CARDINAL'), ('123', 'CARDINAL'), ('55', 'DATE'), ('16-33-305', 'DATE'), ('1999', 'DATE'), ('twelve', 'CARDINAL'), ('Ford', 'ORG'), ('Williams', 'PERSON'), ('347', 'CARDINAL'), ('67', 'CARDINAL'), ('548', 'CARDINAL'), ('2002', 'DATE'), ('Branstetter v. State', 'ORG'), ('346', 'CARDINAL'), ('Ark. 62', 'DATE'), ('57', 'DATE'), ('105', 'CARDINAL'), ('2001', 'DATE'), ('Holder', 'ORG'), ('Batson', 'ORG'), ('three', 'CARDINAL'), ('Holder', 'ORG'), ('three', 'CARDINAL'), ('Linell v. State', 'PERSON'), ('283', 'CARDINAL'), ('162', 'CARDINAL'), ('671', 'CARDINAL'), ('741', 'CARDINAL'), ('1984', 'DATE'), ('Snyder v. State', 'PERSON'), ('151', 'CARDINAL'), ('601', 'DATE'), ('237', 'CARDINAL'), ('1922', 'DATE'), ('Williams', 'PERSON'), ('Nooner v. State', 'PERSON'), ('322', 'CARDINAL'), ('Ark. 87', 'DATE'), ('907', 'CARDINAL'), ('677', 'CARDINAL'), ('1995', 'DATE'), ('Taylor v. State', 'PERSON'), ('334', 'CARDINAL'), ('347', 'CARDINAL'), ('974', 'CARDINAL'), ('454', 'CARDINAL'), ('1998', 'DATE'), ('juror Jacks', 'PERSON'), ('Etoch', 'PERSON'), ('Etoch', 'PERSON'), ('Jacks', 'PERSON'), ('Batson', 'ORG'), ('Thornton', 'PERSON'), ('J.', 'PERSON')]"
36027,Per Curiam.,"[('Curiam', 'PERSON'), ('Jason B. Rogers', 'PERSON'), ('Alvin Q. Malone', 'PERSON'), ('Terry v. State', 'PERSON'), ('272', 'CARDINAL'), ('243', 'CARDINAL'), ('613', 'CARDINAL'), ('90 (1981', 'DATE'), ('265', 'CARDINAL'), ('1979', 'DATE'), ('the Committee on Professional Conduct', 'ORG'), ('265', 'CARDINAL')]"
36028,"Donald L. Corbin, Justice.","[('Donald L. Corbin', 'PERSON'), ('Justice', 'ORG'), ('James C. Fudge', 'PERSON'), ('the Pulaski County Circuit Court', 'ORG'), ('Kimberly Fudge', 'PERSON'), ('Fudge', 'GPE'), ('341', 'CARDINAL'), ('20', 'CARDINAL'), ('2000', 'DATE'), ('Thereafter', 'PERSON'), ('the United States Supreme Court', 'ORG'), ('Fudge', 'ORG'), ('Fudge', 'ORG'), ('Arkansas', 'GPE'), ('531', 'CARDINAL'), ('U.S.', 'GPE'), ('1020', 'DATE'), ('the Supreme Court’s', 'ORG'), ('Fudge', 'ORG'), ('R. Crim', 'PERSON'), ('37', 'CARDINAL'), ('37', 'CARDINAL'), ('Fudge', 'ORG'), ('six', 'CARDINAL'), ('first', 'ORDINAL'), ('Ark. R. Crim', 'ORG'), ('37.5', 'CARDINAL'), ('Echols', 'ORG'), ('344', 'CARDINAL'), ('519', 'CARDINAL'), ('42', 'DATE'), ('467', 'CARDINAL'), ('470', 'CARDINAL'), ('2001', 'DATE'), ('Ark. R. Crim', 'GPE'), ('37.3', 'CARDINAL'), ('State', 'ORG'), ('State', 'ORG'), ('Echols', 'ORG'), ('344', 'CARDINAL'), ('42', 'DATE'), ('467', 'CARDINAL'), ('Kemp v. State', 'PERSON'), ('347', 'CARDINAL'), ('52', 'DATE'), ('60', 'DATE'), ('2001', 'DATE'), ('McGehee', 'ORG'), ('344', 'CARDINAL'), ('602', 'DATE'), ('43', 'DATE'), ('125', 'CARDINAL'), ('2001', 'DATE'), ('State', 'ORG'), ('only one', 'CARDINAL'), ('three', 'CARDINAL'), ('first', 'ORDINAL'), ('Fudge', 'ORG'), ('Tammy Harris', 'PERSON'), ('Fudge', 'ORG'), ('first', 'ORDINAL'), ('Fudge', 'ORG'), ('State', 'ORG'), ('56', 'CARDINAL'), ('first', 'ORDINAL'), ('Harris', 'PERSON'), ('37', 'CARDINAL'), ('State', 'ORG'), ('first', 'ORDINAL'), ('first', 'ORDINAL'), ('first', 'ORDINAL'), ('Exhibit 56', 'LAW'), ('second', 'ORDINAL'), ('Fudge', 'ORG'), ('Fudge', 'ORG'), ('six', 'CARDINAL'), ('1', 'CARDINAL'), ('Fudge', 'ORG'), ('2', 'CARDINAL'), ('Fudge', 'ORG'), ('3', 'CARDINAL'), ('Fudge', 'ORG'), ('4', 'CARDINAL'), ('Fudge', 'ORG'), ('5', 'CARDINAL'), ('Fudge', 'ORG'), ('6)that Fudge', 'PERSON'), ('the years', 'DATE'), ('Fudge', 'ORG'), ('five', 'CARDINAL'), ('Fudge', 'ORG'), ('State', 'ORG'), ('five', 'CARDINAL'), ('third', 'ORDINAL'), ('Fudge', 'ORG'), ('Fudge', 'ORG'), ('two', 'CARDINAL'), ('three', 'CARDINAL'), ('the Pulaski County Public Defender’s Office', 'GPE'), ('Fudge', 'ORG'), ('one', 'CARDINAL'), ('State', 'ORG'), ('Jerome Jones', 'PERSON'), ('Jones', 'GPE'), ('Fudge', 'ORG'), ('three', 'CARDINAL'), ('two', 'CARDINAL'), ('first', 'ORDINAL'), ('37.5', 'CARDINAL'), ('344', 'CARDINAL'), ('42', 'DATE'), ('467', 'CARDINAL'), ('one', 'CARDINAL'), ('37.5', 'CARDINAL'), ('second', 'ORDINAL'), ('Fudge', 'ORG'), ('the Supreme Court’s', 'ORG'), ('Holloway', 'GPE'), ('Arkansas', 'GPE'), ('435', 'CARDINAL'), ('U.S.', 'GPE'), ('1978', 'DATE'), ('Wood v. Georgia', 'ORG'), ('450', 'CARDINAL'), ('U.S.', 'GPE'), ('1981', 'DATE'), ('Mickens v. Taylor', 'PERSON'), ('535', 'CARDINAL'), ('U.S.', 'GPE'), ('2002', 'DATE'), ('Fudge', 'ORG'), ('second', 'ORDINAL'), ('37', 'CARDINAL'), ('Fudge', 'GPE'), ('Lambert', 'PERSON'), ('Fudge', 'ORG'), ('Fudge', 'ORG'), ('Lambert', 'PERSON'), ('Fudge', 'ORG'), ('State', 'ORG'), ('McCormick', 'PERSON'), ('Court', 'ORG'), ('Supreme Court', 'ORG'), ('Lambert', 'PERSON'), ('Lambert', 'PERSON'), ('Fudge', 'ORG'), ('today', 'DATE'), ('Lambert', 'PERSON'), ('We’re', 'DATE'), ('Wood', 'PERSON'), ('Georgia', 'GPE'), ('Holloway', 'GPE'), ('Arkansas', 'GPE'), ('Court', 'ORG'), ('Court', 'ORG'), ('Court', 'ORG'), ('Woods', 'PERSON'), ('Georgia', 'GPE'), ('Holloway', 'GPE'), ('Arkansas', 'GPE'), ('McCormick', 'PERSON'), ('State', 'ORG'), ('one', 'CARDINAL'), ('first', 'ORDINAL'), ('Fudge', 'ORG'), ('37.5', 'CARDINAL'), ('Emphasis', 'ORG'), ('Fudge', 'ORG'), ('Fudge', 'ORG'), ('today', 'DATE'), ('37.5', 'CARDINAL'), ('Fudge', 'ORG'), ('three', 'CARDINAL'), ('sixty days', 'DATE'), ('J.', 'ORG'), ('Thornton', 'PERSON'), ('J.', 'ORG'), ('Joseph Norris', 'PERSON'), ('Fudge', 'ORG'), ('Fudge', 'ORG'), ('341', 'CARDINAL'), ('652, 19 S.W.3d 22 (2000', 'DATE')]"
36028,"Tom Glaze, Justice,","[('Tom Glaze', 'PERSON'), ('Justice', 'ORG'), ('Echols', 'ORG'), ('344', 'CARDINAL'), ('520', 'CARDINAL'), ('42', 'CARDINAL'), ('467', 'CARDINAL'), ('471', 'CARDINAL'), ('2001', 'DATE'), ('McGehee', 'PERSON'), ('344', 'CARDINAL'), ('602', 'DATE'), ('606', 'CARDINAL'), ('43', 'DATE'), ('125', 'CARDINAL'), ('128', 'CARDINAL'), ('2001', 'DATE'), ('J.', 'ORG'), ('Kemp v. State', 'PERSON'), ('347', 'CARDINAL'), ('52', 'DATE'), ('61', 'DATE'), ('60', 'DATE'), ('404', 'CARDINAL'), ('410', 'CARDINAL'), ('2001', 'DATE'), ('J.', 'ORG')]"
36029,"Tom Glaze, Justice,","[('Tom Glaze', 'PERSON'), ('Justice', 'ORG'), ('State', 'ORG'), ('R.', 'NORP'), ('Camargo v. State', 'PERSON'), ('337', 'CARDINAL'), ('987', 'CARDINAL'), ('680', 'CARDINAL'), ('1994', 'DATE'), ('Sup', 'PERSON'), ('5', 'CARDINAL'), ('Arkansas', 'GPE'), ('Robbins', 'ORG'), ('J.', 'ORG')]"
