location,gender,followers_participants_percentage,friends_participants_percentage,favourite_tweets_percentage,interests,class
USA,Male,55,70,20,Yes,Participant
UK,Male,66,52,35,Yes,Participant
Germany,Male,80,63,22,Yes,Participant
Russia,Male,10,12,0,No,Non-Participant
Canada,Female,15,2,2,No,Non-Participant