[gd_scene load_steps=2 format=2]

[ext_resource path="res://scenes/ui/TurnPlaque.gd" type="Script" id=1]

[node name="TurnPlaque" type="VBoxContainer"]
anchor_right = 1.0
anchor_bottom = 1.0
size_flags_horizontal = 3
size_flags_vertical = 3
script = ExtResource( 1 )
__meta__ = {
"_edit_use_anchors_": false
}

[node name="Icon" type="TextureRect" parent="."]
margin_right = 1024.0
margin_bottom = 394.0
size_flags_horizontal = 3
size_flags_vertical = 3
__meta__ = {
"_edit_use_anchors_": false
}

[node name="Name" type="Label" parent="."]
margin_top = 398.0
margin_right = 1024.0
margin_bottom = 497.0
size_flags_horizontal = 3
size_flags_vertical = 3
size_flags_stretch_ratio = 0.25
text = "Name"
align = 1
valign = 1

[node name="AP" type="Label" parent="."]
margin_top = 501.0
margin_right = 1024.0
margin_bottom = 600.0
size_flags_horizontal = 3
size_flags_vertical = 3
size_flags_stretch_ratio = 0.25
align = 1
valign = 1
