{
  "name": "",
  "css_prefix_text": "icon-",
  "css_use_suffix": false,
  "hinting": true,
  "units_per_em": 1000,
  "ascent": 850,
  "glyphs": [
    {
      "uid": "b4bbd11ae493aba8838e4e34a8649d98",
      "css": "sm-facebook",
      "code": 59401,
      "src": "custom_icons",
      "selected": true,
      "svg": {
        "path": "M812.9 139.5A458.8 458.8 0 0 0 476.2 0 458.8 458.8 0 0 0 139.5 139.5 458.8 458.8 0 0 0 0 476.2C0 607.6 46.4 719.8 139.5 812.9 232.4 905.7 344.8 952.4 476.2 952.4 607.6 952.4 719.8 906 812.9 812.9 905.7 720 952.4 607.6 952.4 476.2 952.4 344.8 906 232.6 812.9 139.5ZM599 476.2H520.7V762.6H414.8V476.2H342.1V377.6H414.8V320C414.8 276.4 422.9 243.8 439 222.4 455 200.5 485.5 189.8 530.2 189.8H608.3V288.3H560C542.6 288.3 531.7 291.4 527.4 297.6 523.1 303.8 521 314.3 521 329.3V377.6H610.2L599 476.2Z",
        "width": 1000
      },
      "search": ["sm-facebook"]
    },
    {
      "uid": "eb68f966f03cbeac6493483d3e2c9066",
      "css": "sm-instagram",
      "code": 59402,
      "src": "custom_icons",
      "selected": true,
      "svg": {
        "path": "M812.9 139.5A458.8 458.8 0 0 0 476.2 0 458.8 458.8 0 0 0 139.5 139.5 458.8 458.8 0 0 0 0 476.2C0 607.6 46.4 719.8 139.5 812.9 232.4 905.7 344.8 952.4 476.2 952.4 607.6 952.4 719.8 906 812.9 812.9 905.7 720 952.4 607.6 952.4 476.2 952.4 344.8 906 232.6 812.9 139.5ZM773.8 751.4A21.4 21.4 0 0 1 767.4 767.4 21.4 21.4 0 0 1 751.4 773.8H201A21.4 21.4 0 0 1 185 767.4 21.4 21.4 0 0 1 178.6 751.4V201C178.6 194.8 181 189.5 185 185A21.4 21.4 0 0 1 201 178.6H751.4C757.6 178.6 762.9 181 767.4 185 771.7 189.5 773.8 194.5 773.8 201V751.4ZM392.4 392.4A114.3 114.3 0 0 0 357.1 476.2C357.1 508.3 369 536.4 392.4 560A114.3 114.3 0 0 0 476.2 595.2 114.3 114.3 0 0 0 560 560 114.3 114.3 0 0 0 595.2 476.2 114.3 114.3 0 0 0 560 392.4 114.3 114.3 0 0 0 476.2 357.1 114.3 114.3 0 0 0 392.4 392.4ZM595.2 357.1H714.3V238.1H595.2V357.1ZM652.9 476.2C652.9 524.5 635.5 566.2 600.7 600.7A170 170 0 0 1 476.2 653.1 170 170 0 0 1 351.7 600.7 170 170 0 0 1 299.3 476.2C299.3 468.8 300.7 458.8 303.1 446.4H238.1V714.3H714.3V446.4H649.3A166.7 166.7 0 0 1 652.9 476.2Z",
        "width": 1000
      },
      "search": ["sm-instagram"]
    },
    {
      "uid": "88aa7ec90b55d30a9d42da4fb9dfb86d",
      "css": "sm-twitter",
      "code": 59403,
      "src": "custom_icons",
      "selected": true,
      "svg": {
        "path": "M812.9 139.5A458.8 458.8 0 0 0 476.2 0 458.8 458.8 0 0 0 139.5 139.5 458.8 458.8 0 0 0 0 476.2C0 607.6 46.4 719.8 139.5 812.9 232.4 905.7 344.8 952.4 476.2 952.4 607.6 952.4 719.8 906 812.9 812.9 905.7 720 952.4 607.6 952.4 476.2 952.4 344.8 906 232.6 812.9 139.5ZM712.4 370.2C713.6 375 714.3 380 714.3 385 714.3 469.3 683.8 546 623.1 614.8 562.4 683.8 481.2 718.1 379.5 718.1A323.8 323.8 0 0 1 201 665.7 231.7 231.7 0 0 0 374 617.4 121.4 121.4 0 0 1 305 593.6 112.9 112.9 0 0 1 264 535.7 135.7 135.7 0 0 0 318.1 533.8 122.6 122.6 0 0 1 250.2 492.9 111 111 0 0 1 223.3 418.6V416.7C239.3 426.7 257.4 431.7 277.1 431.7A110 110 0 0 1 223.1 334.8C223.1 313.8 228.8 293.8 239.8 275.2A317.9 317.9 0 0 0 481.7 398.1 112.9 112.9 0 0 1 512.4 287.4 112.9 112.9 0 0 1 595.2 252.9C630 252.9 658.6 265.5 681 290.2A218.1 218.1 0 0 0 755.2 262.4 110.7 110.7 0 0 1 705 327.4C727.4 325 749.5 318.8 771.9 308.8 755.7 332.4 736.2 352.9 712.4 370.2Z",
        "width": 1000
      },
      "search": ["sm-twitter"]
    },
    {
      "uid": "628396a40ac0d90e722ed578b165d9b9",
      "css": "sm-youtube",
      "code": 59405,
      "src": "custom_icons",
      "selected": true,
      "svg": {
        "path": "M812.9 139.5A458.8 458.8 0 0 0 476.2 0 458.8 458.8 0 0 0 139.5 139.5 458.8 458.8 0 0 0 0 476.2C0 607.6 46.4 719.8 139.5 812.9 232.4 905.7 344.8 952.4 476.2 952.4 607.6 952.4 719.8 906 812.9 812.9 905.7 720 952.4 607.6 952.4 476.2 952.4 344.8 906 232.6 812.9 139.5ZM768.3 582.4A118.1 118.1 0 0 1 745 645.5 81.2 81.2 0 0 1 693.8 680.7C561.2 690.7 416 690.7 258.6 680.7 238.8 678.3 221.7 666.9 207.4 646.4A122.9 122.9 0 0 1 184 582.1 1232.4 1232.4 0 0 1 184 368.3C185.5 347.1 193.1 326.4 207.4 306 221.7 285.5 238.8 274 258.6 271.7 387.6 261.7 532.6 261.7 693.8 271.7 716.2 272.9 733.8 282.6 746.9 301.4A119 119 0 0 1 768.3 364.5C774.5 436.4 774.5 509 768.3 582.1ZM416.7 595.2L595.2 476.2 416.7 357.1V595.2Z",
        "width": 1000
      },
      "search": ["sm-youtube"]
    },
    {
      "uid": "55bc8ef51bd995843c0f063e6e14f635",
      "css": "close",
      "code": 59408,
      "src": "custom_icons",
      "selected": true,
      "svg": {
        "path": "M476.7 500L16.7 40.7 40.3 16.7 500 476.7 959.7 16.7 983 40.7 523.7 500 983 960 959.7 983.3 499.7 523.7 40.7 983.3 17.3 960Z",
        "width": 1000
      },
      "search": ["close"]
    },
    {
      "uid": "ce25490bac5ae9c29fa310d210a96ea3",
      "css": "down-open-big",
      "code": 59409,
      "src": "custom_icons",
      "selected": true,
      "svg": {
        "path": "M508.3 711L968 251.3 991.3 275 508.3 758.3 25 275 48.7 251.7 508.3 711Z",
        "width": 1000
      },
      "search": ["down-open-big"]
    },
    {
      "uid": "38abcc6107e62e9999adbb5f093b68e1",
      "css": "up-open-big",
      "code": 59410,
      "src": "custom_icons",
      "selected": true,
      "svg": {
        "path": "M508.3 305.7L968 765.3 991.3 741.7 508.3 258.3 25 741.7 48.7 765 508.3 306Z",
        "width": 1000
      },
      "search": ["up-open-big"]
    },
    {
      "uid": "c9b7aafc0ce1e2520b9453826fb37668",
      "css": "search-big",
      "code": 59411,
      "src": "custom_icons",
      "selected": true,
      "svg": {
        "path": "M670.7 647.3L976.7 953 953.3 976.3 647.3 670.7A366.7 366.7 0 1 1 670.7 647.3ZM400 733.3A333.3 333.3 0 1 0 400 66.7 333.3 333.3 0 0 0 400 733.3Z",
        "width": 1000
      },
      "search": ["search-big"]
    },
    {
      "uid": "f5d8ab98b0bc92d05faf1de097350a73",
      "css": "hamburger",
      "code": 59412,
      "src": "custom_icons",
      "selected": true,
      "svg": {
        "path": "M0 133.3H1000V166.7H0ZM0 366.7H1000V400H0ZM0 600H1000V633.3H0ZM0 833.3H1000V866.7H0Z",
        "width": 1000
      },
      "search": ["hamburger"]
    },
    {
      "uid": "13177ff858237981113832757e2e3c0d",
      "css": "arrow-down",
      "code": 59413,
      "src": "custom_icons",
      "selected": true,
      "svg": {
        "path": "M466.7 910V0H500V910L633.3 776.7V823.3L483.3 973.3 333.3 823.3V776.7Z",
        "width": 1000
      },
      "search": ["arrow-down"]
    },
    {
      "uid": "e529de58f4a8f667b1634ed5c7ca51ad",
      "css": "arrow-left",
      "code": 59414,
      "src": "custom_icons",
      "selected": true,
      "svg": {
        "path": "M90.3 500H1000V533.3H90.3L223.7 666.7H176.3L26.3 516.7 176.3 366.7H223.7Z",
        "width": 1000
      },
      "search": ["arrow-left"]
    },
    {
      "uid": "c095d3d4b73142fcb6a3438abb66dh3f",
      "css": "arrow-steady",
      "code": 59394,
      "src": "custom_icons",
      "selected": true,
      "svg": {
        "path": "M909.7 533.3H0V500H909.7L776.3 366.7H823.7L973.7 516.7 823.7 666.7H776.3Z",
        "width": 1000
      },
      "search": ["arrow-steady"]
    },
    {
      "uid": "8522021e3f1c7ed9efdd450ec2915f2a",
      "css": "arrow-up",
      "code": 59416,
      "src": "custom_icons",
      "selected": true,
      "svg": {
        "path": "M466.7 90V1000H500V90L633.3 223.3V176.7L483.3 26.7 333.3 176.7V223.3Z",
        "width": 1000
      },
      "search": ["arrow-up"]
    },
    {
      "uid": "9c12addc392ebcde52f1eefd77736683",
      "css": "attention",
      "code": 59418,
      "src": "custom_icons",
      "selected": true,
      "svg": {
        "path": "M500 700A200 200 0 1 1 500 300 200 200 0 0 1 500 700ZM500 666.7A166.7 166.7 0 1 0 500 333.3 166.7 166.7 0 0 0 500 666.7ZM483.3 400H516.7V533.3H483.3V400ZM483.3 566.7H516.7V600H483.3V566.7Z",
        "width": 1000
      },
      "search": ["attention"]
    },
    {
      "uid": "542cde1e9e5d1118dacc9cfaf82fc39b",
      "css": "info",
      "code": 59419,
      "src": "custom_icons",
      "selected": true,
      "svg": {
        "path": "M500 700A200 200 0 1 1 500 300 200 200 0 0 1 500 700ZM500 666.7A166.7 166.7 0 1 0 500 333.3 166.7 166.7 0 0 0 500 666.7ZM483.3 466.7H516.7V600H483.3V466.7ZM483.3 400H516.7V433.3H483.3V400Z",
        "width": 1000
      },
      "search": ["info"]
    },
    {
      "uid": "8811524805fa69659eaf6bd05fd4bb3d",
      "css": "down-open",
      "code": 59420,
      "src": "custom_icons",
      "selected": true,
      "svg": {
        "path": "M516.7 568L658 426.3 681.7 450 540.3 591.3 516.7 615 351.7 450 375 426.7 516.7 568Z",
        "width": 1000
      },
      "search": ["down-open"]
    },
    {
      "uid": "fab65fee2b57772698d01e3be2420040",
      "css": "up-open",
      "code": 59421,
      "src": "custom_icons",
      "selected": true,
      "svg": {
        "path": "M516.7 432L658 573.7 681.7 550 540.3 408.7 516.7 385 351.7 550 375 573.3 516.7 432Z",
        "width": 1000
      },
      "search": ["up-open"]
    },
    {
      "uid": "3500b716b8cd8e2f469bf9fa55c949e7",
      "css": "search",
      "code": 59422,
      "src": "custom_icons",
      "selected": true,
      "svg": {
        "path": "M585.9 562.6L755.4 732.1 732.1 755.4 562.6 585.9C527.8 615.5 482.6 633.3 433.3 633.3 322.9 633.3 233.3 543.8 233.3 433.3S322.9 233.3 433.3 233.3 633.3 322.9 633.3 433.3C633.3 482.6 615.5 527.8 585.9 562.6ZM433.3 600C525.4 600 600 525.4 600 433.3S525.4 266.7 433.3 266.7 266.7 341.3 266.7 433.3 341.3 600 433.3 600Z",
        "width": 1000
      },
      "search": ["search"]
    },
    {
      "uid": "b821960faad7f8d708153c5d2520a6bd",
      "css": "external",
      "code": 59423,
      "src": "custom_icons",
      "selected": true,
      "svg": {
        "path": "M580 406H424.7V372.7H637V584.7H603.7V430L384.3 649 361 625.7Z",
        "width": 1000
      },
      "search": ["external"]
    },
    {
      "uid": "8b5688a7267384fb6069bcb597e863a4",
      "css": "download",
      "code": 59424,
      "src": "custom_icons",
      "selected": true,
      "svg": {
        "path": "M233.3 666.7H766.7V700H233.3ZM516.7 576.7L626.7 466.7 650 490 500 640 350 490 373.3 466.7 483.3 576.7V266.7H516.7Z",
        "width": 1000
      },
      "search": ["download"]
    },
    {
      "uid": "b53b483de97b60c96f73e71e4083cf71",
      "css": "arrow-decrease",
      "code": 59425,
      "src": "custom_icons",
      "selected": true,
      "svg": {
        "path": "M774 827.3L130.7 184 154.3 160.7 797.7 804V615.3L831 648.7V861H619L585.7 827.7Z",
        "width": 1000
      },
      "search": ["arrow-decrease"]
    },
    {
      "uid": "d186d3684fbab391880a20fe1ace2c0e",
      "css": "arrow-increase",
      "code": 59426,
      "src": "custom_icons",
      "selected": true,
      "svg": {
        "path": "M797.7 229.3L154.3 872.7 131 849.3 774.3 206H585.3L618.7 172.7H831V384.7L797.7 418Z",
        "width": 1000
      },
      "search": ["arrow-increase"]
    },
    {
      "uid": "b287b479d55c16b0cfbbadc173d52d57",
      "css": "minus-big",
      "code": 59427,
      "src": "custom_icons",
      "selected": true,
      "svg": {
        "path": "M833.3 466.7V500H133.3V466.7Z",
        "width": 1000
      },
      "search": ["minus-big"]
    },
    {
      "uid": "c5b7e4395a81c0a0babe2a63cfa4ec9e",
      "css": "plus-big",
      "code": 59428,
      "src": "custom_icons",
      "selected": true,
      "svg": {
        "path": "M466.7 466.7V133.3H500V466.7H833.3V500H500V833.3H466.7V500H133.3V466.7Z",
        "width": 1000
      },
      "search": ["plus-big"]
    },
    {
      "uid": "5e3300dedfe7d4f54319c6d23e8ff7a0",
      "css": "sm-whatsapp",
      "code": 59463,
      "src": "custom_icons",
      "selected": true,
      "svg": {
        "path": "M844.9 139.5C937.9 232.5 984.4 344.8 984.4 476.2 984.4 607.6 937.9 719.9 844.9 812.9 751.9 905.9 639.6 952.4 508.2 952.4 410.8 952.4 323.9 926.8 247.6 875.8L0 952.4 102.9 727.9C55.6 653.8 32 569.9 32 476.2 32 344.8 78.5 232.5 171.5 139.5 264.5 46.5 376.8 0 508.2 0 639.6 0 751.9 46.5 844.9 139.5ZM763.2 662.3C775.6 631.1 779.5 610.9 774.9 601.5 773.3 598.4 764.7 593 749.2 585.2 746.1 583.6 732 575.8 707.1 561.8 682.2 547.8 667.4 540 662.7 538.5 650.3 533.8 640.1 536.1 632.4 545.5 629.2 548.6 621.8 556.8 610.2 570 598.5 583.2 591.1 591.4 588 594.5 581.7 602.3 572.4 603.1 559.9 596.9 519.4 576.6 485.2 553.3 457.1 526.8 426 497.2 402.6 466.8 387 435.7 382.4 426.3 384.7 417 394 407.6L415.1 386.6C419.7 381.9 424.4 374.9 429.1 365.6 432.2 359.3 432.2 351.5 429.1 342.2 429.1 340.6 426.4 333.6 420.9 321.2A599.9 599.9 0 0 1 404.5 279.1 927.8 927.8 0 0 0 391.7 244.1C385.5 226.9 375.4 218.4 361.3 218.4H338C325.5 218.4 313.8 223.8 302.9 234.7 270.2 267.5 253.1 303.3 251.5 342.2 250 387.4 266.3 432.5 300.6 477.7L307.6 487A645.5 645.5 0 0 0 347.3 545.5C356.7 557.9 367.5 570.4 380 582.9A1772.6 1772.6 0 0 0 418.6 620.2 281.2 281.2 0 0 0 465.3 655.3C483.2 666.2 500.7 675.5 517.9 683.3 574 706.7 613.7 719.9 637 723 660.4 726.1 672.9 725.4 674.4 720.7 688.4 719.1 705.6 712.5 725.8 700.8 746 689.2 758.5 676.3 763.2 662.3Z",
        "width": 1000
      },
      "search": ["sm-whatsapp"]
    },
    {
      "uid": "cffc9ecebfd300bbae68a7e95ad6a996",
      "css": "sm-telegram",
      "code": 59417,
      "src": "custom_icons",
      "selected": true,
      "svg": {
        "path": "M476.2 0C607.6 0 719.9 46.5 812.9 139.5 905.9 232.5 952.4 344.7 952.4 476.2 952.4 607.6 905.9 719.9 812.9 812.9 719.9 905.9 607.6 952.4 476.2 952.4 344.7 952.4 232.5 905.9 139.5 812.9 46.5 719.9 0 607.6 0 476.2 0 344.7 46.5 232.5 139.5 139.5 232.5 46.5 344.7 0 476.2 0ZM738.1 214.3L119 517.3 298 579.3 636 335.5 371 601.8 371 736.7 448.3 629.4 690.3 709.6 738.1 214.3Z",
        "width": 1000
      },
      "search": ["sm-telegram"]
    },
    {
      "uid": "c095d3d4b73142fcb6a3438abb63f0c4",
      "css": "arrow-right",
      "code": 59415,
      "src": "custom_icons",
      "selected": true,
      "svg": {
        "path": "M909.7 533.3H0V500H909.7L776.3 366.7H823.7L973.7 516.7 823.7 666.7H776.3Z",
        "width": 1000
      },
      "search": ["arrow-right"]
    },
    {
      "uid": "f03c4e79973bb7a3c9cb2139a7012af6",
      "css": "location",
      "code": 59457,
      "src": "custom_icons",
      "selected": true,
      "svg": {
        "path": "M516.7 100C746.8 100 933.3 286.5 933.3 516.7S746.8 933.3 516.7 933.3 100 746.8 100 516.7 286.5 100 516.7 100ZM516.7 133.3C305 133.3 133.3 305 133.3 516.7S305 900 516.7 900 900 728.4 900 516.7 728.4 133.3 516.7 133.3ZM516.7 366.7A150 150 0 1 1 516.7 666.7 150 150 0 0 1 516.7 366.7Z",
        "width": 1000
      },
      "search": ["location"]
    },
    {
      "uid": "1d2abf0ff40ff27968cbec2b69a6f914",
      "css": "pause",
      "code": 59448,
      "src": "custom_icons",
      "selected": true,
      "svg": {
        "path": "M516.7 100C746.8 100 933.3 286.5 933.3 516.7S746.8 933.3 516.7 933.3 100 746.8 100 516.7 286.5 100 516.7 100ZM516.7 133.3C305 133.3 133.3 305 133.3 516.7S305 900 516.7 900 900 728.4 900 516.7 728.4 133.3 516.7 133.3ZM416.7 350H483.3V683.3H416.7ZM550 350H616.7V683.3H550Z",
        "width": 1000
      },
      "search": ["pause"]
    },
    {
      "uid": "ef644cd887030485150ab13f6a026603",
      "css": "play",
      "code": 59449,
      "src": "custom_icons",
      "selected": true,
      "svg": {
        "path": "M516.7 100C746.8 100 933.3 286.5 933.3 516.7S746.8 933.3 516.7 933.3 100 746.8 100 516.7 286.5 100 516.7 100ZM516.7 133.3C305 133.3 133.3 305 133.3 516.7S305 900 516.7 900 900 728.4 900 516.7 728.4 133.3 516.7 133.3ZM433.3 316.7L666.7 516.7 433.3 716.7Z",
        "width": 1000
      },
      "search": ["play"]
    },
    {
      "uid": "b3abf6359ab3ed68a6ca31b44a0b3971",
      "css": "search-midsize",
      "code": 59450,
      "src": "custom_icons",
      "selected": true,
      "svg": {
        "path": "M400 66.7C584.1 66.7 733.3 215.9 733.3 400A332.1 332.1 0 0 1 647.2 623.6L943.3 919.7 919.7 943.3 623.6 647.2A332.1 332.1 0 0 1 400 733.3C215.9 733.3 66.7 584.1 66.7 400S215.9 66.7 400 66.7ZM400 100A300 300 0 1 0 400 700 300 300 0 0 0 400 100Z",
        "width": 1000
      },
      "search": ["search-midsize"]
    },
    {
      "uid": "8af6a9e430a8d79f9b944e2d0ec6e189",
      "css": "snow",
      "code": 59451,
      "src": "custom_icons",
      "selected": true,
      "svg": {
        "path": "M531.5 300V471.1L679.7 385.6 696.4 414.4 548.2 500 696.4 585.6 679.7 614.4 531.5 528.9V700H498.2V528.9L350 614.4 333.3 585.6 481.5 500 333.3 414.4 350 385.6 498.2 471.1V300H531.5Z",
        "width": 1000
      },
      "search": ["snow"]
    },
    {
      "uid": "8a0282078fd9dec428ad5b633641d90b",
      "css": "snow-diff",
      "code": 59452,
      "src": "custom_icons",
      "selected": true,
      "svg": {
        "path": "M531.5 300V471.1L679.7 385.6 696.4 414.4 548.2 500 696.4 585.6 679.7 614.4 531.5 528.9V700H498.2V528.9L350 614.4 333.3 585.6 481.5 500 333.3 414.4 350 385.6 498.2 471.1V300H531.5ZM366.7 483.3V516.7H200V483.3H366.7ZM833.3 483.3V516.7H666.7V483.3H833.3Z",
        "width": 1000
      },
      "search": ["snowdiff"]
    },
    {
      "uid": "c0e4949219f2722354dfc57ee1637224",
      "css": "snow-new",
      "code": 59453,
      "src": "custom_icons",
      "selected": true,
      "svg": {
        "path": "M531.5 300V471.1L679.7 385.6 696.4 414.4 548.2 500 696.4 585.6 679.7 614.4 531.5 528.9V700H498.2V528.9L350 614.4 333.3 585.6 481.5 500 333.3 414.4 350 385.6 498.2 471.1V300H531.5ZM515 136.7L350 301.7 373.6 325.2 515 183.8 656.4 325.2 680 301.7 515 136.7Z",
        "width": 1000
      },
      "search": ["snownew"]
    },
    {
      "uid": "137305e3982eaa5e6c3bd03cf933f7f3",
      "css": "wind",
      "code": 59455,
      "src": "custom_icons",
      "selected": true,
      "svg": {
        "path": "M566.7 566.7L572.1 566.9C638.8 572.6 637.1 683.3 566.7 683.3V650L570.3 649.7C594.4 645.6 593.2 600 566.7 600H433.3V566.7H566.7ZM633.3 350C769.8 350 772.2 527.1 640.4 533.2L633.3 533.3H300V500H633.3C725.7 500 727.7 388.3 639.3 383.5L633.3 383.3V350Z",
        "width": 1000
      },
      "search": ["wind"]
    },
    {
      "uid": "bfe8cf371239b5e8928980a25ea35d61",
      "css": "wind-gust",
      "code": 59456,
      "src": "custom_icons",
      "selected": true,
      "svg": {
        "path": "M533.3 566.7L540.4 566.8C672.2 572.9 669.8 750 533.3 750V716.7L539.3 716.5C627.8 711.7 625.8 600 533.3 600H366.7V566.7H533.3ZM600 500V533.3H266.7V500H600ZM633.3 233.3C695.4 233.3 750 289.5 750 350 750 412.9 707.1 463.2 640.3 466.5L633.3 466.7H366.7V433.3H633.3C684.8 433.3 716.7 397.5 716.7 350 716.7 307.7 676.8 266.7 633.3 266.7A84.1 84.1 0 0 0 550.2 344.6L550 350H516.7C516.7 285.9 569.6 233.3 633.3 233.3Z",
        "width": 1000
      },
      "search": ["windgust"]
    },
    {
      "uid": "d02f6638e4705d6284e96edf121c83d0",
      "css": "temperature",
      "code": 59430,
      "src": "custom_icons",
      "selected": true,
      "svg": {
        "path": "M533.3 200V266.7H600V300H533.3V366.7H600V400H533.3V466.7H600V500H533.3V567.9A116.7 116.7 0 1 1 500 567.9V200H533.3ZM516.7 600A83.3 83.3 0 1 0 516.7 766.7 83.3 83.3 0 0 0 516.7 600Z",
        "width": 1000
      },
      "search": ["temperature"]
    },
    {
      "uid": "e9923e7a8b54db166a1153ff2e45e1c0",
      "css": "copyright",
      "code": 59392,
      "src": "custom_icons",
      "selected": true,
      "svg": {
        "path": "M500 300A200 200 0 1 1 500 700 200 200 0 0 1 500 300ZM500 333.3A166.7 166.7 0 1 0 500 666.7 166.7 166.7 0 0 0 500 333.3ZM565.9 424.7L570.5 429 544.1 455.4A62.7 62.7 0 1 0 540.1 547.7L544.1 544.1 570.5 570.5A100 100 0 1 1 565.9 424.7Z",
        "width": 1000
      },
      "search": ["copyright"]
    },
    {
      "uid": "7fe0023255de8f3a1b383e540af42255",
      "css": "language",
      "code": 59393,
      "src": "custom_icons",
      "selected": true,
      "svg": {
        "path": "M533.3 100C750.2 108.9 924.5 283.1 933 500H933.3V533.3H933C924.5 750.2 750.2 924.5 533.3 933V933.3H500V933C283.1 924.5 108.9 750.2 100.3 533.3H100V500C108.9 283.1 283.1 108.9 500 100.3V100H533.3ZM500 727.9C457.3 729.3 414.5 735.8 371.7 747.4 402.8 831.3 449.7 887.9 500 898.3ZM533.3 727.9V898.3C583.7 887.9 630.6 831.3 661.7 747.5A550.7 550.7 0 0 0 533.3 727.9ZM339.7 757.1L330.9 760C305.1 769 279.3 779.9 253.4 792.6L251.5 793.5A382.8 382.8 0 0 0 417.2 887C386.3 856.2 359.7 811.5 339.7 757.1ZM693.7 757.1L693.5 757.5C673.5 811.6 647 856.2 616.1 887A382.7 382.7 0 0 0 781.8 793.5L780 792.6 764.4 785.2A668.6 668.6 0 0 0 693.7 757.1ZM300.2 533.3H133.7A381.7 381.7 0 0 0 227.4 768.2L238.6 762.7 255 754.9A702 702 0 0 1 329.1 725.4C312 668.6 301.6 603.2 300.2 533.3ZM899.6 533.3H733.2C731.7 603.2 721.4 668.6 704.2 725.5 734.4 735.4 764.6 747.9 794.7 762.7L805.9 768.2A381.7 381.7 0 0 0 899.6 533.3ZM500 533.3L333.5 533.4C335 600.3 345 662.4 361 715.8A583.7 583.7 0 0 1 500 694.6L500 533.3ZM699.8 533.4L533.3 533.3V694.6C579.7 695.9 626 703 672.3 715.8 688.4 662.4 698.4 600.3 699.8 533.4ZM133.7 500L300.2 500C301.6 428 312.6 360.8 330.7 302.7A686.4 686.4 0 0 1 255 272.8L238.6 265 230.9 261.1A381.8 381.8 0 0 0 133.7 500ZM362.6 312.4L360.6 319.1C344.8 372.1 334.9 433.7 333.5 500H500V333.1A586.9 586.9 0 0 1 362.7 312.4ZM802.4 261.1L794.7 265C764 280.1 733.4 292.7 702.6 302.8 720.7 360.8 731.7 428 733.2 500H899.6A381.8 381.8 0 0 0 802.4 261.1ZM670.7 312.3L664 314.2C620.5 325.5 576.9 331.8 533.4 333.1L533.3 500H699.8C698.3 430.9 687.7 366.8 670.7 312.3ZM375.5 275.9L373.6 280.8C415.8 292.2 457.9 298.5 500 299.8V135.1C451.7 145 406.6 197.6 375.5 275.9ZM533.4 135.1V299.8A553.3 553.3 0 0 0 659.7 280.8C628.6 199.7 582.6 145.3 533.4 135.1ZM417.2 146.4L413.3 147.5A382.8 382.8 0 0 0 255.5 236.1L253.4 235.1A678 678 0 0 0 341.6 271.3C361.4 219.1 387.2 176.2 417.2 146.4ZM616.1 146.4L617.8 148.1C647 177.8 672.3 220.1 691.8 271.2A649.1 649.1 0 0 0 764.4 242.5L777.9 236.1A382.7 382.7 0 0 0 616.1 146.4Z",
        "width": 1000
      },
      "search": ["language"]
    },
    {
      "uid": "4f6dbbbe37760625847382b5aefed166",
      "css": "snow-line",
      "code": 59434,
      "src": "custom_icons",
      "selected": true,
      "svg": {
        "path": "M516.5 300V471.1L664.7 385.6 681.4 414.4 533.2 500 681.4 585.6 664.7 614.4 516.5 528.9V683.3H833.3V716.7H166.7V683.3H483.2V528.9L335 614.4 318.3 585.6 466.5 500 318.3 414.4 335 385.6 483.2 471.1V300H516.5Z",
        "width": 1000
      },
      "search": ["snowline_line"]
    },
    {
      "uid": "fe9c935ec9552d0913c52ce2449b1e02",
      "css": "snow-drop",
      "code": 59432,
      "src": "custom_icons",
      "selected": true,
      "svg": {
        "path": "M516.5 300L516.5 471.1 664.7 385.6 681.4 414.4 533.2 500 681.4 585.6 664.7 614.4 516.5 528.9V594.2L520.7 599.5C521.9 601.1 523.1 602.7 524.3 604.3L527.9 609.1 541.6 627.5 554.1 645C595.8 704.7 616.7 748.3 616.7 777.8 616.7 836.5 564 883.3 500 883.3S383.3 836.5 383.3 777.8C383.3 748.3 404.2 704.7 445.9 645L458.4 627.5C460.6 624.5 462.8 621.4 465.1 618.4L479.3 599.5 483.2 594.5V528.9L335 614.4 318.3 585.6 466.5 500 318.3 414.4 335 385.6 483.2 471.1 483.2 300ZM500 627.4L492.7 637.2 480 654.6 468.5 671 458.2 686.4C430.5 728.9 416.7 759.7 416.7 777.8 416.7 817.2 453.6 850 500 850S583.3 817.2 583.3 777.8C583.3 759.7 569.5 728.9 541.8 686.4L531.5 671 520 654.6 507.3 637.2ZM495.1 689.9L521.6 710.1C496.7 742.9 484.9 763.7 483.5 779.9L483.3 783.3H450C450 758.2 462.2 734.1 489.4 697.4Z",
        "width": 1000
      },
      "search": ["snowline_drop"]
    }
  ]
}
