<svg width="125" height="31" viewBox="0 0 125 31" fill="none" xmlns="http://www.w3.org/2000/svg">
<path d="M42.7454 27.6508L30.3393 3.92498C28.9912 1.58679 26.5628 0.106965 23.8966 0H18.4247C15.7665 0.134369 13.3496 1.60624 11.9829 3.92498L0.24067 26.5042C-0.0802235 27.0382 -0.0802235 27.71 0.24067 28.244C0.573056 28.7682 1.15562 29.0714 1.76823 29.0396H3.52121C4.63241 28.9892 5.63841 28.3553 6.17765 27.367L16.5514 7.49901C17.1747 6.46119 18.2532 5.79288 19.4475 5.70537H22.888C24.077 5.7973 25.1502 6.46561 25.7707 7.49901L35.8122 26.7739C35.8917 26.9356 35.8122 27.0974 35.5735 27.0974H34.4844C34.068 27.0594 33.695 26.8242 33.4748 26.4636L24.5614 9.44206C24.0169 8.45904 23.0144 7.82786 21.905 7.76952H20.5763C19.466 7.82521 18.4627 8.45728 17.9199 9.44206L8.98083 26.5714C8.68292 27.1169 8.68292 27.7799 8.98083 28.3253C9.31322 28.8495 9.89578 29.1527 10.5084 29.1209H12.2614C13.3726 29.0705 14.3786 28.4367 14.9178 27.4484L21.0546 15.6734C21.1209 15.5116 21.28 15.5116 21.4002 15.6734L23.9373 20.5832C23.9895 20.6557 23.9957 20.752 23.9523 20.8298C23.909 20.9076 23.8259 20.9536 23.7375 20.9474H20.5763C20.1016 21.0048 19.7454 21.4133 19.7454 21.8986C19.7454 22.3839 20.1025 22.7923 20.5763 22.8498H24.2821C24.8965 22.8904 25.4834 22.5846 25.8096 22.0542C26.1464 21.5246 26.1464 20.844 25.8096 20.3144L22.5291 13.9611C22.2789 13.3723 21.7123 12.9878 21.0811 12.9763C20.4579 13.0019 19.9027 13.383 19.6464 13.9611L13.0711 26.5723C12.8545 26.9383 12.4797 27.1787 12.0616 27.2194H10.9725C10.7736 27.2194 10.6534 27.0576 10.7736 26.8959L19.3281 10.3597C19.5473 9.99898 19.9213 9.76383 20.3376 9.72582H21.6663C22.0871 9.7603 22.4663 9.99544 22.6891 10.3597L31.5875 27.489C32.1373 28.4667 33.1372 29.0961 34.2439 29.1616H36.1039C36.7191 29.1898 37.2973 28.8672 37.6049 28.3253C37.9249 27.786 37.9249 27.1115 37.6049 26.5714L27.2576 6.74407C26.3082 5.07419 24.5853 4.01161 22.6882 3.92498H19.4872C17.5884 4.00631 15.8637 5.07065 14.9178 6.74407L4.55727 26.6121C4.33803 26.9728 3.9641 27.2079 3.54773 27.2459H2.45864C2.25974 27.2459 2.17929 27.1381 2.21996 26.9356L13.6696 4.92302C14.6871 3.21955 16.4657 2.13487 18.4247 2.02349H23.8975C25.8591 2.13752 27.6413 3.22131 28.6659 4.92302L41.0057 28.6356C41.1745 28.9609 41.5069 29.1633 41.8694 29.1616C42.0196 29.1651 42.1682 29.1227 42.2946 29.0404C42.7675 28.7585 42.9611 28.1635 42.7454 27.6508Z" fill="#73778C"/>
<path d="M27.2415 24.2201C27.1372 23.9823 26.9409 23.8046 26.7023 23.7312C26.4645 23.6587 26.2072 23.6976 25.9995 23.8399C25.7829 23.9593 25.622 24.167 25.5539 24.4146C25.4859 24.6621 25.5168 24.9282 25.6397 25.1518L27.4784 28.6525C27.634 28.9645 27.939 29.1608 28.2731 29.1634C28.4181 29.167 28.5604 29.1263 28.6833 29.0459C28.8999 28.9265 29.0608 28.7188 29.1289 28.4713C29.1969 28.2237 29.166 27.9576 29.0431 27.734L27.2415 24.2201Z" fill="#73778C"/>
<path d="M48.9972 0.204573C48.9512 0.0755084 48.8284 -0.00758699 48.6958 0.00125307H47.3857C47.2557 0.0127451 47.1382 0.0887685 47.071 0.204573L42.6147 12.3658C42.5581 12.4463 42.5581 12.5559 42.6147 12.6372C42.6819 12.7141 42.7765 12.7583 42.8764 12.7592H44.3314C44.4614 12.7477 44.579 12.6717 44.6461 12.5559L45.9562 8.85456H50.1508L51.4609 12.5559C51.5122 12.6876 51.6386 12.7698 51.7756 12.7592H53.2042C53.305 12.7628 53.4013 12.7177 53.4659 12.6372C53.5224 12.5568 53.5224 12.4472 53.4659 12.3658L48.9972 0.204573ZM49.456 6.98312H46.5468L47.9753 2.83449L49.456 6.98312Z" fill="#73778C"/>
<path d="M59.3807 2.73439C58.57 2.73174 57.7886 3.05794 57.191 3.64845V3.29397C57.1786 3.11893 57.0496 2.97926 56.8869 2.96688H55.6219C55.4645 2.98633 55.3417 3.12335 55.3311 3.29397V12.3639C55.3479 12.5292 55.469 12.6591 55.6219 12.6777H56.8878C57.046 12.6653 57.1733 12.5336 57.1919 12.3639V6.90778C57.1371 6.33406 57.3139 5.76299 57.6772 5.34044C58.0405 4.91788 58.555 4.68362 59.0898 4.69865C59.569 4.69069 60.0287 4.90727 60.3487 5.29182C60.6687 5.67636 60.819 6.19085 60.7606 6.70357V12.4461C60.7783 12.6158 60.9065 12.7475 61.0647 12.7599H62.3306C62.4835 12.7413 62.6047 12.6114 62.6214 12.4461V6.74512C62.6214 4.3035 61.3556 2.73439 59.3807 2.73439Z" fill="#73778C"/>
<path d="M72.3939 2.73516H70.8876C70.7576 2.744 70.641 2.82002 70.5808 2.9376L68.141 9.36343L65.6339 2.9376C65.5818 2.80676 65.4527 2.72544 65.3139 2.73516H63.8739C63.7607 2.74135 63.6564 2.80146 63.5937 2.89693C63.5309 2.9924 63.5159 3.11263 63.5539 3.22048L67.127 11.9774L65.9133 15.0219C65.8611 15.1236 65.8611 15.2438 65.9133 15.3455C65.9814 15.433 66.083 15.4869 66.1935 15.494H67.5266C67.6583 15.4905 67.7785 15.4189 67.8466 15.3057L72.607 3.22136C72.6591 3.1197 72.6591 2.99948 72.607 2.89782C72.5009 2.81649 72.4611 2.73516 72.3939 2.73516Z" fill="#73778C"/>
<path d="M77.8827 0.00924482C77.7041 -0.00136324 77.5255 -0.00136324 77.347 0.00924482C76.554 -0.0570556 75.7752 0.26649 75.2271 0.890598C74.679 1.51471 74.4191 2.37307 74.5208 3.22702V3.372H73.8507C73.6942 3.38437 73.5696 3.51874 73.5581 3.68847V4.80939C73.5696 4.97824 73.6942 5.11349 73.8507 5.12586H74.4598V12.4569C74.4757 12.6169 74.5924 12.7425 74.74 12.7601H75.9582C76.1102 12.7486 76.2331 12.6213 76.2508 12.4569V5.12498H77.6758C77.8323 5.11261 77.9569 4.97824 77.9684 4.80851V3.68759C77.9569 3.51874 77.8323 3.38349 77.6758 3.37112H76.287V3.22614C76.287 1.9072 76.8599 1.78874 77.3956 1.78874C77.5131 1.77725 77.6316 1.77725 77.7492 1.78874C77.8411 1.79935 77.9322 1.77107 78.0047 1.71007C78.0692 1.64996 78.109 1.56421 78.1143 1.47316V0.312458C78.1222 0.161293 78.0214 0.0295769 77.8827 0.00924482Z" fill="#73778C"/>
<path d="M82.7756 2.7353C81.53 2.71319 80.3287 3.23387 79.45 4.17799C78.5713 5.12211 78.0904 6.40833 78.1178 7.73965C78.0683 9.07891 78.5421 10.3793 79.4252 11.3314C80.3083 12.2825 81.5221 12.7997 82.7756 12.7573C85.2712 12.6194 87.2283 10.4164 87.2283 7.74672C87.2283 5.07702 85.2712 2.8732 82.7756 2.7353ZM82.7756 10.9053C81.5795 10.9769 80.4639 10.2617 79.96 9.10101C79.4562 7.94031 79.6639 6.56834 80.486 5.63748C81.3082 4.70663 82.5785 4.40606 83.6914 4.87812C84.8044 5.35018 85.5364 6.49939 85.5381 7.77943C85.5797 8.59094 85.3074 9.38478 84.7849 9.97618C84.2625 10.5667 83.5358 10.9035 82.7756 10.9053Z" fill="#73778C"/>
<path d="M93.3028 2.73601C92.4383 2.70418 91.6003 3.05337 90.9982 3.69869V3.3C90.9868 3.12851 90.8586 2.98972 90.6933 2.97027H89.369C89.1993 2.98353 89.064 3.12409 89.0508 3.3V12.4433C89.0693 12.6148 89.2028 12.7474 89.369 12.7597H90.6933C90.8533 12.7412 90.9806 12.6103 90.9982 12.4433V8.07098C90.9982 5.84329 91.7399 4.79839 93.3028 4.79839C93.4682 4.77895 93.5955 4.64016 93.6078 4.46866V3.09403C93.6087 2.91193 93.477 2.75722 93.3028 2.73601Z" fill="#73778C"/>
<path d="M99.2391 5.38462C97.9873 4.8109 96.9 4.31586 96.9 3.31251C96.9009 2.89438 97.0909 2.49569 97.4224 2.219C97.7539 1.9423 98.1951 1.81412 98.6335 1.86628C99.5273 1.86274 100.332 2.38077 100.656 3.1693C100.689 3.24179 100.752 3.29837 100.83 3.32489C100.909 3.35141 100.995 3.34787 101.069 3.31251L102.28 2.85636C102.43 2.7883 102.515 2.63448 102.486 2.47889C101.914 0.961942 100.375 -0.0325653 98.6751 0.016055C97.6929 -0.0758815 96.7152 0.229983 95.9833 0.857627C95.2522 1.48527 94.835 2.37723 94.8358 3.31251C94.8358 5.50131 96.6109 6.30929 98.1933 6.9997C99.4866 7.57341 100.615 8.06846 100.615 9.25391C100.627 9.71889 100.424 10.1653 100.059 10.4765C99.6934 10.7877 99.2028 10.9309 98.7157 10.8699C97.6187 10.9229 96.6268 10.2537 96.3219 9.25391C96.3042 9.17435 96.2485 9.10628 96.1707 9.0718C96.0938 9.03202 96.0001 9.03202 95.9232 9.0718L94.7121 9.56685C94.6343 9.59248 94.5715 9.64817 94.5397 9.72066C94.5079 9.79315 94.5105 9.87448 94.5468 9.94432C95.0816 11.6637 96.7833 12.8191 98.6742 12.7457C99.7235 12.8306 100.762 12.4911 101.533 11.8105C102.304 11.1307 102.734 10.1733 102.719 9.17523C102.679 6.96168 100.821 6.11481 99.2391 5.38462Z" fill="#73778C"/>
<path d="M108.288 2.73529C107.041 2.71319 105.84 3.23476 104.962 4.17887C104.084 5.12299 103.605 6.40922 103.636 7.73964C103.583 9.07714 104.054 10.3784 104.936 11.3305C105.818 12.2825 107.032 12.7997 108.287 12.7573C110.786 12.6194 112.745 10.4164 112.745 7.74672C112.745 5.07702 110.787 2.8732 108.288 2.73529ZM108.288 10.9053C107.091 10.9707 105.978 10.2529 105.476 9.09129C104.975 7.92971 105.187 6.5595 106.011 5.63218C106.836 4.70486 108.106 4.40606 109.219 4.87901C110.332 5.35195 111.063 6.50027 111.065 7.77943C111.119 8.60332 110.843 9.41307 110.307 10.0089C109.77 10.6047 109.023 10.93 108.249 10.9053H108.288Z" fill="#73778C"/>
<path d="M117.932 0.00986788C117.753 0.000143822 117.573 0.000143822 117.395 0.00986788C116.597 -0.0608525 115.813 0.260927 115.261 0.885035C114.708 1.50914 114.447 2.37016 114.549 3.22676V3.37174H113.938C113.784 3.385 113.663 3.52114 113.657 3.68821V4.80913C113.663 4.97621 113.784 5.11234 113.938 5.1256H114.549V12.4558C114.567 12.6202 114.69 12.7475 114.843 12.759H116.064C116.212 12.7413 116.329 12.6158 116.345 12.4558V5.1256H117.787C117.942 5.11234 118.062 4.97621 118.068 4.80913V3.68821C118.063 3.52114 117.942 3.385 117.787 3.37174H116.383V3.22676C116.383 1.90871 116.957 1.78937 117.495 1.78937C117.617 1.77788 117.74 1.77788 117.862 1.78937C117.95 1.80263 118.039 1.77346 118.106 1.7107C118.17 1.65058 118.21 1.56483 118.215 1.47378V0.313966C118.177 0.154845 118.067 0.00986788 117.932 0.00986788Z" fill="#73778C"/>
<path d="M124.485 10.9387C124.428 10.8751 124.347 10.845 124.268 10.8556H123.954C123.132 10.8556 122.745 10.6903 122.745 9.06288V4.69059H124.196C124.352 4.67733 124.475 4.53677 124.486 4.35997V3.14623C124.475 2.96943 124.351 2.82799 124.196 2.81562H122.745V1.24297C122.734 1.06617 122.61 0.92473 122.455 0.912354H121.247C121.094 0.926498 120.975 1.06882 120.969 1.24297V2.81562H120.329C120.173 2.82888 120.05 2.96943 120.039 3.14623V4.31842C120.05 4.49523 120.174 4.63667 120.329 4.64904H120.969V9.14509C120.969 12.11 122.384 12.7589 123.556 12.7589C123.991 12.7589 124.342 12.7589 124.342 12.7589C124.481 12.7333 124.586 12.6024 124.596 12.4415V11.173C124.574 11.0864 124.536 11.0068 124.485 10.9387Z" fill="#73778C"/>
<path d="M53.9896 28.2125L54.5499 26.7185H57.6843L58.2446 28.2125C58.2667 28.2705 58.3237 28.3094 58.3875 28.3094H59.052C59.1356 28.3094 59.204 28.2434 59.204 28.1626C59.204 28.145 59.201 28.1274 59.1941 28.1113L56.6801 21.6507C56.658 21.5935 56.601 21.5553 56.5379 21.5553H55.7062C55.6431 21.5553 55.5861 21.5935 55.5641 21.65L53.0401 28.1105C53.0105 28.1861 53.05 28.2712 53.1291 28.2999C53.1465 28.3065 53.164 28.3094 53.183 28.3094H53.8475C53.9106 28.3094 53.9676 28.2705 53.9896 28.2125ZM57.4213 26.0258H54.813L56.1175 22.5511L57.4213 26.0258ZM61.1761 28.1626V25.4695C61.1761 24.8707 61.3228 24.4172 61.6162 24.1083C61.9097 23.7993 62.3019 23.6445 62.7938 23.6445C63.2522 23.6445 63.6164 23.7847 63.8855 24.0643C64.1546 24.3438 64.2899 24.7474 64.2899 25.2743V28.1626C64.2899 28.2434 64.3584 28.3094 64.442 28.3094H65.0578C65.1414 28.3094 65.2098 28.2434 65.2098 28.1626V25.4695C65.2098 24.8707 65.3565 24.4172 65.65 24.1083C65.9434 23.7993 66.3327 23.6445 66.8177 23.6445C67.283 23.6445 67.6486 23.7847 67.9147 24.0643C68.1808 24.3438 68.3138 24.7474 68.3138 25.2743V28.1626C68.3138 28.2434 68.3822 28.3094 68.4659 28.3094H69.0816C69.1653 28.3094 69.2337 28.2434 69.2337 28.1626V25.1958C69.2337 24.4407 69.0368 23.8639 68.6422 23.4633C68.2477 23.0633 67.7269 22.863 67.08 22.863C66.6216 22.863 66.2103 22.9819 65.8461 23.2189C65.6036 23.3774 65.3436 23.6159 65.0677 23.9358C64.8039 23.6056 64.556 23.3635 64.3242 23.2094C63.9767 22.9782 63.5677 22.863 63.0956 22.863C62.6441 22.863 62.2449 22.9753 61.8975 23.1998C61.6664 23.3495 61.4254 23.5264 61.1745 23.7304V23.0971C61.1745 23.0164 61.1061 22.9503 61.0225 22.9503H60.4067C60.3231 22.9503 60.2547 23.0164 60.2547 23.0971V28.1619C60.2547 28.2426 60.3231 28.3087 60.4067 28.3087H61.0225C61.1076 28.3094 61.1761 28.2434 61.1761 28.1626ZM71.6345 30.7002V27.2366C71.9006 27.558 72.1583 27.8067 72.4076 27.9821C72.7817 28.2456 73.2386 28.3776 73.7776 28.3776C74.2694 28.3776 74.7081 28.2668 75.092 28.046C75.4759 27.8251 75.7777 27.5073 75.9967 27.0942C76.2156 26.6811 76.3251 26.1945 76.3251 25.6354C76.3251 25.0755 76.2156 24.5875 75.9967 24.1714C75.7777 23.7553 75.4759 23.4361 75.092 23.2152C74.7081 22.9944 74.2694 22.8835 73.7776 22.8835C73.2386 22.8835 72.7817 23.0156 72.4076 23.2791C72.1583 23.4545 71.9006 23.7032 71.6345 24.0246V23.0986C71.6345 23.0178 71.5661 22.9518 71.4824 22.9518H70.8667C70.783 22.9518 70.7146 23.0178 70.7146 23.0986V30.7009C70.7146 30.7816 70.783 30.8477 70.8667 30.8477H71.4824C71.5661 30.847 71.6345 30.7809 71.6345 30.7002ZM73.5145 27.5969C73.1572 27.5969 72.8334 27.5154 72.5437 27.3525C72.2541 27.1896 72.0283 26.9606 71.8664 26.6642C71.7044 26.3685 71.6238 26.025 71.6238 25.6346C71.6238 25.2442 71.7044 24.8993 71.8664 24.5999C72.0283 24.3005 72.2541 24.0716 72.5437 23.9116C72.8334 23.7524 73.1572 23.6724 73.5145 23.6724C74.0877 23.6724 74.5439 23.8463 74.8844 24.1949C75.225 24.5427 75.3953 25.0226 75.3953 25.6346C75.3953 26.2466 75.225 26.7258 74.8844 27.0744C74.5446 27.4229 74.0877 27.5969 73.5145 27.5969ZM78.5031 28.1626V21.2339C78.5031 21.1532 78.4347 21.0872 78.3511 21.0872H77.7353C77.6517 21.0872 77.5833 21.1532 77.5833 21.2339V28.1626C77.5833 28.2434 77.6517 28.3094 77.7353 28.3094H78.3511C78.4347 28.3094 78.5031 28.2434 78.5031 28.1626ZM80.498 21.9266C80.6865 21.9266 80.8385 21.876 80.9526 21.7755C81.0666 21.6749 81.1244 21.5429 81.1244 21.3799C81.1244 21.217 81.0674 21.0857 80.9526 20.9844C80.8378 20.8832 80.6865 20.8333 80.498 20.8333C80.3094 20.8333 80.1574 20.8839 80.0426 20.9844C79.9278 21.085 79.8708 21.217 79.8708 21.3799C79.8708 21.5429 79.9278 21.6742 80.0426 21.7755C80.1574 21.8767 80.3094 21.9266 80.498 21.9266ZM80.9533 28.1626V23.0978C80.9533 23.0171 80.8849 22.9511 80.8013 22.9511H80.1855C80.1019 22.9511 80.0335 23.0171 80.0335 23.0978V28.1626C80.0335 28.2434 80.1019 28.3094 80.1855 28.3094H80.8013C80.8849 28.3094 80.9533 28.2434 80.9533 28.1626ZM83.6255 28.1626V23.7318H84.7879C84.8715 23.7318 84.94 23.6658 84.94 23.5851V23.0978C84.94 23.0171 84.8715 22.9511 84.7879 22.9511H83.6255V22.805C83.6255 22.3889 83.7213 22.0962 83.9137 21.9266C84.0307 21.8232 84.328 21.7461 84.8046 21.6962C84.8814 21.6882 84.94 21.625 84.94 21.5502V20.9022C83.4499 20.8435 82.7057 21.4555 82.7057 22.7368V22.9518H82.0587C81.9751 22.9518 81.9067 23.0178 81.9067 23.0986V23.5858C81.9067 23.6665 81.9751 23.7326 82.0587 23.7326H82.7057V28.1634C82.7057 28.2441 82.7741 28.3101 82.8577 28.3101H83.4735C83.5579 28.3094 83.6255 28.2434 83.6255 28.1626ZM87.6106 30.7545L90.7846 23.1521C90.8157 23.0773 90.7785 22.9914 90.7002 22.9613C90.6819 22.954 90.6629 22.9511 90.6432 22.9511H89.9521C89.889 22.9511 89.8328 22.9885 89.81 23.0457L88.1793 27.1676L86.4186 23.0421C86.395 22.987 86.3395 22.9511 86.278 22.9511H85.5785C85.4949 22.9511 85.4265 23.0171 85.4265 23.0978C85.4265 23.1176 85.4303 23.1374 85.4387 23.1558L87.6836 28.2213L86.6208 30.6429C86.5881 30.7178 86.6239 30.8037 86.7014 30.8352C86.7204 30.8425 86.7402 30.847 86.7607 30.847H87.47C87.5316 30.847 87.5878 30.8103 87.6106 30.7545ZM96.5783 28.3094C97.3666 28.3094 98.0425 28.1678 98.6058 27.8845C99.1683 27.6013 99.5948 27.2013 99.8845 26.684C100.174 26.1667 100.319 25.5598 100.319 24.8641C100.319 24.1611 100.174 23.5513 99.8845 23.034C99.5948 22.5166 99.1683 22.1196 98.6058 21.843C98.0432 21.5663 97.3674 21.4284 96.5783 21.4284H94.3135V28.3087H96.5783V28.3094ZM96.5076 27.5088H95.2334V22.2092H96.5076C97.4442 22.2092 98.1573 22.4418 98.6461 22.907C99.1349 23.3723 99.3789 24.0246 99.3789 24.8641C99.3789 25.7036 99.1326 26.3538 98.6408 26.8161C98.1489 27.2777 97.4373 27.5088 96.5076 27.5088ZM102.082 21.9266C102.27 21.9266 102.422 21.876 102.536 21.7755C102.651 21.6749 102.708 21.5429 102.708 21.3799C102.708 21.217 102.651 21.0857 102.536 20.9844C102.421 20.8839 102.27 20.8333 102.082 20.8333C101.893 20.8333 101.741 20.8839 101.627 20.9844C101.513 21.085 101.455 21.217 101.455 21.3799C101.455 21.5429 101.512 21.6742 101.627 21.7755C101.742 21.8767 101.893 21.9266 102.082 21.9266ZM102.537 28.3094V22.9511H101.617V28.3094H102.537ZM106.817 30.9343C107.336 30.9343 107.791 30.8271 108.182 30.6121C108.573 30.3971 108.876 30.0985 109.092 29.7139C109.308 29.3301 109.416 28.8906 109.416 28.396V22.9503H108.496V24.0965C108.223 23.7208 107.962 23.4456 107.713 23.2725C107.338 23.012 106.882 22.8821 106.343 22.8821C105.851 22.8821 105.412 22.9929 105.028 23.2138C104.644 23.4346 104.342 23.7539 104.124 24.1699C103.905 24.586 103.795 25.074 103.795 25.6339C103.795 26.1938 103.905 26.6796 104.124 27.0927C104.342 27.5059 104.644 27.8229 105.028 28.0445C105.412 28.2654 105.851 28.3762 106.343 28.3762C106.882 28.3762 107.338 28.2463 107.713 27.9858C107.962 27.8126 108.223 27.5374 108.496 27.1617V28.396C108.496 28.9493 108.333 29.38 108.006 29.689C107.679 29.9979 107.266 30.1528 106.768 30.1528C106.295 30.1528 105.91 30.05 105.61 29.8453C105.309 29.6406 105.106 29.3588 104.998 29.0014H104.087C104.215 29.5936 104.515 30.0632 104.987 30.4118C105.458 30.7604 106.069 30.9343 106.817 30.9343ZM106.605 27.5969C106.039 27.5969 105.585 27.4229 105.245 27.0744C104.904 26.7266 104.734 26.2466 104.734 25.6346C104.734 25.0226 104.904 24.5434 105.245 24.1949C105.585 23.847 106.039 23.6724 106.605 23.6724C106.969 23.6724 107.294 23.7524 107.58 23.9116C107.867 24.0709 108.091 24.3005 108.252 24.5999C108.414 24.8993 108.495 25.2442 108.495 25.6346C108.495 26.025 108.414 26.3685 108.252 26.6642C108.09 26.9599 107.866 27.1896 107.58 27.3525C107.294 27.5154 106.969 27.5969 106.605 27.5969ZM111.4 21.9266C111.589 21.9266 111.741 21.876 111.855 21.7755C111.97 21.6749 112.027 21.5429 112.027 21.3799C112.027 21.217 111.97 21.0857 111.855 20.9844C111.74 20.8839 111.589 20.8333 111.4 20.8333C111.212 20.8333 111.06 20.8839 110.946 20.9844C110.832 21.085 110.774 21.217 110.774 21.3799C110.774 21.5429 110.831 21.6742 110.946 21.7755C111.061 21.8767 111.212 21.9266 111.4 21.9266ZM111.856 28.3094V22.9511H110.936V28.3094H111.856ZM116.035 28.3094V27.5286H115.468C115.144 27.5286 114.917 27.4655 114.786 27.3386C114.654 27.2116 114.589 26.9761 114.589 26.6312V23.723H116.025V22.9518H114.589V21.614H113.658V22.9511H112.83V23.7223H113.659V26.6113C113.659 27.2226 113.799 27.6592 114.079 27.919C114.358 28.1795 114.781 28.3094 115.347 28.3094H116.035V28.3094ZM119.486 28.3776C120.025 28.3776 120.482 28.2478 120.856 27.9873C121.105 27.8141 121.367 27.5881 121.64 27.3099V28.3094H122.56V22.9511H121.64V24.0239C121.367 23.6966 121.105 23.4464 120.856 23.2732C120.482 23.0127 120.025 22.8828 119.486 22.8828C118.994 22.8828 118.556 22.9936 118.172 23.2145C117.788 23.4354 117.486 23.7546 117.267 24.1707C117.048 24.5867 116.939 25.0747 116.939 25.6346C116.939 26.1945 117.048 26.6803 117.267 27.0935C117.486 27.5066 117.788 27.8236 118.172 28.0452C118.556 28.2668 118.994 28.3776 119.486 28.3776ZM119.749 27.5969C119.183 27.5969 118.73 27.4229 118.389 27.0744C118.049 26.7258 117.878 26.2466 117.878 25.6346C117.878 25.0226 118.049 24.5434 118.389 24.1949C118.73 23.847 119.183 23.6724 119.749 23.6724C120.113 23.6724 120.439 23.7524 120.725 23.9116C121.011 24.0709 121.235 24.3005 121.397 24.5999C121.558 24.8993 121.639 25.2442 121.639 25.6346C121.639 26.025 121.559 26.3685 121.397 26.6642C121.235 26.9599 121.01 27.1896 120.725 27.3525C120.438 27.5154 120.113 27.5969 119.749 27.5969ZM125 28.3094V21.0872H124.08V28.3094H125Z" fill="#73778C"/>
</svg>
