[{"ExhibitionId":3311,"Title":"Jitter Basics - Teil 2","Description":"Im zweiten Teil dieses Grundlagenkurs behandeln wir Themen wie Jitter-Messungen an Taktsignalen, Zyklus-zu-Zyklus-Jitter versus Perioden-Jitter und die spektrale Betrachtung von Jitter-Komponenten.","TypeId":4,"TypeName":"Webinars","CountryId":70,"Country":"Germany","RegionId":2,"Region":"Europe","State":"","City":"","Address":"","ExhibitionStartDate":"2021-10-06T10:00:00","ExhibitionEndDate":"2021-10-06T11:00:00","Url":"https://go.teledynelecroy.com/l/48392/2021-09-21/89pvd8","Logo":"/images/events/webinar-icon.png","TimeZone":"","Archived":"N","ArchiveUrl":"","EventCategories":""
}
,{"ExhibitionId":3313,"Title":"Utilizzare correttamente un oscilloscopio - Parte I","Description":"Tre appuntamenti consecutivi per imparare ad ottenere la massima accuratezza e precisione dei risultati di misura, con la massima efficienza nell'uso del tuo oscilloscopio.Durante la prima giornata verrà discusso lo schema a blocchi di un oscilloscopio e come comprenderne i limiti.","TypeId":4,"TypeName":"Webinars","CountryId":97,"Country":"Italy","RegionId":2,"Region":"Europe","State":"","City":"","Address":"","ExhibitionStartDate":"2021-10-06T15:00:00","ExhibitionEndDate":"2021-10-06T16:00:00","Url":"https://go.teledynelecroy.com/l/48392/2021-09-21/89pvz6","Logo":"/images/events/webinar-icon.png","TimeZone":"","Archived":"N","ArchiveUrl":"","EventCategories":""},
    {"ExhibitionId":3312,"Title":"Jitter Basics - Teil 3","Description":"Der dritte und letzte Teil der Webinar Serie befasst sich u.a. mit Jitter-Messungen in seriellen Datensystemen, Time Intervall Error und Taktrückgewinnung (Wiederherstellung des Referenztaktes)","TypeId":4,"TypeName":"Webinars","CountryId":70,"Country":"Germany","RegionId":2,"Region":"Europe","State":"","City":"","Address":"","ExhibitionStartDate":"2021-10-07T10:00:00","ExhibitionEndDate":"2021-10-07T11:00:00","Url":"https://go.teledynelecroy.com/l/48392/2021-09-21/89pvdb","Logo":"/images/events/webinar-icon.png","TimeZone":"","Archived":"N","ArchiveUrl":"","EventCategories":""},
    {"ExhibitionId":3314,"Title":"Utilizzare correttamente un oscilloscopio - Parte II","Description":"Durante la seconda giornata si vedrà come eseguire una corretta acquisizione e analisi di un segnale secondo gli standard vigenti.","TypeId":4,"TypeName":"Webinars","CountryId":97,"Country":"Italy","RegionId":2,"Region":"Europe","State":"","City":"","Address":"","ExhibitionStartDate":"2021-10-07T15:00:00","ExhibitionEndDate":"2021-10-07T16:00:00","Url":"https://go.teledynelecroy.com/l/48392/2021-09-22/89rkdv","Logo":"/images/events/webinar-icon.png","TimeZone":"","Archived":"N","ArchiveUrl":"","EventCategories":""},
    {"ExhibitionId":3315,"Title":"Utilizzare correttamente un oscilloscopio - Parte III","Description":"Durante la terza giornata verrà spiegato il corretto significato di rumore e dinamica di un oscilloscopio.","TypeId":4,"TypeName":"Webinars","CountryId":97,"Country":"Italy","RegionId":2,"Region":"Europe","State":"","City":"","Address":"","ExhibitionStartDate":"2021-10-08T15:00:00","ExhibitionEndDate":"2021-10-08T16:00:00","Url":"https://go.teledynelecroy.com/l/48392/2021-09-22/89rkdx","Logo":"/images/events/webinar-icon.png","TimeZone":"","Archived":"N","ArchiveUrl":"","EventCategories":""},
    {"ExhibitionId":2997,"Title":"Fibre Channel Protocol","Description":"Please join Teledyne LeCroy’s Austin Labs to investigate the inner workings of the Fibre Channel Protocol.","TypeId":5,"TypeName":"Training","CountryId":208,"Country":"United States","RegionId":3,"Region":"Japan","State":"","City":"","Address":"","ExhibitionStartDate":"2021-10-12T09:00:00","ExhibitionEndDate":"2021-10-15T16:30:00","Url":"https://go.teledynelecroy.com/l/48392/2021-01-14/8482yr","Logo":"/images/events/vtraining-icon.png","TimeZone":"","Archived":"N","ArchiveUrl":"","EventCategories":"Protocol Analyzers"},
    {"ExhibitionId":3298,"Title":"High-Performance Digitizer Basics","Description":"Join Teledyne SP Devices for part 2 in a three-part introductory webinar series on high-performance digitizers.","TypeId":4,"TypeName":"Webinars","CountryId":208,"Country":"United States","RegionId":3,"Region":"Japan","State":"","City":"","Address":"","ExhibitionStartDate":"2021-10-12T13:00:00","ExhibitionEndDate":"2021-10-12T14:00:00","Url":"https://go.teledynelecroy.com/l/48392/2021-08-25/891z8t?utm_source=lecroy&utm_medium=referral&utm_campaign=digitizer_basics_part_2&utm_content=21w41","Logo":"/images/events/webinar-icon.png","TimeZone":"","Archived":"N","ArchiveUrl":"","EventCategories":""},
    {"ExhibitionId":3319,"Title":"Advanced Oscilloscope Customization - Create a Scope Plug-In","Description":"During this webinar we will learn how to program an oscilloscope locally and create a custom graphical user interface in VB or C# with Microsoft VisualStudio.","TypeId":4,"TypeName":"Webinars","CountryId":207,"Country":"United Kingdom","RegionId":2,"Region":"Europe","State":"","City":"","Address":"","ExhibitionStartDate":"2021-10-13T10:00:00","ExhibitionEndDate":"2021-10-13T11:00:00","Url":"https://go.teledynelecroy.com/l/48392/2021-09-27/89tzx6","Logo":"/images/events/webinar-icon.png","TimeZone":"","Archived":"N","ArchiveUrl":"","EventCategories":""},
    {"ExhibitionId":3323,"Title":"How to Save Results and Data on Teledyne LeCroy Oscilloscopes","Description":"Leverage the full power of your Teledyne LeCroy oscilloscope to save results and data for use/analysis in other software applications, or for recall into your or a colleague’s Teledyne LeCroy oscilloscope or Teledyne LeCroy’s MAUI® Studio Pro.","TypeId":4,"TypeName":"Webinars","CountryId":208,"Country":"United States","RegionId":3,"Region":"Japan","State":"","City":"","Address":"","ExhibitionStartDate":"2021-10-13T14:00:00","ExhibitionEndDate":"2021-10-13T15:00:00","Url":"https://go.teledynelecroy.com/l/48392/2021-09-24/89tsg6","Logo":"/images/events/webinar-icon.png","TimeZone":"","Archived":"N","ArchiveUrl":"","EventCategories":"Oscilloscopes"},
    {"ExhibitionId":3317,"Title":"Qualification de signaux rapides - défis & méthodes","Description":"Ce webinaire montre l’ensemble des outils nécessaires à la validation de liens séries rapides (Diagramme de l’œil, Jitter, etc).","TypeId":4,"TypeName":"Webinars","CountryId":65,"Country":"France","RegionId":2,"Region":"Europe","State":"","City":"","Address":"","ExhibitionStartDate":"2021-10-14T11:00:00","ExhibitionEndDate":"2021-10-14T00:00:00","Url":"https://go.teledynelecroy.com/l/48392/2021-09-07/89d9jr","Logo":"/images/events/webinar-icon.png","TimeZone":"","Archived":"N","ArchiveUrl":"","EventCategories":""},
    {"ExhibitionId":3300,"Title":"USB Type-C®技術網路研討會系列：USB4™/TBT4和USB3.2相容性測試概覽","Description":"","TypeId":4,"TypeName":"Webinars","CountryId":41,"Country":"China","RegionId":4,"Region":"Korea","State":"","City":"","Address":"","ExhibitionStartDate":"2021-10-14T18:00:00","ExhibitionEndDate":"2021-10-14T19:00:00","Url":"https://go.teledynelecroy.com/l/48392/2021-09-09/89frjb","Logo":"/images/events/webinar-icon.png","TimeZone":"","Archived":"N","ArchiveUrl":"","EventCategories":""},
    {"ExhibitionId":3268,"Title":"The Engineering Design Show","Description":"EDS provides visitors with unrivalled access to expert speakers exploring best practice, new design techniques and industry issues.","TypeId":2,"TypeName":"Trade Shows","CountryId":207,"Country":"United Kingdom","RegionId":2,"Region":"Europe","State":"","City":"Coventry","Address":"Booth J17\r\nRicoh Arena, Judds Lane, Longford\r\nCV6 6AQ","ExhibitionStartDate":"2021-10-19T09:00:00","ExhibitionEndDate":"2021-10-20T18:00:00","Url":"https://www.engineeringdesignshows.co.uk/","Logo":"/images/events/exhibition_3268.png","TimeZone":"","Archived":"N","ArchiveUrl":"","EventCategories":""},
    {"ExhibitionId":3316,"Title":"How to use TDR for instant highly accurate Impedance measurements","Description":"During the webinar we will explore how to use the TDR for accurate impedance measurements, comparing measurements with and without calibration.","TypeId":4,"TypeName":"Webinars","CountryId":207,"Country":"United Kingdom","RegionId":2,"Region":"Europe","State":"","City":"","Address":"","ExhibitionStartDate":"2021-10-19T15:00:00","ExhibitionEndDate":"2021-10-19T16:00:00","Url":"https://go.teledynelecroy.com/l/48392/2021-09-21/89pvrv","Logo":"/images/events/webinar-icon.png","TimeZone":"","Archived":"N","ArchiveUrl":"","EventCategories":""},
    {"ExhibitionId":3324,"Title":"How to Optimize Your Oscilloscope for Basic EMC/ESD Pulse Measurements","Description":"Part 1: How to Get the Most Out of Your EMC-EMI Lab Oscilloscope Join us for an overview of the basic EMC/ESD pulse definitions with practical best practice measurement examples using the oscilloscope measurement and analysis tools. Several real-world application examples are also provided and explained.","TypeId":4,"TypeName":"Webinars","CountryId":208,"Country":"United States","RegionId":3,"Region":"Japan","State":"","City":"","Address":"","ExhibitionStartDate":"2021-10-20T14:00:00",
        "ExhibitionEndDate":"2021-10-20T15:00:00","Url":"https://go.teledynelecroy.com/l/48392/2021-09-28/89x46p","Logo":"/images/events/webinar-icon.png","TimeZone":"","Archived":"N","ArchiveUrl":"","EventCategories":"Oscilloscopes"},
    {"ExhibitionId":3318,"Title":"Hi-Res versus Hi-Def: Explaining the Differences","Description":"Digital scopes are going through a technology change, increasing the number of vertical DAC bits from 8 to 10 or even 12. In some cases this can be achieved using oversampling or digital post processing instead of a real 10 or 12 bit ADC. In this webinar we will explain the differences between High Definition and High Resolution and the benefits of these two technologies.","TypeId":4,"TypeName":"Webinars","CountryId":207,"Country":"United Kingdom","RegionId":2,"Region":"Europe","State":"","City":"","Address":"","ExhibitionStartDate":"2021-10-20T15:00:00","ExhibitionEndDate":"2021-10-20T16:00:00","Url":"https://go.teledynelecroy.com/l/48392/2021-09-22/89rkrx","Logo":"/images/events/webinar-icon.png","TimeZone":"","Archived":"N","ArchiveUrl":"","EventCategories":""},
    {"ExhibitionId":3326,"Title":"Essentials of HDMI 2.1 Fixed Rate Link (FRL) Protocols","Description":"In the first of this four-part series, this webinar will provide an overview of the HDMI 2.1 Fixed Rate Link (FRL) main link protocols. The webinar will also discuss FRL link training over the DDC channel. A brief discussion of compliance testing for FRL will also be provided. Developers and test engineers in R & D departments will find this webinar useful.","TypeId":4,"TypeName":"Webinars","CountryId":207,"Country":"United Kingdom","RegionId":2,"Region":"Europe","State":"","City":"","Address":"","ExhibitionStartDate":"2021-10-21T14:00:00","ExhibitionEndDate":"2021-10-21T15:00:00","Url":"https://go.teledynelecroy.com/l/48392/2021-09-30/8b2rhf","Logo":"/images/events/webinar-icon.png","TimeZone":"","Archived":"N","ArchiveUrl":"","EventCategories":""},
    {"ExhibitionId":2998,"Title":"Intro to USB - 1.0 through 3.2","Description":"Please join Teledyne LeCroy's Austin Labs, for a virtual training class -- Intro to USB - 1.0 through 3.2.","TypeId":5,"TypeName":"Training","CountryId":91,"Country":"India","RegionId":4,"Region":"Korea","State":"","City":"","Address":"","ExhibitionStartDate":"2021-10-25T01:30:00","ExhibitionEndDate":"2021-10-25T20:00:00","Url":"https://go.teledynelecroy.com/l/48392/2021-01-14/8482z5","Logo":"/images/events/vtraining-icon.png","TimeZone":"","Archived":"N","ArchiveUrl":"","EventCategories":"Protocol Analyzers"},
    {"ExhibitionId":3334,"Title":"Advanced Oscilloscope Customization - Create your Custom Processing Function in C++","Description":"Processing speed is often very important, especially when lots of data has to be processed. Normal transfer rate over 1GBE is less than 100Mbyte/s. Transferring 256 Ms from one oscilloscope to an external PC may take several seconds. An oscilloscope like the LabMaster in that time can process the data, instead of transferring it to another PC. We will show here how to write in C++ a function which will directly access the acquisition memory, and implement your own math function.","TypeId":4,"TypeName":"Webinars","CountryId":207,"Country":"United Kingdom","RegionId":2,"Region":"Europe","State":"","City":"","Address":"","ExhibitionStartDate":"2021-10-26T10:00:00","ExhibitionEndDate":"2021-10-26T11:00:00","Url":"https://go.teledynelecroy.com/l/48392/2021-09-28/89wcfm","Logo":"/images/events/webinar-icon.png","TimeZone":"","Archived":"N","ArchiveUrl":"","EventCategories":""},
    {"ExhibitionId":3170,"Title":"Real-time Spectral Analysis of Power Rails","Description":" Part 6: How to Become an Expert in Power Integrity Testing \r\nIn this webinar Dr. Eric Bogatin will explain and demonstrate how transforming acquired time-domain signals into the frequency domain will get you to the right answer faster, extract the important figures of merit of the signal, and help you find the root cause of a problem.","TypeId":4,"TypeName":"Webinars","CountryId":208,"Country":"United States","RegionId":3,"Region":"Japan","State":"NY","City":"","Address":"","ExhibitionStartDate":"2021-10-26T14:00:00",
        "ExhibitionEndDate":"2021-10-26T15:00:00","Url":"https://go.teledynelecroy.com/l/48392/2021-05-03/873cgb","Logo":"/images/events/webinar-icon.png","TimeZone":"","Archived":"N","ArchiveUrl":"","EventCategories":"Oscilloscopes"},
    {"ExhibitionId":3301,"Title":"USB Type-C®技術網路研討會系列：DisplayPort™ 2.0/1.4b相容性測試概覽","Description":" ","TypeId":4,"TypeName":"Webinars","CountryId":41,"Country":"China","RegionId":4,"Region":"Korea","State":"","City":"","Address":"","ExhibitionStartDate":"2021-10-27T02:00:00","ExhibitionEndDate":"2021-10-27T03:00:00","Url":"https://go.teledynelecroy.com/l/48392/2021-09-09/89frjz","Logo":"/images/events/webinar-icon.png","TimeZone":"","Archived":"N","ArchiveUrl":"","EventCategories":""},
    {"ExhibitionId":3335,"Title":"Power Conversion and Motor Drive Measurements","Description":"In this webinar we will cover technical aspects of electrical measurements on: 3 phase motor drivers, power conversion circuits, dynamic behavior and efficiency, DC-DC converters and ripple analysis.","TypeId":4,"TypeName":"Webinars","CountryId":207,"Country":"United Kingdom","RegionId":2,"Region":"Europe","State":"","City":"","Address":"","ExhibitionStartDate":"2021-10-27T10:00:00","ExhibitionEndDate":"2021-10-27T11:00:00","Url":"https://go.teledynelecroy.com/l/48392/2021-09-28/89wf31","Logo":"/images/events/webinar-icon.png","TimeZone":"","Archived":"N","ArchiveUrl":"","EventCategories":""},
    {"ExhibitionId":3329,"Title":"Essentials of HDMI 2.1 Display Stream Compression (DSC) Protocols","Description":"In the second of this four-part series, this webinar will provide an overview of the HDMI 2.1 Display Stream Compression (DSC) main link protocols. The webinar will also discuss how DSC is enabled during transactions over the DDC channel. A brief discussion of compliance testing for DSC will also be provided. Developers and test engineers in R & D departments will find this webinar useful.","TypeId":4,"TypeName":"Webinars","CountryId":207,"Country":"United Kingdom","RegionId":2,"Region":"Europe","State":"","City":"","Address":"","ExhibitionStartDate":"2021-10-27T14:00:00","ExhibitionEndDate":"2021-10-27T15:00:00","Url":"https://go.teledynelecroy.com/l/48392/2021-10-04/8b32r1","Logo":"/images/events/webinar-icon.png","TimeZone":"","Archived":"N","ArchiveUrl":"","EventCategories":""},
    {"ExhibitionId":2999,"Title":"PCIe® Architecture & Functionality","Description":"Please join Teledyne LeCroy's Austin Labs, for a one-day intensive course to learn the architectural and functional ins and outs of PCIe, with guided walk-throughs of example traces.","TypeId":5,"TypeName":"Training","CountryId":207,"Country":"United Kingdom","RegionId":2,"Region":"Europe","State":"","City":"","Address":"","ExhibitionStartDate":"2021-10-28T09:00:00","ExhibitionEndDate":"2021-10-28T16:30:00","Url":"https://go.teledynelecroy.com/l/48392/2021-01-14/8482zf","Logo":"/images/events/vtraining-icon.png","TimeZone":"","Archived":"N","ArchiveUrl":"","EventCategories":"Protocol Analyzers"},
    {"ExhibitionId":3251,"Title":"Oscilloscope Coffee Break Series - Part 10: Measuring Transient Response Droop Level","Description":"In this session we will discuss the best practices and techniques for measuring a power supply’s response to transient events.","TypeId":4,"TypeName":"Webinars","CountryId":208,"Country":"United States","RegionId":3,"Region":"Japan","State":"NY","City":"","Address":"","ExhibitionStartDate":"2021-10-28T14:00:00","ExhibitionEndDate":"2021-10-28T14:30:00","Url":"https://go.teledynelecroy.com/l/48392/2021-06-18/88hbfw","Logo":"/images/events/webinar-icon.png","TimeZone":"","Archived":"N","ArchiveUrl":"","EventCategories":"Oscilloscopes"},
    {"ExhibitionId":2901,"Title":"Internet of Things World 2021","Description":"The global conference & exhibition where strategists, technologists, developers and implementers connect, putting IoT into action across industry verticals.","TypeId":2,"TypeName":"Trade Shows","CountryId":208,"Country":"United States","RegionId":3,"Region":"Japan","State":"CA","City":"Santa Clara","Address":"Santa Clara Convention Center\r\n5001 Great American Pkwy","ExhibitionStartDate":"2021-11-02T09:00:00","ExhibitionEndDate":"2021-11-04T15:00:00","Url":"https://tmt.knect365.com/iot-world/","Logo":"/images/events/exhibition_2901.png","TimeZone":"","Archived":"N","ArchiveUrl":"","EventCategories":""},
    {"ExhibitionId":3330,"Title":"Essentials of HDMI 2.1 Forward Error Correction (FEC) Protocols","Description":"In the third of this four-part series, this webinar will provide an overview of the HDMI 2.1 Forward Error Correction (FEC) main link protocols. The webinar will also discuss how FEC is enable during transactions over the DDC channel. A brief discussion of compliance testing for FEC will also be provided. Developers and test engineers in R & D departments will find this webinar useful.","TypeId":4,"TypeName":"Webinars","CountryId":207,"Country":"United Kingdom","RegionId":2,"Region":"Europe","State":"","City":"","Address":"","ExhibitionStartDate":"2021-11-02T14:00:00","ExhibitionEndDate":"2021-11-02T15:00:00","Url":"https://go.teledynelecroy.com/l/48392/2021-10-04/8b32r3","Logo":"/images/events/webinar-icon.png","TimeZone":"","Archived":"N","ArchiveUrl":"","EventCategories":""},
    {"ExhibitionId":3336,"Title":"DDR Probing - Tips and Tricks","Description":"When DDR testing, the most difficult part is probing. In this webinar we will provide some suggestions to help design engineers to probe DDR signals correctly and to figure out if what we see on the scope is effectively the correct signal. We will also explain why reflections often degrade the DDR signals, and how to compensate for this.","TypeId":4,"TypeName":"Webinars","CountryId":208,"Country":"United States","RegionId":3,"Region":"Japan","State":"","City":"","Address":"","ExhibitionStartDate":"2021-11-03T15:00:00","ExhibitionEndDate":"2021-11-03T16:00:00","Url":"https://go.teledynelecroy.com/l/48392/2021-09-29/89y13y","Logo":"/images/events/webinar-icon.png","TimeZone":"","Archived":"N","ArchiveUrl":"","EventCategories":""},
    {"ExhibitionId":3001,"Title":"PCIe® Gen5","Description":"Please join Teledyne LeCroy's Austin Labs, for a virtual training class -- an in-depth examination of the PCIe bus architecture and protocol layers.","TypeId":5,"TypeName":"Training","CountryId":208,"Country":"United States","RegionId":3,"Region":"Japan","State":"","City":"","Address":"","ExhibitionStartDate":"2021-11-09T09:00:00","ExhibitionEndDate":"2021-11-12T16:30:00","Url":"https://go.teledynelecroy.com/l/48392/2021-01-14/8482zy","Logo":"/images/events/vtraining-icon.png","TimeZone":"","Archived":"N","ArchiveUrl":"","EventCategories":"Protocol Analyzers"},
    {"ExhibitionId":3325,"Title":"Advanced EMC/EMI Pulse Measurement Techniques and Examples","Description":"Part 2: How to Get the Most Out of Your EMC-EMI Lab Oscilloscope Join us as we provide techniques and examples for measuring and debugging Electrical Fast Transient (EFT) and other complex measurement examples, including damped sinusoid, multiple bursts, and momentary power interruption.","TypeId":4,"TypeName":"Webinars","CountryId":208,"Country":"United States","RegionId":3,"Region":"Japan","State":"","City":"","Address":"","ExhibitionStartDate":"2021-11-09T14:00:00",
        "ExhibitionEndDate":"2021-11-09T15:00:00","Url":"https://go.teledynelecroy.com/l/48392/2021-09-28/89x49f","Logo":"/images/events/webinar-icon.png","TimeZone":"","Archived":"N","ArchiveUrl":"","EventCategories":"Automotive"},
    {"ExhibitionId":3337,"Title":"DisplayPort 2.0 Protocol Compliance Test Overview","Description":" Part 1: Compliance Test Overview Webinar Series \r\nIn this webinar we will review the new DisplayPort 2.0 protocols operating at the UHBR rates up to 20G using the new 128b/132b line coding. This webinar will be of interest to engineers developing DisplayPort 2.0 products and devices.","TypeId":4,"TypeName":"Webinars","CountryId":208,"Country":"United States","RegionId":3,"Region":"Japan","State":"NY","City":"","Address":"","ExhibitionStartDate":"2021-11-10T14:00:00",
        "ExhibitionEndDate":"2021-11-10T15:00:00","Url":"https://go.teledynelecroy.com/l/48392/2021-09-29/89y3lc","Logo":"/images/events/webinar-icon.png","TimeZone":"","Archived":"N","ArchiveUrl":"","EventCategories":"Protocol Analyzers"},
    {"ExhibitionId":3302,"Title":"USB Type-C®技術網路研討會系列：USB-C®技術之除錯技巧","Description":" ","TypeId":4,"TypeName":"Webinars","CountryId":41,"Country":"China","RegionId":4,"Region":"Korea","State":"","City":"","Address":"","ExhibitionStartDate":"2021-11-11T02:00:00","ExhibitionEndDate":"2021-11-11T03:00:00","Url":"https://go.teledynelecroy.com/l/48392/2021-09-09/89frk6","Logo":"/images/events/webinar-icon.png","TimeZone":"","Archived":"N","ArchiveUrl":"","EventCategories":""},
    {"ExhibitionId":3338,"Title":"DisplayPort 2.0 PHY Compliance Test Overview","Description":" Part 2: Compliance Test Overview Webinar Series \r\nIn this webinar we will review the latest PHY test requirements DisplayPort 2.0. Source and Sink test updates and new VESA compliance program requirements.","TypeId":4,"TypeName":"Webinars","CountryId":208,"Country":"United States","RegionId":3,"Region":"Japan","State":"","City":"","Address":"","ExhibitionStartDate":"2021-11-11T14:00:00","ExhibitionEndDate":"2021-11-11T15:00:00","Url":"https://go.teledynelecroy.com/l/48392/2021-09-30/8b2rj5","Logo":"/images/events/webinar-icon.png","TimeZone":"","Archived":"N","ArchiveUrl":"","EventCategories":"Oscilloscopes"},
    {"ExhibitionId":3035,"Title":"SC21","Description":"SC provides the leading technical program for professionals and students in the HPC community, as measured by impact, at the highest academic and professional standards.","TypeId":2,"TypeName":"Trade Shows","CountryId":208,"Country":"United States","RegionId":3,"Region":"Japan","State":"MO","City":"St. Louis","Address":"701 Convention Plaza, Suite 300","ExhibitionStartDate":"2021-11-14T09:00:00","ExhibitionEndDate":"2021-11-19T17:00:00","Url":"https://sc21.supercomputing.org/","Logo":"/images/events/exhibition_3029.png","TimeZone":"","Archived":"N","ArchiveUrl":"","EventCategories":""},
    {"ExhibitionId":3171,"Title":"Don’t Let Ground Bounce Ruin Your Day","Description":" Part 7: How to Become an Expert in Power Integrity Testing \r\nIn this webinar Dr. Eric Bogatin looks at the principles behind the root cause of ground bounce, how we can measure the ground bounce in your system, and based on the root cause, how we can design ground bounce out of your next product.","TypeId":4,"TypeName":"Webinars","CountryId":208,"Country":"United States","RegionId":3,"Region":"Japan","State":"NY","City":"","Address":"","ExhibitionStartDate":"2021-11-16T13:00:00","ExhibitionEndDate":"2021-11-16T15:00:00","Url":"https://go.teledynelecroy.com/l/48392/2021-05-03/873cjl","Logo":"/images/events/webinar-icon.png","TimeZone":"","Archived":"N","ArchiveUrl":"","EventCategories":"Power"},
    {"ExhibitionId":3331,"Title":"Essentials of HDMI 2.1 Enhanced Audio Return Channel (eARC) Protocols","Description":"In the final part of this four-part series, this webinar will provide an overview of the HDMI 2.1 Enhanced Audio Return Channel (eARC) main link protocols. The webinar will also discuss how eARC is enable during transactions over the DDC channel. A brief discussion of compliance testing for eARC will also be provided. Developers and test engineers in R & D departments will find this webinar useful.","TypeId":4,"TypeName":"Webinars","CountryId":207,"Country":"United Kingdom","RegionId":2,"Region":"Europe","State":"","City":"","Address":"","ExhibitionStartDate":"2021-11-16T14:00:00","ExhibitionEndDate":"2021-11-16T15:00:00","Url":"https://go.teledynelecroy.com/l/48392/2021-10-04/8b32r7","Logo":"/images/events/webinar-icon.png","TimeZone":"","Archived":"N","ArchiveUrl":"","EventCategories":""},
    {"ExhibitionId":3252,"Title":"Oscilloscope Coffee Break Series - Part 11: Finding High Frequency Noise","Description":"In this session we will use our oscilloscope tools and probes to gain an understanding of potential crosstalk or conducted emissions on our power supply circuits.","TypeId":4,"TypeName":"Webinars","CountryId":208,"Country":"United States","RegionId":3,"Region":"Japan","State":"NY","City":"","Address":"","ExhibitionStartDate":"2021-11-18T14:00:00","ExhibitionEndDate":"2021-11-18T14:30:00","Url":"https://go.teledynelecroy.com/l/48392/2021-06-18/88hbg9","Logo":"/images/events/webinar-icon.png","TimeZone":"","Archived":"N","ArchiveUrl":"","EventCategories":"Oscilloscopes"},
    {"ExhibitionId":3002,"Title":"Intro to USB - 1.0 through 3.2","Description":"Please join Teledyne LeCroy's Austin Labs, for a virtual training class -- Intro to USB - 1.0 through 3.2.","TypeId":5,"TypeName":"Training","CountryId":208,"Country":"United States","RegionId":3,"Region":"Japan","State":"","City":"","Address":"","ExhibitionStartDate":"2021-11-29T09:00:00","ExhibitionEndDate":"2021-11-29T16:30:00","Url":"https://go.teledynelecroy.com/l/48392/2021-01-14/84831c","Logo":"/images/events/vtraining-icon.png","TimeZone":"","Archived":"N","ArchiveUrl":"","EventCategories":"Protocol Analyzers"},
    {"ExhibitionId":3003,"Title":"In-Depth USB4™ Protocol Architecture and Functionality","Description":"Please join Teledyne LeCroy's Austin Labs for a virtual training class -- an in-depth examination of the USB4™ protocol architecture and functionality.","TypeId":5,"TypeName":"Training","CountryId":208,"Country":"United States","RegionId":3,"Region":"Japan","State":"","City":"","Address":"","ExhibitionStartDate":"2021-12-07T09:00:00","ExhibitionEndDate":"2021-12-10T16:30:00","Url":"https://go.teledynelecroy.com/l/48392/2021-01-14/84831y","Logo":"/images/events/vtraining-icon.png","TimeZone":"","Archived":"N","ArchiveUrl":"","EventCategories":"Protocol Analyzers"},
    {"ExhibitionId":3172,"Title":"Practical On-die Power Integrity Measurements","Description":" Part 8: How to Become an Expert in Power Integrity Testing \r\nIn this webinar Dr. Eric Bogatin describes the direct measurement of power rail noise on the chip itself (i.e. on die)","TypeId":4,"TypeName":"Webinars","CountryId":208,"Country":"United States","RegionId":3,"Region":"Japan","State":"NY","City":"","Address":"","ExhibitionStartDate":"2021-12-07T14:00:00",
        "ExhibitionEndDate":"2021-12-07T15:00:00","Url":"https://go.teledynelecroy.com/l/48392/2021-05-03/874z78","Logo":"/images/events/webinar-icon.png","TimeZone":"","Archived":"N","ArchiveUrl":"","EventCategories":"Oscilloscopes"},
    {"ExhibitionId":3004,"Title":"NVMe™ over PCIe®","Description":"Please join Teledyne LeCroy's Austin Labs, for a virtual training class -- an in-depth examination of the NVMe™ protocol, as delivered across the PCIe® bus architecture.","TypeId":5,"TypeName":"Training","CountryId":41,"Country":"China","RegionId":4,"Region":"Korea","State":"","City":"","Address":"","ExhibitionStartDate":"2021-12-14T10:00:00","ExhibitionEndDate":"2021-12-17T17:30:00","Url":"https://go.teledynelecroy.com/l/48392/2021-01-14/848333i","Logo":"/images/events/vtraining-icon.png","TimeZone":"","Archived":"N","ArchiveUrl":"","EventCategories":"Protocol Analyzers"},{"ExhibitionId":3253,"Title":"Oscilloscope Coffee Break Series - Part 12: Validating For 1% Noise Margin","Description":"In this session we will investigate how our oscilloscope measurement tools can support us to reach that 1% power supply output noise margin.","TypeId":4,"TypeName":"Webinars","CountryId":208,"Country":"United States","RegionId":3,"Region":"Japan","State":"NY","City":"","Address":"","ExhibitionStartDate":"2021-12-16T14:00:00","ExhibitionEndDate":"2021-12-16T14:30:00","Url":"https://go.teledynelecroy.com/l/48392/2021-06-18/88hbgy","Logo":"/images/events/webinar-icon.png","TimeZone":"","Archived":"N","ArchiveUrl":"","EventCategories":"Oscilloscopes"},{"ExhibitionId":3320,"Title":"NVMe™ over PCIe® Virtual Training","Description":"Please join Teledyne LeCroy's Austin Labs, for a virtual training class -- an in-depth examination of the NVMe™ protocol, as delivered across the PCIe® bus architecture.","TypeId":5,"TypeName":"Training","CountryId":208,"Country":"United States","RegionId":3,"Region":"Japan","State":"","City":"","Address":"","ExhibitionStartDate":"2022-01-11T09:00:00","ExhibitionEndDate":"2022-01-14T16:30:00","Url":"https://go.teledynelecroy.com/l/48392/2021-09-27/89v22s","Logo":"","TimeZone":"","Archived":"N","ArchiveUrl":"","EventCategories":"Protocol Analyzers"},{"ExhibitionId":3321,"Title":"PCIe® Architecture and Functionality Virtual Training","Description":"Please join Teledyne LeCroy's Austin Labs, for a one-day intensive course to learn the architectural and functional ins and outs of PCIe, with guided walk-throughs of example traces.","TypeId":5,"TypeName":"Training","CountryId":207,"Country":"United Kingdom","RegionId":2,"Region":"Europe","State":"","City":"","Address":"","ExhibitionStartDate":"2022-01-18T09:00:00","ExhibitionEndDate":"2022-01-18T16:30:00","Url":"https://go.teledynelecroy.com/l/48392/2021-09-27/89v23q","Logo":"","TimeZone":"","Archived":"N","ArchiveUrl":"","EventCategories":"Protocol Analyzers"},{"ExhibitionId":3322,"Title":"Intro to USB - 1.0 through 3.2","Description":"Please join Teledyne LeCroy's Austin Labs, for a virtual training class -- Intro to USB - 1.0 through 3.2.","TypeId":5,"TypeName":"Training","CountryId":207,"Country":"United Kingdom","RegionId":2,"Region":"Europe","State":"","City":"","Address":"","ExhibitionStartDate":"2022-01-20T09:00:00","ExhibitionEndDate":"2022-01-20T16:30:00","Url":"https://go.teledynelecroy.com/l/48392/2021-09-27/89v242","Logo":"","TimeZone":"","Archived":"N","ArchiveUrl":"","EventCategories":"Protocol Analyzers"}]