{
    'content_type': 'photo', 
    'id': 41, 'message_id': 41, 
    'from_user': 
    {
        'id': 120021876, 'is_bot': False, 'first_name': 'Max', 'username': 'wotan_mk', 'last_name': 'Votintsev', 'language_code': 'ru', 'can_join_groups': None, 'can_read_all_group_messages': None, 'supports_inline_queries': None
    }, 
    'date': 1614512144, 
    'chat': 
    {
        'id': 120021876, 'type': 'private', 'title': None, 'username': 'wotan_mk', 'first_name': 'Max', 'last_name': 'Votintsev', 'photo': None, 'bio': None, 'description': None, 'invite_link': None, 'pinned_message': None, 'permissions': None, 'slow_mode_delay': None, 'sticker_set_name': None, 'can_set_sticker_set': None, 'linked_chat_id': None, 'location': None
    }, 
    'forward_from': None, 'forward_from_chat': None, 'forward_from_message_id': None, 'forward_signature': None, 'forward_sender_name': None, 'forward_date': None, 'reply_to_message': None, 'edit_date': None, 'media_group_id': None, 'author_signature': None, 'text': None, 'entities': None, 'caption_entities': None, 'audio': None, 'document': None, 'photo': [<telebot.types.PhotoSize object at 0x7fc5d07929d0>, <telebot.types.PhotoSize object at 0x7fc5d0792b20>, <telebot.types.PhotoSize object at 0x7fc5d0792880>
    ], 
    'sticker': None, 'video': None, 'video_note': None, 'voice': None, 
    'caption': '🚀 Кофе 3-в-1 (видео)\n\n🤙Максончик, пошли погуляем', 
    'contact': None, 'location': None, 'venue': None, 'animation': None, 'dice': None, 'new_chat_member': None, 'new_chat_members': None, 'left_chat_member': None, 'new_chat_title': None, 'new_chat_photo': None, 'delete_chat_photo': None, 'group_chat_created': None, 'supergroup_chat_created': None, 'channel_chat_created': None, 'migrate_to_chat_id': None, 'migrate_from_chat_id': None, 'pinned_message': None, 'invoice': None, 'successful_payment': None, 'connected_website': None, 'reply_markup': None, 'json': {'message_id': 41, 'from': {'id': 120021876, 'is_bot': False, 'first_name': 'Max', 'last_name': 'Votintsev', 'username': 'wotan_mk', 'language_code': 'ru'
        }, 'chat': {'id': 120021876, 'first_name': 'Max', 'last_name': 'Votintsev', 'username': 'wotan_mk', 'type': 'private'
        }, 'date': 1614512144, 'photo': [
            {'file_id': 'AgACAgIAAxkBAAMpYDuAEPE9q5g7G7LdnP2i7orW6jYAAsWwMRuW3dlJh_Ucyvmj3VFvKUCeLgADAQADAgADbQADm5sAAh4E', 'file_unique_id': 'AQADbylAni4AA5ubAAI', 'file_size': 17065, 'width': 320, 'height': 320
            },
            {'file_id': 'AgACAgIAAxkBAAMpYDuAEPE9q5g7G7LdnP2i7orW6jYAAsWwMRuW3dlJh_Ucyvmj3VFvKUCeLgADAQADAgADeAADnJsAAh4E', 'file_unique_id': 'AQADbylAni4AA5ybAAI', 'file_size': 58174, 'width': 800, 'height': 800
            },
            {'file_id': 'AgACAgIAAxkBAAMpYDuAEPE9q5g7G7LdnP2i7orW6jYAAsWwMRuW3dlJh_Ucyvmj3VFvKUCeLgADAQADAgADeQADmpsAAh4E', 'file_unique_id': 'AQADbylAni4AA5qbAAI', 'file_size': 61076, 'width': 1000, 'height': 1000
            }
        ], 'caption': '🚀 Кофе 3-в-1 (видео)\n\n🤙Максончик, пошли погуляем'
    }
}