<?xml version="1.0" encoding="utf-8"?>
<!-- Generator: Adobe Illustrator 16.0.0, SVG Export Plug-In . SVG Version: 6.00 Build 0)  -->
<!DOCTYPE svg PUBLIC "-//W3C//DTD SVG 1.1//EN" "http://www.w3.org/Graphics/SVG/1.1/DTD/svg11.dtd">
<svg version="1.1" id="Calque_1" xmlns="http://www.w3.org/2000/svg" xmlns:xlink="http://www.w3.org/1999/xlink" x="0px" y="0px"
	 width="32px" height="32px" viewBox="0 0 32 32" enable-background="new 0 0 32 32" xml:space="preserve">
<path d="M16.017,27.355h-0.009c-9.106,0-14.059-7.447-15.36-9.73c-0.288-0.482-0.452-0.803-0.452-0.803
	c-0.128-0.248-0.193-0.521-0.194-0.794c-0.009-0.277,0.05-0.556,0.173-0.811C0.384,14.786,5.414,4.644,15.984,4.644
	c9.112,0,14.066,7.447,15.368,9.729c0.287,0.481,0.451,0.801,0.451,0.801c0.129,0.249,0.194,0.523,0.195,0.796
	c0.009,0.277-0.05,0.555-0.173,0.811C31.617,17.213,26.586,27.355,16.017,27.355z M3.721,15.991
	C4.896,18.009,8.919,23.876,16,23.876h0.017c6.924,0,11.01-5.774,12.262-7.866c-1.44-2.482-5.364-7.886-12.278-7.886
	C9.061,8.124,4.973,13.9,3.721,15.991z"/>
<path d="M16,22.109c-3.369,0-6.11-2.74-6.11-6.109S12.631,9.89,16,9.89c3.37,0,6.111,2.741,6.111,6.11S19.369,22.109,16,22.109z
	 M16,13.369c-1.45,0-2.63,1.179-2.63,2.63s1.179,2.63,2.63,2.63s2.631-1.179,2.631-2.63S17.451,13.369,16,13.369z"/>
<path d="M27.521,29.262c-0.444,0-0.89-0.171-1.229-0.511L3.249,5.708c-0.679-0.679-0.679-1.781,0-2.46s1.781-0.679,2.46,0
	L28.752,26.29c0.68,0.679,0.68,1.78,0,2.46c-0.338,0.34-0.785,0.512-1.229,0.512H27.521z"/>
</svg>
