<svg xmlns="http://www.w3.org/2000/svg" width="110" height="95" viewBox="0 0 110 95">
    <g fill="none" fill-rule="evenodd">
        <path fill="#D8D8D8" fill-rule="nonzero" d="M0 89h110v6H0z"/>
        <g fill-rule="nonzero">
            <path fill="#D8D8D8" d="M24.63 68s-6.973-12.598 7.928-23c0 0 3.26 12.093-7.928 23z"/>
            <path fill="#E6E6E6" d="M33 45l-8.297 23s-.96-1.655-1.437-4.256v-.007c-.598-3.25-.45-7.988 3.242-12.833C28.012 48.924 30.113 46.926 33 45z"/>
            <path fill="#D8D8D8" d="M23.299 63c-.671-3.039-.505-7.47 3.642-12 .437 5.217-1.621 9.314-3.642 12zM15.37 68s6.973-12.598-7.928-23c0 0-3.26 12.093 7.928 23z"/>
            <path fill="#E6E6E6" d="M16.295 68L8 45c15.59 10.402 8.295 23 8.295 23z"/>
            <path fill="#D8D8D8" d="M19.731 66s14.587-13.12-.74-33c0 0-9.454 14.098.74 33z"/>
            <path fill="#E6E6E6" d="M19.74 66L19 33c15.306 19.88.74 33 .74 33z"/>
            <path fill="#E6E6E6" d="M7 65l3.27 18.62c.14.798.839 1.38 1.656 1.38h16.148c.817 0 1.516-.582 1.656-1.38L33 65H7z"/>
            <path fill="#D8D8D8" d="M34.805 61H6.195C5.535 61 5 61.458 5 62.022v2.956C5 65.542 5.535 66 6.195 66h28.61c.66 0 1.195-.458 1.195-1.022v-2.956c0-.564-.535-1.022-1.195-1.022z"/>
        </g>
        <path stroke="#B9B7B7" stroke-dasharray="2,4" d="M45 1h14v84H45V1zM84.003 12.932l13.923-1.464 7.63 72.6-13.923 1.464-7.63-72.6zM65 26h14v59H65V26z"/>
    </g>
</svg>
