<?xml version="1.0" encoding="utf-8"?>
<!-- Generated by IcoMoon.io -->
<!DOCTYPE svg PUBLIC "-//W3C//DTD SVG 1.1//EN" "http://www.w3.org/Graphics/SVG/1.1/DTD/svg11.dtd">
<svg version="1.1" xmlns="http://www.w3.org/2000/svg" xmlns:xlink="http://www.w3.org/1999/xlink" width="32" height="32" viewBox="0 0 32 32">
<path d="M30.919 5.029h-18.515c-0.758 0-1.371-0.613-1.371-1.371s0.613-1.371 1.371-1.371h18.515c0.758 0 1.371 0.613 1.371 1.371s-0.613 1.371-1.371 1.371v0z"></path>
<path d="M5.942 7.314h-4.571c-0.758 0-1.371-0.613-1.371-1.371v-4.571c0-0.758 0.613-1.371 1.371-1.371h4.571c0.758 0 1.371 0.613 1.371 1.371v4.571c0 0.758-0.613 1.371-1.371 1.371v0zM2.743 4.571h1.828v-1.828h-1.828v1.828z"></path>
<path d="M30.919 17.372h-18.515c-0.758 0-1.371-0.613-1.371-1.371s0.613-1.371 1.371-1.371h18.515c0.758 0 1.371 0.613 1.371 1.371s-0.613 1.371-1.371 1.371v0z"></path>
<path d="M5.942 19.657h-4.571c-0.758 0-1.371-0.613-1.371-1.371v-4.571c0-0.758 0.613-1.371 1.371-1.371h4.571c0.758 0 1.371 0.613 1.371 1.371v4.571c0 0.758-0.613 1.371-1.371 1.371v0zM2.743 16.914h1.828v-1.828h-1.828v1.828z"></path>
<path d="M30.919 29.715h-18.515c-0.758 0-1.371-0.613-1.371-1.371s0.613-1.371 1.371-1.371h18.515c0.758 0 1.371 0.613 1.371 1.371s-0.613 1.371-1.371 1.371v0z"></path>
<path d="M5.942 32h-4.571c-0.758 0-1.371-0.613-1.371-1.371v-4.571c0-0.758 0.613-1.371 1.371-1.371h4.571c0.758 0 1.371 0.613 1.371 1.371v4.571c0 0.758-0.613 1.371-1.371 1.371v0zM2.743 29.257h1.828v-1.828h-1.828v1.828z"></path>
</svg>
