<svg xmlns="http://www.w3.org/2000/svg" width="90" height="94" viewBox="0 0 90 94">
    <g fill="none" fill-rule="evenodd">
        <g fill-rule="nonzero">
            <g>
                <path fill="#3E3E3E" d="M47 0c19.196 0 35.704 11.508 43.001 28h-2.197C80.64 12.643 65.064 2 47 2 22.147 2 2 22.147 2 47s20.147 45 45 45c18.063 0 33.64-10.642 40.803-25.999h2.198C82.703 82.493 66.195 94 47 94 21.043 94 0 72.957 0 47S21.043 0 47 0z" transform="translate(-708 -2131) translate(708 2131)"/>
                <path fill="#D8D8D8" d="M28.998 27.002L64.998 27.002 64.998 67.002 28.998 67.002z" transform="translate(-708 -2131) translate(708 2131) rotate(-163.014 46.998 47.002)"/>
                <path fill="#FFF" stroke="#3E3E3E" stroke-width="2" d="M30 28H64V66H30z" transform="translate(-708 -2131) translate(708 2131)"/>
                <path fill="#3E3E3E" d="M47 58v2H34v-2h13zm0-6v2H34v-2h13zm0-6v2H34v-2h13zm13-6v2H34v-2h26zm0-6v2H34v-2h26z" transform="translate(-708 -2131) translate(708 2131) rotate(180 47 47)"/>
                <path fill="#FF641E" d="M34 34H44V48H34z" transform="translate(-708 -2131) translate(708 2131)"/>
            </g>
        </g>
    </g>
</svg>
