<svg xmlns="http://www.w3.org/2000/svg" viewBox="0 0 7 12">
  <defs>
    <style>
      .cls-1 {
        fill: #fff;
      }
    </style>
  </defs>
  <path id="Fill_1" data-name="Fill 1" class="cls-1" d="M-1.023,12A1.018,1.018,0,0,0-.3,11.7a1.029,1.029,0,0,0,0-1.453L-4.53,6-.3,1.754A1.029,1.029,0,0,0-.3.3,1.019,1.019,0,0,0-1.747.3L-6.7,5.274A1.031,1.031,0,0,0-7,6a1.033,1.033,0,0,0,.3.726L-1.747,11.7a1.018,1.018,0,0,0,.723.3" transform="translate(7)"/>
</svg>
