<svg id="Group_3" data-name="Group 3" xmlns="http://www.w3.org/2000/svg" viewBox="0 0 21.6 21.6">
  <defs>
    <style>
      .cls-1 {
        fill: #fff;
      }
    </style>
  </defs>
  <path id="Fill_1" data-name="Fill 1" class="cls-1" d="M.634,10.145C.261,10.145,0,9.7,0,9.065V1.081C0,.444.26,0,.633,0a.645.645,0,0,1,.411.178L5.662,4.171a1.231,1.231,0,0,1,0,1.8L1.044,9.967A.639.639,0,0,1,.634,10.145ZM.643.953h0a.2.2,0,0,1,0,.025.981.981,0,0,0-.006.1V9.065a.529.529,0,0,0,.011.126.2.2,0,0,0,.081-.048L5.344,5.15a.319.319,0,0,0,.069-.079A.059.059,0,0,0,5.4,5.052a.431.431,0,0,0-.057-.057L.726,1A.192.192,0,0,0,.643.953Z" transform="translate(8.874 5.507)"/>
  <path id="Fill_3" data-name="Fill 3" class="cls-1" d="M10.8,21.6A10.8,10.8,0,1,1,21.6,10.8,10.812,10.812,0,0,1,10.8,21.6Zm0-19.687A8.887,8.887,0,1,0,19.688,10.8,8.9,8.9,0,0,0,10.8,1.913Z"/>
</svg>
