<?xml version="1.0" encoding="utf-8"?>
<!-- Generator: Adobe Illustrator 16.0.0, SVG Export Plug-In . SVG Version: 6.00 Build 0)  -->
<!DOCTYPE svg PUBLIC "-//W3C//DTD SVG 1.1//EN" "http://www.w3.org/Graphics/SVG/1.1/DTD/svg11.dtd">
<svg version="1.1" id="Calque_1" xmlns="http://www.w3.org/2000/svg" xmlns:xlink="http://www.w3.org/1999/xlink" x="0px" y="0px"
	 width="282.633px" height="96.613px" viewBox="0 0 282.633 96.613" enable-background="new 0 0 282.633 96.613"
	 xml:space="preserve">
<path fill="#FF641E" d="M218.163,11.236c-14.072,0.111-28.034,9.53-28.034,28.035c0,7.417,2.248,13.35,5.837,17.819
	c-1.829,3.759-4.465,9.105-4.465,9.105l12.436-2.512c4.459,2.412,9.569,3.622,14.67,3.622c14.073,0,28.146-9.308,28.146-28.035
	C246.752,20.434,232.458,11.125,218.163,11.236z M218.274,53.787c-6.427,0-12.743-4.875-12.743-14.516
	c0-9.64,6.538-14.405,13.075-14.405c6.538,0,12.743,4.876,12.743,14.405C231.35,49.022,224.813,53.898,218.274,53.787z"/>
<path fill="#3E3E3E" d="M16.495,66.197H0.981V12.841h15.514V66.197z"/>
<path fill="#3E3E3E" d="M67.174,14.561L43.903,52.79h23.271v13.407H21.521v-1.772l23.602-38.783H23.183V12.788h43.991V14.561z"/>
<path fill="#3E3E3E" d="M113.258,66.197V35.282c0.332-7.313-4.543-11.413-10.084-11.413c-5.872,0-11.302,4.211-11.302,11.746v30.583
	H76.358V29.298c0-5.319,0-6.981-5.098-6.981v-9.641c7.092-1.219,19.503-2.438,19.503,7.203c2.992-6.205,10.859-8.311,17.064-8.311
	c15.07,0,21.054,10.416,21.054,23.713v30.916H113.258z"/>
<path fill="#3E3E3E" d="M180.126,64.727c-5.089,1.787-10.577,2.801-15.939,2.801c-17.951,0.332-30.584-10.638-30.584-28.7
	c0.333-18.616,13.852-27.37,28.035-27.37c19.502,0,27.362,13.404,23.713,31.248h-36.234c0.554,8.312,6.76,11.524,14.184,12.078
	c2.216,0.11,4.765,0.222,7.092-0.11c2.267-0.264,4.534-0.678,6.634-1.195L180.126,64.727z M149.227,32.733h23.492
	c0-7.038-5.319-9.419-11.081-9.419C155.765,23.314,150.446,26.528,149.227,32.733z"/>
<path fill="#FF641E" d="M8.619,0c0.147-0.003,7.955,0.007,7.955,0.007v9.458H8.603H1.016c-0.025-0.295-0.041-0.6-0.041-0.915
	C0.975,3.583,4.798,0.096,8.619,0z"/>
<polygon fill="#3E3E3E" points="215.268,30.813 225.367,39.294 215.268,47.775 "/>
<g>
	<path fill="#3E3E3E" d="M0.973,78.285h3.295c2.521,0,4.069,0.99,4.069,3.691c0,0.972-0.343,2.089-1.188,2.629
		c1.603,0.288,2.322,1.908,2.322,3.402c0,2.665-1.872,3.854-4.339,3.854H0.973V78.285z M3.619,83.939h0.324
		c1.296,0,1.927-0.379,1.927-1.783c0-1.387-0.793-1.746-1.909-1.746H3.619V83.939z M3.619,89.736h0.559
		c1.422,0,2.646-0.18,2.646-1.944s-1.44-1.837-2.773-1.837H3.619V89.736z"/>
	<path fill="#3E3E3E" d="M12.007,78.285h3.78c3.926,0,6.555,2.935,6.555,6.807c0,3.816-2.701,6.77-6.572,6.77h-3.763V78.285z
		 M14.653,89.557h0.432c3.26,0,4.52-1.801,4.52-4.483c0-2.953-1.513-4.483-4.52-4.483h-0.432V89.557z"/>
	<path fill="#3E3E3E" d="M27.955,90.601c0,0.883-0.72,1.621-1.603,1.621c-0.882,0-1.603-0.738-1.603-1.621
		c0-0.882,0.721-1.584,1.603-1.584C27.235,89.017,27.955,89.719,27.955,90.601z"/>
	<path fill="#3E3E3E" d="M40.07,81.887c-0.738-0.9-1.854-1.44-2.988-1.44c-2.539,0-3.998,2.341-3.998,4.681
		c0,2.287,1.513,4.574,3.979,4.574c1.135,0,2.269-0.595,3.007-1.441v3.151c-0.99,0.468-1.98,0.811-3.079,0.811
		c-3.816,0-6.644-3.295-6.644-7.04c0-3.854,2.719-7.257,6.698-7.257c1.062,0,2.106,0.288,3.024,0.793V81.887z"/>
	<path fill="#3E3E3E" d="M48.962,92.222c-4.142,0-6.716-3.169-6.716-7.166c0-4.033,2.665-7.131,6.716-7.131
		c4.052,0,6.716,3.098,6.716,7.131C55.678,89.053,53.104,92.222,48.962,92.222z M48.962,80.536c-2.503,0-3.979,2.215-3.979,4.411
		c0,2.089,1.045,4.663,3.979,4.663s3.979-2.574,3.979-4.663C52.941,82.751,51.465,80.536,48.962,80.536z"/>
	<path fill="#3E3E3E" d="M68.187,83.435H68.15l-3.079,8.606h-0.918l-2.971-8.606h-0.036l-1.206,8.427h-2.665l2.286-13.937h1.873
		l3.349,8.949l3.205-8.949h1.908l2.035,13.937h-2.665L68.187,83.435z"/>
	<path fill="#3E3E3E" d="M76.824,91.861h-2.646V78.285h2.646V91.861z"/>
	<path fill="#3E3E3E" d="M88.904,81.887c-0.738-0.9-1.854-1.44-2.988-1.44c-2.539,0-3.998,2.341-3.998,4.681
		c0,2.287,1.513,4.574,3.979,4.574c1.135,0,2.269-0.595,3.007-1.441v3.151c-0.99,0.468-1.98,0.811-3.079,0.811
		c-3.816,0-6.644-3.295-6.644-7.04c0-3.854,2.719-7.257,6.698-7.257c1.062,0,2.106,0.288,3.024,0.793V81.887z"/>
	<path fill="#3E3E3E" d="M98.12,81.274c-0.504-0.685-1.152-1.116-2.034-1.116c-0.847,0-1.657,0.647-1.657,1.53
		c0,2.286,5.384,1.332,5.384,5.888c0,2.719-1.692,4.646-4.465,4.646c-1.873,0-3.241-1.081-4.178-2.647l1.711-1.674
		c0.359,1.044,1.314,1.98,2.448,1.98c1.08,0,1.747-0.918,1.747-1.963c0-1.404-1.297-1.801-2.359-2.215
		c-1.746-0.72-3.024-1.603-3.024-3.709c0-2.25,1.674-4.069,3.961-4.069c1.206,0,2.881,0.595,3.709,1.513L98.12,81.274z"/>
	<path fill="#3E3E3E" d="M105.516,90.601c0,0.883-0.72,1.621-1.603,1.621c-0.882,0-1.603-0.738-1.603-1.621
		c0-0.882,0.721-1.584,1.603-1.584C104.796,89.017,105.516,89.719,105.516,90.601z"/>
	<path fill="#3E3E3E" d="M118.694,83.435h-0.036l-3.079,8.606h-0.918l-2.971-8.606h-0.036l-1.206,8.427h-2.665l2.286-13.937h1.873
		l3.349,8.949l3.205-8.949h1.908l2.035,13.937h-2.665L118.694,83.435z"/>
	<path fill="#3E3E3E" d="M127.458,88.998l-1.116,2.863h-2.791l5.294-13.937h2.053l5.149,13.937h-2.827l-1.044-2.863H127.458z
		 M129.745,81.904h-0.036l-1.495,4.934h3.224L129.745,81.904z"/>
	<path fill="#3E3E3E" d="M137.934,77.925h1.908l7.148,9.489h0.036v-9.129h2.646v13.847h-1.909l-7.147-9.489h-0.036v9.219h-2.646
		V77.925z"/>
	<path fill="#3E3E3E" d="M164.666,84.642v0.342c0,3.835-1.963,7.238-6.176,7.238c-3.961,0-6.464-3.35-6.464-7.095
		c0-3.871,2.574-7.202,6.626-7.202c2.305,0,4.321,1.171,5.365,3.241l-2.341,1.261c-0.54-1.225-1.692-2.161-3.097-2.161
		c-2.557,0-3.817,2.611-3.817,4.861c0,2.251,1.278,4.754,3.836,4.754c1.656,0,3.042-1.44,3.097-3.079h-2.881v-2.16H164.666z"/>
	<path fill="#3E3E3E" d="M169.83,88.998l-1.116,2.863h-2.791l5.294-13.937h2.053l5.149,13.937h-2.827l-1.044-2.863H169.83z
		 M172.117,81.904h-0.036l-1.495,4.934h3.224L172.117,81.904z"/>
	<path fill="#3E3E3E" d="M186.696,81.274c-0.504-0.685-1.152-1.116-2.034-1.116c-0.847,0-1.657,0.647-1.657,1.53
		c0,2.286,5.384,1.332,5.384,5.888c0,2.719-1.692,4.646-4.465,4.646c-1.873,0-3.241-1.081-4.178-2.647l1.711-1.674
		c0.359,1.044,1.314,1.98,2.448,1.98c1.08,0,1.747-0.918,1.747-1.963c0-1.404-1.297-1.801-2.359-2.215
		c-1.746-0.72-3.024-1.603-3.024-3.709c0-2.25,1.674-4.069,3.961-4.069c1.206,0,2.881,0.595,3.709,1.513L186.696,81.274z"/>
	<path fill="#3E3E3E" d="M194.093,90.601c0,0.883-0.72,1.621-1.603,1.621c-0.882,0-1.602-0.738-1.602-1.621
		c0-0.882,0.72-1.584,1.602-1.584C193.373,89.017,194.093,89.719,194.093,90.601z"/>
	<path fill="#3E3E3E" d="M202.266,87.252c0,1.261-0.036,2.341-0.792,3.439c-0.702,1.025-1.818,1.53-3.043,1.53
		c-0.99,0-1.998-0.576-2.665-1.278l1.693-1.945c0.126,0.396,0.594,0.883,1.025,0.883c1.297,0,1.135-2.197,1.135-3.079v-8.517h2.646
		V87.252z"/>
	<path fill="#3E3E3E" d="M207.863,80.59v2.989h4.213v2.305h-4.213v3.673h4.375v2.305h-7.021V78.285h7.021v2.305H207.863z"/>
	<path fill="#3E3E3E" d="M215.008,78.285h2.646v7.599c0,1.674,0.145,4.033,2.395,4.033c2.251,0,2.396-2.359,2.396-4.033v-7.599
		h2.646v8.12c0,3.313-1.404,5.816-5.042,5.816c-3.637,0-5.041-2.503-5.041-5.816V78.285z"/>
	<path fill="#3E3E3E" d="M228.04,77.925h1.908l7.148,9.489h0.036v-9.129h2.646v13.847h-1.908l-7.148-9.489h-0.036v9.219h-2.646
		V77.925z"/>
	<path fill="#3E3E3E" d="M245.429,80.59v2.989h4.213v2.305h-4.213v3.673h4.375v2.305h-7.021V78.285h7.021v2.305H245.429z"/>
	<path fill="#3E3E3E" d="M259.037,81.274c-0.504-0.685-1.152-1.116-2.035-1.116c-0.846,0-1.656,0.647-1.656,1.53
		c0,2.286,5.384,1.332,5.384,5.888c0,2.719-1.692,4.646-4.465,4.646c-1.873,0-3.241-1.081-4.178-2.647l1.711-1.674
		c0.359,1.044,1.314,1.98,2.448,1.98c1.08,0,1.747-0.918,1.747-1.963c0-1.404-1.297-1.801-2.359-2.215
		c-1.746-0.72-3.024-1.603-3.024-3.709c0-2.25,1.674-4.069,3.961-4.069c1.206,0,2.881,0.595,3.709,1.513L259.037,81.274z"/>
	<path fill="#3E3E3E" d="M269.585,81.274c-0.504-0.685-1.152-1.116-2.034-1.116c-0.847,0-1.657,0.647-1.657,1.53
		c0,2.286,5.384,1.332,5.384,5.888c0,2.719-1.692,4.646-4.465,4.646c-1.873,0-3.241-1.081-4.178-2.647l1.711-1.674
		c0.359,1.044,1.314,1.98,2.448,1.98c1.08,0,1.747-0.918,1.747-1.963c0-1.404-1.297-1.801-2.359-2.215
		c-1.746-0.72-3.024-1.603-3.024-3.709c0-2.25,1.674-4.069,3.961-4.069c1.206,0,2.881,0.595,3.709,1.513L269.585,81.274z"/>
	<path fill="#3E3E3E" d="M276.388,80.59v2.989h4.213v2.305h-4.213v3.673h4.375v2.305h-7.021V78.285h7.021v2.305H276.388z"/>
</g>
</svg>
