<svg xmlns="http://www.w3.org/2000/svg" width="17.511" height="16.76" viewBox="0 0 17.511 16.76">
  <path id="Tracé_4301" data-name="Tracé 4301" d="M384.19,726.111l-4.8-.7-2.144-4.345a1.041,1.041,0,0,0-.93-.58,1.031,1.031,0,0,0-.929.578l-2.145,4.347-4.792.7a1.037,1.037,0,0,0-.577,1.769l3.47,3.381-.82,4.773-.015.182a1.038,1.038,0,0,0,1.036,1.033c.251,0,.257,0,4.772-2.377l4.293,2.259a1.038,1.038,0,0,0,1.5-1.094l-.819-4.775,3.471-3.383a1.044,1.044,0,0,0,.3-.59h0A1.04,1.04,0,0,0,384.19,726.111Zm-4.506,4.627.793,4.625-4.156-2.186-.349.183c-1.872.987-3.085,1.622-3.8,2l.792-4.62-3.362-3.276,4.646-.676,2.078-4.212,2.078,4.212,4.647.676Z" transform="translate(-367.566 -720.489)" fill="#171415"/>
</svg>
