<svg xmlns="http://www.w3.org/2000/svg" width="55" height="50" viewBox="0 0 55 50">
    <g fill="none" fill-rule="evenodd">
        <g fill-rule="nonzero">
            <g>
                <path fill="#272626" d="M50.083 3c1.55 0 2.823 1.217 2.912 2.746l.005.171v27.369c0 1.55-1.217 2.823-2.746 2.912l-.171.005H49v-1.954h1.083c.493 0 .902-.372.957-.85l.007-.113V16.672H4.953v16.614c0 .493.373.902.852.957l.112.007L26 34.249v1.954H5.917c-1.55 0-2.823-1.217-2.912-2.746L3 33.286V5.917c0-1.55 1.217-2.823 2.746-2.912L5.917 3h44.166zm-.996 23.533l.007.118v5.55c0 .534-.023 1.051-.066 1.553L49 34.02l.002-7.783c.043.092.072.191.085.295zm-34.369-3.025c2.424 0 4.395 1.971 4.395 4.394s-1.971 4.395-4.395 4.395c-.588 0-1.17-.12-1.708-.346-.525.223-1.103.346-1.709.346-2.423 0-4.395-1.972-4.395-4.395 0-2.423 1.972-4.394 4.395-4.394.606 0 1.184.123 1.71.346.537-.227 1.119-.346 1.707-.346zm-3.417 1.953c-1.346 0-2.442 1.095-2.442 2.441 0 1.347 1.096 2.442 2.442 2.442s2.441-1.096 2.441-2.442-1.095-2.44-2.441-2.44zm3.66.012c.463.697.734 1.532.734 2.43 0 .897-.27 1.732-.734 2.429 1.233-.122 2.199-1.165 2.199-2.43 0-1.264-.966-2.307-2.2-2.429zm-2.055-6.36c.54 0 .976.437.976.977 0 .5-.377.913-.862.97l-.114.006H7.883c-.54 0-.977-.437-.977-.976 0-.501.377-.914.863-.97l.114-.007h5.023zm2.887 0c.539 0 .976.437.976.977 0 .5-.377.913-.863.97l-.113.006h-.047c-.54 0-.976-.437-.976-.976 0-.501.377-.914.862-.97l.114-.007h.047zm35.254-8.3H4.953v3.906h46.094v-3.906zm-.964-5.86H5.917c-.493 0-.902.373-.957.852l-.007.112V8.86h46.094V5.917c0-.531-.433-.964-.964-.964z" transform="translate(-64 -2050) translate(64 2050)"/>
                <path fill="#FF641E" d="M38.054 20.134c3.205 1.876 6.773 3.376 10.32 4.34.283.076.509.274.628.528L49 32.786l-.022.228H49v1.953h-.362c-.871 3.689-2.843 6.301-4.566 7.975-2.515 2.443-5.398 3.744-6.512 3.744-1.114 0-3.997-1.301-6.511-3.744-1.657-1.61-3.543-4.087-4.461-7.554l-.106-.42-.482-.001v-1.953h.143c-.056-.49-.093-.997-.108-1.52l-.008-.529v-5.55c0-.44.295-.826.72-.942 3.649-.99 7.024-2.41 10.32-4.34.305-.177.682-.178.987 0zm-.493 1.97c-2.853 1.624-5.77 2.887-8.864 3.838l-.717.214v4.81c0 5.144 2.375 8.557 4.368 10.514 2.363 2.322 4.788 3.225 5.212 3.253.425-.028 2.85-.93 5.213-3.253 1.937-1.902 4.236-5.181 4.362-10.09l.006-.425v-4.81c-3.29-.957-6.577-2.347-9.58-4.051zm5.486 7.751c.352.353.38.906.081 1.29l-.081.091-5.913 5.913c-.19.19-.44.286-.69.286-.209 0-.417-.066-.59-.199l-.1-.087-3.428-3.427c-.382-.382-.381-1 0-1.382.352-.352.906-.378 1.29-.08l.091.08 2.737 2.737 5.222-5.222c.382-.381 1-.38 1.381 0z" transform="translate(-64 -2050) translate(64 2050)"/>
            </g>
        </g>
    </g>
</svg>
