<svg xmlns="http://www.w3.org/2000/svg" width="20" height="22" viewBox="0 0 20 22">
    <path fill="#3E3E3E" stroke="#3E3E3E" stroke-width=".5" d="M15.932 1C17.623 1 19 2.402 19 4.125S17.623 7.25 15.932 7.25c-.92 0-1.748-.415-2.31-1.071l-6.636 3.853c.097.305.15.63.15.968 0 .338-.053.663-.15.968l6.635 3.853c.563-.656 1.39-1.071 2.31-1.071 1.692 0 3.069 1.402 3.069 3.125S17.623 21 15.932 21s-3.068-1.402-3.068-3.125c0-.338.053-.663.15-.968L6.38 13.054c-.563.656-1.39 1.071-2.31 1.071C2.376 14.125 1 12.723 1 11s1.377-3.125 3.068-3.125c.92 0 1.748.415 2.31 1.071l6.636-3.853c-.097-.305-.15-.63-.15-.968C12.864 2.402 14.24 1 15.932 1zm0 15c-1.015 0-1.841.84-1.841 1.875 0 1.034.826 1.875 1.84 1.875 1.015 0 1.842-.84 1.842-1.875 0-1.034-.827-1.875-1.841-1.875zM4.068 9.125c-1.014 0-1.84.84-1.84 1.875 0 1.034.826 1.875 1.84 1.875 1.015 0 1.841-.84 1.841-1.875 0-1.034-.826-1.875-1.84-1.875zM15.932 2.25c-1.015 0-1.841.84-1.841 1.875 0 1.034.826 1.875 1.84 1.875 1.015 0 1.842-.84 1.842-1.875 0-1.034-.827-1.875-1.841-1.875z"/>
</svg>
