<svg xmlns="http://www.w3.org/2000/svg" width="40" height="32" viewBox="0 0 40 32">
    <g fill="none" fill-rule="evenodd">
        <g fill-rule="nonzero">
            <g>
                <g>
                    <g fill="#000">
                        <path d="M5.384 4.774V2.743c0-.78-.474-1.287-1.287-1.287-.406 0-.846.135-1.151.576-.237-.373-.576-.576-1.084-.576-.338 0-.677.102-.948.474v-.406h-.71v3.25h.71V2.98c0-.576.305-.847.779-.847.474 0 .711.305.711.847v1.794h.711V2.98c0-.576.339-.847.779-.847.474 0 .711.305.711.847v1.794h.779zm10.53-3.25h-1.15V.542h-.712v.982h-.643v.643h.643v1.49c0 .745.305 1.185 1.118 1.185.304 0 .643-.101.88-.237l-.203-.61c-.203.136-.44.17-.61.17-.338 0-.474-.203-.474-.542V2.167h1.152v-.643zm6.028-.068c-.406 0-.677.203-.847.474v-.406h-.71v3.25h.71V2.946c0-.542.237-.847.678-.847.135 0 .304.034.44.068l.203-.677c-.135-.034-.339-.034-.474-.034zm-9.109.339c-.338-.237-.812-.339-1.32-.339-.813 0-1.355.406-1.355 1.05 0 .541.407.846 1.118.948l.338.034c.373.067.576.169.576.338 0 .237-.27.407-.745.407-.474 0-.847-.17-1.084-.339l-.338.542c.372.27.88.406 1.388.406.948 0 1.49-.44 1.49-1.05 0-.575-.44-.88-1.117-.982l-.339-.033c-.305-.034-.542-.102-.542-.305 0-.237.237-.373.61-.373.406 0 .812.17 1.016.271l.304-.575zm18.895-.339c-.407 0-.677.203-.847.474v-.406h-.71v3.25h.71V2.946c0-.542.237-.847.677-.847.136 0 .305.034.44.068l.204-.677c-.136-.034-.339-.034-.474-.034zm-9.075 1.693c0 .982.677 1.693 1.727 1.693.474 0 .813-.101 1.151-.372l-.338-.576c-.271.203-.542.305-.847.305-.576 0-.982-.407-.982-1.05 0-.61.406-1.016.982-1.05.305 0 .576.102.847.305l.338-.576c-.338-.27-.677-.372-1.151-.372-1.05 0-1.727.711-1.727 1.693zm6.569 0V1.524h-.711v.406c-.237-.305-.576-.474-1.016-.474-.914 0-1.625.711-1.625 1.693 0 .982.71 1.693 1.625 1.693.474 0 .813-.17 1.016-.474v.406h.711V3.15zm-2.607 0c0-.576.372-1.05.982-1.05.575 0 .982.44.982 1.05 0 .576-.407 1.05-.982 1.05-.61-.034-.982-.474-.982-1.05zm-8.5-1.693c-.947 0-1.625.677-1.625 1.693s.678 1.693 1.66 1.693c.474 0 .948-.135 1.32-.44l-.339-.508c-.27.203-.609.339-.948.339-.44 0-.88-.204-.982-.78h2.405v-.27c.033-1.05-.576-1.727-1.49-1.727zm0 .61c.44 0 .746.27.813.778h-1.693c.068-.44.373-.778.88-.778zm17.642 1.083V.237h-.71V1.93c-.238-.305-.577-.474-1.017-.474-.914 0-1.625.711-1.625 1.693 0 .982.711 1.693 1.625 1.693.474 0 .813-.17 1.016-.474v.406h.711V3.15zm-2.607 0c0-.576.372-1.05.982-1.05.576 0 .982.44.982 1.05 0 .576-.406 1.05-.982 1.05-.61-.034-.982-.474-.982-1.05zm-23.77 0V1.524h-.712v.406c-.237-.305-.575-.474-1.015-.474-.915 0-1.626.711-1.626 1.693 0 .982.711 1.693 1.626 1.693.474 0 .812-.17 1.015-.474v.406h.711V3.15zm-2.642 0c0-.576.373-1.05.982-1.05.576 0 .982.44.982 1.05 0 .576-.406 1.05-.982 1.05-.61-.034-.982-.474-.982-1.05z" transform="translate(-68 -2263) translate(68 2263) translate(2.07 26.084)"/>
                    </g>
                    <g>
                        <path fill="#FF5F00" d="M14.628 2.912H25.294V22.076999999999998H14.628z" transform="translate(-68 -2263) translate(68 2263) translate(.04 .01)"/>
                        <path fill="#EB001B" d="M15.305 12.495c0-3.894 1.829-7.348 4.64-9.583C17.878 1.287 15.27.305 12.426.305 5.689.305.237 5.756.237 12.495c0 6.738 5.452 12.19 12.19 12.19 2.844 0 5.452-.982 7.517-2.608-2.81-2.2-4.639-5.688-4.639-9.582z" transform="translate(-68 -2263) translate(68 2263) translate(.04 .01)"/>
                        <path fill="#F79E1B" d="M39.685 12.495c0 6.738-5.452 12.19-12.19 12.19-2.844 0-5.451-.982-7.517-2.608 2.844-2.234 4.639-5.688 4.639-9.582 0-3.894-1.829-7.348-4.639-9.583C22.044 1.287 24.651.305 27.495.305c6.738 0 12.19 5.485 12.19 12.19z" transform="translate(-68 -2263) translate(68 2263) translate(.04 .01)"/>
                    </g>
                </g>
            </g>
        </g>
    </g>
</svg>
