<svg xmlns="http://www.w3.org/2000/svg" width="95.407" height="95.407" viewBox="0 0 95.407 95.407">
  <g id="icone" transform="translate(-8530.291 13515.709)">
    <circle id="Ellipse_36" data-name="Ellipse 36" cx="47.704" cy="47.704" r="47.704" transform="translate(8530.291 -13515.709)" fill="#e6e6e6"/>
    <path id="Tracé_4245" data-name="Tracé 4245" d="M165.085,341.139a2.981,2.981,0,0,1-.82-4.135c6.905-10.316,17.561-10.316,32.31-10.316a2.981,2.981,0,1,1,0,5.963c-15.006,0-22.439.325-27.355,7.671A2.985,2.985,0,0,1,165.085,341.139Z" transform="translate(8397.046 -13781.521)" fill="#d8d8d8"/>
    <circle id="Ellipse_37" data-name="Ellipse 37" cx="7.65" cy="7.65" r="7.65" transform="translate(8553.052 -13483.536)" fill="#d8d8d8"/>
    <path id="Tracé_4246" data-name="Tracé 4246" d="M174.417,193.957a1.825,1.825,0,1,1-.2-2.224A1.593,1.593,0,0,1,174.417,193.957Z" transform="translate(8390.611 -13671.172)" fill="#e6e6e6"/>
    <circle id="Ellipse_38" data-name="Ellipse 38" cx="7.65" cy="7.65" r="7.65" transform="translate(8587.648 -13483.536)" fill="#d8d8d8"/>
    <path id="Tracé_4247" data-name="Tracé 4247" d="M360.081,193.957a1.825,1.825,0,1,1-.2-2.224A1.593,1.593,0,0,1,360.081,193.957Z" transform="translate(8239.544 -13671.172)" fill="#e6e6e6"/>
  </g>
</svg>
