<?xml version="1.0" encoding="utf-8"?>
<!-- Generated by IcoMoon.io -->
<!DOCTYPE svg PUBLIC "-//W3C//DTD SVG 1.1//EN" "http://www.w3.org/Graphics/SVG/1.1/DTD/svg11.dtd">
<svg version="1.1" xmlns="http://www.w3.org/2000/svg" xmlns:xlink="http://www.w3.org/1999/xlink" width="32" height="32" viewBox="0 0 32 32">
<path d="M14.084 23.187c-0.553 0-0.938-0.657-0.938-1.6v-11.828c0-0.942 0.385-1.601 0.937-1.601 0.201 0 0.405 0.089 0.609 0.265l6.842 5.915c0.37 0.32 0.582 0.806 0.582 1.335 0 0.53-0.213 1.017-0.582 1.336l-6.842 5.915c-0.203 0.176-0.408 0.264-0.608 0.264v0zM14.098 9.569c0.001 0.021-0.011 0.084-0.011 0.19v11.83c0 0.095 0.008 0.154 0.017 0.187 0.024-0.006 0.062-0.024 0.119-0.072l6.84-5.916c0.062-0.052 0.091-0.098 0.105-0.122-0.014-0.010-0.043-0.055-0.105-0.108l-6.842-5.915c-0.061-0.052-0.102-0.069-0.123-0.074v0z"></path>
<path d="M16 32c-8.821 0-16-7.177-16-16s7.179-16 16-16c8.824 0 16 7.177 16 16s-7.176 16-16 16v0zM16 2.834c-7.26 0-13.166 5.906-13.166 13.166s5.906 13.166 13.166 13.166 13.166-5.906 13.166-13.166-5.906-13.166-13.166-13.166v0z"></path>
</svg>
