<?xml version="1.0" encoding="utf-8"?>
<!-- Generated by IcoMoon.io -->
<!DOCTYPE svg PUBLIC "-//W3C//DTD SVG 1.1//EN" "http://www.w3.org/Graphics/SVG/1.1/DTD/svg11.dtd">
<svg version="1.1" xmlns="http://www.w3.org/2000/svg" xmlns:xlink="http://www.w3.org/1999/xlink" width="31" height="32" viewBox="0 0 31 32">
<path d="M13.729 27.461c-7.566 0-13.726-6.157-13.729-13.725 0.003-7.574 6.163-13.736 13.731-13.737 7.569 0 13.73 6.16 13.733 13.731-0.001 7.57-6.163 13.73-13.736 13.73v0zM13.731 2.755c-6.051 0.001-10.974 4.927-10.977 10.981 0.003 6.048 4.924 10.97 10.974 10.97 6.055 0 10.981-4.923 10.981-10.974-0.003-6.052-4.928-10.977-10.978-10.977v0z"></path>
<path d="M6.008 13.729h-1.377c0.001-5.018 4.084-9.101 9.101-9.101v1.377c-4.258 0-7.722 3.464-7.723 7.723v0z"></path>
<path d="M30.092 32c-0.353 0-0.705-0.135-0.974-0.404l-7.669-7.668c-0.539-0.537-0.539-1.409 0-1.948s1.409-0.539 1.948 0l7.669 7.668c0.539 0.537 0.539 1.409 0 1.948-0.27 0.27-0.621 0.404-0.974 0.404v0z"></path>
</svg>
