<?xml version="1.0" encoding="utf-8"?>
<!-- Generator: Adobe Illustrator 16.0.0, SVG Export Plug-In . SVG Version: 6.00 Build 0)  -->
<!DOCTYPE svg PUBLIC "-//W3C//DTD SVG 1.1//EN" "http://www.w3.org/Graphics/SVG/1.1/DTD/svg11.dtd">
<svg version="1.1" id="Calque_1" xmlns="http://www.w3.org/2000/svg" xmlns:xlink="http://www.w3.org/1999/xlink" x="0px" y="0px"
	 width="37px" height="37px" viewBox="0 -2.5 37 37" enable-background="new 0 -2.5 37 37" xml:space="preserve">
<path d="M18.704,32c-0.258,0-0.518-0.064-0.753-0.193c-0.069-0.039-0.137-0.082-0.2-0.132l-0.485-0.338
	c-1.159-0.806-3.868-2.69-5.663-4.075c-6.89-5.365-10.409-9.23-11.079-12.174c-0.32-0.969-0.51-2.139-0.524-3.342
	c-0.041-3.194,1.164-6.277,3.31-8.459c1.953-1.988,4.517-3.088,7.218-3.098h0.001c3.047,0,5.818,1.233,7.816,3.38
	c1.961-2.226,4.728-3.527,7.74-3.568L26.286,0c5.771,0,10.528,5.063,10.608,11.286c0.016,1.2-0.146,2.373-0.477,3.49
	c-0.557,2.82-4.072,6.898-10.709,12.333c-2.551,2.104-4.627,3.668-6.17,4.646C19.285,31.918,18.994,32,18.704,32L18.704,32z
	 M10.64,3.311C8.68,3.32,6.903,4.088,5.537,5.477C3.973,7.069,3.092,9.34,3.123,11.709c0.009,0.888,0.148,1.747,0.41,2.552
	c0.311,1.341,1.968,4.293,9.985,10.534c1.58,1.223,3.946,2.875,5.208,3.755c1.327-0.918,3.034-2.229,5-3.853
	c7.834-6.418,9.416-9.439,9.662-10.671c0.276-0.953,0.395-1.816,0.383-2.703c-0.058-4.523-3.416-8.201-7.486-8.201
	c-0.004,0-0.153,0.001-0.156,0.001c-2.652,0.035-5.042,1.473-6.393,3.846c-0.275,0.482-0.781,0.781-1.336,0.79
	c-0.52-0.001-1.07-0.279-1.357-0.755C15.647,4.693,13.253,3.311,10.64,3.311L10.64,3.311L10.64,3.311z"/>
</svg>
