<?xml version="1.0" encoding="UTF-8" standalone="no"?>
<!-- Generated by IcoMoon.io -->

<svg
   xmlns:dc="http://purl.org/dc/elements/1.1/"
   xmlns:cc="http://creativecommons.org/ns#"
   xmlns:rdf="http://www.w3.org/1999/02/22-rdf-syntax-ns#"
   xmlns:svg="http://www.w3.org/2000/svg"
   xmlns="http://www.w3.org/2000/svg"
   xmlns:sodipodi="http://sodipodi.sourceforge.net/DTD/sodipodi-0.dtd"
   xmlns:inkscape="http://www.inkscape.org/namespaces/inkscape"
   version="1.1"
   width="22.000004"
   height="21.999996"
   viewBox="0 0 22.000004 21.999996"
   id="svg3796"
   sodipodi:docname="plus_white22.svg"
   inkscape:version="0.92.4 (f8dce91, 2019-08-02)">
  <metadata
     id="metadata3802">
    <rdf:RDF>
      <cc:Work
         rdf:about="">
        <dc:format>image/svg+xml</dc:format>
        <dc:type
           rdf:resource="http://purl.org/dc/dcmitype/StillImage" />
        <dc:title></dc:title>
      </cc:Work>
    </rdf:RDF>
  </metadata>
  <defs
     id="defs3800" />
  <sodipodi:namedview
     pagecolor="#ffffff"
     bordercolor="#666666"
     borderopacity="1"
     objecttolerance="10"
     gridtolerance="10"
     guidetolerance="10"
     inkscape:pageopacity="0"
     inkscape:pageshadow="2"
     inkscape:window-width="1920"
     inkscape:window-height="968"
     id="namedview3798"
     showgrid="false"
     inkscape:zoom="22.627417"
     inkscape:cx="14.339182"
     inkscape:cy="10.418778"
     inkscape:window-x="1920"
     inkscape:window-y="27"
     inkscape:window-maximized="1"
     inkscape:current-layer="svg3796" />
  <path
     d="m 11.000299,15.590111 c -0.514031,0 -0.930184,-0.416908 -0.930184,-0.930341 V 7.3347885 c 0,-0.513434 0.415468,-0.930341 0.930184,-0.930341 0.514716,0 0.930184,0.416907 0.930184,0.930341 V 14.65977 c 0,0.513433 -0.415468,0.930341 -0.930184,0.930341 z"
     id="path3790"
     inkscape:connector-curvature="0"
     style="stroke-width:0.68452007" />
  <path
     d="M 14.661489,11.92762 H 7.3377401 c -0.513346,0 -0.930184,-0.416908 -0.930184,-0.930341 0,-0.513433 0.416838,-0.930341 0.930184,-0.930341 h 7.3237489 c 0.514031,0 0.930184,0.416908 0.930184,0.930341 0,0.513433 -0.414784,0.930341 -0.930184,0.930341 z"
     id="path3792"
     inkscape:connector-curvature="0"
     style="stroke-width:0.68452007" />
  <path
     d="m 10.999615,21.950522 c -2.9253929,0 -5.6755629,-1.138453 -7.7433241,-3.207247 C -1.0140703,14.472195 -1.0133858,7.5223625 3.2569754,3.2512824 5.3254211,1.1838579 8.0742221,0.04403611 11.000299,0.04403611 c 2.924708,0 5.676247,1.13913719 7.744693,3.20724629 4.269676,4.2724491 4.269676,11.2209126 0,15.4906236 -2.06913,2.069479 -4.819985,3.2093 -7.746062,3.2093 v 0 z m 6.84e-4,-20.0464884 c -2.4284729,0 -4.7111549,0.9460863 -6.4277868,2.6623225 -3.544831,3.5454274 -3.5461999,9.3150489 -0.00205,12.8618459 1.7166319,1.71692 3.9999979,2.662322 6.4277868,2.662322 2.429157,0 4.713208,-0.946086 6.431893,-2.663691 3.544147,-3.544744 3.544147,-9.3143645 0,-12.8597923 C 15.713507,2.8508045 13.430141,1.9047181 11.000299,1.9047181 v 0 z"
     id="path3794"
     inkscape:connector-curvature="0"
     style="stroke-width:0.68452007" />
  <path
     style="fill:#ffffff;stroke:#ffffff;stroke-width:0.13690402;stroke-miterlimit:4;stroke-dasharray:none;stroke-opacity:1"
     d="M 10.494949,21.921277 C 8.9781631,21.858827 7.4836661,21.471933 6.1200291,20.788699 5.0374051,20.246263 4.1517094,19.603666 3.2713747,18.721922 2.1843685,17.633174 1.3984784,16.446269 0.84784277,15.061738 -0.61214513,11.390709 0.00644847,7.2341125 2.4720429,4.1480358 2.8582327,3.6646589 3.6692889,2.8531562 4.1459102,2.4732469 5.8361891,1.1259444 7.7712751,0.33210131 9.8981151,0.11348131 c 0.5169959,-0.053142 1.5783129,-0.060263 2.0801249,-0.013956 3.005163,0.2773158 5.697486,1.72994019 7.580683,4.09010509 2.438926,3.0566471 3.050065,7.2437436 1.588594,10.8839186 -1.161294,2.892505 -3.507062,5.157024 -6.445662,6.222407 -1.312892,0.475985 -2.727372,0.686236 -4.206906,0.625321 z m 1.718954,-1.896717 c 1.679231,-0.238733 3.166728,-0.875683 4.477597,-1.917318 0.391561,-0.311139 1.15528,-1.078933 1.445553,-1.453265 1.022064,-1.318038 1.616814,-2.702159 1.870634,-4.353401 0.07376,-0.479825 0.10254,-1.60999 0.05419,-2.12778 C 19.819058,7.5723175 18.523698,5.2566885 16.437424,3.693604 15.206422,2.7713085 13.782696,2.1903016 12.213903,1.9700305 11.72018,1.9007085 10.581433,1.8857875 10.053558,1.9417255 7.4539181,2.2172013 5.1146301,3.5775975 3.599811,5.6948555 1.2987386,8.9110565 1.3418937,13.289978 3.7057233,16.441691 c 1.5574498,2.076562 3.7710728,3.32866 6.4010747,3.620659 0.363904,0.0404 1.729352,0.01592 2.107105,-0.03779 z"
     id="path3808"
     inkscape:connector-curvature="0" />
  <path
     style="fill:#ffffff;fill-opacity:1;stroke:#ffffff;stroke-width:0.13690402;stroke-miterlimit:4;stroke-dasharray:none;stroke-opacity:1"
     d="m 10.761109,15.548382 c -0.254135,-0.08357 -0.476374,-0.271671 -0.587451,-0.497216 -0.064,-0.129942 -0.06411,-0.132302 -0.07795,-1.627536 l -0.01386,-1.497405 -1.4832909,-0.01386 -1.483291,-0.01386 -0.15659,-0.07343 c -0.706336,-0.331211 -0.706336,-1.324368 0,-1.655579 l 0.15659,-0.07343 1.483291,-0.01386 1.4832909,-0.01386 0.01386,-1.4974055 0.01386,-1.497405 0.06717,-0.136511 c 0.08558,-0.173902 0.237707,-0.325968 0.423998,-0.423814 0.128457,-0.06747 0.177239,-0.07698 0.396029,-0.0772 0.203276,-2.08e-4 0.273039,0.01133 0.376384,0.06227 0.206118,0.101589 0.348009,0.242463 0.447272,0.444069 l 0.09127,0.185373 0.0081,1.476331 0.0081,1.4763305 1.489082,0.0078 1.489083,0.0078 0.128536,0.06396 c 0.207475,0.103242 0.346382,0.241125 0.44523,0.441946 0.07854,0.159561 0.0909,0.213343 0.0909,0.395309 0,0.181966 -0.01237,0.235748 -0.0909,0.395309 -0.09885,0.200821 -0.237755,0.338704 -0.44523,0.441946 l -0.128536,0.06396 -1.489083,0.0079 -1.489082,0.0079 -0.0081,1.47633 -0.0081,1.476331 -0.09127,0.185373 c -0.159117,0.32317 -0.424249,0.496747 -0.780092,0.510711 -0.115453,0.0045 -0.241105,-0.002 -0.279227,-0.01456 z"
     id="path3810"
     inkscape:connector-curvature="0" />
</svg>
