<svg xmlns="http://www.w3.org/2000/svg" width="20" height="20" viewBox="0 0 20 20">
    <path fill="#FFF" d="M10 0c5.532 0 10 4.468 10 10s-4.468 10-10 10S0 15.532 0 10 4.468 0 10 0zm0 1.66c-4.596 0-8.34 3.744-8.34 8.34s3.744 8.34 8.34 8.34 8.34-3.744 8.34-8.34S14.596 1.66 10 1.66zm.043 6c.468 0 .85.383.85.85v6.937c0 .425-.382.808-.85.808-.469 0-.852-.383-.852-.85V8.51c0-.468.383-.851.852-.851zm-.086-3.958c.469 0 .851.383.851.851v.809c-.042.468-.382.85-.85.85-.469 0-.852-.382-.852-.85v-.809c0-.468.383-.85.851-.85z"/>
</svg>
