<svg xmlns="http://www.w3.org/2000/svg" width="55" height="50" viewBox="0 0 55 50">
    <g fill="none" fill-rule="evenodd">
        <g fill-rule="nonzero" stroke="#FFF" stroke-width=".7">
            <g>
                <g>
                    <path fill="#272626" d="M43.592 22.199c-1.504-1.24-3.882-1.346-5.443.329l-3.875 4.16c-.501-1.61-2.005-2.783-3.777-2.783h-6.915c-.525 0-.7-.2-1.612-.903-3.475-3.03-8.694-3.02-12.159.03L7.27 25.268c-1.142-.605-2.476-.62-3.625-.046L.73 26.68c-.651.326-.915 1.118-.59 1.77l7.91 15.819c.326.651 1.118.915 1.77.59l2.914-1.459c1.437-.718 2.237-2.184 2.185-3.676h15.579c2.888 0 5.649-1.38 7.382-3.69l6.329-8.44c1.227-1.635 1.033-4.034-.616-5.395zM11.554 41.042l-1.736.869-6.731-13.462 1.737-.868c.65-.325 1.442-.062 1.768.59l5.551 11.103c.326.651.062 1.442-.59 1.768zm30.544-15.03l-6.328 8.44c-1.239 1.65-3.21 2.636-5.273 2.636h-16.5l-4.94-9.881 2.496-2.196c2.483-2.184 6.227-2.184 8.71 0 1.462 1.287 2.371 1.53 3.319 1.53h6.915c.726 0 1.318.592 1.318 1.319s-.592 1.318-1.318 1.318h-6.733c-.728 0-1.319.59-1.319 1.318 0 .728.591 1.319 1.319 1.319h7.616c1.094 0 2.149-.46 2.894-1.26l5.804-6.23c.53-.57 1.345-.522 1.844-.085.522.457.578 1.238.176 1.772z" transform="translate(-893 -2050) translate(893 2050) translate(5 3)"/>
                    <path fill="#FF641E" d="M27.72 8.996c.902-.947 1.458-2.226 1.458-3.635C29.178 2.459 26.834 0 23.905 0c-2.906 0-5.36 2.455-5.36 5.361 0 1.366.534 2.655 1.506 3.646-2.41 1.351-4.143 3.946-4.143 6.988v1.318c0 .728.59 1.319 1.318 1.319h13.27c.728 0 1.319-.591 1.319-1.319v-1.318c0-2.983-1.64-5.617-4.096-6.999zm-3.815-6.36c1.43 0 2.637 1.249 2.637 2.725 0 1.454-1.183 2.637-2.637 2.637-1.476 0-2.724-1.208-2.724-2.637 0-1.45 1.273-2.724 2.724-2.724zm-5.36 13.36c0-2.907 2.454-5.362 5.36-5.362 2.907 0 5.273 2.405 5.273 5.361H18.544z" transform="translate(-893 -2050) translate(893 2050) translate(5 3)"/>
                </g>
            </g>
        </g>
    </g>
</svg>
