<?xml version="1.0" encoding="UTF-8"?>
<svg width="14px" height="14px" viewBox="0 0 14 14" version="1.1" xmlns="http://www.w3.org/2000/svg" xmlns:xlink="http://www.w3.org/1999/xlink">
    <!-- Generator: sketchtool 55.2 (78181) - https://sketchapp.com -->
    <title>8C48E8B3-0870-4886-9AC8-8D36EC12CE73</title>
    <desc>Created with sketchtool.</desc>
    <g id="Page-1" stroke="none" stroke-width="1" fill="none" fill-rule="evenodd">
        <g id="Popin01" transform="translate(-458.000000, -460.000000)" fill-rule="nonzero">
            <g id="Group" transform="translate(302.000000, 180.000000)">
                <g id="Group-2" transform="translate(116.000000, 112.000000)">
                    <g id="ic_color_checked" transform="translate(40.000000, 168.000000)">
                        <circle id="Oval" fill="#FF641E" cx="7" cy="7" r="7"></circle>
                        <path d="M9.1945504,5.20601386 C9.44896253,4.93985933 9.87096513,4.93034022 10.1371197,5.18475233 C10.4032742,5.43916443 10.4127933,5.86116707 10.1583812,6.1273216 L6.65348349,9.79398827 C6.3873571,10.0723977 5.94135884,10.0680338 5.68073115,9.78447027 L3.84250009,7.78447027 C3.59334465,7.51338849 3.61111943,7.09165291 3.88220118,6.84249747 C4.15328293,6.59334202 4.57501851,6.6111168 4.82417395,6.88219855 L6.18110605,8.35854407 L9.1945504,5.20601386 Z" id="Line-2" fill="#FFFFFF"></path>
                    </g>
                </g>
            </g>
        </g>
    </g>
</svg>