<svg xmlns="http://www.w3.org/2000/svg" width="30" height="24" viewBox="0 0 30 24">
    <g fill="#FFF" fill-rule="evenodd">
        <path d="M1 3c.552 0 1 .448 1 1v19c0 .552-.448 1-1 1s-1-.448-1-1V4c0-.552.448-1 1-1zm6 0c.552 0 1 .448 1 1v19c0 .552-.448 1-1 1s-1-.448-1-1V4c0-.552.448-1 1-1zm5.69 1.23l6.499 17.855c.189.519-.079 1.093-.598 1.282-.519.189-1.093-.079-1.282-.598L10.811 4.915c-.189-.519.079-1.093.598-1.282.519-.189 1.093.079 1.282.598zM29.536.464c.39.391.39 1.024 0 1.415l-5.657 5.657c-.155.154-.348.248-.549.28-.048.11-.118.214-.209.305-.39.39-1.023.39-1.414 0L18.88 5.293c-.39-.39-.39-1.024 0-1.414.39-.39 1.023-.39 1.414 0L22.5 6.086 28.12.464c.39-.39 1.024-.39 1.415 0z"/>
    </g>
</svg>
