<?xml version="1.0" encoding="utf-8"?>
<!-- Generator: Adobe Illustrator 16.0.0, SVG Export Plug-In . SVG Version: 6.00 Build 0)  -->
<!DOCTYPE svg PUBLIC "-//W3C//DTD SVG 1.1//EN" "http://www.w3.org/Graphics/SVG/1.1/DTD/svg11.dtd">
<svg version="1.1" id="Mode_Isolation" xmlns="http://www.w3.org/2000/svg" xmlns:xlink="http://www.w3.org/1999/xlink" x="0px"
	 y="0px" width="11.68px" height="11.68px" viewBox="-2.419 0 11.68 11.68" enable-background="new -2.419 0 11.68 11.68"
	 xml:space="preserve">
<g>
	<path fill="#3E3E3E" d="M1,11.68c-0.256,0-0.512-0.098-0.707-0.293c-0.391-0.391-0.391-1.024,0-1.414L4.429,5.84L0.293,1.707
		c-0.391-0.391-0.391-1.023,0-1.414c0.391-0.392,1.023-0.392,1.414,0l4.842,4.84C6.735,5.32,6.842,5.575,6.842,5.84
		S6.737,6.36,6.549,6.547l-4.842,4.84C1.512,11.583,1.256,11.68,1,11.68L1,11.68z"/>
</g>
</svg>
