<?xml version="1.0" encoding="utf-8"?>
<!-- Generator: Adobe Illustrator 15.1.0, SVG Export Plug-In . SVG Version: 6.00 Build 0)  -->
<!DOCTYPE svg PUBLIC "-//W3C//DTD SVG 1.1//EN" "http://www.w3.org/Graphics/SVG/1.1/DTD/svg11.dtd">
<svg version="1.1" id="Calque_1" xmlns="http://www.w3.org/2000/svg" xmlns:xlink="http://www.w3.org/1999/xlink" x="0px" y="0px"
	 width="52.835px" height="30.376px" viewBox="0 0 52.835 30.376" enable-background="new 0 0 52.835 30.376" xml:space="preserve">
<g>
	<defs>
		<rect id="SVGID_1_" width="52.835" height="30.376"/>
	</defs>
	<clipPath id="SVGID_2_">
		<use xlink:href="#SVGID_1_"  overflow="visible"/>
	</clipPath>
	<path clip-path="url(#SVGID_2_)" fill="#3E3E3E" d="M36.56,29.875H4.917C2.208,29.875,0,27.67,0,24.958V4.918
		C0,2.207,2.208,0,4.917,0H36.56c2.713,0,4.916,2.207,4.916,4.918v20.04C41.476,27.67,39.272,29.875,36.56,29.875 M4.917,3.504
		c-0.777,0-1.413,0.635-1.413,1.414v20.04c0,0.778,0.636,1.413,1.413,1.413H36.56c0.78,0,1.413-0.635,1.413-1.413V4.918
		c0-0.779-0.633-1.414-1.413-1.414H4.917z"/>
	<rect x="1.142" y="8.806" clip-path="url(#SVGID_2_)" fill="#3E3E3E" width="40.333" height="5.52"/>
	<path clip-path="url(#SVGID_2_)" fill="#3E3E3E" d="M34.312,19.895H7.165c-0.483,0-0.876-0.392-0.876-0.876
		s0.393-0.876,0.876-0.876h27.147c0.486,0,0.876,0.392,0.876,0.876S34.798,19.895,34.312,19.895"/>
	<path clip-path="url(#SVGID_2_)" fill="#3E3E3E" d="M52.496,28.398l-5.851-5.85c1.753-2.025,2.82-4.657,2.82-7.539
		c-0.002-6.368-5.184-11.55-11.55-11.55C31.55,3.46,26.37,8.645,26.367,15.014c0.003,6.365,5.183,11.544,11.547,11.544
		c2.654,0,5.094-0.908,7.046-2.417l5.898,5.896c0.226,0.227,0.521,0.339,0.818,0.339s0.594-0.112,0.819-0.339
		C52.949,29.584,52.949,28.852,52.496,28.398 M28.685,15.014c0.002-5.092,4.144-9.235,9.231-9.236c5.09,0,9.231,4.141,9.233,9.233
		c0,5.09-4.143,9.229-9.235,9.229C32.827,24.24,28.687,20.101,28.685,15.014"/>
	<path clip-path="url(#SVGID_2_)" fill="#FFFFFF" d="M47.381,14.917c0,5.24-4.249,9.489-9.489,9.489
		c-5.241,0-9.489-4.249-9.489-9.489c0-5.241,4.248-9.49,9.489-9.49C43.132,5.427,47.381,9.676,47.381,14.917"/>
</g>
<g>
	<path fill="#3E3E3E" d="M33.721,17.981c-0.219,0.104-0.703,0.266-1.321,0.266c-1.388,0-2.291-0.941-2.291-2.348
		c0-1.417,0.97-2.453,2.472-2.453c0.494,0,0.932,0.124,1.159,0.248l-0.189,0.637c-0.2-0.104-0.514-0.219-0.97-0.219
		c-1.056,0-1.626,0.789-1.626,1.74c0,1.064,0.685,1.721,1.598,1.721c0.475,0,0.789-0.114,1.026-0.219L33.721,17.981z"/>
	<path fill="#3E3E3E" d="M34.954,13.542l0.902,2.577c0.152,0.428,0.276,0.808,0.371,1.188h0.028c0.104-0.38,0.238-0.76,0.39-1.188
		l0.894-2.577h0.875l-1.807,4.601H35.81l-1.749-4.601H34.954z"/>
	<path fill="#3E3E3E" d="M39.523,13.542l0.902,2.577c0.152,0.428,0.276,0.808,0.371,1.188h0.028c0.104-0.38,0.238-0.76,0.39-1.188
		l0.894-2.577h0.875l-1.807,4.601h-0.798l-1.749-4.601H39.523z"/>
</g>
</svg>
