[
  {
    "id": "16253289",
    "name": "Volkswagen Passat",
    "price": 35000,
    "engine": "2.0l Gasoline",
    "hp": "280hp",
    "years": 2020,
    "image": "https://cdn.motor1.com/images/mgl/geNbP/s1/4x3/vw-passat-facelift-2019.webp",
    "color": "Grey"
  },
  {
    "id": "22222224",
    "name": "Audi A4",
    "price": 21900,
    "engine": "2.0l Gasoline",
    "hp": "252hp",
    "years": 2017,
    "image": "https://cdn.motor1.com/images/mgl/2yp2k/s1/2017-audi-a4.jpg",
    "color": "White"
  },
  {
    "id": "53874512",
    "name": "Mercedes-Benz E400",
    "price": 55000,
    "engine": "3.0l Diesel",
    "hp": "340hp",
    "years": 2018,
    "image": "https://assets-eu-01.kc-usercontent.com/3b3d460e-c5ae-0195-6b86-3ac7fb9d52db/01e1b74f-2ecc-4afd-a7fb-babadaf19c50/Mercedes%20E-Class%20Estate%20%281%29.jpg",
    "color": "Grey"
  },
  {
    "id": "67773933",
    "name": "BMW 540i",
    "price": 65000,
    "engine": "3.0l Gasoline",
    "hp": "333hp",
    "years": 2021,
    "image": "https://i.ytimg.com/vi/B0-z8LCf6-0/maxresdefault.jpg",
    "color": "Black"
  },
  {
    "id": "03333333",
    "name": "Volkswagen Golf R",
    "price": 30000,
    "engine": "2.0l Gasoline",
    "hp": "310hp",
    "years": 2020,
    "image": "https://img.classistatic.de/api/v1/mo-prod/images/fa/fa9e6445-3657-4550-a67b-36f770323480?rule=mo-1024.jpg",
    "color": "Black"
  },
  {
    "id": "58833882",
    "name": "Audi RS6",
    "price": 175000,
    "engine": "4.0l Gasoline",
    "hp": "600hp",
    "years": 2021,
    "image": "https://cars.ua/thumb/upload/w933/h622/q80/634fb6c0103837_52368312.jpeg",
    "color": "Black"
  },
  {
    "id": "13467812",
    "name": "Mercedes-Benz S500",
    "price": 180000,
    "engine": "3.0l Gasoline",
    "hp": "435hp",
    "years": 2022,
    "image": "https://mfair.ua/user/cars/53087/53087-new-sedan-mercedes-benz-s-class-s-400d-4matic-amg-black-series-kiev-2021-1.jpg",
    "color": "Black"
  },
  {
    "id": "18121342",
    "name": "Volkswagen Tiguan",
    "price": 43500,
    "engine": "2.0l Gasoline",
    "hp": "220hp",
    "years": 2022,
    "image": "https://i.infocar.ua/i/12/6246/1400x936.jpg",
    "color": "Green"
  },
  {
    "id": "18777812",
    "name": "Skoda Kodiaq",
    "price": 34400,
    "engine": "2.0l Diesel",
    "hp": "150hp",
    "years": 2020,
    "image": "https://i.pinimg.com/originals/36/00/91/360091c3e91540eaad59400e176fe0cb.jpg",
    "color": "White"
  },
  {
    "id": "18777772",
    "name": "Mercedes-Benz G63",
    "price": 243500,
    "engine": "4.0l Gasoline",
    "hp": "585hp",
    "years": 2020,
    "image": "https://mfair.ua/user/cars/52367/52367-oficial-mercedes-benz-g-class-63-amg-edition1-kiev-2019-1.jpg",
    "color": "Black"
  },
  {
    "id": "87777890",
    "name": "BMW X7",
    "price": 99800,
    "engine": "3.0l Diesel",
    "hp": "400hp",
    "years": 2020,
    "image": "https://cdn0.riastatic.com/photosnew/auto/photo/bmw_x7__502795780f.webp",
    "color": "White"
  },
  {
    "id": "87770972",
    "name": "BMW 7 Series",
    "price": 95900,
    "engine": "6.6l Gasoline",
    "hp": "510hp",
    "years": 2021,
    "image": "https://cdn3.riastatic.com/photosnew/auto/photo/bmw_7-series__490130393f.webp",
    "color": "Black"
  },
  {
    "id": "12345678",
    "name": "Land Rover Range Rover",
    "price": 243500,
    "engine": "3.0l Diesel",
    "hp": "249hp",
    "years": 2023,
    "image": "https://cdn.riastatic.com/photosnewr/auto/new_auto_storage/land-rover-range-rover__2054395-620x465x72.webp",
    "color": "Beige"
  },
  {
    "id": "87654321",
    "name": " Land Rover Defender ",
    "price": 162000,
    "engine": "5.0l Gasoline",
    "hp": "525hp",
    "years": 2023,
    "image": "https://cdn.riastatic.com/photosnewr/auto/new_auto_storage/land-rover-defender__2004228-341x224x60.webp",
    "color": "Black"
  },
  {
    "id": "18569012",
    "name": "Cadillac Escalade",
    "price": 350000,
    "engine": "6.2l Gasoline",
    "hp": "682hp",
    "years": 2023,
    "image": "https://o.aolcdn.com/images/dims3/GLOB/legacy_thumbnail/1062x597/format/jpg/quality/100/https://s.aolcdn.com/os/ab/_cms/2022/06/10140253/2023-Cadillac-Escalade-V.jpg",
    "color": "Black"
  },
  {
    "id": "18764532",
    "name": "Audi S8",
    "price": 120000,
    "engine": "4.0l Gasoline",
    "hp": "571hp",
    "years": 2021,
    "image": "https://cdn4.riastatic.com/photosnew/auto/photo/audi_s8__501937419f.webp",
    "color": "Black"
  },
  {
    "id": "58777778",
    "name": "Lamborghini Huracan ",
    "price": 360000,
    "engine": "5.2l Gasoline",
    "hp": "640hp",
    "years": 2021,
    "image": "https://cdn3.riastatic.com/photosnew/auto/photo/lamborghini_huracan__482077728f.webp",
    "color": "Green"
  },
  {
    "id": "77777777",
    "name": "Rolls-Royce Ghost  Black Badge",
    "price": 490000,
    "engine": "6.75l Gasoline",
    "hp": "600hp",
    "years": 2021,
    "image": "https://cdn3.riastatic.com/photosnew/auto/photo/rolls-royce_ghost__484061818f.webp",
    "color": "Black"
  },
  {
    "id": "90667543",
    "name": "Porsche 911 GT3",
    "price": 320000,
    "engine": "4.0l Gasoline",
    "hp": "510hp",
    "years": 2023,
    "image": "https://auto.bigmir.net/i/68/56/05/9/6856059/image_main/498c869ed52c19cc53f939699db27274-resize_crop_1Xquality_100Xallow_enlarge_0Xw_1200Xh_630.jpg",
    "color": "Dolomite Silver Metallic"
  },
  {
    "id": "59121259",
    "name": "Porsche Cayenne",
    "price": 131500,
    "engine": "4.0l Gasoline",
    "hp": "460hp",
    "years": 2021,
    "image": "https://cdn2.riastatic.com/photosnew/auto/photo/porsche_cayenne__508869112f.webp",
    "color": "Grey"
  },
  {
    "id": "97671977",
    "name": "Volkswagen Touareg",
    "price": 80500,
    "engine": "3.0l Diesel",
    "hp": "286hp",
    "years": 2023,
    "image": "https://cdn.riastatic.com/photosnewr/auto/new_auto_storage/volkswagen-touareg__1902703-620x465x72.webp",
    "color": "Black"
  },
  {
    "id": "00000001",
    "name": "Toyota Supra",
    "price": 55000,
    "engine": "3.0l Gasoline",
    "hp": "387hp",
    "years": 2020,
    "image": "https://upload.wikimedia.org/wikipedia/commons/thumb/5/5c/2020_Toyota_Supra_front_in_red_NYIAS_2019.jpg/1200px-2020_Toyota_Supra_front_in_red_NYIAS_2019.jpg",
    "color": "Red"
  }
]