
<- Color ----------------------------------------------------------------------
The Color class handles RGB colors.

An instance can be contructed from either a RGB value:
new Color( array( 'rgb' => 12345 ) );

Or from distinct red, green, blue constitutives:
new Color( array( 'red' => 255, 'green' => 255, 'blue' => 255 ) );

Red, green, blue constitutives and RGB values are converted to intergers.
Negative values are limited to 0, values grater than 255 - limited to 255.

The class provides the following methods :

Color   add( Color $rhs );
Adds each color constitutive and returns a new Color instance.

Color   sub( Color $rhs );
Substracts each color constitutive and returns a new Color instance.

Color   mult( $f );
Multiplies each color constitutive by factor $f and returns a new Color
instance.
---------------------------------------------------------------------- Color ->