{
  "nomCommercial": "TuyO - Plombier à Vélo Lyon",
  "phraseAccroche": "Des solutions de plomberie rapides et écologiques avec TuyO, votre plombier à vélo à Lyon",
  "texteAppelAction": "Demandez une intervention",
  "avantagesClients": [
    "Interventions rapides grâce à nos plombiers à vélo",
    "Approche écologique avec des déplacements à vélo",
    "Expertise en plomberie pour résoudre tous vos problèmes"
  ],
  "services": [
    {
      "nom": "Réparations Express",
      "description": "Nos plombiers à vélo interviennent rapidement pour résoudre les fuites, les robinets défectueux, et autres problèmes de plomberie dans les plus brefs délais.",
      "image-url": "https://js-dynamic-portfolio-data-makerslab-emlyon-cdweb-8f83155c64a0cc.gitlab.io/images/plombier-a-velo/reparation-express.webp"
    },
    {
      "nom": "Débouchage Écologique",
      "description": "Nous utilisons des méthodes écologiques pour déboucher vos canalisations, éviers et toilettes. Un service efficace qui respecte l'environnement.",
      "image-url": "https://js-dynamic-portfolio-data-makerslab-emlyon-cdweb-8f83155c64a0cc.gitlab.io/images/plombier-a-velo/debouchage-ecologique.webp"
    },
    {
      "nom": "Installation Éco-Responsable",
      "description": "Optez pour des installations de plomberie durables et respectueuses de l'environnement. Notre équipe assure des installations éco-responsables pour votre confort à long terme.",
      "image-url": "https://js-dynamic-portfolio-data-makerslab-emlyon-cdweb-8f83155c64a0cc.gitlab.io/images/plombier-a-velo/installation-eco-responsable.webp"
    }
  ],
  "temoignages": [
    {
      "prenom": "Sylvie",
      "typeIntervention": "Réparations Express",
      "commentaire": "TuyO a résolu rapidement un problème de fuite dans ma cuisine. L'intervention à vélo était une excellente idée, rapide et efficace. Je recommande leurs services.",
      "note": 4
    },
    {
      "prenom": "Jean",
      "typeIntervention": "Débouchage Écologique",
      "commentaire": "Le débouchage écologique de TuyO a résolu notre problème de canalisation sans nuire à l'environnement. Un service ingénieux et responsable.",
      "note": 5
    },
    {
      "prenom": "Pierre",
      "typeIntervention": "Installation Éco-Responsable",
      "commentaire": "TuyO a installé une nouvelle plomberie dans notre maison de manière éco-responsable. Un travail de qualité et une équipe professionnelle. Nous sommes très satisfaits.",
      "note": 4
    }
  ]
}
