{
  "nomCommercial": "Dehors! - Escape Game Paris",
  "phraseAccroche": "Découvrez l'aventure ultime avec Dehors!, votre destination d'escape game à Paris",
  "texteAppelAction": "Réservez votre aventure",
  "avantagesClients": [
    "Énigmes captivantes pour des expériences uniques",
    "Maîtres du jeu passionnés pour vous guider",
    "Ambiances immersives dans des décors soigneusement conçus"
  ],
  "activites": [
    {
      "nom": "Mystère du Manoir",
      "description": "Explorez un manoir mystérieux rempli d'énigmes et de mystères. Parviendrez-vous à résoudre les énigmes et à vous échapper avant que le temps ne s'écoule ?",
      "image-url": "https://js-dynamic-portfolio-data-makerslab-emlyon-cdweb-8f83155c64a0cc.gitlab.io/images/escape-game/mystere-du-manoir.webp"
    },
    {
      "nom": "Évasion dans l'Espace",
      "description": "Voyagez dans l'espace et relevez des défis intergalactiques. Une aventure cosmique qui mettra à l'épreuve votre esprit d'équipe et votre ingéniosité.",
      "image-url": "https://js-dynamic-portfolio-data-makerslab-emlyon-cdweb-8f83155c64a0cc.gitlab.io/images/escape-game/evasion-dans-l-espace.webp"
    },
    {
      "nom": "Mission Secrète: Paris",
      "description": "Plongez dans une mission secrète au cœur de Paris. Résolvez des énigmes pour déjouer les complots et accomplir votre mission dans la Ville Lumière.",
      "image-url": "https://js-dynamic-portfolio-data-makerslab-emlyon-cdweb-8f83155c64a0cc.gitlab.io/images/escape-game/mission-secrete-paris.webp"
    }
  ],
  "temoignages": [
    {
      "prenom": "Alexandre",
      "typeExperience": "Mystère du Manoir",
      "commentaire": "L'expérience du Mystère du Manoir chez Dehors! était incroyable. Les énigmes étaient stimulantes, et l'atmosphère était parfaitement captivante. À refaire !",
      "note": 5
    },
    {
      "prenom": "Camille",
      "typeExperience": "Évasion dans l'Espace",
      "commentaire": "Une aventure spatiale passionnante chez Dehors! L'évasion dans l'espace était pleine de rebondissements. Nous avons adoré chaque minute de cette expérience unique.",
      "note": 4
    },
    {
      "prenom": "Lucie",
      "typeExperience": "Mission Secrète: Paris",
      "commentaire": "La Mission Secrète: Paris chez Dehors! était une expérience mémorable. Les énigmes étaient intelligentes, et l'intrigue nous a tenus en haleine. Recommandé à tous les amateurs d'escape game !",
      "note": 5
    }
  ]
}
