
(kicad_symbol_lib (version 20211014) (generator kicad_symbol_editor)
  (symbol "ABM8-25.000MHz-12-D1X-T" (pin_names (offset 1.016)) (in_bom yes) (on_board yes)
    (property "Reference" "Y" (id 0) (at -5.0878 6.35585 0)
      (effects (font (size 1.27 1.27)) (justify bottom left))
    )
    (property "Value" "ABM8-25.000MHz-12-D1X-T" (id 1) (at -5.09439 -10.16 0)
      (effects (font (size 1.27 1.27)) (justify bottom left))
    )
    (property "Footprint" "XTAL_ABM8-25.000MHz-12-D1X-T" (id 2) (at 0 0 0)
      (effects (font (size 1.27 1.27)) (justify bottom) hide)
    )
    (property "MAXIMUM_PACKAGE_HEIGHT" "0.8 mm" (id 4) (at 0 0 0)
      (effects (font (size 1.27 1.27)) (justify bottom) hide)
    )
    (property "STANDARD" "Manufacturer Recommendations" (id 5) (at 0 0 0)
      (effects (font (size 1.27 1.27)) (justify bottom) hide)
    )
    (property "PARTREV" "44041" (id 6) (at 0 0 0)
      (effects (font (size 1.27 1.27)) (justify bottom) hide)
    )
    (property "MANUFACTURER" "Abracon" (id 7) (at 0 0 0)
      (effects (font (size 1.27 1.27)) (justify bottom) hide)
    )
    (symbol "ABM8-25.000MHz-12-D1X-T_0_0"
      (polyline
        (pts (xy -1.397 2.54) (xy 1.397 2.54)) (stroke (width 0.4064))
      )
      (polyline
        (pts (xy 1.397 2.54) (xy 1.397 -2.54)) (stroke (width 0.4064))
      )
      (polyline
        (pts (xy 1.397 -2.54) (xy -1.397 -2.54)) (stroke (width 0.4064))
      )
      (polyline
        (pts (xy -1.397 2.54) (xy -1.397 -2.54)) (stroke (width 0.4064))
      )
      (polyline
        (pts (xy 2.3368 2.54) (xy 2.3368 -2.54)) (stroke (width 0.4064))
      )
      (polyline
        (pts (xy -2.3368 2.54) (xy -2.3368 -2.54)) (stroke (width 0.4064))
      )
      (polyline
        (pts (xy -5.08 0.0) (xy -2.54 0.0)) (stroke (width 0.1524))
      )
      (polyline
        (pts (xy 2.54 0.0) (xy 5.08 0.0)) (stroke (width 0.1524))
      )
      (rectangle (start -5.08 -7.62) (end 5.08 5.08)
        (stroke (width 0.254)) (fill (type background))
      )
      (pin passive line (at 7.62 0.0 180.0) (length 2.54)
        (name "~"
          (effects (font (size 1.016 1.016)))
        )
        (number "3"
          (effects (font (size 1.016 1.016)))
        )
      )
      (pin passive line (at -7.62 0.0 0) (length 2.54)
        (name "~"
          (effects (font (size 1.016 1.016)))
        )
        (number "1"
          (effects (font (size 1.016 1.016)))
        )
      )
      (pin power_in line (at 7.62 -5.08 180.0) (length 2.54)
        (name "GND"
          (effects (font (size 1.016 1.016)))
        )
        (number "2"
          (effects (font (size 1.016 1.016)))
        )
      )
      (pin power_in line (at 7.62 -5.08 180.0) (length 2.54)
        (name "GND"
          (effects (font (size 1.016 1.016)))
        )
        (number "4"
          (effects (font (size 1.016 1.016)))
        )
      )
    )
  )
)