
(module SW_TL3305AF260QG (layer F.Cu) (tedit 62446D41)
  (descr "")
  (fp_text reference REF** (at 0.16155 -5.48386 0) (layer F.SilkS)
    (effects (font (size 0.8 0.8) (thickness 0.15)))
  )
  (fp_text value SW_TL3305AF260QG (at 5.91801 5.57039 0) (layer F.Fab)
    (effects (font (size 0.8 0.8) (thickness 0.15)))
  )
  (pad 1 smd rect (at -1.5 -3.6) (size 1.4 1.6) (layers F.Cu F.Mask F.Paste))
  (pad 2 smd rect (at -1.5 3.6) (size 1.4 1.6) (layers F.Cu F.Mask F.Paste))
  (pad 3 smd rect (at 1.5 -3.6) (size 1.4 1.6) (layers F.Cu F.Mask F.Paste))
  (pad 4 smd rect (at 1.5 3.6) (size 1.4 1.6) (layers F.Cu F.Mask F.Paste))
  (fp_circle (center -2.7 -3.6) (end -2.6 -3.6) (layer F.Fab) (width 0.2))
  (fp_circle (center -2.7 -3.6) (end -2.6 -3.6) (layer F.SilkS) (width 0.2))
  (fp_line (start -2.5 -4.65) (end -2.5 4.65) (layer F.CrtYd) (width 0.05))
  (fp_line (start -2.5 -4.65) (end 2.5 -4.65) (layer F.CrtYd) (width 0.05))
  (fp_line (start 2.5 4.65) (end 2.5 -4.65) (layer F.CrtYd) (width 0.05))
  (fp_line (start 2.5 4.65) (end -2.5 4.65) (layer F.CrtYd) (width 0.05))
  (fp_line (start -2.25 -2.25) (end -2.25 2.25) (layer F.Fab) (width 0.127))
  (fp_line (start -2.25 -2.25) (end 2.25 -2.25) (layer F.Fab) (width 0.127))
  (fp_line (start 2.25 2.25) (end 2.25 -2.25) (layer F.Fab) (width 0.127))
  (fp_line (start 2.25 2.25) (end -2.25 2.25) (layer F.Fab) (width 0.127))
  (fp_line (start -2.25 -2.25) (end -2.25 2.25) (layer F.SilkS) (width 0.127))
  (fp_line (start -2.25 -2.25) (end 2.25 -2.25) (layer F.SilkS) (width 0.127))
  (fp_line (start 2.25 2.25) (end 2.25 -2.25) (layer F.SilkS) (width 0.127))
  (fp_line (start 2.25 2.25) (end -2.25 2.25) (layer F.SilkS) (width 0.127))
)