
(footprint XTAL_ABM8-25.000MHz-12-D1X-T (layer F.Cu) (tedit 64289148)
  (descr "")
  (attr smd)
  (fp_text reference REF** (at 1.525 -2.885 0) (layer F.SilkS)
    (effects (font (size 1.0 1.0) (thickness 0.15)))
  )
  (fp_text value XTAL_ABM8-25.000MHz-12-D1X-T (at 16.13 2.885 0) (layer F.Fab)
    (effects (font (size 1.0 1.0) (thickness 0.15)))
  )
  (pad 1 smd rect (at -0.875 -1.15) (size 1.05 1.3) (layers F.Cu F.Mask F.Paste))
  (pad 2 smd rect (at -0.875 1.15) (size 1.05 1.3) (layers F.Cu F.Mask F.Paste))
  (pad 3 smd rect (at 0.875 1.15) (size 1.05 1.3) (layers F.Cu F.Mask F.Paste))
  (pad 4 smd rect (at 0.875 -1.15) (size 1.05 1.3) (layers F.Cu F.Mask F.Paste))
  (fp_line (start -1.25 -1.6) (end 1.25 -1.6) (layer F.Fab) (width 0.127))
  (fp_line (start 1.25 -1.6) (end 1.25 1.6) (layer F.Fab) (width 0.127))
  (fp_line (start -1.25 -1.6) (end -1.25 1.6) (layer F.Fab) (width 0.127))
  (fp_line (start 1.25 1.6) (end -1.25 1.6) (layer F.Fab) (width 0.127))
  (fp_line (start 1.25 -0.18) (end 1.25 0.18) (layer F.SilkS) (width 0.127))
  (fp_line (start -1.25 -0.18) (end -1.25 0.18) (layer F.SilkS) (width 0.127))
  (fp_line (start -1.65 -2.05) (end 1.65 -2.05) (layer F.CrtYd) (width 0.05))
  (fp_line (start -1.65 -2.05) (end -1.65 2.05) (layer F.CrtYd) (width 0.05))
  (fp_line (start 1.65 -2.05) (end 1.65 2.05) (layer F.CrtYd) (width 0.05))
  (fp_line (start 1.65 2.05) (end -1.65 2.05) (layer F.CrtYd) (width 0.05))
  (fp_circle (center -2.15 -1.15) (end -2.05 -1.15) (layer F.SilkS) (width 0.2))
  (fp_circle (center -2.15 -1.15) (end -2.05 -1.15) (layer F.Fab) (width 0.2))
)