(module RM_10_ADI (layer F.Cu)
  (fp_text reference REF** (at 0 0) (layer F.SilkS)
    (effects (font (size 1 1) (thickness .15)))
  )
  (fp_text value RM_10_ADI (at 0 0) (layer F.SilkS)
    (effects (font (size 1 1) (thickness .15)))
  )
  (fp_text user "Copyright 2021 Accelerated Designs. All rights reserved." (at 0 0) (layer Cmts.User)
    (effects (font (size .127 .127) (thickness .002)))
  )
  (fp_text user "*" (at -2.4257 -2.4732) (layer F.SilkS)
    (effects (font (size 1 1) (thickness .15)))
  )
  (fp_text user "*" (at -1.1684 -1.4732) (layer F.Fab)
    (effects (font (size 1 1) (thickness .15)))
  )
  (fp_text user "0.02in/0.5mm" (at -5.2197 -.75) (layer Cmts.User)
    (effects (font (size 1 1) (thickness .15)))
  )
  (fp_text user "0.013in/0.33mm" (at 5.2197 -1) (layer Cmts.User)
    (effects (font (size 1 1) (thickness .15)))
  )
  (fp_text user "0.171in/4.343mm" (at 0 -3.9624) (layer Cmts.User)
    (effects (font (size 1 1) (thickness .15)))
  )
  (fp_text user "0.06in/1.513mm" (at -2.1717 3.9624) (layer Cmts.User)
    (effects (font (size 1 1) (thickness .15)))
  )
  (fp_text user "*" (at -2.4257 -2.4732) (layer F.SilkS)
    (effects (font (size 1 1) (thickness .15)))
  )
  (fp_text user "*" (at -1.1684 -1.4732) (layer F.Fab)
    (effects (font (size 1 1) (thickness .15)))
  )
  (fp_line (start -1.5494 -.8349) (end -1.5494 -1.1651) (layer F.Fab) (width .1))
  (fp_line (start -1.5494 -1.1651) (end -2.5781 -1.1651) (layer F.Fab) (width .1))
  (fp_line (start -2.5781 -1.1651) (end -2.5781 -.8349) (layer F.Fab) (width .1))
  (fp_line (start -2.5781 -.8349) (end -1.5494 -.8349) (layer F.Fab) (width .1))
  (fp_line (start -1.5494 -.3349) (end -1.5494 -.6651) (layer F.Fab) (width .1))
  (fp_line (start -1.5494 -.6651) (end -2.5781 -.6651) (layer F.Fab) (width .1))
  (fp_line (start -2.5781 -.6651) (end -2.5781 -.3349) (layer F.Fab) (width .1))
  (fp_line (start -2.5781 -.3349) (end -1.5494 -.3349) (layer F.Fab) (width .1))
  (fp_line (start -1.5494 .1651) (end -1.5494 -.1651) (layer F.Fab) (width .1))
  (fp_line (start -1.5494 -.1651) (end -2.5781 -.1651) (layer F.Fab) (width .1))
  (fp_line (start -2.5781 -.1651) (end -2.5781 .1651) (layer F.Fab) (width .1))
  (fp_line (start -2.5781 .1651) (end -1.5494 .1651) (layer F.Fab) (width .1))
  (fp_line (start -1.5494 .6651) (end -1.5494 .3349) (layer F.Fab) (width .1))
  (fp_line (start -1.5494 .3349) (end -2.5781 .3349) (layer F.Fab) (width .1))
  (fp_line (start -2.5781 .3349) (end -2.5781 .6651) (layer F.Fab) (width .1))
  (fp_line (start -2.5781 .6651) (end -1.5494 .6651) (layer F.Fab) (width .1))
  (fp_line (start -1.5494 1.1651) (end -1.5494 .8349) (layer F.Fab) (width .1))
  (fp_line (start -1.5494 .8349) (end -2.5781 .8349) (layer F.Fab) (width .1))
  (fp_line (start -2.5781 .8349) (end -2.5781 1.1651) (layer F.Fab) (width .1))
  (fp_line (start -2.5781 1.1651) (end -1.5494 1.1651) (layer F.Fab) (width .1))
  (fp_line (start 1.5494 .8349) (end 1.5494 1.1651) (layer F.Fab) (width .1))
  (fp_line (start 1.5494 1.1651) (end 2.5781 1.1651) (layer F.Fab) (width .1))
  (fp_line (start 2.5781 1.1651) (end 2.5781 .8349) (layer F.Fab) (width .1))
  (fp_line (start 2.5781 .8349) (end 1.5494 .8349) (layer F.Fab) (width .1))
  (fp_line (start 1.5494 .3349) (end 1.5494 .6651) (layer F.Fab) (width .1))
  (fp_line (start 1.5494 .6651) (end 2.5781 .6651) (layer F.Fab) (width .1))
  (fp_line (start 2.5781 .6651) (end 2.5781 .3349) (layer F.Fab) (width .1))
  (fp_line (start 2.5781 .3349) (end 1.5494 .3349) (layer F.Fab) (width .1))
  (fp_line (start 1.5494 -.1651) (end 1.5494 .1651) (layer F.Fab) (width .1))
  (fp_line (start 1.5494 .1651) (end 2.5781 .1651) (layer F.Fab) (width .1))
  (fp_line (start 2.5781 .1651) (end 2.5781 -.1651) (layer F.Fab) (width .1))
  (fp_line (start 2.5781 -.1651) (end 1.5494 -.1651) (layer F.Fab) (width .1))
  (fp_line (start 1.5494 -.6651) (end 1.5494 -.3349) (layer F.Fab) (width .1))
  (fp_line (start 1.5494 -.3349) (end 2.5781 -.3349) (layer F.Fab) (width .1))
  (fp_line (start 2.5781 -.3349) (end 2.5781 -.6651) (layer F.Fab) (width .1))
  (fp_line (start 2.5781 -.6651) (end 1.5494 -.6651) (layer F.Fab) (width .1))
  (fp_line (start 1.5494 -1.1651) (end 1.5494 -.8349) (layer F.Fab) (width .1))
  (fp_line (start 1.5494 -.8349) (end 2.5781 -.8349) (layer F.Fab) (width .1))
  (fp_line (start 2.5781 -.8349) (end 2.5781 -1.1651) (layer F.Fab) (width .1))
  (fp_line (start 2.5781 -1.1651) (end 1.5494 -1.1651) (layer F.Fab) (width .1))
  (fp_line (start -3.182099 1.4191) (end -3.182099 -1.4191) (layer F.CrtYd) (width .05))
  (fp_line (start -3.182099 -1.4191) (end -1.8034 -1.4191) (layer F.CrtYd) (width .05))
  (fp_line (start -1.8034 -1.4191) (end -1.8034 -1.8034) (layer F.CrtYd) (width .05))
  (fp_line (start -1.8034 -1.8034) (end 1.8034 -1.8034) (layer F.CrtYd) (width .05))
  (fp_line (start 1.8034 -1.8034) (end 1.8034 -1.4191) (layer F.CrtYd) (width .05))
  (fp_line (start 3.182099 -1.4191) (end 1.8034 -1.4191) (layer F.CrtYd) (width .05))
  (fp_line (start 3.182099 -1.4191) (end 3.182099 1.4191) (layer F.CrtYd) (width .05))
  (fp_line (start 3.182099 1.4191) (end 1.8034 1.4191) (layer F.CrtYd) (width .05))
  (fp_line (start 1.8034 1.4191) (end 1.8034 1.8034) (layer F.CrtYd) (width .05))
  (fp_line (start 1.8034 1.8034) (end -1.8034 1.8034) (layer F.CrtYd) (width .05))
  (fp_line (start -1.8034 1.8034) (end -1.8034 1.4191) (layer F.CrtYd) (width .05))
  (fp_line (start -3.182099 1.4191) (end -1.8034 1.4191) (layer F.CrtYd) (width .05))
  (fp_line (start -1.5494 0) (end -1.5494 -3.8354) (layer Cmts.User) (width 0))
  (fp_line (start 1.5494 0) (end 1.5494 -3.8354) (layer Cmts.User) (width 0))
  (fp_line (start -1.5494 -3.4544) (end -2.8194 -3.4544) (layer Cmts.User) (width 0))
  (fp_line (start 1.5494 -3.4544) (end 2.8194 -3.4544) (layer Cmts.User) (width 0))
  (fp_line (start -1.5494 -3.4544) (end -1.8034 -3.5814) (layer Cmts.User) (width 0))
  (fp_line (start -1.5494 -3.4544) (end -1.8034 -3.3274) (layer Cmts.User) (width 0))
  (fp_line (start -1.8034 -3.5814) (end -1.8034 -3.3274) (layer Cmts.User) (width 0))
  (fp_line (start 1.5494 -3.4544) (end 1.8034 -3.5814) (layer Cmts.User) (width 0))
  (fp_line (start 1.5494 -3.4544) (end 1.8034 -3.3274) (layer Cmts.User) (width 0))
  (fp_line (start 1.8034 -3.5814) (end 1.8034 -3.3274) (layer Cmts.User) (width 0))
  (fp_line (start -2.5781 0) (end -2.5781 -5.7404) (layer Cmts.User) (width 0))
  (fp_line (start 2.5781 0) (end 2.5781 -5.7404) (layer Cmts.User) (width 0))
  (fp_line (start -2.5781 -5.3594) (end 2.5781 -5.3594) (layer Cmts.User) (width 0))
  (fp_line (start -2.5781 -5.3594) (end -2.3241 -5.4864) (layer Cmts.User) (width 0))
  (fp_line (start -2.5781 -5.3594) (end -2.3241 -5.2324) (layer Cmts.User) (width 0))
  (fp_line (start -2.3241 -5.4864) (end -2.3241 -5.2324) (layer Cmts.User) (width 0))
  (fp_line (start 2.5781 -5.3594) (end 2.3241 -5.4864) (layer Cmts.User) (width 0))
  (fp_line (start 2.5781 -5.3594) (end 2.3241 -5.2324) (layer Cmts.User) (width 0))
  (fp_line (start 2.3241 -5.4864) (end 2.3241 -5.2324) (layer Cmts.User) (width 0))
  (fp_line (start 0 -1.5494) (end 4.4704 -1.5494) (layer Cmts.User) (width 0))
  (fp_line (start 0 1.5494) (end 4.4704 1.5494) (layer Cmts.User) (width 0))
  (fp_line (start 4.0894 -1.5494) (end 4.0894 -2.8194) (layer Cmts.User) (width 0))
  (fp_line (start 4.0894 1.5494) (end 4.0894 2.8194) (layer Cmts.User) (width 0))
  (fp_line (start 4.0894 -1.5494) (end 3.9624 -1.8034) (layer Cmts.User) (width 0))
  (fp_line (start 4.0894 -1.5494) (end 4.2164 -1.8034) (layer Cmts.User) (width 0))
  (fp_line (start 3.9624 -1.8034) (end 4.2164 -1.8034) (layer Cmts.User) (width 0))
  (fp_line (start 4.0894 1.5494) (end 3.9624 1.8034) (layer Cmts.User) (width 0))
  (fp_line (start 4.0894 1.5494) (end 4.2164 1.8034) (layer Cmts.User) (width 0))
  (fp_line (start 3.9624 1.8034) (end 4.2164 1.8034) (layer Cmts.User) (width 0))
  (fp_line (start -2.1717 -1) (end -5.0927 -1) (layer Cmts.User) (width 0))
  (fp_line (start -2.1717 -.5) (end -5.0927 -.5) (layer Cmts.User) (width 0))
  (fp_line (start -4.7117 -1) (end -4.7117 -2.27) (layer Cmts.User) (width 0))
  (fp_line (start -4.7117 -.5) (end -4.7117 .77) (layer Cmts.User) (width 0))
  (fp_line (start -4.7117 -1) (end -4.8387 -1.254) (layer Cmts.User) (width 0))
  (fp_line (start -4.7117 -1) (end -4.5847 -1.254) (layer Cmts.User) (width 0))
  (fp_line (start -4.8387 -1.254) (end -4.5847 -1.254) (layer Cmts.User) (width 0))
  (fp_line (start -4.7117 -.5) (end -4.8387 -.246) (layer Cmts.User) (width 0))
  (fp_line (start -4.7117 -.5) (end -4.5847 -.246) (layer Cmts.User) (width 0))
  (fp_line (start -4.8387 -.246) (end -4.5847 -.246) (layer Cmts.User) (width 0))
  (fp_line (start -2.5781 0) (end -2.5781 3.8354) (layer Cmts.User) (width 0))
  (fp_line (start -1.7653 0) (end -1.7653 3.8354) (layer Cmts.User) (width 0))
  (fp_line (start -2.5781 3.4544) (end -3.8481 3.4544) (layer Cmts.User) (width 0))
  (fp_line (start -1.7653 3.4544) (end -.4953 3.4544) (layer Cmts.User) (width 0))
  (fp_line (start -2.5781 3.4544) (end -2.8321 3.3274) (layer Cmts.User) (width 0))
  (fp_line (start -2.5781 3.4544) (end -2.8321 3.5814) (layer Cmts.User) (width 0))
  (fp_line (start -2.8321 3.3274) (end -2.8321 3.5814) (layer Cmts.User) (width 0))
  (fp_line (start -1.7653 3.4544) (end -1.5113 3.3274) (layer Cmts.User) (width 0))
  (fp_line (start -1.7653 3.4544) (end -1.5113 3.5814) (layer Cmts.User) (width 0))
  (fp_line (start -1.5113 3.3274) (end -1.5113 3.5814) (layer Cmts.User) (width 0))
  (fp_line (start -1.6764 1.6764) (end 1.6764 1.6764) (layer F.SilkS) (width .12))
  (fp_line (start 1.6764 1.6764) (end 1.6764 1.497841) (layer F.SilkS) (width .12))
  (fp_line (start 1.6764 -1.6764) (end -1.6764 -1.6764) (layer F.SilkS) (width .12))
  (fp_line (start -1.6764 -1.6764) (end -1.6764 -1.497841) (layer F.SilkS) (width .12))
  (fp_line (start -1.5494 1.5494) (end 1.5494 1.5494) (layer F.Fab) (width .1))
  (fp_line (start 1.5494 1.5494) (end 1.5494 -1.5494) (layer F.Fab) (width .1))
  (fp_line (start 1.5494 -1.5494) (end -1.5494 -1.5494) (layer F.Fab) (width .1))
  (fp_line (start -1.5494 -1.5494) (end -1.5494 1.5494) (layer F.Fab) (width .1))
  (fp_line (start -1.6764 1.497841) (end -1.6764 1.6764) (layer F.SilkS) (width .12))
  (fp_line (start 1.6764 -1.497841) (end 1.6764 -1.6764) (layer F.SilkS) (width .12))
  (fp_poly (pts (xy 3.436099 -1.190501) (xy 3.436099 -.809501) (xy 3.182099 -.809501) (xy 3.182099 -1.190501)) (layer F.SilkS) (width .1))
  (fp_line (start -3.182099 1.4191) (end -3.182099 -1.4191) (layer F.CrtYd) (width .05))
  (fp_line (start -3.182099 -1.4191) (end -1.8034 -1.4191) (layer F.CrtYd) (width .05))
  (fp_line (start -1.8034 -1.4191) (end -1.8034 -1.8034) (layer F.CrtYd) (width .05))
  (fp_line (start -1.8034 -1.8034) (end 1.8034 -1.8034) (layer F.CrtYd) (width .05))
  (fp_line (start 1.8034 -1.8034) (end 1.8034 -1.4191) (layer F.CrtYd) (width .05))
  (fp_line (start 1.8034 -1.4191) (end 3.182099 -1.4191) (layer F.CrtYd) (width .05))
  (fp_line (start 3.182099 -1.4191) (end 3.182099 1.4191) (layer F.CrtYd) (width .05))
  (fp_line (start 3.182099 1.4191) (end 1.8034 1.4191) (layer F.CrtYd) (width .05))
  (fp_line (start 1.8034 1.4191) (end 1.8034 1.8034) (layer F.CrtYd) (width .05))
  (fp_line (start 1.8034 1.8034) (end -1.8034 1.8034) (layer F.CrtYd) (width .05))
  (fp_line (start -1.8034 1.8034) (end -1.8034 1.4191) (layer F.CrtYd) (width .05))
  (fp_line (start -1.8034 1.4191) (end -3.182099 1.4191) (layer F.CrtYd) (width .05))
  (fp_arc (start 0 -1.5494) (end -.007742 -.039355) (angle -180)(layer F.Fab) (width .1))
  (pad 1 smd rect (at -2.1717 -1.000001) (size 1.512799 .3302) (layers F.Cu F.Paste F.Mask))
  (pad 2 smd rect (at -2.1717 -.499999) (size 1.512799 .3302) (layers F.Cu F.Paste F.Mask))
  (pad 3 smd rect (at -2.1717 0) (size 1.512799 .3302) (layers F.Cu F.Paste F.Mask))
  (pad 4 smd rect (at -2.1717 .499999) (size 1.512799 .3302) (layers F.Cu F.Paste F.Mask))
  (pad 5 smd rect (at -2.1717 1.000001) (size 1.512799 .3302) (layers F.Cu F.Paste F.Mask))
  (pad 6 smd rect (at 2.1717 1.000001) (size 1.512799 .3302) (layers F.Cu F.Paste F.Mask))
  (pad 7 smd rect (at 2.1717 .499999) (size 1.512799 .3302) (layers F.Cu F.Paste F.Mask))
  (pad 8 smd rect (at 2.1717 0) (size 1.512799 .3302) (layers F.Cu F.Paste F.Mask))
  (pad 9 smd rect (at 2.1717 -.499999) (size 1.512799 .3302) (layers F.Cu F.Paste F.Mask))
  (pad 10 smd rect (at 2.1717 -1.000001) (size 1.512799 .3302) (layers F.Cu F.Paste F.Mask))
)
