
(kicad_symbol_lib (version 20211014) (generator kicad_symbol_editor)
  (symbol "1546216-2" (pin_names (offset 1.016)) (in_bom yes) (on_board yes)
    (property "Reference" "J" (id 0) (at -5.58 5.08 0)
      (effects (font (size 1.27 1.27)) (justify bottom left))
    )
    (property "Value" "1546216-2" (id 1) (at -5.08 -5.08 0)
      (effects (font (size 1.27 1.27)) (justify bottom left))
    )
    (property "Footprint" "TE_1546216-2" (id 2) (at 0 0 0)
      (effects (font (size 1.27 1.27)) (justify bottom) hide)
    )
    (property "Comment" "1546216-2" (id 4) (at 0 0 0)
      (effects (font (size 1.27 1.27)) (justify bottom) hide)
    )
    (property "EU_RoHS_Compliance" "Compliant with Exemptions" (id 5) (at 0 0 0)
      (effects (font (size 1.27 1.27)) (justify bottom) hide)
    )
    (property "Centerline_Pitch" "5 mm[.197 in]" (id 6) (at 0 0 0)
      (effects (font (size 1.27 1.27)) (justify bottom) hide)
    )
    (property "Number_of_Positions" "2" (id 7) (at 0 0 0)
      (effects (font (size 1.27 1.27)) (justify bottom) hide)
    )
    (symbol "1546216-2_0_0"
      (rectangle (start -5.08 -2.54) (end 5.08 5.08)
        (stroke (width 0.254)) (fill (type background))
      )
      (pin passive line (at -10.16 2.54 0) (length 5.08)
        (name "1"
          (effects (font (size 1.016 1.016)))
        )
        (number "1"
          (effects (font (size 1.016 1.016)))
        )
      )
      (pin passive line (at -10.16 0.0 0) (length 5.08)
        (name "2"
          (effects (font (size 1.016 1.016)))
        )
        (number "2"
          (effects (font (size 1.016 1.016)))
        )
      )
    )
  )
)