
(footprint TO254P1054X470X1955-3 (layer F.Cu) (tedit 6428983F)
  (descr "")
  (fp_text reference REF** (at -0.835 -4.399 0) (layer F.SilkS)
    (effects (font (size 1.4 1.4) (thickness 0.15)))
  )
  (fp_text value TO254P1054X470X1955-3 (at 13.389 3.729 0) (layer F.Fab)
    (effects (font (size 1.4 1.4) (thickness 0.15)))
  )
  (pad 1 thru_hole rect (at -2.54 0.0) (size 1.86 1.86) (drill 1.24) (layers *.Cu *.Mask))
  (pad 2 thru_hole circle (at 0.0 0.0) (size 1.86 1.86) (drill 1.24) (layers *.Cu *.Mask))
  (pad 3 thru_hole circle (at 2.54 0.0) (size 1.86 1.86) (drill 1.24) (layers *.Cu *.Mask))
  (fp_line (start -5.27 -2.86) (end -5.27 1.84) (layer F.SilkS) (width 0.127))
  (fp_line (start -5.27 1.84) (end 5.27 1.84) (layer F.SilkS) (width 0.127))
  (fp_line (start 5.27 1.84) (end 5.27 -2.86) (layer F.SilkS) (width 0.127))
  (fp_line (start 5.27 -2.86) (end -5.27 -2.86) (layer F.SilkS) (width 0.127))
  (fp_line (start -5.27 -2.86) (end -5.27 1.84) (layer F.Fab) (width 0.127))
  (fp_line (start -5.27 1.84) (end 5.27 1.84) (layer F.Fab) (width 0.127))
  (fp_line (start 5.27 1.84) (end 5.27 -2.86) (layer F.Fab) (width 0.127))
  (fp_line (start 5.27 -2.86) (end -5.27 -2.86) (layer F.Fab) (width 0.127))
  (fp_line (start -5.52 -3.11) (end -5.52 2.09) (layer F.CrtYd) (width 0.05))
  (fp_line (start -5.52 2.09) (end 5.52 2.09) (layer F.CrtYd) (width 0.05))
  (fp_line (start 5.52 2.09) (end 5.52 -3.11) (layer F.CrtYd) (width 0.05))
  (fp_line (start 5.52 -3.11) (end -5.52 -3.11) (layer F.CrtYd) (width 0.05))
  (fp_circle (center -2.54 2.54) (end -2.44 2.54) (layer F.SilkS) (width 0.2))
  (fp_circle (center -2.54 2.54) (end -2.44 2.54) (layer F.Fab) (width 0.2))
)