<svg xmlns="http://www.w3.org/2000/svg" width="113" height="84" viewBox="0 0 113 84">
    <defs>
        <linearGradient id="prefix__a" x1="50%" x2="50%" y1="100%" y2="0%">
            <stop offset="0%" stop-color="gray" stop-opacity=".25"/>
            <stop offset="54%" stop-color="gray" stop-opacity=".12"/>
            <stop offset="100%" stop-color="gray" stop-opacity=".1"/>
        </linearGradient>
        <linearGradient id="prefix__b" x1="49.984%" x2="49.984%" y1="100.006%" y2="0%">
            <stop offset="0%" stop-color="gray" stop-opacity=".25"/>
            <stop offset="54%" stop-color="gray" stop-opacity=".12"/>
            <stop offset="100%" stop-color="gray" stop-opacity=".1"/>
        </linearGradient>
    </defs>
    <g fill="none" fill-rule="evenodd">
        <path fill="#253186" fill-rule="nonzero" d="M11.275 8.352c-.697.29-1.414.66-1.797 1.312-.406.688-.357 1.542-.282 2.338.659 6.903 2.395 14.245-.602 20.498-1.455 3.034-3.888 5.465-5.824 8.22C.835 43.475-.626 46.915.272 50.156c1.097 3.96 5.193 6.156 7.953 9.204 1.807 1.993 3.074 4.414 4.76 6.51 1.686 2.097 3.996 3.943 6.687 4.066 3.87.179 7.02-3.164 10.815-3.938 3.888-.793 7.803 1.224 10.956 3.64 3.152 2.414 6.02 5.34 9.693 6.848 4.056 1.666 8.629 1.411 12.9 2.412 3.887.913 7.466 2.854 11.326 3.888 3.86 1.035 8.384.972 11.375-1.67 3.898-3.456 3.591-9.612 6.08-14.184 2.313-4.248 6.839-6.784 9.886-10.539 5.482-6.758 5.302-17.089.648-24.439-4.655-7.35-13.087-11.801-21.708-12.96-3.888-.522-7.892-.45-11.63-1.637C60.008 14.18 54.054 2.805 43.84.437c-6.493-1.502-12.807 1.1-18.338 4.302-4.8 2.78-9.23 1.54-14.226 3.613z" opacity=".1"/>
        <path stroke="#535461" stroke-width=".5" d="M21.025 30.654s-3.686 3.478-7.642 3.582c-1.66.033-3.267.604-4.576 1.628-.618.489-1.191 1.033-1.71 1.627"/>
        <path fill="#253186" fill-rule="nonzero" d="M4.602 37.576c.531-.27 2.56-.09 2.56-.09S6.11 39.23 5.577 39.5c-.347.206-.78.2-1.121-.012-.343-.213-.538-.6-.506-1.001.031-.402.284-.753.655-.91h-.004zM6.737 34.493c.593.063 2.198 1.315 2.198 1.315s-1.836.893-2.424.831c-.57-.086-.973-.607-.912-1.18.06-.575.562-1 1.138-.966zM11.8 32.008c.48.353 1.233 2.245 1.233 2.245s-2.031-.154-2.51-.506c-.45-.363-.534-1.015-.192-1.48.342-.465.989-.58 1.47-.259zM16.054 30.992c.533.266 1.595 2.004 1.595 2.004s-2.028.191-2.56-.075c-.366-.16-.614-.509-.645-.907-.03-.398.16-.78.498-.995.337-.214.765-.225 1.112-.027zM10.063 37.775c.178-.569-.34-2.539-.34-2.539s-1.543 1.33-1.72 1.9c-.136.374-.055.793.21 1.09.266.296.673.422 1.06.328.387-.094.69-.393.79-.779zM15.024 36.52c0-.597-1.086-2.32-1.086-2.32s-1.073 1.727-1.072 2.326c.002.596.487 1.078 1.083 1.076.597-.001 1.079-.486 1.077-1.083h-.002zM19.678 34.644c.099-.587-.679-2.47-.679-2.47s-1.35 1.525-1.449 2.113c-.069.572.324 1.098.893 1.194.568.096 1.112-.272 1.235-.836z"/>
        <path stroke="#535461" stroke-width=".5" d="M25.815 21.441s-4.44-2.438-5.76-6.174c-.542-1.571-1.579-2.924-2.955-3.855-.657-.437-1.353-.813-2.078-1.123"/>
        <path fill="#253186" fill-rule="nonzero" d="M14.18 7.94c.42.422.872 2.409.872 2.409s-1.983-.465-2.403-.888c-.385-.428-.367-1.083.041-1.489.409-.406 1.064-.42 1.49-.032zM17.77 9.023c.123.584-.575 2.496-.575 2.496s-1.412-1.467-1.535-2.052c-.1-.385.02-.793.312-1.063.292-.27.709-.358 1.085-.229.376.13.65.455.714.847v.001zM21.69 13.083c-.187.565-1.756 1.864-1.756 1.864s-.478-1.98-.29-2.545c.188-.567.8-.874 1.367-.686.567.189.873.8.685 1.367h-.005zM23.967 16.815c-.09.588-1.417 2.134-1.417 2.134s-.805-1.871-.716-2.46c.041-.396.297-.737.665-.889.369-.15.79-.087 1.098.167.307.254.45.656.37 1.046v.002zM15.669 13.199c.596-.007 2.31-1.106 2.31-1.106s-1.739-1.059-2.335-1.052c-.597.007-1.075.496-1.068 1.092.007.597.496 1.075 1.093 1.068v-.002zM18.386 17.534c.566-.185 1.874-1.747 1.874-1.747s-1.978-.489-2.544-.304c-.38.108-.67.416-.757.802-.087.386.045.788.342 1.049.298.26.714.338 1.085.2zM21.604 21.385c.59-.086 2.143-1.404 2.143-1.404s-1.866-.816-2.455-.73c-.395.04-.735.295-.887.661-.152.367-.09.788.16 1.095.251.308.65.454 1.04.38v-.002z"/>
        <circle cx="56.37" cy="41.516" r="39.096" fill="url(#prefix__a)" fill-rule="nonzero"/>
        <circle cx="56.37" cy="41.516" r="38.448" fill="#253186" fill-rule="nonzero"/>
        <circle cx="56.37" cy="41.516" r="30.564" fill="#DDE1EC" fill-rule="nonzero"/>
        <path fill="#535461" fill-rule="nonzero" d="M55.506 16.352H57.234V43.352000000000004H55.506z" opacity=".3"/>
        <g fill="#000" fill-rule="nonzero" opacity=".1" transform="translate(39.96 32.724)">
            <path d="M18.246 8.144H42.653999999999996V10.304H18.246z"/>
            <path d="M7.111 -3.627H9.271V13.709H7.111z" transform="rotate(-62.36 8.191 5.041)"/>
            <circle cx="16.41" cy="9.224" r="3.24"/>
        </g>
        <path fill="#535461" fill-rule="nonzero" d="M58.206 40.436H82.614V42.596000000000004H58.206z"/>
        <path fill="#535461" fill-rule="nonzero" d="M39.49 36.256H56.826V38.416H39.49z" transform="rotate(27.64 48.158 37.336)"/>
        <circle cx="56.37" cy="41.516" r="3.24" fill="#535461" fill-rule="nonzero"/>
        <path fill="#000" fill-rule="nonzero" d="M28.18 45.188c0-16.88 13.683-30.564 30.563-30.564 9.606-.008 18.656 4.507 24.426 12.187-5.202-9.452-15.246-15.859-26.802-15.859-16.88 0-30.564 13.684-30.564 30.564-.01 6.632 2.147 13.085 6.142 18.378-2.477-4.505-3.773-9.565-3.766-14.706z" opacity=".1"/>
        <path fill="url(#prefix__b)" fill-rule="nonzero" d="M84.61 19.033c-.364-.349-3.418 1.944-3.418 1.944s-1.087.199-.828.945c.26.746-1.14 4.926-1.14 4.926l-.569-.796c.055-.934-.202-1.596-.452-2.009-.02-.034-.041-.066-.062-.096l.1-.035c-.038-.51-.854-1.286-1.287-1.666v-.164c.027-.61.271-1.252 0-1.804-.306-.63-1.204-.946-1.28-1.637-.045-.413.234-.785.357-1.183.294-.95-.317-1.92-.9-2.739-.197-.307-.438-.584-.714-.823-.263-.192-.551-.346-.857-.458-.854-.345-1.728-.519-2.61-.756-.845-.224-1.625-.331-2.483-.05-.204.056-.39.162-.54.31-.205.23-.232.556-.365.83-.216.439-.682.701-1.093.983-.412.282-.824.668-.827 1.154 0 .69.789 1.125 1.052 1.767.247.599 0 1.265-.137 1.896-.057.204-.063.419-.016.625.054.154.136.297.242.421.163.216.338.417.512.622l-.08.032c-1.45-.15-2.382 1.691-2.382 1.691.067.014.131.03.194.049l-.062.08c-.438.568-.796 1.194-1.064 1.86l-1.188 1.592s-.259-3.98.363-4.876c.622-.895-.569-1.443-.569-1.443s-2.592-2.886-2.951-2.637c-.36.248.88 3.383 1.967 3.881 0 0 .108.995-.108 1.642-.13.41-.828 4.727-.828 4.727s-.621 3.632 2.227 1.836c1.85-1.164 3.045-3.169 3.655-4.428l.12-.254c.028.134.047.27.057.405l.108 4.162c.027 1.029-.198 2.05-.655 2.972l-1.269 2.573.142.044-.086.123c-.836 1.23-2.257 3.996.669 5.405l3.888.498-.207.995s-1.605 3.034-2.072 5.124c-.29 1.28-.742 2.517-1.347 3.682l.12.064-.075.087c-.236.265-.392.592-.45.942l-.527.747s-.207 3.085.208 3.832c.226.408.98.668 1.62.819.95.225 1.717-.756 1.213-1.565l-.007-.011h-.01c-.108-.502-.438-2.06-.33-2.652.03-.169.058-.336.072-.507.026-.224.094-.442.201-.64.017-.034.036-.066.054-.099l.056.024c.174.075.346.145.509.206-.253.23-.432.707-.216 1.686 0 0 .02 2.45.207 2.836.187.386 2.278.896 2.64.498.364-.397-.232-1.767-.232-1.767l-.019.013c-.12-.794-.268-2.215.096-2.774.147-.226.29-.46.417-.677l.08-.135c.675.337 1.39.59 1.781.414 0 0 1.709-3.98 1.605-4.477-.104-.497 2.64-6.12 2.64-6.12s2.33-2.593-.517-4.38c-.904-.568-1.563-.95-2.041-1.209l-.4-2.095c-.207-1.098-.17-2.228.107-3.311l.432-1.648.036-.14s1.088-2.24 1.036-3.285c-.004-.081.005-.162.027-.24l.039.155c.285 1.086.662 2.147 1.125 3.17.826 1.865 2.052 1.717 2.724 1.452.292-.113.507-.365.573-.672.242-1.16.906-4.41.948-5.307.038-.702.125-1.4.26-2.09 1.704-.996 3.153-2.737 2.79-3.086z"/>
        <path fill="#F8BDC5" fill-rule="nonzero" d="M71.931 50.917s-.228.456-.54 1.005c-.122.216-.258.448-.397.672-.494.79 0 3.305 0 3.305l-1.08.148-1.08-.54-.198-1.826v-1.334l1.231-1.377.54-.597 1.524.544z"/>
        <path fill="#000" fill-rule="nonzero" d="M71.931 50.917s-.228.456-.54 1.005c-.477-.255-.938-.538-1.38-.849l-.095-.067-.05-.036.54-.597 1.525.544z" opacity=".1"/>
        <path fill="#5E52AD" fill-rule="nonzero" d="M77.211 41.691s-2.614 5.574-2.515 6.068c.1.493-1.53 4.44-1.53 4.44-.37.175-1.053-.077-1.697-.41-.485-.26-.954-.548-1.404-.865l-.095-.067-.057-.04 4.292-11.89-3.798-2.785-.28-.206-1.698-1.253 5.184.938s.18-.023 1.134.51c.458.256 1.094.64 1.973 1.216 2.71 1.78.491 4.344.491 4.344z"/>
        <path fill="#000" fill-rule="nonzero" d="M77.211 41.691s-2.614 5.574-2.515 6.068c.1.493-1.53 4.44-1.53 4.44-.37.175-1.053-.077-1.697-.41-.485-.26-.954-.548-1.404-.865l-.095-.067-.057-.04 4.292-11.89-3.798-2.785-.28-.206-1.698-1.253 5.184.938s.18-.023 1.134.51c.458.256 1.094.64 1.973 1.216 2.71 1.78.491 4.344.491 4.344z" opacity=".03"/>
        <path fill="#5D3E53" fill-rule="nonzero" d="M69.268 51.903s-1.283-.198-.838 1.875c0 0 .02 2.43.198 2.808.178.378 2.17.887 2.515.493.344-.394-.223-1.75-.223-1.75s-1.454 1.06-1.85-.075c-.395-1.135.198-3.351.198-3.351z"/>
        <path fill="#F8BDC5" fill-rule="nonzero" d="M68.38 51.508c-.14.134-.255.292-.337.467-.102.198-.166.413-.19.635-.014.169-.04.336-.069.502-.123.703.349 2.787.349 2.787l-1.875.296-.69-.74-.148-1.628c.184-.558.284-1.14.296-1.728 0-.424.216-.803.432-1.08.146-.184.314-.35.5-.496 0 0 2.126.64 1.731.985z"/>
        <path fill="#000" fill-rule="nonzero" d="M68.38 51.508c-.14.134-.255.292-.337.467-.768-.347-1.574-.784-1.868-.946l-.023-.012c.147-.184.314-.35.5-.496 0 0 2.122.642 1.727.987z" opacity=".1"/>
        <path fill="#5E52AD" fill-rule="nonzero" d="M74.448 40.212s-1.233 2.318-2.023 4.242c-.519 1.263-1.59 4.272-2.268 6.188l-.1.283c-.298.848-.496 1.422-.496 1.422-.132 0-.263-.019-.388-.058-.117-.031-.247-.073-.387-.125l-.156-.06c-.156-.06-.324-.13-.485-.204-.784-.35-1.62-.805-1.924-.972l-.114-.063c.579-1.16 1.01-2.387 1.286-3.654.444-2.071 1.973-5.076 1.973-5.076l.198-.987-3.7-.494c-2.788-1.393-1.433-4.14-.637-5.359.135-.211.282-.416.44-.612l2.96.648s.466.15 1.503.608l.476.216c.581.267 1.296.61 2.16 1.051 2.914 1.473 1.682 3.006 1.682 3.006z"/>
        <path fill="#5D3E53" fill-rule="nonzero" d="M68.115 55.75c.215.364.191.822-.061 1.161-.253.34-.685.493-1.095.39-.606-.15-1.324-.407-1.54-.812-.394-.74-.198-3.798-.198-3.798l.519-.765s-.271 3.38.37 3.672c.642.293 1.998.138 1.998.138l.007.015z"/>
        <path fill="#85555C" fill-rule="nonzero" d="M68.64 12.852c-.198.055-.377.161-.519.308-.194.227-.216.55-.348.822-.205.432-.648.696-1.04.972-.394.275-.786.663-.788 1.144 0 .685.756 1.115 1.002 1.751.234.594 0 1.254-.13 1.88-.055.202-.06.414-.016.62.052.151.13.293.231.417.477.648 1.068 1.223 1.387 1.96.242.561.309 1.18.373 1.788.091.875.183 1.766.017 2.63-.016.051-.016.107 0 .158.028.05.073.088.126.108.635.309 1.369.345 2.031.1.662-.244 1.196-.748 1.478-1.396.216-.489.3-1.08.727-1.397.05-.041.11-.069.174-.079.1.003.199.036.28.094.556.3 1.229.309 1.848.186.373-.075.756-.208 1.003-.5.487-.578.216-1.443.248-2.198.026-.604.258-1.241 0-1.787-.291-.625-1.148-.938-1.219-1.62-.043-.409.222-.78.34-1.172.28-.943-.301-1.904-.856-2.715-.187-.303-.416-.577-.68-.816-.249-.19-.524-.342-.816-.453-.813-.343-1.643-.516-2.484-.749-.806-.23-1.548-.337-2.37-.056z"/>
        <path fill="#F8BDC5" fill-rule="nonzero" d="M72.77 26.942h-2.862v-4.638c.085-.445.135-.897.15-1.35v-.464c-.028-.553-.142-1.105-.442-1.442-.79-.888 2.565-.74 2.565-.74.103.408.236.807.4 1.195.242.604.566 1.174.96 1.692.348.461.793.84 1.304 1.11 1.97.986-2.075 4.637-2.075 4.637z"/>
        <path fill="#000" fill-rule="nonzero" d="M72.577 19.503c-.592.772-1.564 1.152-2.523.987-.027-.553-.141-1.105-.442-1.442-.789-.888 2.565-.74 2.565-.74.103.408.237.807.4 1.195z" opacity=".1"/>
        <circle cx="70.5" cy="17.767" r="2.615" fill="#F8BDC5" fill-rule="nonzero"/>
        <path fill="#F8BDC5" fill-rule="nonzero" d="M81.353 22.256c-.128.684-.21 1.376-.246 2.071-.04.889-.673 4.112-.904 5.262-.06.3-.264.55-.547.666-.641.263-1.807.41-2.592-1.438-.442-1.017-.8-2.068-1.072-3.143-.096-.362-.168-.729-.216-1.1l1.728-.937c.163.152.3.329.408.524.239.409.484 1.066.432 1.991l.54.79s1.332-4.144 1.08-4.884c-.251-.74.79-.938.79-.938s2.91-2.268 3.256-1.923c.346.345-1.03 2.071-2.657 3.059zM67.195 24.229c-.134.386-.29.764-.464 1.134-.581 1.25-1.72 3.24-3.482 4.391-2.713 1.776-2.121-1.825-2.121-1.825s.664-4.281.79-4.686c.197-.642.098-1.628.098-1.628-1.036-.493-2.22-3.6-1.875-3.848.344-.247 2.808 2.615 2.808 2.615s1.135.54.54 1.43c-.595.892-.346 4.835-.346 4.835l1.142-1.576c.254-.657.595-1.278 1.014-1.845.216-.294.367-.473.367-.473l1.53 1.476z"/>
        <path fill="#000" fill-rule="nonzero" d="M77.913 24.16c-.363.135-1.768.702-1.923 1.513-.096-.362-.168-.729-.216-1.1l1.728-.937c.164.152.303.33.411.525zM67.195 24.229c-.134.386-.29.764-.464 1.134-.067-.488-.342-1.737-1.432-2.14.216-.295.367-.473.367-.473l1.53 1.479zM72.77 26.942h-2.862v-4.638c.085-.445.135-.897.15-1.35.588.568.442 1.448.442 1.448l1.53 3.456.74-3.055-.246-.394L73.54 21.2c.348.462.793.84 1.304 1.11 1.972.98-2.073 4.63-2.073 4.63zM74.792 36.411s-2.242-.178-4.187-.262l-.195-.009c-.277-.01-.54-.02-.799-.026-1.887-.045-4.023-.705-4.385-.82.136-.212.283-.415.44-.61l2.96.647s.467.15 1.504.608l-1.701-1.256 5.184.938s.18-.023 1.134.51l.045.28z" opacity=".1"/>
        <path fill="#ED677B" fill-rule="nonzero" d="M72.77 22.995l-.246-.394 1.095-1.31s2.259 1.107 2.85.864c0 0 1.431 1.188 1.48 1.875 0 0-2.071.69-2.023 1.728.049 1.038-.983 3.255-.983 3.255l-.432 1.773c-.265 1.075-.302 2.194-.108 3.284l.395 2.195s-3.109-.246-5.184-.296c-2.076-.05-4.44-.838-4.44-.838l1.21-2.547c.437-.92.65-1.93.625-2.947l-.108-4.124s-.099-2.072-1.728-2.417c0 0 .887-1.825 2.268-1.677 0 0 2.01-.84 2.608-.273.597.567.45 1.456.45 1.456l1.53 3.456.741-3.063z"/>
        <path fill="#000" fill-rule="nonzero" d="M68.613 17.228c.397 0 .708-.42 1.104-.398.205.01.381.141.551.259.64.444 1.354.772 2.107.972.293.078.603.136.897.065.293-.072.569-.303.602-.604.008-.133-.01-.266-.052-.392-.332-1.159-1.085-2.152-2.11-2.785-.41-.252-.912-.444-1.366-.287-.41.142-.675.526-.972.843-.224.237-.478.443-.756.613-.216.13-.54.216-.664.456-.235.447.134 1.254.66 1.258z" opacity=".1"/>
        <path fill="#85555C" fill-rule="nonzero" d="M68.613 17.13c.397 0 .708-.42 1.104-.399.205.011.381.142.551.26.64.443 1.354.772 2.107.972.293.077.603.136.897.064.293-.07.569-.302.602-.603.008-.133-.01-.266-.052-.392-.332-1.159-1.085-2.152-2.11-2.786-.41-.251-.912-.444-1.366-.286-.41.142-.675.526-.972.842-.224.237-.478.444-.756.614-.216.13-.54.216-.664.456-.235.451.134 1.252.66 1.258z"/>
        <path fill="#000" fill-rule="nonzero" d="M67.418 28.396s2.417.888 3.996.198l.79.05s1.312.92 2.7.508M78.863 26.917s-.395.937-.198 1.233M63.126 26.62s.198.938 0 1.234" opacity=".05"/>
        <path fill="#253186" fill-rule="nonzero" d="M104.039 47.982s-4.52 4.519-1.968 11.224c2.55 6.704-4.372 17.854-4.372 17.854s.074-.01.216-.034c9.28-1.639 13.89-12.252 8.73-20.137-1.923-2.932-3.497-6.37-2.606-8.907z"/>
        <path fill="#000" fill-rule="nonzero" d="M104.039 48.058s-4.52 4.519-1.968 11.223c2.55 6.705-4.372 17.854-4.372 17.854l.216-.035c9.28-1.638 13.89-12.251 8.73-20.136-1.923-2.932-3.497-6.37-2.606-8.906z" opacity=".1"/>
        <path stroke="#535461" stroke-width=".5" d="M104.039 47.982s-2.551 5.538 0 10.057c2.55 4.519.432 17.2-6.341 19.021"/>
        <path fill="#253186" fill-rule="nonzero" d="M112.087 66.258s-5.156-.82-5.626 3.8c-.47 4.62-9.918 5.26-9.918 5.26l.177.118c7.798 5.119 15.253 3.26 14.129-3.537-.415-2.526-.38-5.064 1.238-5.641z"/>
        <path stroke="#535461" stroke-width=".5" d="M112.087 66.258s-4.003.878-3.672 4.518c.33 3.64-5.94 8.001-11.867 4.543"/>
        <path fill="#A8A8A8" fill-rule="nonzero" d="M107.55 75.487s-4.06-.813-5.143-1.896c-1.084-1.083-5.957-2.977-6.498-1.62-.54 1.358-7.309 5.956-2.707 6.769 4.602.812 10.829 1.08 12.182.54 1.353-.54 2.167-3.793 2.167-3.793z"/>
        <path fill="#000" fill-rule="nonzero" d="M93.202 78.233c4.603.812 10.829 1.08 12.182.54 1.032-.413 1.748-2.393 2.03-3.316l.136.029s-.813 3.248-2.166 3.79c-1.353.54-7.58.27-12.182-.54-1.329-.235-1.709-.786-1.565-1.483.112.455.576.805 1.565.98z" opacity=".2"/>
    </g>
</svg>
