<svg width="32" height="33" viewBox="0 0 32 33" fill="none" xmlns="http://www.w3.org/2000/svg">
<path d="M27 5.0835H5C4.46957 5.0835 3.96086 5.29421 3.58579 5.66928C3.21071 6.04436 3 6.55306 3 7.0835V25.0835C3 25.6139 3.21071 26.1226 3.58579 26.4977C3.96086 26.8728 4.46957 27.0835 5 27.0835H27C27.5304 27.0835 28.0391 26.8728 28.4142 26.4977C28.7893 26.1226 29 25.6139 29 25.0835V7.0835C29 6.55306 28.7893 6.04436 28.4142 5.66928C28.0391 5.29421 27.5304 5.0835 27 5.0835ZM27 25.0835H5V7.0835H27V25.0835ZM23 12.0835C23 12.3487 22.8946 12.6031 22.7071 12.7906C22.5196 12.9781 22.2652 13.0835 22 13.0835H10C9.73478 13.0835 9.48043 12.9781 9.29289 12.7906C9.10536 12.6031 9 12.3487 9 12.0835C9 11.8183 9.10536 11.5639 9.29289 11.3764C9.48043 11.1889 9.73478 11.0835 10 11.0835H22C22.2652 11.0835 22.5196 11.1889 22.7071 11.3764C22.8946 11.5639 23 11.8183 23 12.0835ZM23 16.0835C23 16.3487 22.8946 16.6031 22.7071 16.7906C22.5196 16.9781 22.2652 17.0835 22 17.0835H10C9.73478 17.0835 9.48043 16.9781 9.29289 16.7906C9.10536 16.6031 9 16.3487 9 16.0835C9 15.8183 9.10536 15.5639 9.29289 15.3764C9.48043 15.1889 9.73478 15.0835 10 15.0835H22C22.2652 15.0835 22.5196 15.1889 22.7071 15.3764C22.8946 15.5639 23 15.8183 23 16.0835ZM23 20.0835C23 20.3487 22.8946 20.6031 22.7071 20.7906C22.5196 20.9781 22.2652 21.0835 22 21.0835H10C9.73478 21.0835 9.48043 20.9781 9.29289 20.7906C9.10536 20.6031 9 20.3487 9 20.0835C9 19.8183 9.10536 19.5639 9.29289 19.3764C9.48043 19.1889 9.73478 19.0835 10 19.0835H22C22.2652 19.0835 22.5196 19.1889 22.7071 19.3764C22.8946 19.5639 23 19.8183 23 20.0835Z" fill="#343330"/>
</svg>
