<?xml version="1.0" encoding="UTF-8"?>
<svg width="36px" height="24px" viewBox="0 0 36 24" version="1.1" xmlns="http://www.w3.org/2000/svg" xmlns:xlink="http://www.w3.org/1999/xlink">
    <title>Triangle</title>
    <g id="page-about" stroke="none" stroke-width="1" fill="none" fill-rule="evenodd">
        <g transform="translate(-647.000000, -3385.000000)" fill="#FFFFFF" id="Triangle">
            <polygon transform="translate(665.000000, 3397.000000) rotate(180.000000) translate(-665.000000, -3397.000000) " points="665 3385 683 3409 647 3409"></polygon>
        </g>
    </g>
</svg>