<?xml version="1.0" encoding="UTF-8"?>
<svg width="413px" height="153px" viewBox="0 0 413 153" version="1.1" xmlns="http://www.w3.org/2000/svg" xmlns:xlink="http://www.w3.org/1999/xlink">
    <!-- Generator: Sketch 53.2 (72643) - https://sketchapp.com -->
    <title>logoVFFVioletFR</title>
    <desc>Created with Sketch.</desc>
    <g id="Identité" stroke="none" stroke-width="1" fill="none" fill-rule="evenodd">
        <g id="logos-vff" transform="translate(-817.000000, -375.000000)">
            <g id="outline" transform="translate(210.000000, 375.000000)">
                <g id="violet" transform="translate(601.000000, 0.000000)">
                    <g id="logoVFFVioletFR" transform="translate(6.000000, 0.000000)">
                        <g id="texte" transform="translate(1.000000, 37.000000)">
                            <path d="M174.423743,49.5131655 L174.296372,49.5131655 L168.564664,17.6066595 L160.795016,17.6066595 L170.411548,63.5876921 L178.308567,63.5876921 L187.925099,17.6066595 L180.155451,17.6066595 L174.423743,49.5131655 Z M201.299084,63.5876921 L201.299084,17.6066595 L193.402064,17.6066595 L193.402064,63.5876921 L201.299084,63.5876921 Z M210.024017,52.4427049 L210.024017,28.7516466 C210.024017,22.2557112 213.845155,16.969803 222.124288,16.969803 C230.403422,16.969803 234.22456,22.2557112 234.22456,28.7516466 L234.22456,52.4427049 C234.22456,58.9386403 230.403422,64.2245485 222.124288,64.2245485 C213.845155,64.2245485 210.024017,58.9386403 210.024017,52.4427049 Z M217.921036,28.9427035 L217.921036,52.251648 C217.921036,55.6906726 218.940006,57.3464993 222.124288,57.3464993 C225.30857,57.3464993 226.327541,55.6906726 226.327541,52.251648 L226.327541,28.9427035 C226.327541,25.5036789 225.30857,23.8478522 222.124288,23.8478522 C218.940006,23.8478522 217.921036,25.5036789 217.921036,28.9427035 Z M261.800442,63.5876921 L261.800442,56.7096429 L249.381742,56.7096429 L249.381742,17.6066595 L241.484723,17.6066595 L241.484723,63.5876921 L261.800442,63.5876921 Z M288.675783,63.5876921 L288.675783,56.7096429 L274.537571,56.7096429 L274.537571,43.208287 L284.727273,43.208287 L284.727273,36.3302378 L274.537571,36.3302378 L274.537571,24.4847087 L287.784184,24.4847087 L287.784184,17.6066595 L266.640551,17.6066595 L266.640551,63.5876921 L288.675783,63.5876921 Z M302.049767,63.5876921 L302.049767,34.8654681 L302.177139,34.8654681 L312.23947,63.5876921 L319.117519,63.5876921 L319.117519,17.6066595 L311.984727,17.6066595 L311.984727,43.9088291 L311.857356,43.9088291 L302.240824,17.6066595 L294.916976,17.6066595 L294.916976,63.5876921 L302.049767,63.5876921 Z M350.578226,32.9548989 L350.578226,29.5795599 C350.578226,22.7015107 346.757087,16.969803 338.860068,16.969803 C330.580934,16.969803 326.759796,22.2557112 326.759796,28.7516466 L326.759796,52.4427049 C326.759796,58.9386403 330.580934,64.2245485 338.860068,64.2245485 C346.757087,64.2245485 350.578226,58.9386403 350.578226,52.4427049 L350.578226,47.1567968 L342.681206,47.1567968 L342.681206,52.6974475 C342.681206,55.6906726 341.725922,57.3464993 338.860068,57.3464993 C335.675786,57.3464993 334.656815,55.6906726 334.656815,52.251648 L334.656815,28.9427035 C334.656815,25.5036789 335.675786,23.8478522 338.860068,23.8478522 C340.898008,23.8478522 342.681206,25.5036789 342.681206,29.388503 L342.681206,32.9548989 L350.578226,32.9548989 Z M380.637848,63.5876921 L380.637848,56.7096429 L366.499636,56.7096429 L366.499636,43.208287 L376.689338,43.208287 L376.689338,36.3302378 L366.499636,36.3302378 L366.499636,24.4847087 L379.746249,24.4847087 L379.746249,17.6066595 L358.602616,17.6066595 L358.602616,63.5876921 L380.637848,63.5876921 Z M408.786901,28.1147902 C408.086359,21.6188548 404.265221,16.969803 397.832971,16.969803 C390.063323,16.969803 385.605328,21.1093697 385.605328,28.4332184 C385.605328,41.616146 401.65411,44.0362004 401.65411,53.143247 C401.65411,55.8817295 399.807226,57.3464993 397.068743,57.3464993 C394.521318,57.3464993 392.674434,55.0538162 392.356006,50.4047644 L384.8411,51.4874203 C385.159529,58.3654695 389.362781,64.2245485 396.68663,64.2245485 C404.074164,64.2245485 409.169015,60.0212962 409.169015,52.4427049 C409.169015,39.9603194 393.120234,36.2028666 393.120234,28.3695327 C393.120234,25.5036789 394.521318,23.8478522 397.068743,23.8478522 C398.851941,23.8478522 400.953568,24.9941938 401.271996,28.9427035 L408.786901,28.1147902 Z" id="VIOLENCES" fill="#660779" opacity="0.2"></path>
                            <path d="M164.708954,2.88780665 L163.995675,7.40038919 L165.451346,7.40038919 L164.738067,2.88780665 L164.708954,2.88780665 Z M163.733654,8.97251472 L163.413406,11.3015896 L161.6666,11.3015896 L163.602643,0.791639272 L165.844378,0.791639272 L167.780421,11.3015896 L166.033615,11.3015896 L165.713367,8.97251472 L163.733654,8.97251472 Z M168.828505,8.65226693 C168.828505,10.4572999 169.876589,11.4471568 171.594281,11.4471568 C173.311974,11.4471568 174.360058,10.4572999 174.360058,8.65226693 L174.360058,0.791639272 L172.555025,0.791639272 L172.555025,8.72505052 C172.555025,9.49655657 172.249334,9.87503123 171.594281,9.87503123 C170.939229,9.87503123 170.633538,9.49655657 170.633538,8.72505052 L170.633538,0.791639272 L168.828505,0.791639272 L168.828505,8.65226693 Z M175.437255,11.3015896 L177.213174,11.3015896 L178.465052,7.47317278 L178.494166,7.47317278 L179.71693,11.3015896 L181.492849,11.3015896 L179.454909,5.79915022 L181.274499,0.791639272 L179.498579,0.791639272 L178.494166,4.12512767 L178.465052,4.12512767 L177.358742,0.791639272 L175.582822,0.791639272 L177.504309,5.79915022 L175.437255,11.3015896 Z" id="AUX" fill="#660779" opacity="0.2"></path>
                            <path d="M33.1235024,15.5628333 C32.162759,6.65412193 26.9223406,0.278279493 18.1009695,0.278279493 C7.44545203,0.278279493 1.33163052,5.95539947 1.33163052,15.9995348 C1.33163052,34.0789784 23.341388,37.3979101 23.341388,49.8875741 C23.341388,53.6432073 20.8085191,55.6520343 17.0528858,55.6520343 C13.5592735,55.6520343 11.0264046,52.5077833 10.5897031,46.1319408 L0.283546833,47.6167261 C0.720248369,57.0494793 6.48470865,65.0847875 16.528844,65.0847875 C26.6603196,65.0847875 33.6475442,59.3203272 33.6475442,48.9268307 C33.6475442,31.8081304 11.6377868,26.6550523 11.6377868,15.9121945 C11.6377868,11.9818807 13.5592735,9.71103268 17.0528858,9.71103268 C19.4984144,9.71103268 22.3806446,11.2831582 22.8173461,16.6982573 L33.1235024,15.5628333 Z M48.1460352,64.2113845 L58.9762334,64.2113845 L58.9762334,10.5844358 L69.4570702,10.5844358 L69.4570702,1.15168257 L37.6651984,1.15168257 L37.6651984,10.5844358 L48.1460352,10.5844358 L48.1460352,64.2113845 Z M75.8329127,48.9268307 L75.8329127,16.4362363 C75.8329127,7.527525 81.0733311,0.278279493 92.4275711,0.278279493 C103.781811,0.278279493 109.022229,7.527525 109.022229,16.4362363 L109.022229,48.9268307 C109.022229,57.835542 103.781811,65.0847875 92.4275711,65.0847875 C81.0733311,65.0847875 75.8329127,57.835542 75.8329127,48.9268307 Z M86.6631108,16.6982573 L86.6631108,48.6648098 C86.6631108,53.3811863 88.0605557,55.6520343 92.4275711,55.6520343 C96.7945864,55.6520343 98.1920313,53.3811863 98.1920313,48.6648098 L98.1920313,16.6982573 C98.1920313,11.9818807 96.7945864,9.71103268 92.4275711,9.71103268 C88.0605557,9.71103268 86.6631108,11.9818807 86.6631108,16.6982573 Z M130.333264,10.0603939 L130.333264,29.4499421 L134.525599,29.4499421 C141.600164,29.4499421 143.783672,27.2664345 143.783672,19.755168 C143.783672,12.2439016 141.600164,10.0603939 134.525599,10.0603939 L130.333264,10.0603939 Z M130.333264,64.2113845 L119.503066,64.2113845 L119.503066,1.15168257 L135.049641,1.15168257 C148.412708,1.15168257 154.61387,6.3047607 154.61387,19.755168 C154.61387,33.2055754 148.412708,38.3586535 135.049641,38.3586535 L130.333264,38.3586535 L130.333264,64.2113845 Z" id="STOP" fill="#660779" opacity="0.2"></path>
                            <g id="faites-aux-femmes" transform="translate(1.827333, 45.866051)">
                                <path d="M173.132854,3.20829804 C175.974513,1.08870003 179.584763,0.0289169183 183.963713,0.0289169183 C186.269649,0.0289169183 188.266933,0.355004029 189.955624,1.00718803 C191.644314,1.65937204 192.937017,2.5910495 193.83377,3.80224836 C194.730523,5.01344723 195.178893,6.43425535 195.178893,8.06471536 C195.178893,9.20603737 194.852806,10.3298733 194.200622,11.4362569 C193.548438,12.5426405 192.634229,13.451026 191.457969,14.1614407 C190.281708,14.8718554 188.948245,15.2270575 187.457539,15.2270575 C185.687325,15.2270575 184.289809,14.8019796 183.264948,13.9518112 C182.240087,13.1016427 181.727665,11.896285 181.727665,10.3357019 C181.727665,8.4956113 182.292494,6.81859187 183.42217,5.30459329 C184.551846,3.79059471 186.106583,2.66093579 188.086427,1.91558264 C187.410951,1.61278292 186.793714,1.46138534 186.2347,1.46138534 C184.790578,1.46138534 183.625981,1.84570229 182.740874,2.61434772 C181.389922,3.75566973 180.236971,6.11980128 179.281987,9.70681331 L176.731495,19.2100184 L183.963713,19.2100184 L183.509516,20.6424868 L176.347174,20.6424868 L163.559773,68.4380185 C158.831439,68.5078953 154.510784,68.8456284 150.59768,69.4512278 L163.734464,20.6424868 L158.109405,20.6424868 L158.563602,19.2100184 L164.118785,19.2100184 C166.191798,11.4536872 169.196458,6.11983378 173.132854,3.20829804 Z M203.04,54.2530873 C199.942126,56.0931779 196.366814,57.0132094 192.313956,57.0132094 C190.031312,57.0132094 187.952507,56.6230694 186.077477,55.8427779 C184.202448,55.0624863 182.711765,53.9153584 181.605381,52.4013598 C180.498997,50.8873612 179.945814,49.0589442 179.945814,46.9160539 C179.945814,42.2343045 181.151172,37.645793 183.561923,33.1503818 C185.972675,28.6549706 189.268484,24.9806677 193.449449,22.1273626 C197.630414,19.2740576 202.236395,17.8474265 207.267529,17.8474265 C209.946141,17.8474265 212.094823,18.3831411 213.713636,19.4545862 C215.33245,20.5260314 216.141845,22.0982371 216.141845,24.1712505 C216.141845,26.896448 215.05877,29.4003311 212.892588,31.6829751 C210.726405,33.9656192 207.931373,35.9104959 204.507407,37.5176636 C201.083441,39.1248313 197.438252,40.3709499 193.571733,41.2560568 C193.408687,42.5371325 193.327165,43.7599592 193.327165,44.9245734 C193.327165,47.5333095 193.827942,49.3384345 194.82951,50.3400028 C195.831078,51.3415711 197.310116,51.8423478 199.266668,51.8423478 C200.454575,51.8423478 201.98602,51.4347389 203.861049,50.6195089 C205.736078,49.8042789 207.547026,48.5465143 209.293947,46.8461774 L210.411971,47.4051895 C208.595173,50.1303869 206.137874,52.4129967 203.04,54.2530873 Z M201.223211,22.3020539 C199.569458,24.3634212 198.055482,27.007056 196.681238,30.2330376 C195.306993,33.4590192 194.340377,36.7024213 193.781363,39.9633414 C196.250345,38.5890965 198.439787,36.9703069 200.349754,35.106924 C204.682119,30.8211434 206.84827,26.1278182 206.84827,21.0268076 C206.84827,19.8156088 206.463953,19.2100184 205.695307,19.2100184 C204.367647,19.2100184 202.876963,20.2406866 201.223211,22.3020539 Z M276.130827,44.4004996 L274.314038,49.6412378 C272.636994,54.5559101 269.224725,57.0132094 264.07713,57.0132094 C260.886087,57.0132094 258.673353,56.0116561 257.438862,54.0085195 C256.80997,52.9370744 256.495529,51.6793098 256.495529,50.2351881 C256.495529,48.6280203 256.856554,46.7763114 257.578615,44.6800057 L263.727747,26.162731 C264.077132,25.1378704 264.251821,24.3692365 264.251821,23.8568062 C264.251821,23.2977914 264.05384,23.0182881 263.657871,23.0182881 C262.726179,23.0182881 261.619812,23.7345152 260.338737,25.1669907 C259.057661,26.5994663 257.601915,29.0218277 255.971455,32.4341476 C254.340995,35.8464675 252.663975,40.3243423 250.940346,45.8679063 L248.005533,56 L235.25307,56 L243.847881,26.162731 C244.220557,24.8816553 244.406893,24.0664375 244.406893,23.7170532 C244.406893,23.2512075 244.173973,23.0182881 243.708128,23.0182881 C242.007791,23.0182881 240.103675,24.9398729 237.995723,28.7831 C235.887771,32.6263272 233.692506,38.0067645 231.409862,44.9245734 L228.544925,56 L215.862339,56 L224.596903,24.9398921 C224.806533,24.1712467 224.911347,23.5773023 224.911347,23.1580411 C224.911347,22.3428111 224.538676,21.9352022 223.793323,21.9352022 C222.419078,21.9352022 221.161313,23.4375321 220.019991,26.442237 L218.377893,30.8095188 L217.015302,30.8095188 L219.006782,25.2193981 C219.938473,22.680539 221.306875,20.8171841 223.112027,19.6292775 C224.917179,18.4413709 226.984338,17.8474265 229.313567,17.8474265 C231.782549,17.8474265 233.564382,18.4471939 234.65912,19.6467466 C235.753857,20.8462993 236.301218,22.424328 236.301218,24.38088 C236.301218,25.4523252 236.14982,26.616922 235.84702,27.8747054 L235.043441,31.0191483 C236.394393,27.897982 237.821024,25.3708069 239.323377,23.4375472 C240.825729,21.5042874 242.479457,20.0893023 244.284609,19.1925493 C246.089761,18.2957963 248.133628,17.8474265 250.416272,17.8474265 C254.608884,17.8474265 256.705158,19.7457193 256.705158,23.5423619 C256.705158,25.0097759 256.425655,26.7217333 255.86664,28.6782853 L255.482319,29.9710007 C256.926441,26.8731267 258.428771,24.4332963 259.989354,22.6514365 C261.549937,20.8695766 263.157081,19.623458 264.810833,18.9130433 C266.464585,18.2026285 268.281356,17.8474265 270.261201,17.8474265 C274.546981,17.8474265 276.68984,19.7224274 276.68984,23.4724854 C276.68984,24.9631917 276.352106,26.698441 275.67663,28.6782853 L268.619103,49.9207438 C268.38618,50.6195124 268.26972,51.1901648 268.26972,51.6327182 C268.26972,52.4945328 268.665683,52.9254336 269.457621,52.9254336 C270.87845,52.9254336 272.147861,51.4231037 273.265891,48.4183989 L274.768236,44.4004996 L276.130827,44.4004996 Z M339.613635,44.4004996 L337.796846,49.6412378 C336.119801,54.5559101 332.707533,57.0132094 327.559938,57.0132094 C324.368894,57.0132094 322.15616,56.0116561 320.921669,54.0085195 C320.292778,52.9370744 319.978336,51.6793098 319.978336,50.2351881 C319.978336,48.6280203 320.339361,46.7763114 321.061422,44.6800057 L327.210555,26.162731 C327.559939,25.1378704 327.734629,24.3692365 327.734629,23.8568062 C327.734629,23.2977914 327.536647,23.0182881 327.140678,23.0182881 C326.208987,23.0182881 325.10262,23.7345152 323.821544,25.1669907 C322.540469,26.5994663 321.084723,29.0218277 319.454263,32.4341476 C317.823803,35.8464675 316.146783,40.3243423 314.423154,45.8679063 L311.488341,56 L298.735878,56 L307.330688,26.162731 C307.703365,24.8816553 307.8897,24.0664375 307.8897,23.7170532 C307.8897,23.2512075 307.656781,23.0182881 307.190935,23.0182881 C305.490598,23.0182881 303.586483,24.9398729 301.478531,28.7831 C299.370579,32.6263272 297.175314,38.0067645 294.89267,44.9245734 L292.027733,56 L279.345147,56 L288.07971,24.9398921 C288.289341,24.1712467 288.394155,23.5773023 288.394155,23.1580411 C288.394155,22.3428111 288.021484,21.9352022 287.276131,21.9352022 C285.901886,21.9352022 284.644121,23.4375321 283.502799,26.442237 L281.860701,30.8095188 L280.498109,30.8095188 L282.48959,25.2193981 C283.421281,22.680539 284.789682,20.8171841 286.594835,19.6292775 C288.399987,18.4413709 290.467146,17.8474265 292.796375,17.8474265 C295.265357,17.8474265 297.04719,18.4471939 298.141928,19.6467466 C299.236665,20.8462993 299.784025,22.424328 299.784025,24.38088 C299.784025,25.4523252 299.632628,26.616922 299.329828,27.8747054 L298.526248,31.0191483 C299.877201,27.897982 301.303832,25.3708069 302.806184,23.4375472 C304.308537,21.5042874 305.962264,20.0893023 307.767417,19.1925493 C309.572569,18.2957963 311.616436,17.8474265 313.89908,17.8474265 C318.091692,17.8474265 320.187966,19.7457193 320.187966,23.5423619 C320.187966,25.0097759 319.908463,26.7217333 319.349448,28.6782853 L318.965127,29.9710007 C320.409249,26.8731267 321.911579,24.4332963 323.472162,22.6514365 C325.032745,20.8695766 326.639889,19.623458 328.293641,18.9130433 C329.947393,18.2026285 331.764164,17.8474265 333.744008,17.8474265 C338.029789,17.8474265 340.172647,19.7224274 340.172647,23.4724854 C340.172647,24.9631917 339.834914,26.698441 339.159438,28.6782853 L332.101911,49.9207438 C331.868988,50.6195124 331.752528,51.1901648 331.752528,51.6327182 C331.752528,52.4945328 332.148491,52.9254336 332.940429,52.9254336 C334.361258,52.9254336 335.630669,51.4231037 336.748698,48.4183989 L338.251043,44.4004996 L339.613635,44.4004996 Z M365.502881,54.2530873 C362.405007,56.0931779 358.829695,57.0132094 354.776837,57.0132094 C352.494193,57.0132094 350.415388,56.6230694 348.540359,55.8427779 C346.66533,55.0624863 345.174646,53.9153584 344.068263,52.4013598 C342.961879,50.8873612 342.408696,49.0589442 342.408696,46.9160539 C342.408696,42.2343045 343.614053,37.645793 346.024805,33.1503818 C348.435556,28.6549706 351.731365,24.9806677 355.912331,22.1273626 C360.093296,19.2740576 364.699276,17.8474265 369.73041,17.8474265 C372.409023,17.8474265 374.557704,18.3831411 376.176518,19.4545862 C377.795332,20.5260314 378.604727,22.0982371 378.604727,24.1712505 C378.604727,26.896448 377.521652,29.4003311 375.355469,31.6829751 C373.189287,33.9656192 370.394254,35.9104959 366.970288,37.5176636 C363.546322,39.1248313 359.901134,40.3709499 356.034615,41.2560568 C355.871569,42.5371325 355.790047,43.7599592 355.790047,44.9245734 C355.790047,47.5333095 356.290823,49.3384345 357.292392,50.3400028 C358.29396,51.3415711 359.772998,51.8423478 361.72955,51.8423478 C362.917457,51.8423478 364.448901,51.4347389 366.32393,50.6195089 C368.198959,49.8042789 370.009908,48.5465143 371.756829,46.8461774 L372.874853,47.4051895 C371.058055,50.1303869 368.600755,52.4129967 365.502881,54.2530873 Z M363.686092,22.3020539 C362.03234,24.3634212 360.518364,27.007056 359.144119,30.2330376 C357.769874,33.4590192 356.803259,36.7024213 356.244244,39.9633414 C358.713226,38.5890965 360.902668,36.9703069 362.812636,35.106924 C367.145001,30.8211434 369.311151,26.1278182 369.311151,21.0268076 C369.311151,19.8156088 368.926834,19.2100184 368.158189,19.2100184 C366.830528,19.2100184 365.339845,20.2406866 363.686092,22.3020539 Z M386.640525,55.5108644 C388.131231,55.5108644 389.359881,55.0159108 390.326511,54.0259886 C391.293141,53.0360665 391.776449,51.7142491 391.776449,50.0604968 C391.776449,48.5697905 391.421247,46.9684699 390.710832,45.2564869 C390.000417,43.5445039 388.969749,41.5938042 387.618796,39.4043293 C386.500767,37.587531 385.691372,36.2249527 385.190588,35.3165536 C384.689804,34.4081544 384.258903,33.3833092 383.897872,32.2419872 C383.536842,31.1006652 383.356329,29.9127764 383.356329,28.6782853 C383.356329,26.6052718 383.886221,24.7535629 384.94602,23.1231029 C386.005819,21.4926429 387.601317,20.2057634 389.732561,19.2624258 C391.863805,18.3190882 394.478325,17.8474265 397.576199,17.8474265 C401.093334,17.8474265 404.022295,18.4763088 406.36317,19.7340922 C408.704044,20.9918757 409.874464,23.1114419 409.874464,26.0928545 C409.874464,27.1177151 409.676483,28.1192683 409.280514,29.0975443 C408.884545,30.0758203 408.30807,30.8793922 407.55107,31.5082839 C406.794071,32.1371756 405.879862,32.4516167 404.808417,32.4516167 C403.387588,32.4516167 402.269575,31.8984332 401.454345,30.7920497 C400.639115,29.6856661 400.231506,28.235743 400.231506,26.442237 C400.231506,25.0446999 400.464425,23.7345284 400.930271,22.5116834 C401.396117,21.2888384 401.920185,20.362984 402.502493,19.7340922 C402.083231,19.5244617 401.489287,19.4196479 400.720642,19.4196479 C399.043597,19.4196479 397.780009,19.9087786 396.929841,20.8870546 C396.079673,21.8653306 395.654595,23.2861388 395.654595,25.1495216 C395.654595,26.3141359 395.910806,27.4670868 396.423236,28.6084088 C396.935667,29.7497308 397.552903,30.9085046 398.274964,32.0847651 C398.997025,33.2610255 399.532739,34.1519421 399.882124,34.7575415 C401.465999,37.4594467 402.572366,39.6488887 403.201258,41.3259333 C403.830149,43.0029779 404.144591,44.6450594 404.144591,46.2522271 C404.144591,48.2553637 403.59723,50.0721347 402.502493,51.7025947 C401.407755,53.3330548 399.783143,54.6257572 397.628606,55.580741 C395.47407,56.5357247 392.882842,57.0132094 389.854845,57.0132094 C386.011617,57.0132094 382.843914,56.3028053 380.351639,54.8819759 C377.859365,53.4611464 376.613246,51.1203068 376.613246,47.8593868 C376.613246,46.0425885 377.055793,44.5227896 377.9409,43.2999446 C378.826007,42.0770996 380.00225,41.4656863 381.469664,41.4656863 C382.867201,41.4656863 383.991037,42.0421617 384.841205,43.1951299 C385.691374,44.348098 386.116451,45.8678969 386.116451,47.754572 C386.116451,48.6862635 386.005815,49.600472 385.784538,50.497225 C385.563261,51.393978 385.295404,52.2324877 384.980958,53.0127793 C384.666512,53.7930709 384.381186,54.4510681 384.124971,54.9867906 C384.847032,55.3361749 385.685541,55.5108644 386.640525,55.5108644 Z" id="femmes" fill="#000000"></path>
                                <path d="M8.2878389,32.8311143 C8.84538128,31.6306915 9.5053195,30.6550069 10.2676734,29.9040315 C10.8024589,29.3578675 11.456708,28.9283388 12.2304403,28.6154323 C13.0041726,28.3025259 13.8063388,28.146075 14.6369632,28.146075 C15.672399,28.146075 16.483099,28.3793291 17.0690874,28.8458441 C17.6550758,29.3123592 17.9480656,29.909717 17.9480656,30.6379356 C17.9480656,31.0361802 17.8456614,31.420196 17.64085,31.7899945 C17.4360385,32.159793 17.1544269,32.4613165 16.7960068,32.694574 C16.4375867,32.9278316 16.0421927,33.0444586 15.6098129,33.0444586 C15.1660547,33.0444586 14.8190182,32.9420544 14.568693,32.7372429 C14.3183679,32.5324314 14.1988963,32.2422861 14.2102747,31.8667984 C14.2102747,31.309256 14.3923267,30.8228361 14.756436,30.4075239 C15.1205453,29.9922117 15.6041207,29.6935328 16.2071767,29.5114781 C16.2071767,29.2952882 16.0507259,29.101858 15.7378194,28.9311818 C15.424913,28.7605056 15.0465863,28.6751687 14.6028281,28.6751687 C13.9201232,28.6751687 13.2431176,28.9766922 12.571791,29.5797483 C12.0938976,30.0348849 11.6842808,30.7545589 11.3429283,31.7387919 C11.0015758,32.7230248 10.6801404,33.8011136 10.3786124,34.9730904 C10.0770843,36.1450672 9.86374224,36.9813683 9.73857967,37.4820186 L9.72151213,37.5161536 L13.868924,37.5161536 L13.647046,38.2159227 L9.53376921,38.2159227 L3.26998261,61.5643153 C2.0411137,61.5984505 0.994315144,61.7634351 0.129555541,62.0592739 L6.51281491,38.2159227 L3.33825276,38.2159227 L3.56013076,37.5161536 L6.68349029,37.5161536 L6.70055783,37.4820186 C7.20120813,35.5818231 7.73029653,34.0315372 8.2878389,32.8311143 Z M28.768885,49.7877138 L27.8984405,52.3478445 C27.4205471,53.6449839 26.8231892,54.5751555 26.106349,55.138387 C25.3895088,55.7016186 24.6442338,55.9832302 23.8705015,55.9832302 C23.4381217,55.9832302 23.0541059,55.9007379 22.7184426,55.7357509 C22.3827794,55.5707639 22.1239243,55.3460435 21.9418696,55.0615831 C21.7484366,54.7202306 21.6517215,54.3106138 21.6517215,53.8327204 C21.6517215,53.4913679 21.6915453,53.1357977 21.7711943,52.7659992 C21.8508432,52.3962007 21.93618,52.0434751 22.0272073,51.7078118 C22.1182347,51.3721486 22.1751259,51.1531173 22.1978827,51.0507116 L22.8293816,48.5076484 C21.7142969,51.124684 20.5793169,53.024851 19.4244077,54.2082062 C18.2694985,55.3915615 17.06056,55.9832302 15.7975558,55.9832302 C14.7279847,55.9832302 13.9115956,55.5992144 13.348364,54.8311714 C12.7851325,54.0631283 12.5035209,53.0362417 12.5035209,51.7504807 C12.5035209,49.8616636 13.0070082,47.7509992 14.013998,45.4184239 C15.0209878,43.0858487 16.3237969,41.106034 17.9224643,39.4789205 C19.5211318,37.8518071 21.1567545,37.0382626 22.8293816,37.0382626 C23.4438161,37.0382626 23.9529926,37.2658275 24.3569263,37.7209641 C24.7608601,38.1761007 24.9969587,38.8189716 25.0652292,39.6495959 L25.6113904,37.5161536 C26.9085298,37.4820184 27.983774,37.322723 28.8371552,37.0382626 L24.4678653,52.4843848 C24.2971891,53.0988193 24.2118522,53.5311926 24.2118522,53.7815177 C24.2118522,54.361817 24.4735519,54.6519622 24.996959,54.6519622 C26.0210164,54.6519622 26.9142087,53.4629356 27.6765625,51.0848467 L28.103251,49.7877138 L28.768885,49.7877138 Z M24.6385407,40.7419184 C24.6385407,39.8088883 24.4707116,39.0693024 24.1350483,38.5231384 C23.7993851,37.9769744 23.3243433,37.7038966 22.7099089,37.7038966 C21.7199867,37.7038966 20.6646545,38.4747727 19.5438805,40.016548 C18.4231065,41.5583234 17.4844013,43.467024 16.7277367,45.7427071 C15.971072,48.0183903 15.5927453,50.1575004 15.5927453,52.1601016 C15.5927453,53.1272669 15.6951496,53.8184953 15.899961,54.2338075 C16.1047725,54.6491197 16.406296,54.8567727 16.8045406,54.8567727 C17.4531103,54.8567727 18.2296755,54.3589744 19.1342596,53.3633631 C20.0388436,52.3677517 20.9263468,51.0393415 21.7967956,49.3780928 C22.6672444,47.7168441 23.3869184,45.9418379 23.9558392,44.0530208 L24.6044056,41.5099576 C24.6271625,41.1458483 24.6385407,40.8898378 24.6385407,40.7419184 Z M37.4050594,30.3051187 C37.6553846,29.8898065 37.9825091,29.5569928 38.3864429,29.3066677 C38.7903767,29.0563425 39.2085272,28.9311818 39.640907,28.9311818 C40.1643141,28.9311818 40.5909983,29.1047 40.9209724,29.4517417 C41.2509464,29.7987834 41.415931,30.2340013 41.415931,30.7574084 C41.415931,31.2125451 41.2936148,31.6420738 41.0489789,32.0460076 C40.804343,32.4499413 40.4772184,32.7770659 40.0675954,33.027391 C39.6579725,33.2777162 39.2312883,33.4028769 38.7875301,33.4028769 C38.2755013,33.4028769 37.8545063,33.2322032 37.5245322,32.8908507 C37.1945582,32.5494982 37.0295736,32.1228141 37.0295736,31.6107853 C37.0295736,31.1556487 37.1547343,30.7204308 37.4050594,30.3051187 Z M36.2615344,39.2058399 C36.2615344,38.6141623 36.011213,38.3183279 35.5105627,38.3183279 C34.9757771,38.3183279 34.4978908,38.5999395 34.0768895,39.1631711 C33.6558881,39.7264027 33.2121365,40.6338177 32.7456215,41.8854435 L32.2506628,43.1825764 L31.6020964,43.1825764 L32.5066759,40.6395132 C32.9845694,39.3082385 33.6103729,38.3752224 34.3841051,37.8404369 C35.1578374,37.3056513 35.9770711,37.0382626 36.8418307,37.0382626 C38.3892952,37.0382626 39.1630159,37.7664702 39.1630159,39.2229075 C39.1630159,39.9056124 38.9695857,40.8044938 38.5827196,41.9195785 L34.8449287,52.5185199 C34.662874,53.0191702 34.5718481,53.4458544 34.5718481,53.7985853 C34.5718481,54.3902629 34.8506151,54.6860973 35.4081574,54.6860973 C35.8860509,54.6860973 36.3354916,54.4215531 36.756493,53.8924567 C37.1774944,53.3633604 37.6383133,52.438878 38.1389636,51.1189818 L38.6168547,49.8218488 L39.2824887,49.8218488 L38.3779091,52.3819796 C37.9227725,53.6449838 37.3140364,54.5609325 36.5516825,55.1298533 C35.7893287,55.6987741 34.9644059,55.9832302 34.0768895,55.9832302 C32.449776,55.9832302 31.6362315,55.2720899 31.6362315,53.8497879 C31.6362315,53.1329477 31.8410399,52.2113098 32.2506628,51.0848467 L36.0055213,40.4859053 C36.1761975,39.9738766 36.2615344,39.5471924 36.2615344,39.2058399 Z M45.1366543,53.3036267 C45.1366543,53.7701417 45.2760379,54.1171782 45.554809,54.3447465 C45.8335802,54.5723148 46.2005286,54.6860973 46.6556653,54.6860973 C47.2359645,54.6860973 47.7792757,54.4357759 48.2856152,53.9351256 C48.7919547,53.4344753 49.2840638,52.5185266 49.7619573,51.1872519 L50.2569159,49.8218488 L50.9225499,49.8218488 L50.1886457,52.0235613 C49.6993738,53.4686201 49.0621921,54.4898176 48.2770814,55.0871844 C47.4919707,55.6845513 46.530509,55.9832302 45.3926674,55.9832302 C44.3458532,55.9832302 43.5635988,55.7272197 43.0458809,55.215191 C42.528163,54.7031623 42.2693079,53.9920219 42.2693079,53.0817487 C42.2693079,52.5242063 42.3774012,51.858579 42.5935911,51.0848467 L46.297247,38.2159227 L43.1568199,38.2159227 L43.3274953,37.5161536 L46.5020574,37.5161536 L48.0210683,32.2081492 C49.3068293,32.1740139 50.3536279,32.0090294 51.1614954,31.7131906 L49.5059442,37.5161536 L54.1312471,37.5161536 L54.0288419,38.2159227 L49.3182013,38.2159227 L45.2561271,52.5185199 C45.1764782,52.7916019 45.1366543,53.0533015 45.1366543,53.3036267 Z M63.0234346,53.5852411 C62.295216,54.296392 61.4788269,54.873838 60.5742428,55.3175962 C59.6696588,55.7613544 58.7451764,55.9832302 57.8007679,55.9832302 C56.355709,55.9832302 55.2264182,55.5593906 54.4128615,54.7116986 C53.5993047,53.8640066 53.1925325,52.6436898 53.1925325,51.0507116 C53.1925325,49.2870571 53.7102426,47.2930197 54.7456785,45.0685394 C55.7811143,42.8440591 57.183483,40.9495813 58.9528267,39.3850491 C60.7221704,37.8205169 62.6422492,37.0382626 64.7131209,37.0382626 C65.4640964,37.0382626 66.0842107,37.2373818 66.5734826,37.6356264 C67.0627545,38.033871 67.3073868,38.6027832 67.3073868,39.3423802 C67.3073868,41.2311973 66.2548991,42.8753537 64.1498921,44.2748988 C62.0448852,45.674444 59.6156299,46.8407141 56.8620532,47.7737442 C56.6003497,48.9343426 56.4694999,50.0607889 56.4694999,51.1531168 C56.4694999,53.3946647 57.2716661,54.5154219 58.8760228,54.5154219 C60.8672455,54.5154219 62.6650083,53.3491518 64.2693649,51.0165765 L64.8325937,51.2896571 C64.3547002,52.1089031 63.7516532,52.8740901 63.0234346,53.5852411 Z M61.4361535,39.0095632 C60.5145019,39.8800121 59.6525998,41.0405931 58.8504215,42.4913411 C58.0482432,43.9420891 57.4366625,45.4809968 57.0156611,47.1081102 C59.3141011,46.3002427 60.9013663,45.5492785 61.7775043,44.8551952 C62.6422639,44.1838686 63.3135804,43.3674795 63.7914738,42.4060034 C64.2693673,41.4445273 64.5083105,40.4005733 64.5083105,39.2741101 C64.5083105,38.6482972 64.4627975,38.2301467 64.3717701,38.019646 C64.2807428,37.8091453 64.1385148,37.7038966 63.9450817,37.7038966 C63.1941062,37.7038966 62.3578052,38.1391144 61.4361535,39.0095632 Z M71.4547986,55.2834611 C72.5129913,55.2834611 73.3663596,54.9677148 74.0149294,54.3362127 C74.6634991,53.7047107 74.987779,52.8200521 74.987779,51.6822105 C74.987779,50.9426135 74.8483955,50.2144058 74.5696243,49.4975656 C74.2908532,48.7807254 73.8215005,47.9671809 73.1615524,47.0569076 C72.6040101,46.2945537 72.1915487,45.7085741 71.9241559,45.2989512 C71.6567631,44.8893282 71.41782,44.4000636 71.2073193,43.8311428 C70.9968186,43.2622221 70.8915698,42.6477968 70.8915698,41.9878487 C70.8915698,41.0206834 71.1333575,40.1616258 71.6169402,39.4106504 C72.1005229,38.659675 72.7576165,38.0765399 73.5882409,37.6612277 C74.4188652,37.2459155 75.3291249,37.0382626 76.319047,37.0382626 C77.5251591,37.0382626 78.5378229,37.2629829 79.3570689,37.7124303 C80.1763148,38.1618777 80.5859316,38.9498212 80.5859316,40.0762844 C80.5859316,40.3266095 80.5290404,40.5911537 80.4152563,40.8699249 C80.3014721,41.1486961 80.1222647,41.3876393 79.8776288,41.5867615 C79.6329929,41.7858838 79.3286248,41.8854435 78.9645155,41.8854435 C78.5662709,41.8854435 78.2334573,41.7489045 77.9660645,41.4758225 C77.6986717,41.2027406 77.5649773,40.850015 77.5649773,40.4176352 C77.5649773,39.6666597 77.8949465,38.8872499 78.5548946,38.0793824 C78.0883795,37.8063004 77.5023999,37.6697615 76.7969381,37.6697615 C75.9094217,37.6697615 75.181214,37.9655959 74.6122932,38.5572735 C74.0433724,39.1489511 73.7589163,39.9568065 73.7589163,40.9808639 C73.7589163,41.5952984 73.8613205,42.1215422 74.066132,42.5596112 C74.2709435,42.9976802 74.5667778,43.4926339 74.953644,44.0444871 C75.3405101,44.5963402 75.6420336,45.0315581 75.8582235,45.3501538 C76.5523069,46.4311033 77.070017,47.3527411 77.4113695,48.115095 C77.752722,48.8774489 77.9233956,49.6682369 77.9233956,50.4874828 C77.9233956,51.5456755 77.6503178,52.4929144 77.1041538,53.329228 C76.5579898,54.1655415 75.8269376,54.8169461 74.9109751,55.2834611 C73.9950126,55.7499762 72.9965716,55.9832302 71.9156221,55.9832302 C70.5729691,55.9832302 69.4493673,55.6987741 68.5447833,55.1298533 C67.6401992,54.5609325 67.187914,53.6904967 67.187914,52.5185199 C67.187914,52.1088969 67.2988519,51.7447931 67.520731,51.4261974 C67.7426101,51.1076018 68.086802,50.9483064 68.5533171,50.9483064 C69.0767242,50.9483064 69.4635845,51.1588039 69.7139097,51.5798053 C69.9642348,52.0008067 70.0893955,52.524206 70.0893955,53.1500188 C70.0893955,53.5596418 70.0097478,54.1626888 69.85045,54.9591779 C70.2828298,55.1753678 70.8176073,55.2834611 71.4547986,55.2834611 Z M106.494455,49.7877138 L105.624011,52.3478445 C105.146117,53.6449839 104.548759,54.5751555 103.831919,55.138387 C103.115079,55.7016186 102.369804,55.9832302 101.596071,55.9832302 C101.163692,55.9832302 100.779676,55.9007379 100.444013,55.7357509 C100.108349,55.5707639 99.8494942,55.3460435 99.6674396,55.0615831 C99.4740065,54.7202306 99.3772914,54.3106138 99.3772914,53.8327204 C99.3772914,53.4913679 99.4171153,53.1357977 99.4967642,52.7659992 C99.5764131,52.3962007 99.66175,52.0434751 99.7527773,51.7078118 C99.8438046,51.3721486 99.9006958,51.1531173 99.9234527,51.0507116 L100.554952,48.5076484 C99.4398668,51.124684 98.3048869,53.024851 97.1499777,54.2082062 C95.9950685,55.3915615 94.7861299,55.9832302 93.5231258,55.9832302 C92.4535547,55.9832302 91.6371656,55.5992144 91.073934,54.8311714 C90.5107024,54.0631283 90.2290908,53.0362417 90.2290908,51.7504807 C90.2290908,49.8616636 90.7325782,47.7509992 91.739568,45.4184239 C92.7465578,43.0858487 94.0493669,41.106034 95.6480343,39.4789205 C97.2467017,37.8518071 98.8823245,37.0382626 100.554952,37.0382626 C101.169386,37.0382626 101.678563,37.2658275 102.082496,37.7209641 C102.48643,38.1761007 102.722529,38.8189716 102.790799,39.6495959 L103.33696,37.5161536 C104.6341,37.4820184 105.709344,37.322723 106.562725,37.0382626 L102.193435,52.4843848 C102.022759,53.0988193 101.937422,53.5311926 101.937422,53.7815177 C101.937422,54.361817 102.199122,54.6519622 102.722529,54.6519622 C103.746586,54.6519622 104.639779,53.4629356 105.402133,51.0848467 L105.828821,49.7877138 L106.494455,49.7877138 Z M102.364111,40.7419184 C102.364111,39.8088883 102.196282,39.0693024 101.860618,38.5231384 C101.524955,37.9769744 101.049913,37.7038966 100.435479,37.7038966 C99.4455566,37.7038966 98.3902244,38.4747727 97.2694504,40.016548 C96.1486765,41.5583234 95.2099713,43.467024 94.4533066,45.7427071 C93.696642,48.0183903 93.3183153,50.1575004 93.3183153,52.1601016 C93.3183153,53.1272669 93.4207195,53.8184953 93.625531,54.2338075 C93.8303425,54.6491197 94.131866,54.8567727 94.5301105,54.8567727 C95.1786802,54.8567727 95.9552455,54.3589744 96.8598295,53.3633631 C97.7644136,52.3677517 98.6519167,51.0393415 99.5223655,49.3780928 C100.392814,47.7168441 101.112488,45.9418379 101.681409,44.0530208 L102.329976,41.5099576 C102.352732,41.1458483 102.364111,40.8898378 102.364111,40.7419184 Z M126.309867,49.8218488 L125.439423,52.3819796 C124.59742,54.7828253 123.186517,55.9832302 121.206673,55.9832302 C120.819807,55.9832302 120.464237,55.9007379 120.139952,55.7357509 C119.815667,55.5707639 119.573879,55.3346653 119.414582,55.027448 C119.278041,54.7429877 119.209771,54.3845729 119.209771,53.9521931 C119.209771,53.3377587 119.374756,52.3819861 119.70473,51.0848467 L120.81412,46.6984893 C119.88109,48.9514156 118.979364,50.7577121 118.108915,52.1174327 C117.238466,53.4771534 116.362341,54.4613716 115.480514,55.0701169 C114.598687,55.6788621 113.651448,55.9832302 112.638769,55.9832302 C110.670303,55.9832302 109.686085,55.0843488 109.686085,53.2865591 C109.686085,52.5583405 109.856758,51.6935939 110.198111,50.6922933 L113.577483,40.4859053 C113.759538,39.9169845 113.850564,39.4789221 113.850564,39.1717049 C113.850564,38.6027841 113.577486,38.3183279 113.031322,38.3183279 C112.553429,38.3183279 112.098299,38.5828721 111.665919,39.1119685 C111.233539,39.6410648 110.789788,40.5655472 110.334651,41.8854435 L109.873828,43.1825764 L109.208194,43.1825764 L110.095706,40.6395132 C110.914952,38.2386674 112.320165,37.0382626 114.311388,37.0382626 C115.949879,37.0382626 116.769113,37.7607811 116.769113,39.2058399 C116.769113,39.8430312 116.581372,40.7476017 116.205884,41.9195785 L112.877714,51.9211561 C112.650146,52.603861 112.536364,53.1841515 112.536364,53.662045 C112.536364,54.4585341 112.906157,54.8567727 113.645754,54.8567727 C114.53327,54.8567727 115.520333,54.2082127 116.606971,52.9110733 C117.69361,51.6139339 118.763165,49.8047929 119.815669,47.4835961 C120.868172,45.1623992 121.792655,42.5340246 122.589144,39.5983933 L123.118237,37.5161536 C124.449512,37.4820184 125.513378,37.322723 126.309867,37.0382626 L121.974712,52.5185199 C121.804036,53.1101975 121.718699,53.5653273 121.718699,53.883923 C121.718699,54.4187085 121.969021,54.6860973 122.469671,54.6860973 C122.9817,54.6860973 123.451052,54.4101748 123.877743,53.8583217 C124.304433,53.3064685 124.739651,52.3933643 125.18341,51.1189818 L125.644233,49.8218488 L126.309867,49.8218488 Z M141.243963,39.1717049 C141.903911,38.409351 142.504114,37.8631952 143.044588,37.5332212 C143.585063,37.2032471 144.151131,37.0382626 144.742809,37.0382626 C145.186567,37.0382626 145.553515,37.1548896 145.843665,37.3881471 C146.133814,37.6214046 146.278887,37.9314618 146.278887,38.3183279 C146.278887,38.7734646 146.105369,39.1688586 145.758327,39.5045219 C145.411285,39.8401851 144.970378,40.0080142 144.435593,40.0080142 C143.650482,40.0080142 142.910896,39.7292472 142.216813,39.1717049 C140.771754,40.5029795 139.520147,42.5396854 138.461954,45.2818836 L139.281196,52.7574654 C139.372224,53.3491431 139.514452,53.764449 139.707885,54.0033957 C139.901318,54.2423425 140.157328,54.361814 140.475924,54.361814 C140.874169,54.361814 141.25534,54.1370937 141.619449,53.6876463 C141.983558,53.2381989 142.381797,52.3933642 142.814177,51.1531168 L143.275,49.8559839 L143.940634,49.8559839 L143.07019,52.4161147 C142.20543,54.7942036 140.874176,55.9832302 139.076386,55.9832302 C137.39238,55.9832302 136.425229,54.907986 136.174904,52.7574654 L135.662878,48.2175002 C134.741226,50.2883719 133.500998,52.1544041 131.942155,53.8156528 C131.225315,54.5666283 130.590977,55.1156286 130.039124,55.4626703 C129.487271,55.809712 128.949649,55.9832302 128.426242,55.9832302 C127.902835,55.9832302 127.507441,55.8694477 127.240048,55.6418794 C126.972655,55.4143111 126.838961,55.0957203 126.838961,54.6860973 C126.838961,54.2423391 127.015324,53.8526342 127.368054,53.5169709 C127.720785,53.1813076 128.153159,53.0134785 128.665187,53.0134785 C129.416163,53.0134785 130.15006,53.2922455 130.8669,53.8497879 C131.822687,52.9622715 132.707345,51.9012501 133.520902,50.666692 C134.334459,49.4321339 135.002931,48.2061279 135.526338,46.9886375 L134.775366,40.2469598 C134.627447,39.1773887 134.234897,38.6426112 133.597706,38.6426112 C133.21084,38.6426112 132.832513,38.8701761 132.462715,39.3253127 C132.092916,39.7804493 131.686144,40.6224395 131.242386,41.8513084 L130.79863,43.1484413 L130.132996,43.1484413 L131.00344,40.6053781 C131.469955,39.2968603 132.041712,38.3752224 132.718728,37.8404369 C133.395743,37.3056513 134.155241,37.0382626 134.997244,37.0382626 C135.850625,37.0382626 136.513408,37.2800503 136.985612,37.7636329 C137.457817,38.2472156 137.762185,39.0749829 137.898726,40.2469598 L138.291279,43.8482104 C139.07639,42.0504207 140.060608,40.4916011 141.243963,39.1717049 Z" id="faites-aux" fill="#660779"></path>
                            </g>
                        </g>
                        <g id="etiquette-gdes-causes" transform="translate(0.188154, 0.000000)">
                            <rect id="Rectangle-3" fill="#000000" x="0" y="0" width="156" height="23.6546666"></rect>
                            <path d="M13.4627912,13.0987996 L14.612772,13.0987996 L14.612772,14.1177699 C14.612772,15.1658535 14.350751,15.5734416 13.6229151,15.5734416 C12.9969763,15.5734416 12.7786255,15.1367401 12.7786255,14.4671311 L12.7786255,9.06658875 C12.7786255,8.17862896 13.1425435,7.91660804 13.579245,7.91660804 C14.2925242,7.91660804 14.612772,8.32419614 14.612772,9.89632167 L16.3304647,9.89632167 L16.3304647,9.22671265 C16.3304647,7.65458712 15.4279482,6.34448251 13.6229151,6.34448251 C11.8469956,6.34448251 10.9735925,7.55269009 10.9735925,9.03747532 L10.9735925,14.4525744 C10.9735925,16.1265969 11.9634493,17.1455672 13.3900077,17.1455672 C14.2342973,17.1455672 14.6709988,16.8544328 15.2095974,16.2139372 L15.5444019,17 L16.417805,17 L16.417805,11.6722413 L13.4627912,11.6722413 L13.4627912,13.0987996 Z M20.0569844,7.97483491 L20.0569844,11.2064263 L20.69748,11.2064263 C21.6727801,11.2064263 22.0366981,10.8425083 22.0366981,9.5906306 C22.0366981,8.33875286 21.6727801,7.97483491 20.69748,7.97483491 L20.0569844,7.97483491 Z M20.0569844,12.6912115 L20.0569844,17 L18.2519514,17 L18.2519514,6.49004969 L20.7848203,6.49004969 C22.8082041,6.49004969 23.8417311,7.34889604 23.8417311,9.5906306 C23.8417311,11.2792099 23.1866788,11.9633756 22.5752966,12.2399533 L24.103752,17 L22.2696056,17 L20.9886144,12.6475414 C20.7557069,12.6766548 20.3772322,12.6912115 20.0569844,12.6912115 Z M27.873942,8.58621706 L27.1606628,13.0987996 L28.6163346,13.0987996 L27.9030554,8.58621706 L27.873942,8.58621706 Z M26.8986419,14.6709251 L26.5783941,17 L24.8315879,17 L26.7676314,6.49004969 L29.009366,6.49004969 L30.9454094,17 L29.1986033,17 L28.8783555,14.6709251 L26.8986419,14.6709251 Z M33.6238455,17 L33.6238455,10.4349202 L33.652959,10.4349202 L35.9529204,17 L37.5250459,17 L37.5250459,6.49004969 L35.8946935,6.49004969 L35.8946935,12.5019742 L35.8655801,12.5019742 L33.6675157,6.49004969 L31.9934931,6.49004969 L31.9934931,17 L33.6238455,17 Z M41.0768851,7.97483491 L41.0768851,15.5152148 L41.7028239,15.5152148 C42.6635673,15.5152148 42.9983718,15.1512968 42.9983718,14.0449863 L42.9983718,9.44506342 C42.9983718,8.33875286 42.6635673,7.97483491 41.7028239,7.97483491 L41.0768851,7.97483491 Z M39.2718521,17 L39.2718521,6.49004969 L41.9502882,6.49004969 C43.813548,6.49004969 44.8034049,7.50901994 44.8034049,9.66341418 L44.8034049,13.8266355 C44.8034049,15.9810297 43.813548,17 41.9502882,17 L39.2718521,17 Z M51.5868354,17 L51.5868354,15.4278745 L48.355244,15.4278745 L48.355244,12.3418503 L50.6843189,12.3418503 L50.6843189,10.7697247 L48.355244,10.7697247 L48.355244,8.06217522 L51.3830413,8.06217522 L51.3830413,6.49004969 L46.550211,6.49004969 L46.550211,17 L51.5868354,17 Z M61.6891976,9.9982187 L61.6891976,9.22671265 C61.6891976,7.65458712 60.8157945,6.34448251 59.0107615,6.34448251 C57.1183882,6.34448251 56.2449851,7.55269009 56.2449851,9.03747532 L56.2449851,14.4525744 C56.2449851,15.9373596 57.1183882,17.1455672 59.0107615,17.1455672 C60.8157945,17.1455672 61.6891976,15.9373596 61.6891976,14.4525744 L61.6891976,13.2443668 L59.8841646,13.2443668 L59.8841646,14.5108012 C59.8841646,15.194967 59.6658138,15.5734416 59.0107615,15.5734416 C58.2829256,15.5734416 58.0500181,15.194967 58.0500181,14.4089042 L58.0500181,9.08114547 C58.0500181,8.2950827 58.2829256,7.91660804 59.0107615,7.91660804 C59.4765765,7.91660804 59.8841646,8.2950827 59.8841646,9.18304249 L59.8841646,9.9982187 L61.6891976,9.9982187 Z M65.8669756,8.58621706 L65.1536965,13.0987996 L66.6093683,13.0987996 L65.8960891,8.58621706 L65.8669756,8.58621706 Z M64.8916755,14.6709251 L64.5714277,17 L62.8246216,17 L64.7606651,6.49004969 L67.0023996,6.49004969 L68.9384431,17 L67.191637,17 L66.8713892,14.6709251 L64.8916755,14.6709251 Z M69.9865268,14.3506773 C69.9865268,16.1557104 71.0346105,17.1455672 72.7523032,17.1455672 C74.4699959,17.1455672 75.5180796,16.1557104 75.5180796,14.3506773 L75.5180796,6.49004969 L73.7130466,6.49004969 L73.7130466,14.4234609 C73.7130466,15.194967 73.4073555,15.5734416 72.7523032,15.5734416 C72.0972509,15.5734416 71.7915598,15.194967 71.7915598,14.4234609 L71.7915598,6.49004969 L69.9865268,6.49004969 L69.9865268,14.3506773 Z M82.2723967,8.89190814 C82.1122728,7.40712291 81.2388697,6.34448251 79.7686412,6.34448251 C77.9927216,6.34448251 76.9737514,7.29066917 76.9737514,8.96469173 C76.9737514,11.9779323 80.6420443,12.5310876 80.6420443,14.6126983 C80.6420443,15.2386371 80.2198995,15.5734416 79.5939606,15.5734416 C79.0116919,15.5734416 78.5895471,15.0493998 78.5167635,13.9867594 L76.7990708,14.2342236 C76.8718544,15.8063491 77.8325977,17.1455672 79.5066203,17.1455672 C81.1951996,17.1455672 82.359737,16.1848238 82.359737,14.4525744 C82.359737,11.5994577 78.6914441,10.7406113 78.6914441,8.95013501 C78.6914441,8.2950827 79.0116919,7.91660804 79.5939606,7.91660804 C80.0015487,7.91660804 80.4819204,8.17862896 80.554704,9.08114547 L82.2723967,8.89190814 Z M88.7646929,17 L88.7646929,15.4278745 L85.5331015,15.4278745 L85.5331015,12.3418503 L87.8621764,12.3418503 L87.8621764,10.7697247 L85.5331015,10.7697247 L85.5331015,8.06217522 L88.5608988,8.06217522 L88.5608988,6.49004969 L83.7280685,6.49004969 L83.7280685,17 L88.7646929,17 Z M98.2847864,6.49004969 L97.0037952,12.6329846 L96.9746818,12.6329846 L95.6936906,6.49004969 L93.3209456,6.49004969 L93.3209456,17 L94.8930711,17 L94.8930711,8.79001111 L94.9221845,8.79001111 L96.5525369,17 L97.42594,17 L99.0562924,8.79001111 L99.0854059,8.79001111 L99.0854059,17 L100.657531,17 L100.657531,6.49004969 L98.2847864,6.49004969 Z M104.660629,8.58621706 L103.94735,13.0987996 L105.403021,13.0987996 L104.689742,8.58621706 L104.660629,8.58621706 Z M103.685329,14.6709251 L103.365081,17 L101.618275,17 L103.554318,6.49004969 L105.796053,6.49004969 L107.732096,17 L105.98529,17 L105.665042,14.6709251 L103.685329,14.6709251 Z M110.497873,17 L110.497873,13.2734802 L111.138368,12.1089428 L111.167482,12.1089428 L112.63771,17 L114.471857,17 L112.273792,10.4058068 L114.224392,6.49004969 L112.419359,6.49004969 L110.526986,10.3766934 L110.497873,10.3766934 L110.497873,6.49004969 L108.69284,6.49004969 L108.69284,17 L110.497873,17 Z M120.279987,17 L120.279987,15.4278745 L117.048396,15.4278745 L117.048396,12.3418503 L119.377471,12.3418503 L119.377471,10.7697247 L117.048396,10.7697247 L117.048396,8.06217522 L120.076193,8.06217522 L120.076193,6.49004969 L115.243363,6.49004969 L115.243363,17 L120.279987,17 Z M123.307784,17 L123.307784,15.2823073 L121.590092,15.2823073 L121.590092,17 L123.307784,17 Z M124.938137,14.4525744 L124.938137,9.03747532 C124.938137,7.55269009 125.81154,6.34448251 127.703913,6.34448251 C129.596287,6.34448251 130.46969,7.55269009 130.46969,9.03747532 L130.46969,14.4525744 C130.46969,15.9373596 129.596287,17.1455672 127.703913,17.1455672 C125.81154,17.1455672 124.938137,15.9373596 124.938137,14.4525744 Z M126.74317,9.08114547 L126.74317,14.4089042 C126.74317,15.194967 126.976077,15.5734416 127.703913,15.5734416 C128.431749,15.5734416 128.664657,15.194967 128.664657,14.4089042 L128.664657,9.08114547 C128.664657,8.2950827 128.431749,7.91660804 127.703913,7.91660804 C126.976077,7.91660804 126.74317,8.2950827 126.74317,9.08114547 Z M134.021529,7.97483491 L134.021529,11.2064263 L134.662024,11.2064263 C135.637324,11.2064263 136.001242,10.8425083 136.001242,9.5906306 C136.001242,8.33875286 135.637324,7.97483491 134.662024,7.97483491 L134.021529,7.97483491 Z M134.021529,12.6912115 L134.021529,17 L132.216496,17 L132.216496,6.49004969 L134.749365,6.49004969 C136.772748,6.49004969 137.806275,7.34889604 137.806275,9.5906306 C137.806275,11.2792099 137.151223,11.9633756 136.539841,12.2399533 L138.068296,17 L136.23415,17 L134.953159,12.6475414 C134.720251,12.6766548 134.341777,12.6912115 134.021529,12.6912115 Z M141.984053,13.0987996 L143.134034,13.0987996 L143.134034,14.1177699 C143.134034,15.1658535 142.872013,15.5734416 142.144177,15.5734416 C141.518239,15.5734416 141.299888,15.1367401 141.299888,14.4671311 L141.299888,9.06658875 C141.299888,8.17862896 141.663806,7.91660804 142.100507,7.91660804 C142.813786,7.91660804 143.134034,8.32419614 143.134034,9.89632167 L144.851727,9.89632167 L144.851727,9.22671265 C144.851727,7.65458712 143.94921,6.34448251 142.144177,6.34448251 C140.368258,6.34448251 139.494855,7.55269009 139.494855,9.03747532 L139.494855,14.4525744 C139.494855,16.1265969 140.484712,17.1455672 141.91127,17.1455672 C142.75556,17.1455672 143.192261,16.8544328 143.73086,16.2139372 L144.065664,17 L144.939067,17 L144.939067,11.6722413 L141.984053,11.6722413 L141.984053,13.0987996 Z" id="GRANDE-CAUSE-MAKE.OR" fill="#FFFFFF"></path>
                        </g>
                    </g>
                </g>
            </g>
        </g>
    </g>
</svg>