<?xml version="1.0" encoding="UTF-8"?>
<svg width="18px" height="18px" viewBox="0 0 18 18" version="1.1" xmlns="http://www.w3.org/2000/svg" xmlns:xlink="http://www.w3.org/1999/xlink">
    <!-- Generator: Sketch 53.2 (72643) - https://sketchapp.com -->
    <title>timeline-circle-jeunes</title>
    <desc>Created with Sketch.</desc>
    <g id="intégration" stroke="none" stroke-width="1" fill="none" fill-rule="evenodd">
        <g id="timeline-circle" transform="translate(-34.000000, -32.000000)" fill="#FFFFFF" fill-rule="nonzero" stroke="#2999D5" stroke-width="4">
            <g id="timeline-circle-jeunes" transform="translate(36.000000, 34.000000)">
                <circle id="Oval-4" cx="7" cy="7" r="7"></circle>
            </g>
        </g>
    </g>
</svg>