<svg xmlns="http://www.w3.org/2000/svg" width="148" height="67" viewBox="0 0 148 67">
  <g fill="none" fill-rule="evenodd">
    <rect width="148" height="67" fill="#FFF"/>
    <g fill="#221F20" fill-rule="nonzero" transform="translate(17 24)">
      <polygon points="1.485 3.848 1.593 11.601 1.593 18.747 0 18.747 0 .227 2.475 .227 5.675 14.823 8.876 .227 11.351 .227 11.351 18.747 9.716 18.747 9.716 11.525 9.792 3.848 6.478 18.747 4.838 18.747"/>
      <path d="M18.1350007 18.9765008L17.2215007 18.9765008C14.9355006 18.9765008 13.7925005 17.8335007 13.7925005 15.5475006L13.7925005 3.42900014C13.7925005 1.14150005 14.9355006-.00150000006 17.2215007-.00000147444306L18.1350007-.00000147444306C20.4210008-.00000147444306 21.5640009 1.14300005 21.5640009 3.42900014L21.5640009 15.5475006C21.5640009 17.8335007 20.4210008 18.9765008 18.1350007 18.9765008zM18.0585007 1.56150006L17.2575007 1.56150006C16.0402506 1.56150006 15.4575006 2.13300008 15.4575006 3.36150013L15.4575006 15.6330006C15.4575006 16.8525007 16.0290006 17.4217507 17.2575007 17.4217507L18.0585007 17.4217507C19.2780008 17.4217507 19.8585008 16.8525007 19.8585008 15.6330006L19.8585008 3.35250013C19.8495008 2.13300008 19.2780008 1.56150006 18.0585007 1.56150006L18.0585007 1.56150006zM31.5832513 15.5092506C31.5832513 17.7592507 30.4402512 18.9382508 28.1565011 18.9382508L27.3937511 18.9382508C25.107751 18.9382508 23.964751 17.7570007 23.964751 15.5092506L23.964751.227250009 25.641001.227250009 25.641001 15.5857506C25.641001 16.8030007 26.250751 17.3857507 27.4702511 17.3857507L28.0777511 17.3857507C29.3355012 17.3857507 29.9070012 16.8120007 29.9070012 15.5857506L29.9070012.227250009 31.5832513.227250009 31.5832513 15.5092506z"/>
      <polygon points="36.65 18.817 33.451 .221 35.165 .221 37.604 14.587 40.041 .221 41.679 .221 38.529 18.817"/>
      <polygon points="49.491 .227 49.491 1.789 45.299 1.789 45.299 8.271 49.338 8.271 49.338 9.794 45.299 9.794 45.299 17.186 49.574 17.186 49.574 18.747 43.585 18.747 43.585 .227"/>
      <polygon points="53.033 3.848 53.147 11.601 53.147 18.747 51.543 18.747 51.543 .227 54.018 .227 57.218 14.823 60.419 .227 62.894 .227 62.894 18.747 61.263 18.747 61.263 11.525 61.34 3.848 58.025 18.747 56.385 18.747"/>
      <polygon points="71.323 .227 71.323 1.789 67.131 1.789 67.131 8.271 71.181 8.271 71.181 9.794 67.131 9.794 67.131 17.186 71.406 17.186 71.406 18.747 65.417 18.747 65.417 .227"/>
      <polygon points="79.322 18.747 74.822 4.19 74.975 10.078 74.975 18.747 73.375 18.747 73.375 .227 75.546 .227 79.821 13.871 79.747 7.715 79.747 .227 81.347 .227 81.347 18.747"/>
      <polygon points="85.799 18.747 85.799 1.789 82.942 1.789 82.942 .227 90.367 .227 90.367 1.789 87.476 1.789 87.476 18.747"/>
      <path d="M102.447004 14.7465006C102.447004 17.5275007 101.112754 18.9382508 98.2552539 18.9382508L96.1222538 18.9382508C93.3412537 18.9382508 91.9687537 17.5275007 91.9687537 14.7465006L91.9687537.227250009 96.6937538.227250009 96.6937538 14.6700006C96.6937538 14.8950006 96.8085038 15.0142506 97.0762539 15.0142506L97.3417539 15.0142506C97.6095039 15.0142506 97.7242539 14.8995006 97.7242539 14.6700006L97.7242539.227250009 102.449254.227250009 102.447004 14.7465006zM108.018004 18.7470007L103.293004 18.7470007 103.293004.227250009 109.543504.227250009C112.401004.227250009 113.733005 1.59975006 113.733005 4.41900018L113.733005 9.20025037C113.733005 12.0195005 112.401004 13.3920005 109.543504 13.3920005L108.018004 13.3920005 108.018004 18.7470007zM108.666004 4.12200016L108.018004 4.12200016 108.018004 9.52200038 108.666004 9.52200038C108.933754 9.52200038 109.046254 9.40950037 109.046254 9.14175036L109.046254 4.49550018C109.037254 4.22775017 108.918004 4.11300016 108.657004 4.11300016L108.666004 4.12200016z"/>
    </g>
  </g>
</svg>
