<?xml version="1.0" encoding="UTF-8"?>
<svg width="202px" height="202px" viewBox="0 0 202 202" version="1.1" xmlns="http://www.w3.org/2000/svg" xmlns:xlink="http://www.w3.org/1999/xlink">
    <!-- Generator: Sketch 62 (91390) - https://sketch.com -->
    <title>Group</title>
    <desc>Created with Sketch.</desc>
    <g id="Sial" stroke="none" stroke-width="1" fill="none" fill-rule="evenodd">
        <g id="Group" transform="translate(1.000000, 1.000000)">
            <circle id="Oval" stroke="#979797" fill="#FFFFFF" cx="100" cy="100" r="100"></circle>
            <g id="SIAL_Logo_N" transform="translate(32.000000, 70.000000)" fill="#1A1919">
                <path d="M31.6608033,29.3945631 C31.6617633,29.4134431 31.6630433,29.4320031 31.6640033,29.4512031 C31.6630433,29.4320031 31.6617633,29.4134431 31.6608033,29.3945631 Z M135.892494,40.2841642 C135.118414,38.248644 133.973454,35.9113637 131.985934,35.9113637 C131.715214,35.9113637 131.430094,35.9542438 131.111374,36.0460838 C128.485133,36.9654439 125.744973,37.4128039 122.738253,37.4128039 C116.368332,37.4128039 113.000332,35.1238437 113.000332,30.7939232 L112.879692,1.84544019 L112.879692,0.832000087 L112.538252,0.723520075 C111.951692,0.542080057 111.027532,0.323200034 109.937291,0.323200034 C108.318091,0.323200034 106.848651,0.795520083 105.567051,1.72672018 L105.365131,1.8726402 L105.365131,27.2262428 L93.5449698,27.2262428 L80.1059284,0.875200091 L80.0214483,0.712320074 L79.8540883,0.644480067 C79.4016083,0.462400048 78.4732882,0.155200016 77.3203281,0.155200016 C74.4649678,0.155200016 72.0339275,2.03552021 70.2985673,5.58592058 L59.5036862,27.2262428 L46.3667248,27.2262428 L46.2790448,1.43488015 L46.2422448,0.779840081 L45.9011248,0.67264007 C45.3155247,0.489280051 44.3926446,0.271680028 43.3001645,0.271680028 C41.6816043,0.271680028 40.2092842,0.743040078 38.9305641,1.67520017 L38.727684,1.82112019 L38.727684,27.2262428 L31.3884833,27.2262428 C30.3820832,22.6105624 26.6672028,20.2224021 18.6009619,18.6099219 L18.3920019,18.5683219 C11.1264012,17.1353618 6.7417607,16.2707217 6.7417607,11.6825612 C6.7417607,6.17568064 13.8291214,6.17568064 16.1606417,6.17568064 C18.4185619,6.17568064 20.8316822,6.42112067 22.7699224,6.84704071 C25.6768027,7.52256078 26.8588828,4.90016051 27.7561629,2.42464025 L27.9395229,1.9196802 L27.4156829,1.78656019 C23.7305625,0.844160088 20.2886421,0.38624004 16.8992018,0.38624004 C6.00256063,0.38624004 0,4.62368048 0,12.3193613 C0,16.1414417 1.48384015,18.962242 4.53760047,20.9456022 C7.34368077,22.7488024 11.2099212,23.6073625 15.6947216,24.6019226 L16.3049617,24.7376026 C21.1366422,25.8038427 24.6275226,26.5756828 24.6275226,30.8156832 C24.6275226,32.8035234 23.6230425,37.4307239 14.3100815,37.4307239 C11.3043212,37.4307239 8.54816089,36.9788839 5.85504061,36.0393638 C5.60288058,35.9683238 5.32224056,35.9296037 5.06240053,35.9296037 C3.08608032,35.9296037 1.97984021,38.139844 1.15552012,40.3030442 L0.985600103,40.7536043 L1.43264015,40.9312043 C5.29056055,42.4499244 9.83808103,43.2204845 14.9449616,43.2204845 C21.6812823,43.2204845 29.5542431,41.4636843 31.3168033,33.6784035 L38.727684,33.6784035 L38.727684,42.0051244 L46.4169648,42.0051244 L46.3884848,33.6784035 L56.2851259,33.6784035 L52.2156854,41.8364844 L59.3680062,41.8364844 L75.8995279,8.02624084 L85.0371289,26.6636828 L85.3436889,27.2355228 L73.1792076,27.2262428 L74.1433677,27.2262428 L71.5571275,27.2249628 L68.7459272,32.9571234 L68.5238471,33.6572835 L88.4883292,33.7008035 L92.4796896,41.8364844 L100.996171,41.8364844 L96.8355301,33.6784035 L105.739211,33.6784035 C107.511051,41.4480043 115.378572,43.2022445 122.103373,43.2022445 C127.212813,43.2022445 131.758094,42.4323244 135.614094,40.9116843 L136.062734,40.7344042 L135.892494,40.2841642 L135.892494,40.2841642 Z" id="Fill-1"></path>
                <polyline id="Fill-2" points="85.3385689 27.2262428 74.1433677 27.2262428 85.3436889 27.2355228 85.3385689 27.2262428"></polyline>
                <text id="INSPIRE-FOOD-BUSINESS" font-family="Futura-Bold, Futura" font-size="9.600001" font-weight="bold" letter-spacing="0.0192000019">
                    <tspan x="0.601408063" y="57.4752434">INSPIRE FOOD BUSINESS</tspan>
                </text>
            </g>
        </g>
    </g>
</svg>