<?xml version="1.0" encoding="UTF-8"?>
<svg width="300px" height="300px" viewBox="0 0 300 300" version="1.1" xmlns="http://www.w3.org/2000/svg" xmlns:xlink="http://www.w3.org/1999/xlink">
    <!-- Generator: Sketch 60.1 (88133) - https://sketch.com -->
    <title>aines/AvecNosProches</title>
    <desc>Created with Sketch.</desc>
    <g id="aines/AvecNosProches" stroke="none" stroke-width="1" fill="none" fill-rule="evenodd">
        <g id="Plan-de-travail-4" transform="translate(12.000000, 26.000000)">
            <rect id="Rectangle" x="0.245999985" y="0.389999977" width="275.915984" height="247.847985"></rect>
            <path d="M116.951993,165.40799 C116.951993,168.390328 114.534331,170.80799 111.551993,170.80799 L53.7419968,170.80799 C50.7596593,170.80799 48.3419971,168.390328 48.3419971,165.40799 C48.3419971,165.335994 48.3419971,164.53799 48.3899971,163.16399 C48.3899971,162.77399 48.3899971,162.34199 48.4319971,161.86199 C48.8939971,149.465991 51.8099969,108.107994 70.0319958,94.8359943 C77.735777,99.7399883 87.5822131,99.7399883 95.2859943,94.8359943 C98.8859941,97.4699942 101.885994,101.213994 104.417994,105.635994 C104.729994,106.181994 105.017994,106.739994 105.329994,107.309994 C106.601656,109.756084 107.719818,112.278962 108.677994,114.863993 C108.845994,115.299993 109.007994,115.743993 109.163993,116.195993 C109.241993,116.399993 109.313993,116.609993 109.379993,116.795993 L109.379993,116.795993 C109.643993,117.551993 109.895993,118.319993 110.141993,119.087993 C116.813993,140.039992 116.951993,164.99999 116.951993,165.40799 Z" id="Path" fill="#E99244" fill-rule="nonzero"></path>
            <path d="M172.48799,163.61399 C172.48799,166.596328 170.070328,169.01399 167.08799,169.01399 L109.271993,169.01399 C106.289656,169.01399 103.871994,166.596328 103.871994,163.61399 C103.871994,162.86399 104.267994,88.9019947 138.179992,88.9019947 C172.09199,88.9019947 172.48799,162.86399 172.48799,163.61399 Z" id="Path" fill="#FFFFFF" fill-rule="nonzero"></path>
            <path d="M138.179992,87.1019948 C102.071994,87.1019948 102.071994,163.61399 102.071994,163.61399 C102.071994,167.59044 105.295544,170.81399 109.271993,170.81399 L167.08799,170.81399 C171.06444,170.81399 174.28799,167.59044 174.28799,163.61399 C174.28799,163.61399 174.28799,87.1019948 138.179992,87.1019948 Z M167.08799,169.01399 L109.271993,169.01399 C106.289656,169.01399 103.871994,166.596328 103.871994,163.61399 C103.871994,162.86399 104.267994,88.9019947 138.179992,88.9019947 C172.09199,88.9019947 172.48799,162.86399 172.48799,163.61399 C172.48799,166.596328 170.070328,169.01399 167.08799,169.01399 L167.08799,169.01399 Z" id="Shape" fill="#E99244" fill-rule="nonzero"></path>
            <path d="M105.167994,73.2599956 C105.222136,81.6559323 100.81893,89.4506117 93.5999944,93.7379944 C86.8177028,97.7058765 78.4222873,97.7058765 71.6399957,93.7379944 C64.4320851,89.4428415 60.0392831,81.6504127 60.0959964,73.2599956 C60.0959964,60.3299964 70.1999958,49.811997 82.6199951,49.811997 C95.0399943,49.811997 105.167994,60.3299964 105.167994,73.2599956 Z" id="Path" fill="#E99244" fill-rule="nonzero"></path>
            <ellipse id="Oval" fill="#FFFFFF" fill-rule="nonzero" cx="138.179992" cy="73.2599956" rx="23.4299986" ry="24.3479985"></ellipse>
            <path d="M138.179992,98.5139941 C124.769993,98.5139941 113.855993,87.1859948 113.855993,73.2599956 C113.855993,59.3339965 124.799993,47.9999971 138.179992,47.9999971 C151.559991,47.9999971 162.50999,59.3279965 162.50999,73.2479956 C162.50999,87.1679948 151.595991,98.5139941 138.179992,98.5139941 Z M138.179992,49.811997 C125.759993,49.811997 115.655993,60.3299964 115.655993,73.2599956 C115.655993,86.1899949 125.759993,96.7139942 138.179992,96.7139942 C150.599991,96.7139942 160.70999,86.1899949 160.70999,73.2599956 C160.70999,60.3299964 150.599991,49.799997 138.179992,49.799997 L138.179992,49.811997 Z" id="Shape" fill="#E99244" fill-rule="nonzero"></path>
            <path d="M104.807994,111.377993 C106.763994,116.141993 111.095993,118.859993 115.505993,117.419993 C119.915993,115.979993 120.569993,112.019993 119.105993,106.715994 C117.641993,101.411994 115.373993,98.7719941 109.361993,100.427994 C105.077994,101.807994 102.857994,106.607994 104.807994,111.377993 Z" id="Path" fill="#E99244" fill-rule="nonzero"></path>
            <path d="M112.571993,101.135994 C115.295993,101.135994 116.807993,102.785994 117.971993,107.027994 C119.843993,113.879993 117.251993,115.589993 115.139993,116.279993 C114.491507,116.494974 113.813175,116.606341 113.129993,116.609993 C110.129993,116.609993 107.363994,114.425993 105.929994,110.921993 C105.085558,109.011127 105.085558,106.83286 105.929994,104.921994 C106.66824,103.318534 108.046486,102.099232 109.727993,101.561994 C110.653091,101.293744 111.609052,101.146518 112.571993,101.123994 M112.571993,99.923994 C111.490684,99.9434075 110.416962,100.108906 109.379993,100.415994 C105.077994,101.795994 102.857994,106.595994 104.807994,111.365993 C106.409994,115.265993 109.607993,117.797993 113.123993,117.797993 C113.939719,117.797394 114.75005,117.665716 115.523993,117.407993 C119.927993,115.967993 120.587993,112.007993 119.123993,106.703994 C117.965993,102.461994 116.273993,99.923994 112.571993,99.923994 L112.571993,99.923994 Z" id="Shape" fill="#FFFFFF" fill-rule="nonzero"></path>
            <path d="M113.123993,117.881993 C109.589993,117.881993 106.379994,115.397993 104.723994,111.401993 C103.745401,109.168347 103.756297,106.625172 104.753994,104.399994 C105.645311,102.465075 107.312207,100.996464 109.343993,100.355994 C110.386476,100.045267 111.466367,99.8777328 112.553993,99.857994 C115.931993,99.857994 117.851993,101.837994 119.153993,106.691994 C120.773993,112.625993 119.573993,116.159993 115.487993,117.491993 C114.72492,117.74353 113.927426,117.875096 113.123993,117.881993 L113.123993,117.881993 Z M112.571993,100.007994 C111.498652,100.028539 110.433009,100.194037 109.403993,100.499994 C107.413961,101.126086 105.781512,102.564558 104.909994,104.459994 C103.930214,106.64927 103.919321,109.150265 104.879994,111.347993 C106.493994,115.283993 109.679993,117.731993 113.123993,117.731993 C113.924927,117.73011 114.720604,117.602559 115.481993,117.353993 C119.477993,116.045993 120.647993,112.553993 119.051993,106.733994 C117.749993,101.957994 115.871993,100.007994 112.571993,100.007994 Z M113.123993,116.681993 C110.087993,116.681993 107.297994,114.485993 105.851994,110.951993 C105.00237,109.02551 105.00237,106.830477 105.851994,104.903994 C106.600258,103.282165 107.996007,102.049725 109.697993,101.507994 C110.629658,101.230809 111.594207,101.079468 112.565993,101.057994 C115.331993,101.057994 116.861993,102.725994 118.031993,107.009994 C119.921993,113.921993 117.287993,115.655993 115.145993,116.351993 C114.494053,116.569723 113.81133,116.681147 113.123993,116.681993 L113.123993,116.681993 Z M112.571993,101.207994 C111.614511,101.230455 110.664232,101.379756 109.745993,101.651994 C108.085365,102.18205 106.724346,103.38628 105.995994,104.969994 C105.161101,106.855715 105.161101,109.006272 105.995994,110.891993 C107.423994,114.371993 110.153993,116.531993 113.129993,116.531993 C113.804975,116.529863 114.475332,116.4205 115.115993,116.207994 C117.197993,115.529993 119.753993,113.837993 117.899993,107.051994 C116.747993,102.845994 115.253993,101.207994 112.571993,101.207994 Z" id="Shape" fill="#FFFFFF" fill-rule="nonzero"></path>
            <path d="M89.7179947,123.041993 C89.1839947,120.707993 78.7679953,111.041993 69.0899959,128.849992 C66.689996,133.295992 64.8299961,136.805992 63.5279962,139.649992 C59.6159964,148.121991 60.5279964,150.449991 65.2139961,153.785991 C71.4299957,158.207991 75.0599955,148.385991 73.5719956,146.795991 C72.0839957,145.205991 68.8319959,147.335991 68.2919959,143.765991 C67.751996,140.195992 74.3519956,127.403992 76.7999954,125.999992 C79.2479953,124.595993 80.7659952,129.767992 83.861995,130.379992 C86.9579948,130.991992 90.2519946,125.399993 89.7179947,123.041993 Z" id="Path" fill="#FFFFFF" fill-rule="nonzero"></path>
            <path d="M63.8999962,150.995991 C63.7488343,150.944661 63.5834487,150.955686 63.4404385,151.026629 C63.2974282,151.097571 63.1885853,151.222579 63.1379962,151.373991 C63.0779962,151.547991 63.0119962,151.727991 62.9459962,151.907991 C62.4433048,153.465019 61.3977579,154.789521 59.9999964,155.639991 C58.8590189,156.222887 57.6682956,156.702791 56.4419966,157.073991 C56.7456296,156.45868 56.832323,155.758789 56.6879966,155.087991 C56.4358132,154.132134 55.61417,153.435055 54.6299967,153.341991 C53.1398169,153.18099 51.7058006,153.960139 51.029997,155.297991 C50.177997,156.809991 50.519997,157.697991 50.957997,158.129991 C51.3959969,158.561991 52.4219969,158.873991 53.5799968,158.819991 C53.0431828,159.309224 52.4760579,159.764126 51.8819969,160.18199 C50.764916,160.822934 49.6040382,161.384325 48.4079971,161.86199 C48.4079971,162.34199 48.3719971,162.77399 48.3659971,163.16399 C49.8087271,162.628253 51.2020022,161.967753 52.5299969,161.18999 C53.6324446,160.447572 54.6294722,159.559532 55.4939967,158.549991 C57.2487383,158.141516 58.9472306,157.520951 60.5519964,156.701991 C62.0769384,155.808047 63.2499516,154.419064 63.8759962,152.765991 C64.0199962,152.417991 64.1399962,152.081991 64.2479962,151.757991 C64.3578513,151.451647 64.2034572,151.113577 63.8999962,150.995991 Z M54.8279967,157.475991 C53.3399968,157.751991 52.2299969,157.691991 51.8279969,157.301991 C51.4259969,156.911991 51.8279969,156.275991 52.0799969,155.879991 C52.485945,155.068373 53.3030676,154.543573 54.2099968,154.511991 C54.2938757,154.505613 54.3781178,154.505613 54.4619968,154.511991 C54.9545833,154.549732 55.3737015,154.885503 55.5179967,155.357991 C55.6559967,155.861991 55.4759967,156.599991 54.8279967,157.475991 L54.8279967,157.475991 Z" id="Shape" fill="#FFFFFF" fill-rule="nonzero"></path>
            <path d="M65.9099961,124.199993 C65.9099961,124.199993 71.2199958,127.799992 72.3419957,128.843992 C75.3419955,131.657992 75.1439955,134.603992 72.9419957,137.243992 C70.2779958,140.471992 62.3519963,136.043992 62.3519963,136.043992 L59.3039965,134.399992 L65.9099961,124.199993 Z" id="Path" fill="#E99244" fill-rule="nonzero"></path>
            <path d="M69.9659958,138.989992 C66.521996,138.989992 62.3279963,136.673992 62.0819963,136.535992 L59.0219965,134.897992 C58.7546258,134.730678 58.662444,134.384918 58.8110345,134.106706 C58.9596251,133.828493 59.2982521,133.712824 59.5859964,133.841992 L62.6579963,135.479992 C64.7519961,136.679992 70.5839958,139.169992 72.5039957,136.841992 C74.6699955,134.213992 74.4779956,131.663992 71.9039957,129.263992 C70.8299958,128.255992 65.6039961,124.709993 65.5499961,124.673993 C65.2812531,124.485068 65.2144029,124.115156 65.4000219,123.844119 C65.585641,123.573083 65.9547064,123.501707 66.2279961,123.683993 C66.443996,123.827993 71.5859957,127.313992 72.7259957,128.393992 C75.7259955,131.219992 75.9719955,134.489992 73.4039956,137.603992 C72.5290858,138.565765 71.2633279,139.076045 69.9659958,138.989992 Z" id="Path" fill="#FFFFFF" fill-rule="nonzero"></path>
            <path d="M165.55199,153.473991 C161.11199,157.073991 156.845991,138.767992 153.173991,123.353993 C152.345991,119.867993 152.033991,117.473993 152.033991,117.473993 L154.691991,116.717993 C154.691991,116.717993 158.177991,148.697991 165.55199,153.473991 L165.55199,153.473991 Z" id="Path" fill="#E99244" fill-rule="nonzero"></path>
            <path d="M228.539986,165.41399 C228.539986,168.396328 226.122324,170.81399 223.139987,170.81399 L165.32999,170.81399 C162.347653,170.81399 159.92999,168.396328 159.92999,165.41399 C159.92999,164.77199 160.21799,110.423993 181.601989,94.8359943 C189.308925,99.7366058 199.155052,99.7366058 206.861988,94.8359943 C228.239986,110.429993 228.539986,164.77199 228.539986,165.41399 Z" id="Path" fill="#F6CEA1" fill-rule="nonzero"></path>
            <path d="M216.767987,73.2659956 C216.821217,81.6601139 212.417971,89.4525803 205.199988,93.7379944 C198.419897,97.7060738 190.02608,97.7060738 183.245989,93.7379944 C176.03492,89.4480738 171.639,81.6564475 171.69599,73.2659956 C171.69599,60.3359964 181.799989,49.817997 194.225988,49.817997 C206.651988,49.817997 216.767987,60.3359964 216.767987,73.2659956 Z" id="Path" fill="#F6CEA1" fill-rule="nonzero"></path>
            <path d="M180.707989,118.361993 C180.707989,118.361993 180.161989,120.707993 179.207989,124.163993 C176.459989,134.279992 170.12999,153.833991 163.33199,153.077991 C160.87199,152.699991 160.63799,150.821991 160.45199,149.309991 C160.45199,149.309991 161.34599,137.993992 162.19799,133.247992 C162.50999,131.519992 162.70799,130.451992 162.67199,130.751992 C162.53399,131.951992 162.43799,137.063992 161.81399,141.653992 C161.509495,144.041244 161.429145,146.45176 161.57399,148.853991 C161.57399,151.487991 163.02599,151.853991 163.63199,152.003991 C165.50999,152.423991 172.46399,149.231991 178.361989,117.005993 L180.707989,118.361993 Z" id="Path" fill="#FFFFFF" fill-rule="nonzero"></path>
            <path d="M52.6679969,187.895989 L54.8279967,187.895989 L59.6279964,200.495988 L57.1139966,200.495988 L55.9139967,197.363988 L51.5219969,197.363988 L50.399997,200.471988 L47.8859971,200.471988 L52.6679969,187.895989 Z M55.4819967,195.599988 L53.7479968,190.661989 L51.9479969,195.599988 L55.4819967,195.599988 Z" id="Shape" fill="#414042" fill-rule="nonzero"></path>
            <path d="M59.8259964,200.621988 L56.9999966,200.621988 L55.7999967,197.489988 L51.5999969,197.489988 L50.447997,200.621988 L47.6099972,200.621988 L47.6879972,200.417988 L52.5239969,187.745989 L54.8939967,187.745989 L54.9299967,187.847989 L59.8259964,200.621988 Z M57.1979966,200.321988 L59.3999965,200.321988 L54.7319967,188.045989 L52.7999969,188.045989 L48.1139971,200.321988 L50.303997,200.321988 L51.4559969,197.189988 L56.0579967,197.189988 L57.1979966,200.321988 Z M55.6919967,195.767988 L51.7259969,195.767988 L53.7479968,190.235989 L55.6919967,195.767988 Z M52.1519969,195.467988 L55.2719967,195.467988 L53.7419968,191.123989 L52.1519969,195.467988 Z" id="Shape" fill="#414042" fill-rule="nonzero"></path>
            <polygon id="Path" fill="#414042" fill-rule="nonzero" points="61.6439963 187.895989 65.0459961 197.399988 68.3999959 187.895989 70.9679958 187.895989 66.0599961 200.495988 64.0199962 200.495988 59.0759965 187.895989"></polygon>
            <path d="M66.1739961,200.621988 L63.9179962,200.621988 L63.8819962,200.525988 L58.8539965,187.745989 L61.7519963,187.745989 L65.0459961,196.961988 L68.3039959,187.745989 L71.2019958,187.745989 L71.1179958,187.955989 L66.1739961,200.621988 Z M64.1219962,200.321988 L65.9999961,200.321988 L70.7999958,188.045989 L68.5559959,188.045989 L65.0879961,197.855988 L61.5839963,188.045989 L59.3399965,188.045989 L64.1219962,200.321988 Z" id="Shape" fill="#414042" fill-rule="nonzero"></path>
            <polygon id="Path" fill="#414042" fill-rule="nonzero" points="81.4979951 198.329988 81.4979951 200.471988 72.7679957 200.471988 72.7679957 187.871989 81.3419952 187.871989 81.3419952 190.019989 75.2099955 190.019989 75.2099955 193.019988 80.5079952 193.019988 80.5079952 195.005988 75.2099955 195.005988 75.2099955 198.281988"></polygon>
            <path d="M81.6479951,200.621988 L72.5999957,200.621988 L72.5999957,187.745989 L81.4739951,187.745989 L81.4739951,190.199989 L75.3599955,190.199989 L75.3599955,192.923989 L80.6579952,192.923989 L80.6579952,195.209988 L75.3599955,195.209988 L75.3599955,198.209988 L81.6479951,198.209988 L81.6479951,200.621988 Z M72.9179957,200.321988 L81.3479952,200.321988 L81.3479952,198.479988 L75.0599955,198.479988 L75.0599955,194.879988 L80.3579952,194.879988 L80.3579952,193.199988 L75.0599955,193.199988 L75.0599955,189.875989 L81.1919952,189.875989 L81.1919952,188.027989 L72.9179957,188.027989 L72.9179957,200.321988 Z" id="Shape" fill="#414042" fill-rule="nonzero"></path>
            <path d="M82.8299879,194.099988 C82.8316905,193.321451 82.9718745,192.549423 83.243995,191.819989 C83.8017739,190.307147 84.936735,189.077246 86.3999949,188.399989 C87.221692,188.022756 88.1180197,187.836107 89.0219947,187.853989 C90.0732071,187.825787 91.1116597,188.089554 92.0219945,188.615989 C92.8285967,189.079476 93.4831341,189.767365 93.9059944,190.595989 L92.0339945,191.891989 C91.8864697,191.561936 91.6835397,191.259571 91.4339946,190.997989 C91.2163037,190.755747 90.9585405,190.552784 90.6719946,190.397989 C90.4053839,190.256249 90.1207942,190.151294 89.8259946,190.085989 C89.5403453,190.022466 89.2486217,189.990276 88.9559947,189.989989 C88.3988877,189.97414 87.8471118,190.102268 87.3539948,190.361989 C86.9105919,190.598203 86.5236983,190.927779 86.2199949,191.327989 C85.9147458,191.732287 85.6831989,192.187256 85.5359949,192.671989 C85.3880081,193.156311 85.3112052,193.659572 85.3079949,194.165988 C85.3073278,194.71283 85.3965158,195.256066 85.5719949,195.773988 C85.7392263,196.266474 85.995476,196.724063 86.3279949,197.123988 C86.6506399,197.511106 87.0461109,197.831152 87.4919948,198.065988 C87.9561605,198.303146 88.4707728,198.424594 88.9919947,198.419988 C89.2891765,198.418133 89.5851452,198.381891 89.8739946,198.311988 C90.1823857,198.242199 90.4793357,198.129075 90.7559946,197.975988 C91.0406295,197.815626 91.2995255,197.613363 91.5239945,197.375988 C91.767326,197.123565 91.9589244,196.825977 92.0879945,196.499988 L94.0919944,197.651988 C93.8925334,198.121291 93.6007516,198.545701 93.2339944,198.899988 C92.8597229,199.262624 92.435409,199.569747 91.9739945,199.811988 C91.5019635,200.0714 91.000332,200.272859 90.4799946,200.411988 C89.969226,200.536411 89.4456902,200.600846 88.9199947,200.603988 C88.0669563,200.612941 87.2239332,200.419663 86.4599948,200.039988 C85.7306635,199.671259 85.0772813,199.168501 84.533995,198.557988 C83.9964827,197.94786 83.5718604,197.246929 83.279995,196.487988 C82.9814438,195.727288 82.8287847,194.917177 82.8299879,194.099988 L82.8299879,194.099988 Z" id="Path" fill="#414042" fill-rule="nonzero"></path>
            <path d="M88.9199947,200.730012 C88.040478,200.732551 87.1728377,200.526949 86.3879949,200.129988 C85.6426618,199.75455 84.9765482,199.239178 84.425995,198.611988 C83.8723131,197.992527 83.4370953,197.276655 83.141995,196.499988 C82.8382741,195.736208 82.6815275,194.92194 82.6799951,194.099988 C82.6822603,193.304815 82.8265253,192.516437 83.105995,191.771989 C83.6699156,190.21149 84.8343289,188.941221 86.3399949,188.243989 C87.181891,187.855365 88.1008955,187.662538 89.0279947,187.679989 C90.1058689,187.654949 91.1701278,187.924645 92.1059945,188.459989 C92.9354109,188.943201 93.609792,189.652966 94.0499944,190.505989 L94.1099944,190.619989 L91.9739945,192.089989 L91.9019945,191.927989 C91.7518722,191.611951 91.5489649,191.323823 91.3019946,191.075989 C91.0920859,190.857387 90.8491209,190.673138 90.5819946,190.529989 C90.3242455,190.394822 90.0499165,190.293966 89.7659946,190.229989 C88.9717547,190.032828 88.1331749,190.126477 87.4019948,190.493989 C86.9876484,190.717109 86.6256079,191.025969 86.3399949,191.399989 C86.0463031,191.790321 85.8229552,192.228895 85.6799951,192.695989 C85.5335777,193.166112 85.4587398,193.655593 85.4579949,194.147988 C85.4548721,194.676901 85.5421271,195.20246 85.7159949,195.701988 C85.8740237,196.179573 86.1202869,196.623253 86.4419948,197.009988 C86.7522073,197.383411 87.1336098,197.691388 87.5639948,197.915988 C88.2702572,198.268635 89.0808248,198.351825 89.8439946,198.149988 C90.1354366,198.080422 90.4160244,197.971417 90.6779946,197.825988 C90.9517829,197.677442 91.2007664,197.487161 91.4159946,197.261988 C91.6460595,197.020985 91.8273837,196.737793 91.9499945,196.427988 L92.0159945,196.271988 L94.2839944,197.573988 L94.2299944,197.699988 C94.0204701,198.186769 93.7166263,198.62724 93.3359944,198.995988 C92.9517479,199.366619 92.5175399,199.681673 92.0459945,199.931988 C91.5629843,200.194952 91.0490006,200.396514 90.5159946,200.531988 C89.9937758,200.661299 89.4579806,200.727769 88.9199947,200.730012 Z M89.0279947,187.979989 C87.3323397,187.948065 85.7061236,188.652832 84.569995,189.911989 C84.0472212,190.48249 83.6397366,191.148727 83.369995,191.873989 C82.8217921,193.338618 82.8346146,194.954244 83.405995,196.409988 C83.6935989,197.151224 84.1100098,197.835762 84.635995,198.431988 C85.1630435,199.03042 85.8007238,199.521414 86.5139948,199.877988 C87.7338563,200.466514 89.125312,200.594366 90.4319946,200.237988 C90.9391034,200.11548 91.4289031,199.930042 91.8899945,199.685988 C92.3296854,199.44777 92.7336496,199.148836 93.0899945,198.797988 C93.4121406,198.488585 93.6745207,198.122473 93.8639944,197.717988 L92.1239945,196.721988 C91.9890769,197.00393 91.8109277,197.263057 91.5959945,197.489988 C91.129448,197.974281 90.5304821,198.310286 89.8739946,198.455988 C89.0421037,198.674051 88.1593141,198.58236 87.3899948,198.197988 C86.9293738,197.954373 86.5215348,197.621985 86.1899949,197.219988 C85.8502136,196.803207 85.5862095,196.33003 85.4099949,195.821988 C85.2296155,195.288574 85.1383928,194.729074 85.1399949,194.165988 C85.1412923,193.64521 85.2201577,193.127529 85.3739949,192.629989 C85.5280032,192.126805 85.7675019,191.653897 86.0819949,191.231989 C86.9552238,190.078264 88.4401618,189.568262 89.8379946,189.941989 C90.1464901,190.009179 90.4449763,190.11607 90.7259946,190.259989 C91.0211899,190.417882 91.2903378,190.620249 91.5239945,190.859989 C91.7462312,191.090701 91.9323318,191.35367 92.0759945,191.639989 L93.7019944,190.517989 C93.2831678,189.770808 92.6720311,189.149313 91.9319945,188.717989 C91.0493805,188.211834 90.0451743,187.956633 89.0279947,187.979989 Z" id="Shape" fill="#414042" fill-rule="nonzero"></path>
            <polygon id="Path" fill="#414042" fill-rule="nonzero" points="103.319994 192.413989 103.319994 200.471988 100.877994 200.471988 100.877994 187.871989 102.767994 187.871989 109.325993 196.127988 109.325993 187.913989 111.767993 187.913989 111.767993 200.471988 109.799993 200.471988"></polygon>
            <path d="M111.917993,200.621988 L109.709993,200.621988 L103.469994,192.821989 L103.469994,200.621988 L100.727994,200.621988 L100.727994,187.745989 L102.845994,187.745989 L102.887994,187.805989 L109.199993,195.719988 L109.199993,187.763989 L111.941993,187.763989 L111.917993,200.621988 Z M109.853993,200.321988 L111.599993,200.321988 L111.599993,188.063989 L109.457993,188.063989 L109.457993,196.583988 L102.677994,188.045989 L101.009994,188.045989 L101.009994,200.321988 L103.199994,200.321988 L103.199994,191.999989 L109.853993,200.321988 Z" id="Shape" fill="#414042" fill-rule="nonzero"></path>
            <path d="M120.197993,200.561988 C119.331862,200.574485 118.474233,200.389828 117.689993,200.021988 C116.958826,199.674243 116.302558,199.187138 115.757993,198.587988 C115.222759,197.986277 114.800038,197.293258 114.509993,196.541988 C114.219889,195.789707 114.071393,194.990268 114.071987,194.183988 C114.070833,193.361204 114.229787,192.546056 114.539993,191.783989 C114.843585,191.031827 115.280608,190.340722 115.829993,189.743989 C116.384257,189.152981 117.04872,188.676035 117.785993,188.339989 C118.560052,187.988122 119.40175,187.809953 120.251993,187.817989 C121.114113,187.807625 121.966745,187.998697 122.741993,188.375989 C123.469408,188.734628 124.121204,189.229586 124.661993,189.833989 C125.192506,190.44146 125.610995,191.138265 125.897992,191.891989 C126.1917,192.635072 126.342343,193.426965 126.341992,194.225988 C126.347228,195.048578 126.190234,195.864128 125.879992,196.625988 C125.582512,197.371748 125.151453,198.05697 124.607993,198.647988 C124.055257,199.236554 123.392847,199.711451 122.657993,200.045988 C121.885609,200.395861 121.045865,200.572003 120.197993,200.561988 Z M116.549993,194.183988 C116.54921,194.719598 116.632213,195.252033 116.795993,195.761988 C116.953094,196.249693 117.197011,196.705005 117.515993,197.105988 C117.828518,197.498454 118.221283,197.819622 118.667993,198.047988 C119.14757,198.290001 119.678896,198.411505 120.215993,198.401988 C120.760429,198.413277 121.298957,198.287414 121.781993,198.035988 C122.231149,197.800812 122.624132,197.47128 122.933993,197.069988 C123.247935,196.665375 123.487646,196.2083 123.641993,195.719988 C123.801909,195.22371 123.882896,194.705395 123.882,194.183988 C123.877782,193.643883 123.782443,193.108362 123.599993,192.599989 C123.44088,192.110105 123.194966,191.652827 122.873993,191.249989 C122.561012,190.861079 122.168153,190.543928 121.721993,190.319989 C120.739353,189.849748 119.596632,189.849748 118.613993,190.319989 C118.165532,190.553582 117.772627,190.881003 117.461993,191.279989 C117.15052,191.682145 116.914692,192.137538 116.765993,192.623989 C116.611505,193.129196 116.538589,193.655811 116.549993,194.183988 Z" id="Shape" fill="#414042" fill-rule="nonzero"></path>
            <path d="M120.197993,200.711988 C119.309465,200.723233 118.429777,200.534582 117.623993,200.159988 C116.87604,199.801418 116.205449,199.300004 115.649993,198.683988 C114.540263,197.447493 113.925073,195.845437 113.92199,194.183988 C113.921124,193.338693 114.084131,192.501244 114.401993,191.717989 C114.714947,190.951151 115.161921,190.246152 115.721993,189.635989 C116.289572,189.029756 116.970385,188.540549 117.725993,188.195989 C118.519266,187.836793 119.381218,187.654575 120.251993,187.661989 C121.138872,187.662124 122.01369,187.86748 122.807993,188.261989 C123.554017,188.631316 124.222129,189.140547 124.775993,189.761989 C125.318948,190.381549 125.747599,191.092581 126.041992,191.861989 C126.967807,194.229107 126.45206,196.917526 124.715993,198.773988 C124.150495,199.375764 123.474113,199.862677 122.723993,200.207988 C121.928408,200.556873 121.06655,200.728835 120.197993,200.711988 L120.197993,200.711988 Z M120.251993,187.961989 C119.424958,187.95444 118.606128,188.126394 117.851993,188.465989 C117.134001,188.797796 116.486303,189.26422 115.943993,189.839989 C115.404143,190.421303 114.975093,191.096396 114.677993,191.831989 C114.373279,192.578515 114.218339,193.377676 114.22193,194.183988 C114.228611,195.771287 114.815465,197.301375 115.871993,198.485988 C116.401883,199.07142 117.042119,199.5465 117.755993,199.883988 C118.519889,200.24151 119.354631,200.421995 120.197993,200.411988 C121.025471,200.417652 121.84432,200.243647 122.597993,199.901988 C123.314514,199.575965 123.960573,199.113329 124.499993,198.539988 C125.032129,197.964169 125.453208,197.294919 125.741993,196.565988 C126.042547,195.820522 126.19538,195.023755 126.192048,194.219988 C126.190413,193.439795 126.043928,192.666683 125.759993,191.939989 C125.483662,191.203498 125.0772,190.522673 124.559993,189.929989 C124.034668,189.334392 123.396329,188.849011 122.681993,188.501989 C121.9251,188.135202 121.092993,187.950289 120.251993,187.961989 L120.251993,187.961989 Z M120.215993,198.551988 C119.653897,198.560424 119.098099,198.432796 118.595993,198.179988 C118.132033,197.941445 117.72324,197.608278 117.395993,197.201988 C117.068862,196.784829 116.817082,196.313756 116.651993,195.809988 C116.32013,194.767769 116.32013,193.648208 116.651993,192.605989 C116.808547,192.102201 117.054465,191.63069 117.377993,191.213989 C117.701931,190.799768 118.11119,190.460083 118.577993,190.217989 C119.602072,189.726485 120.793913,189.726485 121.817993,190.217989 C122.282571,190.452954 122.691676,190.784329 123.017993,191.189989 C123.344744,191.608347 123.598326,192.078994 123.767993,192.581989 C123.942574,193.104269 124.03172,193.651302 124.031993,194.201988 C124.030946,194.737456 123.947986,195.269612 123.785993,195.779988 C123.628572,196.288267 123.380586,196.763911 123.053993,197.183988 C122.728058,197.597835 122.319346,197.93911 121.853993,198.185988 C121.347391,198.443603 120.784064,198.569474 120.215993,198.551988 L120.215993,198.551988 Z M120.215993,190.151989 C119.693691,190.142217 119.176845,190.259588 118.709993,190.493989 C118.280272,190.714378 117.902001,191.023129 117.599993,191.399989 C117.299313,191.790822 117.069808,192.231553 116.921993,192.701989 C116.771813,193.181692 116.694946,193.681327 116.693993,194.183988 C116.691176,194.703578 116.772217,195.220218 116.933993,195.713988 C117.083312,196.186166 117.317102,196.627317 117.623993,197.015988 C117.926494,197.388409 118.302256,197.694736 118.727993,197.915988 C119.18798,198.144989 119.696221,198.260217 120.209993,198.251988 C120.729114,198.261371 121.242451,198.141799 121.703993,197.903988 C122.134429,197.67937 122.511074,197.364135 122.807993,196.979988 C123.112724,196.588623 123.344428,196.145541 123.491993,195.671988 C123.647041,195.191209 123.726005,194.689151 123.726005,194.183988 C123.72721,193.665519 123.642044,193.150469 123.473993,192.659989 C123.322482,192.187536 123.086678,191.746421 122.777993,191.357989 C122.478354,190.98582 122.101738,190.68289 121.673993,190.469989 C121.221275,190.245258 120.721359,190.132108 120.215993,190.139989 L120.215993,190.151989 Z" id="Shape" fill="#414042" fill-rule="nonzero"></path>
            <path d="M136.157992,191.189989 C136.015052,191.066186 135.862581,190.953838 135.701992,190.853989 C135.447282,190.695238 135.180455,190.556809 134.903992,190.439989 C134.575836,190.297074 134.23675,190.180701 133.889992,190.091989 C133.524923,190.001129 133.150197,189.954792 132.773992,189.953989 C132.245365,189.916549 131.718389,190.046719 131.267992,190.325989 C130.935964,190.578343 130.758767,190.984987 130.799992,191.399989 C130.793708,191.629998 130.858673,191.856328 130.985992,192.047989 C131.132887,192.233765 131.316772,192.387002 131.525992,192.497989 C131.810868,192.646762 132.11049,192.765405 132.419992,192.851989 C132.779992,192.959988 133.199992,193.073988 133.667992,193.187988 C134.234666,193.337554 134.793385,193.515784 135.341992,193.721988 C135.803848,193.8865 136.235583,194.125677 136.619992,194.429988 C136.960701,194.70336 137.235495,195.049928 137.423992,195.443988 C137.626637,195.904651 137.723018,196.405012 137.705992,196.907988 C137.722681,197.506184 137.592916,198.099395 137.327992,198.635988 C137.086332,199.100425 136.733943,199.498151 136.301992,199.793988 C135.848606,200.096999 135.344668,200.316456 134.813992,200.441988 C134.235802,200.577648 133.643883,200.645988 133.049992,200.645988 C132.101948,200.644415 131.159488,200.500821 130.253992,200.219988 C129.36638,199.957382 128.527416,199.552086 127.769992,199.019988 L128.855992,196.913988 C129.03842,197.075865 129.239907,197.214891 129.455992,197.327988 C129.773309,197.519634 130.101907,197.691948 130.439992,197.843988 C130.845417,198.027431 131.2673,198.172076 131.699992,198.275988 C132.162353,198.396295 132.638237,198.456788 133.115992,198.455988 C134.459992,198.455988 135.131992,198.023988 135.131992,197.159988 C135.140542,196.910182 135.059697,196.665519 134.903992,196.469988 C134.724144,196.260615 134.501012,196.092754 134.249992,195.977988 C133.921409,195.815113 133.5778,195.684502 133.223992,195.587988 L131.873992,195.197988 C131.340541,195.053089 130.817374,194.872687 130.307992,194.657988 C129.906365,194.486768 129.533892,194.253972 129.203992,193.967988 C128.91501,193.714283 128.687304,193.398366 128.537992,193.043988 C128.379867,192.647422 128.304326,192.222759 128.315992,191.795989 C128.305856,191.210669 128.42681,190.630497 128.669992,190.097989 C128.874965,189.604662 129.193626,189.166761 129.599992,188.819989 C130.036088,188.481599 130.530142,188.225423 131.057992,188.063989 C131.642275,187.891649 132.248846,187.806729 132.857992,187.811989 C133.690167,187.803264 134.517192,187.943472 135.299992,188.225989 C135.987087,188.474634 136.641787,188.805006 137.249992,189.209989 L136.157992,191.189989 Z" id="Path" fill="#414042" fill-rule="nonzero"></path>
            <path d="M133.019992,200.766096 C132.055676,200.765645 131.096914,200.62001 130.175992,200.333988 C129.278346,200.068391 128.427985,199.663457 127.655992,199.133988 L127.547992,199.055988 L128.783992,196.655988 L128.927992,196.799988 C129.095324,196.951113 129.278369,197.083871 129.473992,197.195988 C129.787463,197.383559 130.112064,197.55187 130.445992,197.699988 C130.832626,197.87715 131.234196,198.019708 131.645992,198.125988 C132.096923,198.24138 132.560531,198.299835 133.025992,198.299988 C134.285992,198.299988 134.897992,197.927988 134.897992,197.153988 C134.905593,196.936785 134.835376,196.724007 134.699992,196.553988 C134.532631,196.363251 134.328575,196.208169 134.099992,196.097988 C133.777338,195.94375 133.442124,195.817293 133.097992,195.719988 L131.753992,195.329988 C131.211769,195.185745 130.680441,195.003288 130.163992,194.783988 C129.746814,194.60516 129.360148,194.362229 129.017992,194.063988 C128.715593,193.795344 128.475939,193.463515 128.315992,193.091988 C128.150913,192.676136 128.071329,192.231281 128.081992,191.783989 C128.071264,191.175448 128.198443,190.572375 128.453992,190.019989 C128.689123,189.514879 129.038285,189.071238 129.473992,188.723989 C129.926561,188.37592 130.438999,188.1136 130.985992,187.949989 C131.580735,187.767918 132.200045,187.678867 132.821992,187.685989 C133.672759,187.677761 134.518116,187.822041 135.317992,188.111989 C136.016053,188.362202 136.680969,188.696675 137.297992,189.107989 L137.405992,189.185989 L136.169992,191.465989 L136.025992,191.321989 C135.894603,191.20247 135.751935,191.095972 135.599992,191.003989 C135.351931,190.851663 135.093268,190.717318 134.825992,190.601989 C134.502622,190.465871 134.169735,190.353572 133.829992,190.265989 C133.477086,190.175494 133.114314,190.12914 132.749992,190.127989 C132.25376,190.090096 131.758226,190.20978 131.333992,190.469989 C131.041329,190.684265 130.876594,191.031787 130.895992,191.393989 C130.888079,191.591759 130.942661,191.786997 131.051992,191.951989 C131.184224,192.122291 131.352161,192.261556 131.543992,192.359989 C131.818456,192.505595 132.108229,192.620297 132.407992,192.701989 C132.773992,192.809989 133.193992,192.923989 133.649992,193.037988 C134.249992,193.205988 134.849992,193.385988 135.341992,193.571988 C135.816904,193.746903 136.262103,193.993786 136.661992,194.303988 C137.018387,194.596551 137.307032,194.962987 137.507992,195.377988 C137.7181,195.857806 137.818538,196.378446 137.801992,196.901988 C137.819044,197.525331 137.683079,198.143356 137.405992,198.701988 C137.151563,199.183834 136.782779,199.595883 136.331992,199.901988 C135.865482,200.21688 135.344706,200.442685 134.795992,200.567988 C134.213686,200.70271 133.617671,200.769158 133.019992,200.766096 L133.019992,200.766096 Z M127.937992,198.935988 C128.652465,199.423206 129.437652,199.797586 130.265992,200.045988 C131.714671,200.511765 133.260376,200.588326 134.747992,200.267988 C135.259872,200.155273 135.747521,199.952086 136.187992,199.667988 C136.599545,199.38318 136.93528,199.002132 137.165992,198.557988 C137.418526,198.043356 137.542079,197.475016 137.525992,196.901988 C137.539351,196.422441 137.449311,195.945639 137.261992,195.503988 C137.079949,195.129552 136.81775,194.799756 136.493992,194.537988 C136.122739,194.246385 135.70758,194.015516 135.263992,193.853988 C134.765992,193.667988 134.207992,193.487988 133.601992,193.325988 C133.139992,193.211988 132.719992,193.097988 132.347992,192.989988 C132.018504,192.895557 131.700547,192.764752 131.399992,192.599989 C131.164894,192.481516 130.959743,192.311241 130.799992,192.101989 C130.650251,191.887997 130.574414,191.630993 130.583992,191.369989 C130.563734,190.913109 130.77312,190.476326 131.141992,190.205989 C131.617227,189.904559 132.176672,189.763646 132.737992,189.803989 C133.126469,189.804175 133.513423,189.852544 133.889992,189.947989 C134.244416,190.039671 134.591404,190.158008 134.927992,190.301989 C135.213583,190.420408 135.488576,190.562922 135.749992,190.727989 C135.881992,190.817989 135.989992,190.889989 136.073992,190.955989 L137.003992,189.257989 C136.43641,188.898742 135.833203,188.599149 135.203992,188.363989 C134.434749,188.086473 133.621679,187.950284 132.803992,187.961989 C132.213053,187.957557 131.624702,188.040452 131.057992,188.207989 C130.544882,188.362559 130.064801,188.610737 129.641992,188.939989 C129.2406,189.261443 128.920046,189.67241 128.705992,190.139989 C128.470272,190.653325 128.353371,191.213218 128.363992,191.777989 C128.352528,192.188045 128.423954,192.596195 128.573992,192.977988 C128.708432,193.308124 128.913179,193.605007 129.173992,193.847988 C129.492695,194.12485 129.853139,194.34962 130.241992,194.513988 C130.744694,194.728426 131.261996,194.906876 131.789992,195.047988 L133.139992,195.437988 C133.501025,195.538643 133.852406,195.671163 134.189992,195.833988 C134.461337,195.95938 134.701194,196.143886 134.891992,196.373988 C135.071393,196.593882 135.167056,196.870241 135.161992,197.153988 C135.161992,198.113988 134.429992,198.599988 132.989992,198.599988 C132.499916,198.602159 132.011697,198.539619 131.537992,198.413988 C131.097356,198.30805 130.667511,198.161421 130.253992,197.975988 C129.910034,197.82181 129.575455,197.647508 129.251992,197.453988 C129.065992,197.333988 128.915992,197.237988 128.801992,197.147988 L127.937992,198.935988 Z" id="Shape" fill="#414042" fill-rule="nonzero"></path>
            <path d="M144.653991,200.471988 L144.653991,187.871931 L149.999991,187.871931 C150.555067,187.868851 151.103349,187.994114 151.601991,188.237989 C152.082384,188.470029 152.512526,188.794164 152.867991,189.191989 C153.222357,189.590084 153.504585,190.046927 153.701991,190.541989 C153.897439,191.022263 153.999267,191.535475 154.001991,192.053989 C154.001271,193.114655 153.617779,194.139431 152.921991,194.939988 C152.574492,195.333176 152.152314,195.653378 151.679991,195.881988 C151.183999,196.119921 150.640077,196.241021 150.089991,196.235988 L147.089991,196.235988 L147.089991,200.435988 L144.653991,200.471988 Z M147.101991,194.117988 L149.933991,194.117988 C150.37424,194.121777 150.79033,193.917069 151.055991,193.565988 C151.380152,193.140021 151.541831,192.61244 151.511991,192.077989 C151.516662,191.785604 151.467861,191.494828 151.367991,191.219989 C151.283141,190.983757 151.157204,190.764382 150.995991,190.571989 C150.847713,190.401437 150.663225,190.266146 150.455991,190.175989 C150.257615,190.08816 150.042939,190.04318 149.825991,190.043978 L147.101991,190.043978 L147.101991,194.117988 Z" id="Shape" fill="#414042" fill-rule="nonzero"></path>
            <path d="M147.251991,200.621988 L144.503991,200.621988 L144.503991,187.745953 L149.999991,187.745953 C150.578183,187.743474 151.149101,187.874909 151.667991,188.129989 C152.172278,188.370009 152.624767,188.706319 152.999991,189.119989 C153.36292,189.529692 153.653104,189.99845 153.857991,190.505989 C154.059266,191.005901 154.165092,191.539101 154.169991,192.077989 C154.168946,193.179311 153.772978,194.243741 153.053991,195.077988 C152.692951,195.484597 152.254384,195.815053 151.763991,196.049988 C151.247746,196.299122 150.68119,196.426392 150.107991,196.421988 L147.281991,196.421988 L147.251991,200.621988 Z M144.803991,200.321988 L146.951991,200.321988 L146.951991,196.121988 L150.077991,196.121988 C150.605709,196.128387 151.12761,196.011268 151.601991,195.779988 C152.058779,195.564294 152.467024,195.258111 152.801991,194.879988 C153.47254,194.104821 153.84295,193.114933 153.845991,192.089989 C153.843889,191.590065 153.74613,191.095164 153.557991,190.631989 C153.364787,190.154681 153.090778,189.714237 152.747991,189.329989 C152.40975,188.949167 152.002611,188.63567 151.547991,188.405989 C151.069383,188.173931 150.543881,188.054872 150.011991,188.057929 L144.827991,188.057929 L144.803991,200.321988 Z M149.933991,194.267988 L146.933991,194.267988 L146.933991,189.893989 L149.807991,189.893989 C150.045354,189.894915 150.280071,189.943899 150.497991,190.037989 C150.729002,190.135924 150.934321,190.285806 151.097991,190.475989 C151.271804,190.679324 151.406107,190.913337 151.493991,191.165989 C151.60065,191.45807 151.653504,191.767061 151.649991,192.077989 C151.681163,192.64694 151.50889,193.208422 151.163991,193.661988 C150.870093,194.04373 150.415761,194.267571 149.933991,194.267988 L149.933991,194.267988 Z M147.251991,193.967988 L149.933991,193.967988 C150.330415,193.973258 150.705306,193.788044 150.941991,193.469988 C151.240006,193.06915 151.388571,192.576766 151.361991,192.077989 C151.364136,191.804424 151.319493,191.532507 151.229991,191.273989 C151.152251,191.054116 151.034239,190.850646 150.881991,190.673989 C150.750967,190.517002 150.584345,190.393579 150.395991,190.313989 C150.207617,190.2292 150.002486,190.188174 149.795991,190.193989 L147.221991,190.193989 L147.251991,193.967988 Z" id="Shape" fill="#414042" fill-rule="nonzero"></path>
            <path d="M156.131991,200.471988 L156.131991,187.871931 L161.69399,187.871931 C162.249066,187.868851 162.797348,187.994114 163.29599,188.237989 C163.776384,188.470029 164.206525,188.794164 164.56199,189.191989 C164.916357,189.590084 165.198584,190.046927 165.39599,190.541989 C165.591438,191.022263 165.693266,191.535475 165.69599,192.053989 C165.70754,192.837429 165.499709,193.60848 165.09599,194.279988 C164.712417,194.924922 164.131938,195.429686 163.43999,195.719988 L166.30799,200.447988 L163.56599,200.447988 L160.99799,196.247988 L158.597991,196.247988 L158.597991,200.447988 L156.131991,200.471988 Z M158.573991,194.118009 L161.63999,194.118009 C161.860448,194.119231 162.077478,194.063424 162.26999,193.955988 C162.46433,193.845913 162.635488,193.699207 162.77399,193.523988 C162.921165,193.328125 163.034716,193.109134 163.10999,192.875989 C163.195467,192.618698 163.238035,192.349098 163.23599,192.077989 C163.238506,191.799454 163.189692,191.522838 163.09199,191.261989 C163.00369,191.027919 162.87583,190.81076 162.71399,190.619989 C162.562828,190.439881 162.374531,190.294565 162.16199,190.193989 C161.975769,190.099629 161.770708,190.048364 161.56199,190.043989 L158.603991,190.043989 L158.573991,194.118009 Z" id="Shape" fill="#414042" fill-rule="nonzero"></path>
            <path d="M166.56599,200.621988 L163.46999,200.621988 L160.90199,196.421988 L158.723991,196.421988 L158.723991,200.621988 L155.999991,200.621988 L155.999991,187.745933 L161.71199,187.745933 C162.290255,187.742818 162.861322,187.874287 163.37999,188.129989 C163.877838,188.371996 164.324065,188.708195 164.69399,189.119989 C165.059167,189.528015 165.349606,189.997186 165.55199,190.505989 C165.755928,191.005105 165.861857,191.53882 165.86399,192.077989 C165.87355,192.890604 165.653063,193.68935 165.22799,194.381988 C164.859658,195.003165 164.314415,195.500359 163.66199,195.809988 L166.56599,200.621988 Z M163.63799,200.321988 L166.03799,200.321988 L163.21799,195.671988 L163.37999,195.605988 C164.040577,195.32497 164.59512,194.841846 164.96399,194.225988 C165.360186,193.579863 165.567996,192.835902 165.56399,192.077989 C165.561888,191.578065 165.46413,191.083164 165.27599,190.619989 C165.082631,190.144109 164.810865,189.704011 164.47199,189.317989 C164.132116,188.938922 163.72533,188.625697 163.27199,188.393989 C162.793383,188.161931 162.26788,188.042872 161.73599,188.045929 L156.335991,188.045929 L156.335991,200.321988 L158.399991,200.321988 L158.399991,196.121988 L161.04599,196.121988 L163.63799,200.321988 Z M161.63999,194.267988 L158.399991,194.267988 L158.399991,189.893989 L161.50799,189.893989 C161.749181,189.895306 161.987009,189.950662 162.20399,190.055989 C162.432678,190.16863 162.636644,190.325684 162.80399,190.517989 C162.976931,190.722978 163.112952,190.956447 163.20599,191.207989 C163.311403,191.48583 163.3643,191.780832 163.36199,192.077989 C163.361975,192.365116 163.317446,192.650505 163.22999,192.923989 C163.146625,193.17132 163.025163,193.404122 162.86999,193.613988 C162.720174,193.807917 162.532338,193.969211 162.31799,194.087988 C162.110283,194.20296 161.877373,194.264795 161.63999,194.267988 L161.63999,194.267988 Z M158.723991,193.967993 L161.63999,193.967993 C161.835253,193.968569 162.027392,193.918985 162.19799,193.823988 C162.376379,193.725856 162.531826,193.590863 162.65399,193.427988 C162.793107,193.248302 162.898787,193.04507 162.96599,192.827989 C163.046153,192.586091 163.086676,192.332822 163.086013,192.077989 C163.087161,191.818201 163.042476,191.560245 162.95399,191.315989 C162.870016,191.097772 162.750389,190.895014 162.59999,190.715989 C162.460497,190.552818 162.288945,190.42007 162.09599,190.325989 C161.920644,190.239199 161.72764,190.194028 161.53199,190.193989 L158.723991,190.193989 L158.723991,193.967993 Z" id="Shape" fill="#414042" fill-rule="nonzero"></path>
            <path d="M173.71799,200.561988 C172.853858,200.573783 171.998335,200.389138 171.21599,200.021988 C170.483857,199.675853 169.827294,199.188529 169.28399,198.587988 C168.201991,197.375329 167.600277,195.809164 167.591984,194.183988 C167.59083,193.361204 167.749784,192.546056 168.05999,191.783989 C168.363474,191.03039 168.802759,190.338924 169.35599,189.743989 C169.909011,189.151565 170.573773,188.674404 171.31199,188.339989 C172.08415,187.988794 172.923747,187.810635 173.77199,187.817989 C174.634179,187.806959 175.486963,187.998065 176.261989,188.375989 C176.991333,188.7315 177.643696,189.226888 178.181989,189.833989 C178.716419,190.43969 179.13716,191.136861 179.423989,191.891989 C179.714835,192.635899 179.865374,193.427247 179.868011,194.225988 C179.870143,195.048291 179.713263,195.863251 179.405989,196.625988 C179.10866,197.373202 178.675333,198.058795 178.127989,198.647988 C177.578677,199.237803 176.917959,199.71295 176.183989,200.045988 C175.409463,200.39579 174.567786,200.571908 173.71799,200.561988 Z M170.069965,194.183988 C170.068289,194.72014 170.15339,195.253033 170.32199,195.761988 C170.474507,196.250422 170.716633,196.706188 171.03599,197.105988 C171.348514,197.498454 171.74128,197.819622 172.18799,198.047988 C172.668054,198.288644 173.199043,198.410072 173.73599,198.401988 C174.280589,198.414843 174.819502,198.28889 175.30199,198.035988 C175.751146,197.800812 176.144128,197.47128 176.453989,197.069988 C176.770361,196.666942 177.010313,196.209408 177.161989,195.719988 C177.321906,195.22371 177.402893,194.705395 177.402029,194.183988 C177.40415,193.649276 177.316949,193.11796 177.143989,192.611989 C176.98685,192.121264 176.740752,191.663645 176.417989,191.261989 C176.105828,190.87466 175.715284,190.557727 175.27199,190.331989 C174.794052,190.09866 174.267774,189.981481 173.73599,189.989989 C173.190434,189.97962 172.650662,190.103232 172.16399,190.349989 C171.715529,190.583582 171.322624,190.911003 171.01199,191.309989 C170.698389,191.711689 170.460513,192.167109 170.30999,192.653989 C170.153385,193.148989 170.072472,193.664811 170.069965,194.183988 L170.069965,194.183988 Z" id="Shape" fill="#414042" fill-rule="nonzero"></path>
            <path d="M173.71799,200.711988 C172.8314,200.723153 171.95368,200.534484 171.14999,200.159988 C170.40021,199.801553 169.727628,199.300174 169.16999,198.683988 C168.060259,197.447493 167.44507,195.845437 167.441987,194.183988 C167.441121,193.338693 167.604128,192.501244 167.92199,191.717989 C168.234944,190.951151 168.681917,190.246152 169.24199,189.635989 C169.810686,189.031029 170.491233,188.542014 171.24599,188.195989 C172.039621,187.837887 172.90133,187.65572 173.77199,187.661989 C174.658944,187.66147 175.53391,187.866861 176.327989,188.261989 C177.076281,188.627652 177.745057,189.13739 178.295989,189.761989 C178.841041,190.380014 179.269931,191.091444 179.561989,191.861989 C180.480384,194.228802 179.967935,196.912171 178.241989,198.773988 C177.673148,199.37459 176.99505,199.861273 176.243989,200.207988 C175.448405,200.556873 174.586547,200.728835 173.71799,200.711988 L173.71799,200.711988 Z M173.77199,187.961989 C172.944954,187.95444 172.126125,188.126394 171.37199,188.465989 C170.653997,188.797796 170.0063,189.26422 169.46399,189.839989 C168.925725,190.422525 168.496869,191.097313 168.19799,191.831989 C167.896658,192.579519 167.741849,193.378009 167.74199,194.183988 C167.742407,194.972082 167.88888,195.753274 168.17399,196.487988 C168.449828,197.221098 168.856415,197.898066 169.37399,198.485988 C169.90388,199.07142 170.544116,199.5465 171.25799,199.883988 C172.021885,200.24151 172.856628,200.421995 173.69999,200.411988 C174.527526,200.418227 175.346498,200.244196 176.09999,199.901988 C176.816511,199.575965 177.46257,199.113329 178.001989,198.539988 C178.534002,197.96292 178.956855,197.29408 179.249989,196.565988 C179.842065,195.080823 179.842065,193.425154 179.249989,191.939989 C178.973659,191.203498 178.567196,190.522673 178.049989,189.929989 C177.525669,189.335836 176.889594,188.850625 176.177989,188.501989 C175.428371,188.138835 174.604903,187.954017 173.77199,187.961989 L173.77199,187.961989 Z M173.73599,198.551988 C173.173894,198.560424 172.618096,198.432796 172.11599,198.179988 C171.652899,197.940119 171.24436,197.607159 170.91599,197.201988 C170.584497,196.78769 170.332276,196.315794 170.17199,195.809988 C169.83612,194.768395 169.83612,193.647582 170.17199,192.605989 C170.331015,192.103223 170.576714,191.632131 170.89799,191.213989 C171.221928,190.799768 171.631187,190.460083 172.09799,190.217989 C173.124133,189.726311 174.317846,189.726311 175.34399,190.217989 C175.808973,190.452328 176.218202,190.783803 176.543989,191.189989 C176.875153,191.605449 177.12917,192.076903 177.293989,192.581989 C177.633908,193.620891 177.633908,194.741086 177.293989,195.779988 C177.136568,196.288267 176.888583,196.763911 176.561989,197.183988 C176.238823,197.600515 175.829486,197.942311 175.36199,198.185988 C174.859154,198.442124 174.300077,198.567968 173.73599,198.551988 L173.73599,198.551988 Z M173.73599,190.151989 C173.213688,190.142217 172.696842,190.259588 172.22999,190.493989 C171.80128,190.718575 171.425018,191.031445 171.12599,191.411989 C170.824921,191.801668 170.597218,192.242843 170.45399,192.713989 C170.298789,193.192669 170.219824,193.692777 170.21999,194.195988 C170.220203,194.715345 170.30117,195.231511 170.45999,195.725988 C170.611501,196.198441 170.847304,196.639556 171.15599,197.027988 C171.454879,197.401615 171.828966,197.708245 172.25399,197.927988 C173.200629,198.389989 174.307351,198.389989 175.25399,197.927988 C175.683382,197.701809 176.059719,197.386832 176.357989,197.003988 C176.660467,196.611177 176.891951,196.168515 177.041989,195.695988 C177.19223,195.21424 177.269091,194.71262 177.269995,194.207988 C177.27075,193.690043 177.187676,193.175389 177.023989,192.683989 C176.868047,192.212225 176.630436,191.771526 176.321989,191.381989 C176.02235,191.00982 175.645734,190.70689 175.21799,190.493989 C174.760146,190.257179 174.251433,190.135664 173.73599,190.139989 L173.73599,190.151989 Z" id="Shape" fill="#414042" fill-rule="nonzero"></path>
            <path d="M181.421989,194.099988 C181.422868,193.320835 181.565175,192.548312 181.841989,191.819989 C182.109608,191.079337 182.516987,190.396978 183.041989,189.809989 C183.591639,189.208712 184.254223,188.721458 184.991989,188.375989 C185.811854,187.999641 186.706031,187.813013 187.607989,187.829989 C188.659061,187.80304 189.697179,188.066722 190.607989,188.591989 C191.412672,189.057914 192.066597,189.745161 192.491989,190.571989 L190.613989,191.867989 C190.466777,191.537763 190.263813,191.235347 190.013989,190.973989 C189.796298,190.731747 189.538535,190.528784 189.251989,190.373989 C188.983709,190.231256 188.697,190.126264 188.399989,190.061989 C188.116425,189.998136 187.826653,189.965939 187.535989,189.965989 C186.978827,189.949594 186.426914,190.077754 185.933989,190.337989 C185.490586,190.574203 185.103692,190.903779 184.799989,191.303989 C184.492769,191.707052 184.261034,192.16239 184.115989,192.647989 C183.965062,193.131636 183.888192,193.635339 183.887989,194.141988 C183.884401,194.689063 183.973668,195.23278 184.151989,195.749988 C184.317029,196.242199 184.571265,196.699824 184.901989,197.099988 C185.225502,197.488632 185.623255,197.808874 186.071989,198.041988 C186.536155,198.279146 187.050767,198.400594 187.571989,198.395988 C187.869171,198.394133 188.165139,198.357891 188.453989,198.287988 C188.760477,198.218203 189.055447,198.105064 189.329989,197.951988 C189.615483,197.790224 189.876164,197.588146 190.103989,197.351988 C190.34732,197.099565 190.538918,196.801977 190.667989,196.475988 L192.671989,197.627988 C192.472527,198.097291 192.180746,198.521701 191.813989,198.875988 C191.439717,199.238624 191.015403,199.545747 190.553989,199.787988 C190.081958,200.0474 189.580326,200.248859 189.059989,200.387988 C188.549152,200.512037 188.02566,200.576466 187.499989,200.579988 C186.64695,200.588941 185.803927,200.395663 185.039989,200.015988 C184.30965,199.64886 183.655985,199.145885 183.113989,198.533988 C182.576477,197.92386 182.151854,197.222929 181.859989,196.463988 C181.565727,195.7108 181.417096,194.908604 181.421989,194.099988 L181.421989,194.099988 Z" id="Path" fill="#414042" fill-rule="nonzero"></path>
            <path d="M187.517989,200.730012 C186.638472,200.732551 185.770832,200.526949 184.985989,200.129988 C184.240656,199.75455 183.574542,199.239178 183.023989,198.611988 C182.470539,197.991249 182.033548,197.275803 181.733989,196.499988 C181.130453,194.977853 181.117613,193.285104 181.697989,191.753989 C182.26156,190.191314 183.42884,188.920276 184.937989,188.225989 C185.779885,187.837365 186.69889,187.644538 187.625989,187.661989 C188.703863,187.636949 189.768122,187.906645 190.703989,188.441989 C191.533405,188.925201 192.207786,189.634966 192.647989,190.487989 L192.701989,190.601989 L190.571989,192.071989 L190.499989,191.909989 C190.347636,191.595259 190.144976,191.307482 189.899989,191.057989 C189.689156,190.837871 189.443962,190.653469 189.173989,190.511989 C188.918768,190.375885 188.646292,190.274969 188.363989,190.211989 C187.569785,190.014289 186.731015,190.107959 185.999989,190.475989 C185.574091,190.699856 185.203176,191.015441 184.913989,191.399989 C184.615748,191.787464 184.391963,192.226896 184.253989,192.695989 C184.108014,193.166214 184.033187,193.655627 184.031989,194.147988 C184.028866,194.676901 184.116121,195.20246 184.289989,195.701988 C184.448018,196.179573 184.694281,196.623253 185.015989,197.009988 C185.325053,197.384574 185.706709,197.692757 186.137989,197.915988 C186.842068,198.268763 187.650822,198.351986 188.411989,198.149988 C188.704837,198.078816 188.987199,197.969905 189.251989,197.825988 C189.523617,197.674131 189.772133,197.484208 189.989989,197.261988 C190.220054,197.020985 190.401378,196.737793 190.523989,196.427988 L190.589989,196.271988 L192.851989,197.573988 L192.803989,197.699988 C192.594464,198.186769 192.29062,198.62724 191.909989,198.995988 C191.524606,199.365261 191.090595,199.680171 190.619989,199.931988 C189.65521,200.437842 188.58332,200.7053 187.493989,200.711988 L187.517989,200.730012 Z M187.625989,187.979989 C185.929704,187.944868 184.302216,188.650186 183.167989,189.911989 C182.645215,190.48249 182.237731,191.148727 181.967989,191.873989 C181.411708,193.337178 181.424554,194.955813 182.003989,196.409988 C182.291593,197.151224 182.708004,197.835762 183.233989,198.431988 C183.761038,199.03042 184.398718,199.521414 185.111989,199.877988 C186.33185,200.466514 187.723306,200.594366 189.029989,200.237988 C189.537098,200.11548 190.026897,199.930042 190.487989,199.685988 C190.926758,199.446324 191.330531,199.147532 191.687989,198.797988 C192.010135,198.488585 192.272515,198.122473 192.461989,197.717988 L190.721989,196.721988 C190.584737,197.002574 190.40682,197.261363 190.193989,197.489988 C189.954764,197.728501 189.681862,197.93065 189.383989,198.089988 C189.097198,198.246856 188.790378,198.363932 188.471989,198.437988 C187.640359,198.659418 186.756361,198.567601 185.987989,198.179988 C185.527368,197.936373 185.119529,197.603985 184.787989,197.201988 C184.44609,196.786648 184.181865,196.313075 184.007989,195.803988 C183.82761,195.270574 183.736387,194.711074 183.737989,194.147988 C183.73973,193.627244 183.818586,193.109628 183.971989,192.611989 C184.123474,192.107793 184.363187,191.634462 184.679989,191.213989 C185.553218,190.060264 187.038156,189.550262 188.435989,189.923989 C188.744484,189.991179 189.04297,190.09807 189.323989,190.241989 C189.619184,190.399882 189.888332,190.602249 190.121989,190.841989 C190.344225,191.072701 190.530326,191.33567 190.673989,191.621989 L192.299989,190.499989 C191.881162,189.752808 191.270025,189.131313 190.529989,188.699989 C189.645579,188.20011 188.641483,187.951161 187.625989,187.979989 L187.625989,187.979989 Z" id="Shape" fill="#414042" fill-rule="nonzero"></path>
            <polygon id="Path" fill="#414042" fill-rule="nonzero" points="205.349988 187.895989 205.349988 200.495988 202.949988 200.495988 202.949988 195.131988 197.219988 195.131988 197.219988 200.495988 194.777988 200.495988 194.777988 187.895989 197.219988 187.895989 197.219988 192.983988 202.925988 192.983988 202.925988 187.895989"></polygon>
            <path d="M205.499988,200.621988 L202.799988,200.621988 L202.799988,195.257988 L197.399988,195.257988 L197.399988,200.621988 L194.657988,200.621988 L194.657988,187.745989 L197.399988,187.745989 L197.399988,192.833989 L202.799988,192.833989 L202.799988,187.745989 L205.523988,187.745989 L205.499988,200.621988 Z M203.099988,200.321988 L205.199988,200.321988 L205.199988,188.045989 L203.075988,188.045989 L203.075988,193.133988 L197.075988,193.133988 L197.075988,188.045989 L194.933988,188.045989 L194.933988,200.321988 L197.075988,200.321988 L197.075988,194.957988 L203.075988,194.957988 L203.099988,200.321988 Z" id="Shape" fill="#414042" fill-rule="nonzero"></path>
            <polygon id="Path" fill="#414042" fill-rule="nonzero" points="217.145987 198.329988 217.145987 200.471988 208.415988 200.471988 208.415988 187.871989 216.989987 187.871989 216.989987 190.019989 210.857987 190.019989 210.857987 193.019988 216.155987 193.019988 216.155987 195.005988 210.857987 195.005988 210.857987 198.281988"></polygon>
            <path d="M217.295988,200.621988 L208.295988,200.621988 L208.295988,187.745989 L217.139987,187.745989 L217.139987,190.199989 L211.007987,190.199989 L211.007987,192.923989 L216.305987,192.923989 L216.305987,195.209988 L211.007987,195.209988 L211.007987,198.209988 L217.295988,198.209988 L217.295988,200.621988 Z M208.565988,200.321988 L216.965987,200.321988 L216.965987,198.479988 L210.707987,198.479988 L210.707987,194.879988 L215.999987,194.879988 L215.999987,193.199988 L210.701987,193.199988 L210.701987,189.875989 L216.839987,189.875989 L216.839987,188.027989 L208.565988,188.027989 L208.565988,200.321988 Z" id="Shape" fill="#414042" fill-rule="nonzero"></path>
            <path d="M226.727986,191.189989 C226.586295,191.067271 226.435902,190.954977 226.277987,190.853989 C226.021892,190.697681 225.75525,190.559348 225.479987,190.439989 C225.149769,190.297083 224.808689,190.180715 224.459987,190.091989 C224.094917,190.001129 223.720192,189.954792 223.343987,189.953989 C222.817151,189.915338 222.291712,190.045647 221.843987,190.325989 C221.510153,190.565741 221.322245,190.959668 221.345987,191.369989 C221.336829,191.600353 221.402043,191.827551 221.531987,192.017989 C221.676161,192.206396 221.860669,192.360153 222.071987,192.467989 C222.356372,192.617832 222.65611,192.736521 222.965987,192.821989 C223.325987,192.929989 223.739987,193.043988 224.213987,193.157988 C224.813987,193.325988 225.383987,193.499988 225.887987,193.691988 C226.348051,193.856398 226.777827,194.095613 227.159986,194.399988 C227.502438,194.673142 227.779236,195.019653 227.969986,195.413988 C228.169754,195.875544 228.266009,196.375252 228.251986,196.877988 C228.268676,197.476184 228.138911,198.069395 227.873986,198.605988 C227.62823,199.069442 227.274197,199.4667 226.841986,199.763988 C226.389167,200.068035 225.885035,200.287577 225.353987,200.411988 C224.77789,200.547986 224.187918,200.616447 223.595987,200.61599 C222.645979,200.614383 221.701546,200.470797 220.793987,200.189988 C219.908737,199.926088 219.071951,199.520864 218.315987,198.989988 L219.395987,196.883988 C219.580084,197.043723 219.781312,197.182569 219.995987,197.297988 C220.312609,197.490864 220.641285,197.663219 220.979987,197.813988 C221.383691,197.996552 221.803498,198.141175 222.233987,198.245988 C222.69839,198.366285 223.176256,198.426774 223.655987,198.425988 C224.999987,198.425988 225.671987,197.993988 225.671987,197.129988 C225.677477,196.88063 225.596967,196.636982 225.443987,196.439988 C225.261758,196.230617 225.036681,196.062832 224.783987,195.947988 C224.455404,195.785113 224.111794,195.654502 223.757987,195.557988 C223.355987,195.437988 222.911987,195.305988 222.413987,195.167988 C221.880536,195.023089 221.357369,194.842687 220.847987,194.627988 C220.444248,194.45732 220.069714,194.224501 219.737987,193.937988 C219.452546,193.682422 219.227163,193.366886 219.077987,193.013988 C218.919861,192.617422 218.84432,192.192759 218.855987,191.765989 C218.84294,191.180397 218.964029,190.599582 219.209987,190.067989 C219.436174,189.579259 219.775543,189.151448 220.199987,188.819989 C220.635349,188.480453 221.129623,188.224163 221.657987,188.063989 C222.242232,187.891476 222.848829,187.806552 223.457987,187.811989 C224.292153,187.802806 225.121228,187.943017 225.905987,188.225989 C226.591211,188.474592 227.24393,188.80498 227.849986,189.209989 L226.727986,191.189989 Z" id="Path" fill="#414042" fill-rule="nonzero"></path>
            <path d="M223.595987,200.765988 C222.63167,200.765645 221.672909,200.62001 220.751987,200.333988 C219.854341,200.068391 219.00398,199.663457 218.231987,199.133988 L218.123987,199.055988 L219.359987,196.655988 L219.503987,196.799988 C219.669562,196.953267 219.852862,197.08621 220.049987,197.195988 C220.36069,197.384805 220.683375,197.553162 221.015987,197.699988 C221.414723,197.877895 221.828311,198.020442 222.251987,198.125988 C222.702846,198.241754 223.166502,198.300215 223.631987,198.299988 C224.885987,198.299988 225.497987,197.927988 225.497987,197.153988 C225.505587,196.936785 225.43537,196.724007 225.299987,196.553988 C225.135169,196.360542 224.930499,196.204993 224.699987,196.097988 C224.377759,195.942751 224.042458,195.816261 223.697987,195.719988 C223.295987,195.599988 222.851987,195.467988 222.353987,195.329988 C221.81399,195.184856 221.284718,195.002417 220.769987,194.783988 C220.35206,194.606591 219.965178,194.363524 219.623987,194.063988 C219.318536,193.798117 219.078341,193.465541 218.921987,193.091988 C218.756907,192.676136 218.677323,192.231281 218.687987,191.783989 C218.67538,191.17591 218.800503,190.572858 219.053987,190.019989 C219.290837,189.514258 219.642096,189.070563 220.079987,188.723989 C220.532555,188.37592 221.044994,188.1136 221.591987,187.949989 C222.184682,187.767965 222.80201,187.678908 223.421987,187.685989 C224.272753,187.677761 225.118111,187.822041 225.917987,188.111989 C226.617116,188.359705 227.282332,188.694329 227.897986,189.107989 L228.011986,189.185989 L226.769986,191.465989 L226.631986,191.321989 C226.497573,191.203547 226.353018,191.097138 226.199987,191.003989 C225.95262,190.850438 225.693865,190.716046 225.425987,190.601989 C225.103322,190.464016 224.770292,190.351669 224.429987,190.265989 C224.077151,190.175126 223.714333,190.128766 223.349987,190.127989 C222.855656,190.090138 222.362043,190.209866 221.939987,190.469989 C221.647323,190.684265 221.482589,191.031787 221.501987,191.393989 C221.494073,191.591759 221.548656,191.786997 221.657987,191.951989 C221.788901,192.123561 221.957151,192.263086 222.149987,192.359989 C222.42445,192.505595 222.714224,192.620297 223.013987,192.701989 C223.379987,192.809989 223.793987,192.923989 224.255987,193.037988 C224.855987,193.205988 225.455987,193.385988 225.947987,193.571988 C226.420443,193.748223 226.863471,193.995023 227.261986,194.303988 C227.620064,194.594899 227.909027,194.961739 228.107986,195.377988 C228.319575,195.857515 228.422041,196.378043 228.407986,196.901988 C228.424308,197.525262 228.288381,198.143112 228.011986,198.701988 C227.755463,199.184237 227.384644,199.596259 226.931986,199.901988 C226.465476,200.21688 225.944701,200.442685 225.395987,200.567988 C224.805942,200.70502 224.20171,200.771485 223.595987,200.765988 Z M218.507987,198.935988 C219.225247,199.422117 220.012236,199.796392 220.841987,200.045988 C222.290615,200.512045 223.836393,200.588609 225.323987,200.267988 C225.833627,200.154111 226.319106,199.950981 226.757986,199.667988 C227.16954,199.38318 227.505275,199.002132 227.735986,198.557988 C227.993397,198.044871 228.119171,197.475796 228.101986,196.901988 C228.116559,196.421749 228.024341,195.944263 227.831986,195.503988 C227.652183,195.129828 227.391991,194.799978 227.069986,194.537988 C226.69736,194.245141 226.280021,194.014187 225.833987,193.853988 C225.335987,193.667988 224.777987,193.487988 224.177987,193.325988 C223.709987,193.211988 223.289987,193.097988 222.923987,192.989988 C222.602747,192.893904 222.292922,192.763134 221.999987,192.599989 C221.763943,192.482965 221.558488,192.312437 221.399987,192.101989 C221.250245,191.887997 221.174408,191.630993 221.183987,191.369989 C221.163729,190.913109 221.373115,190.476326 221.741987,190.205989 C222.215025,189.904627 222.77256,189.763666 223.331987,189.803989 C223.722463,189.803802 224.111448,189.852173 224.489987,189.947989 C224.84441,190.039671 225.191399,190.158008 225.527987,190.301989 C225.811094,190.421614 226.083995,190.564085 226.343987,190.727989 C226.481987,190.817989 226.589986,190.889989 226.673986,190.955989 L227.597986,189.257989 C227.031292,188.897168 226.427915,188.597491 225.797987,188.363989 C225.028445,188.087616 224.215584,187.951462 223.397987,187.961989 C222.807123,187.958684 222.218935,188.041556 221.651987,188.207989 C221.141244,188.363873 220.663363,188.611964 220.241987,188.939989 C219.838728,189.261079 219.51614,189.67202 219.299987,190.139989 C219.069027,190.654679 218.954308,191.213936 218.963987,191.777989 C218.949615,192.188251 219.021144,192.596989 219.173987,192.977988 C219.308427,193.308124 219.513174,193.605007 219.773987,193.847988 C220.09269,194.12485 220.453133,194.34962 220.841987,194.513988 C221.34433,194.729356 221.8617,194.907828 222.389987,195.047988 L223.733987,195.437988 C224.097269,195.537685 224.450726,195.670232 224.789987,195.833988 C225.060404,195.960907 225.299951,196.145174 225.491987,196.373988 C225.669233,196.594711 225.762742,196.870988 225.755987,197.153988 C225.755987,198.113988 225.023987,198.599988 223.589987,198.599988 C223.097958,198.601783 222.607806,198.539253 222.131987,198.413988 C221.69328,198.308095 221.265421,198.161458 220.853987,197.975988 C220.509384,197.823145 220.174725,197.648802 219.851987,197.453988 C219.696251,197.36069 219.546003,197.258522 219.401987,197.147988 L218.507987,198.935988 Z" id="Shape" fill="#414042" fill-rule="nonzero"></path>
        </g>
    </g>
</svg>