<?xml version="1.0" encoding="UTF-8"?>
<svg width="282px" height="243px" viewBox="0 0 282 243" version="1.1" xmlns="http://www.w3.org/2000/svg" xmlns:xlink="http://www.w3.org/1999/xlink">
    <!-- Generator: Sketch 61 (89581) - https://sketch.com -->
    <title>undraw_absorbed_in_xahs (1)</title>
    <desc>Created with Sketch.</desc>
    <g id="OK" stroke="none" stroke-width="1" fill="none" fill-rule="evenodd">
        <g id="about" transform="translate(-276.000000, -1108.000000)" fill-rule="nonzero">
            <g id="Group-11" transform="translate(276.000000, 1108.000000)">
                <g id="undraw_absorbed_in_xahs-(1)" transform="translate(141.000000, 121.500000) scale(-1, 1) translate(-141.000000, -121.500000) ">
                    <polygon id="Path" fill="#E6E6E6" points="60.2241024 61.3275024 60.2241024 57.4275023 45.2241018 57.4275023 45.2241018 61.3275024 42.2241017 61.3275024 42.2241017 6.42750026 10.1241004 6.42750026 10.1241004 98.5275039 36.5241015 98.5275039 42.2241017 98.5275039 68.6241027 98.5275039 68.6241027 61.3275024"></polygon>
                    <path d="M171.491461,51.301253 C171.491461,51.301253 171.4711,51.320843 171.435796,51.355157 L171.436096,51.301253 L171.434632,51.356276 C170.675806,52.0942281 162.226989,60.4310004 158.949144,68.8868307 C157.861059,67.6762467 157.091466,66.9376917 157.091466,66.9376917 C157.091466,66.9376917 157.078137,66.9505257 157.054992,66.9730317 L157.055211,66.9376917 L157.05426,66.9737637 C156.435876,67.5750807 148.02531,75.874794 148.02531,82.4517243 C148.02531,88.8016385 151.536192,91.3076376 156.055161,91.6274316 L155.72733,97.8909219 L156.643077,97.8909219 L156.744336,91.6593216 C156.859581,91.6619226 156.975156,91.6636626 157.091466,91.6636626 C160.430613,91.6636626 163.34613,90.6009546 164.919367,87.8695895 C166.514146,88.4989408 168.198849,88.87072 169.910383,88.9710035 L169.410139,98.5273719 L170.807341,98.5273719 L170.961811,89.0196545 C171.137629,89.0236115 171.314011,89.0262545 171.491461,89.0262545 C179.130988,89.0262545 185.323981,85.3888624 185.323981,74.971389 C185.323981,64.5539156 171.491461,51.301253 171.491461,51.301253 Z" id="Path" fill="#F2F2F2"></path>
                    <path d="M138.52398,57.8087123 L138.52398,52.3273581 L121.723979,52.3273581 L121.723979,57.8087123 L113.923979,57.8087123 L113.923979,36.1273574 L106.423978,36.1273574 L106.423978,27.7273571 L89.6239776,27.7273571 L89.6239776,36.1273574 L81.8239773,36.1273574 L81.8239773,70.1642098 C80.6930692,68.7487693 79.4801597,67.4008403 78.1914901,66.1273586 C78.1914901,66.1273586 78.1781221,66.1401926 78.1549981,66.1626956 L78.1551991,66.1273586 L78.1542481,66.1634306 C77.5358821,66.7647477 69.1253157,75.064461 69.1253157,81.6413912 C69.1253157,87.9913055 72.6361979,90.4973046 77.1551851,90.8170986 L76.8273181,97.0805889 L77.7431011,97.0805889 L77.8443421,90.8489886 C77.9595691,90.8515896 78.0751831,90.8533296 78.1914901,90.8533296 C79.4214383,90.8688106 80.6464942,90.6956948 81.8239923,90.3400116 L81.8239923,98.5273719 L146.023995,98.5273719 L146.023995,57.8087123 L138.52398,57.8087123 Z" id="Path" fill="#F2F2F2"></path>
                    <path d="M267.791465,51.6909201 C267.791465,51.6909201 267.771104,51.7105101 267.7358,51.7448241 L267.7361,51.6909201 L267.734636,51.7459431 C266.949236,52.5097431 257.92516,61.4142234 254.92399,70.1655118 L254.92399,65.8273569 L226.123989,22.3273569 L197.323988,65.8273569 L197.323988,98.5273599 L254.92399,98.5273599 L254.92399,81.6202772 C256.764565,86.7670444 261.057436,88.9960055 266.210393,89.3606586 L265.710149,98.9170269 L267.107351,98.9170269 L267.261821,89.4093096 C267.437639,89.4132666 267.614021,89.4159096 267.791471,89.4159096 C275.430998,89.4159096 281.623991,85.7785174 281.623991,75.361044 C281.623991,64.9435706 267.791465,51.6909201 267.791465,51.6909201 Z" id="Path" fill="#F2F2F2"></path>
                    <ellipse id="Oval" fill="#F2F2F2" cx="45.8239758" cy="106.825507" rx="37.9500015" ry="3.49814714"></ellipse>
                    <ellipse id="Oval" fill="#F2F2F2" cx="256.274497" cy="151.13847" rx="16.9249837" ry="1.56010806"></ellipse>
                    <path d="M263.473984,144.868674 C263.473984,149.242935 260.873704,150.770274 257.665816,150.770274 C257.591502,150.770274 257.517302,150.769449 257.443216,150.767799 C257.294587,150.764613 257.147371,150.757536 257.001916,150.747627 C254.106859,150.542727 251.857621,148.936842 251.857621,144.868683 C251.857621,140.658621 257.237599,135.346235 257.641723,134.953082 L257.642431,134.952377 C257.658004,134.937161 257.665789,134.929727 257.665789,134.929727 C257.665789,134.929727 263.473984,140.494413 263.473984,144.868674 Z" id="Path" fill="#21816E"></path>
                    <path d="M257.454199,150.101085 L259.578514,147.132774 L257.448889,150.427005 L257.443231,150.767805 C257.294602,150.764619 257.147386,150.757542 257.001931,150.747633 L257.230894,146.371248 L257.229121,146.337276 L257.233021,146.330907 L257.254621,145.917579 L255.119686,142.615209 L257.261344,145.607583 L257.266303,145.695345 L257.439343,142.388727 L255.611569,138.976284 L257.46163,141.808356 L257.64175,134.953055 L257.642458,134.9297 L257.642458,134.95235 L257.61238,140.358162 L259.432012,138.215087 L257.604952,140.823861 L257.556823,143.784387 L259.255783,140.943117 L257.549749,144.220017 L257.522854,145.865892 L259.989367,141.911328 L257.513653,146.440233 L257.454199,150.101085 Z" id="Path" fill="#3F3D56"></path>
                    <ellipse id="Oval" fill="#F2F2F2" cx="31.5744883" cy="205.178078" rx="31.5744883" ry="2.91046812"></ellipse>
                    <path d="M45.0055278,193.481429 C45.0055278,201.641855 40.1545606,204.491174 34.1700704,204.491174 C34.0314344,204.491174 33.8930193,204.489633 33.7548253,204.486551 C33.4775473,204.480608 33.2029123,204.467408 32.9315803,204.448919 C27.5306801,204.06668 23.3346159,201.070805 23.3346159,193.481429 C23.3346159,185.627326 33.3712603,175.716778 34.1251754,174.98332 L34.1264984,174.982003 C34.1555504,174.953614 34.1700704,174.939751 34.1700704,174.939751 C34.1700704,174.939751 45.0055278,185.321005 45.0055278,193.481429 Z" id="Path" fill="#21816E"></path>
                    <path d="M33.7752883,203.242778 L37.7383125,197.705234 L33.7653883,203.850803 L33.7548313,204.486551 C33.4775533,204.480608 33.2029183,204.467408 32.9315863,204.448919 L33.3587263,196.284536 L33.3554263,196.221158 L33.3626863,196.209275 L33.4029553,195.438191 L29.4201042,189.277436 L33.4154863,194.859875 L33.4247383,195.023597 L33.7475563,188.854925 L30.3377562,182.488852 L33.7891453,187.772236 L34.1251724,174.98332 L34.1264954,174.939751 L34.1264954,174.982003 L34.0703954,185.066839 L37.4650185,181.068817 L34.0565354,185.935627 L33.9667513,191.458652 L37.1362515,186.158107 L33.9535513,192.271331 L33.9033763,195.341804 L38.5047885,187.964344 L33.8862073,196.413269 L33.7752883,203.242778 Z" id="Path" fill="#3F3D56"></path>
                    <path d="M88.8739775,67.8983637 C88.8739775,85.1258284 78.6325231,91.1410176 65.9990486,91.1410176 C53.3655741,91.1410176 43.1241197,85.1258284 43.1241197,67.8983637 C43.1241197,50.670899 65.9990486,28.7548451 65.9990486,28.7548451 C65.9990486,28.7548451 88.8739775,50.670899 88.8739775,67.8983637 Z" id="Path" fill="#21816E"></path>
                    <polygon id="Path" fill="#3F3D56" points="65.1657026 88.5057035 65.4000026 74.0880029 75.150003 56.2509022 65.4366026 71.8263029 65.5419026 65.3433026 72.2616029 52.4385021 65.5698026 63.6276025 65.5698026 63.6279025 65.7594026 51.9681021 72.9549029 41.6943017 65.7891026 50.134502 65.9076026 28.7547011 65.1636026 57.0579023 65.2248026 55.8903022 57.9090023 44.6922018 65.1075026 58.1316023 64.4259026 71.1534028 64.4055026 70.8078028 55.9719022 59.0238023 64.3800026 72.0288029 64.2948026 73.6572029 64.2795026 73.6818029 64.2864026 73.8156029 62.5572025 106.853104 64.8678026 106.853104 65.1450026 89.7885036 73.5324029 76.8153031"></polygon>
                    <path d="M48.7588309,67.8983637 C48.7588309,85.1258284 38.5173765,91.1410176 25.883902,91.1410176 C13.2504275,91.1410176 3.00897312,85.1258284 3.00897312,67.8983637 C3.00897312,50.670899 25.883902,28.7548451 25.883902,28.7548451 C25.883902,28.7548451 48.7588309,50.670899 48.7588309,67.8983637 Z" id="Path" fill="#21816E"></path>
                    <polygon id="Path" fill="#3F3D56" points="25.050601 88.5057035 25.284901 74.0880029 35.0346014 56.2509022 25.321501 71.8263029 25.426801 65.3433026 32.1465013 52.4385021 25.454701 63.6276025 25.454701 63.6279025 25.644301 51.9681021 32.8395013 41.6943017 25.674001 50.134502 25.792201 28.7547011 25.048501 57.0579023 25.109701 55.8903022 17.7939007 44.6922018 24.992401 58.1316023 24.310801 71.1534028 24.290401 70.8078028 15.8568006 59.0238023 24.264901 72.0288029 24.179701 73.6572029 24.164401 73.6818029 24.171301 73.8156029 22.4421009 106.853104 24.752701 106.853104 25.029901 89.7885036 33.4173013 76.8153031"></polygon>
                    <path d="M79.5739772,52.9316151 C79.5739772,76.227363 65.7250256,84.3613684 48.6414769,84.3613684 C31.5579283,84.3613684 17.7089737,76.227363 17.7089737,52.9316151 C17.7089737,29.6358672 48.6414889,0 48.6414889,0 C48.6414889,0 79.5739772,29.6358792 79.5739772,52.9316151 Z" id="Path" fill="#F2F2F2"></path>
                    <polygon id="Path" fill="#3F3D56" points="47.5146019 80.7978032 47.8314019 61.3014024 61.0155024 37.1814015 47.8812019 58.2429023 48.0234019 49.476602 57.1101023 32.0262013 48.0612019 47.1567019 48.0612019 47.1567019 48.3174019 31.3899012 58.0473023 17.4972007 48.3576019 28.9107011 48.5175019 0 47.5119019 38.2725015 47.5944019 36.6936015 37.7019015 21.5514009 47.4360019 39.7245016 46.5141018 57.3333023 46.4868018 56.8659023 35.0823014 40.9308016 46.4523018 58.5171023 46.3368018 60.7191024 46.3161018 60.7521024 46.3257018 60.9330024 43.9872017 105.607804 47.1117019 105.607804 47.4864019 82.5324033 58.8285023 64.9896026"></polygon>
                    <ellipse id="Oval" fill="#F2F2F2" cx="164.023981" cy="237.802362" rx="72.9000029" ry="4.27500017"></ellipse>
                    <rect id="Rectangle" fill="#3F3D56" transform="translate(135.373980, 80.077358) rotate(-30.000000) translate(-135.373980, -80.077358) " x="127.273979" y="60.127357" width="16.2000006" height="39.9000016"></rect>
                    <rect id="Rectangle" fill="#21816E" transform="translate(129.385847, 70.587380) rotate(-30.925350) translate(-129.385847, -70.587380) " x="122.878554" y="70.437452" width="13.0145855" height="1"></rect>
                    <rect id="Rectangle" fill="#21816E" transform="translate(131.162114, 73.067364) rotate(-30.925350) translate(-131.162114, -73.067364) " x="124.654821" y="72.9174356" width="13.0145855" height="1"></rect>
                    <rect id="Rectangle" fill="#21816E" transform="translate(132.362113, 75.167364) rotate(-30.925350) translate(-132.362113, -75.167364) " x="125.85482" y="75.0174357" width="13.0145855" height="1"></rect>
                    <rect id="Rectangle" fill="#21816E" transform="translate(134.162114, 77.867365) rotate(-30.925350) translate(-134.162114, -77.867365) " x="127.654821" y="77.7174368" width="13.0145855" height="1"></rect>
                    <rect id="Rectangle" fill="#21816E" transform="translate(136.862113, 81.767435) rotate(-30.925350) translate(-136.862113, -81.767435) " x="130.354783" y="81.6175073" width="13.0146605" height="1"></rect>
                    <path d="M183.297994,102.5299 C183.297994,102.5299 191.020373,98.8157169 196.515572,100.200145 L183.297994,64.5527366 L183.297994,60.8922804 L202.006637,105.405982 L202.006637,105.405982 C206.684186,114.222929 212.597837,134.318285 202.515356,135.93149 C191.076452,137.761715 170.486422,144.625059 170.486422,144.625059 L165.910858,104.817682 L183.297994,102.5299 Z" id="Path" fill="#2F2E41"></path>
                    <path d="M138.22871,90.6334386 C138.22871,90.6334386 125.874692,75.07653 122.671799,80.5672022 C119.468906,86.0578744 137.055992,95.2936358 137.055992,95.2936358 L138.22871,90.6334386 Z" id="Path" fill="#FFB9B9"></path>
                    <path d="M142.346715,91.0909956 L137.313596,88.3456565 C137.313596,88.3456565 134.110703,96.5816678 134.110703,97.9543359 C134.110703,99.3270039 139.143822,99.784561 139.143822,99.784561 L142.346715,91.0909956 Z" id="Path" fill="#D0CDE1"></path>
                    <circle id="Oval" fill="#FFB9B9" cx="161.564073" cy="44.4202638" r="11.8964615"></circle>
                    <path d="M170.715199,43.0475957 C170.715199,43.0475957 175.748317,58.1469503 179.408764,59.0620613 C183.069211,59.9771724 165.224524,66.8405187 165.224524,66.8405187 C165.224524,66.8405187 159.733848,54.0289431 156.988512,50.82605 C154.243176,47.6231569 170.715199,43.0475957 170.715199,43.0475957 Z" id="Path" fill="#FFB9B9"></path>
                    <path d="M199.31246,131.355938 C209.17505,129.777938 203.73146,110.514148 199.11116,101.422006 C199.529856,101.741227 199.905155,102.113665 200.227571,102.529906 C204.803132,108.478135 213.954258,134.10128 202.515353,135.931505 C191.076449,137.76173 170.486419,144.625074 170.486419,144.625074 L169.863919,139.209354 C175.747423,137.320616 190.342637,132.791108 199.31246,131.355938 Z" id="Path" fill="#000000" opacity="0.1"></path>
                    <path d="M215.098146,210.055586 C215.098146,210.055586 226.53705,219.206712 225.621939,220.121823 C224.706828,221.036934 215.098146,235.678734 206.862134,237.051402 C198.626123,238.42407 194.965676,238.42407 194.965676,237.051402 C194.965676,235.678734 197.253455,232.475841 201.371462,231.10317 C205.489469,229.730499 205.947023,220.57938 205.489466,218.749155 C205.031909,216.91893 215.098146,210.055586 215.098146,210.055586 Z" id="Path" fill="#2F2E41"></path>
                    <path d="M180.781432,141.879729 L188.102332,176.19643 C188.102332,176.19643 218.301039,210.055586 217.385934,210.513131 C216.470829,210.970676 207.319697,220.121811 205.489472,220.121811 C203.659247,220.121811 172.087873,184.432429 172.087873,184.432429 L160.648968,154.691277 L180.781432,141.879729 Z" id="Path" fill="#2F2E41"></path>
                    <path d="M180.781432,141.879729 L188.102332,176.19643 C188.102332,176.19643 218.301039,210.055586 217.385934,210.513131 C216.470829,210.970676 207.319697,220.121811 205.489472,220.121811 C203.659247,220.121811 172.087873,184.432429 172.087873,184.432429 L160.648968,154.691277 L180.781432,141.879729 Z" id="Path" fill="#000000" opacity="0.1"></path>
                    <path d="M188.102332,130.898381 C188.102332,130.898381 184.441894,146.455284 174.375646,156.979083 C164.309398,167.502883 159.733845,189.008015 159.733845,189.008015 L149.667615,232.018287 C149.667615,232.018287 131.822924,229.730505 132.738035,225.154944 L142.346715,187.17778 C142.346715,187.17778 153.328062,134.558822 159.276294,130.898378 C165.224527,127.237934 188.102332,130.898381 188.102332,130.898381 Z" id="Path" fill="#2F2E41"></path>
                    <path d="M148.752501,228.357846 C148.752501,228.357846 151.497837,237.051414 149.667615,237.966525 C147.837393,238.881636 115.350902,240.711865 113.520692,234.306087 C113.520692,234.306087 112.605577,231.103194 119.926478,231.103194 C127.247378,231.103194 135.025832,224.239854 135.025832,224.239854 L148.752501,228.357846 Z" id="Path" fill="#2F2E41"></path>
                    <path d="M162.479193,65.0102936 C162.479193,65.0102936 174.375652,53.1138321 177.578545,54.0289431 C180.781438,54.9440542 180.781438,59.5196184 180.781438,59.5196184 C180.781438,59.5196184 190.847675,60.8922864 189.932564,93.8363197 C189.017453,126.780353 198.168575,130.440821 194.965682,132.271037 C191.762789,134.101253 155.158293,142.337286 153.785619,134.101283 C152.412945,125.865281 152.870508,94.2938977 156.530955,84.2276613 C160.191402,74.1614249 164.766967,67.7556297 162.479193,65.0102936 Z" id="Path" fill="#575A89"></path>
                    <path d="M177.578539,67.7556297 C177.578539,67.7556297 191.305226,74.1614159 183.526771,86.5154314 C175.748317,98.8694469 169.800094,112.138582 161.564073,111.681022 C153.328053,111.223462 140.51649,103.445011 136.856039,103.445011 C133.195589,103.445011 138.22871,90.1758816 140.974047,89.7183246 C143.719383,89.2607675 156.530955,97.0392249 156.530955,97.0392249 C156.530955,97.0392249 161.106519,65.9254046 177.578539,67.7556297 Z" id="Path" fill="#575A89"></path>
                    <path d="M168.427054,45.7348698 C167.412211,45.6743178 166.421287,46.0172838 165.413485,46.1510838 C161.80785,46.6297819 158.056884,44.0133617 157.260768,40.4642836 C157.196955,39.991662 157.056092,39.5326987 156.843783,39.1056526 C156.288861,38.1996525 155.025051,38.0269035 153.983226,38.2352385 C152.941401,38.4435735 151.953846,38.9311725 150.892854,38.9868405 C149.254662,39.0727966 147.681918,38.0642595 146.80887,36.6754305 C145.935822,35.2866014 145.688622,33.5776573 145.80648,31.9414513 L146.59182,32.7656983 C146.910935,32.0905812 147.03414,31.3394451 146.947416,30.5977602 C147.7937,30.3723727 148.696297,30.6033286 149.330316,31.2074952 C150.0228,31.2811902 149.500164,29.9230572 150.014631,29.4536952 C150.230055,29.2571592 150.560331,29.2942392 150.851931,29.2970502 C152.325105,29.3112552 153.516831,28.1844671 154.677723,27.2773961 C156.689126,25.7092528 159.041263,24.6363463 161.544018,24.145396 C163.207518,23.8209369 164.976439,23.7687969 166.55404,24.388243 C167.849641,24.896959 168.934078,25.8235 169.937386,26.7882431 C172.407268,29.1632052 174.594385,31.9537003 175.621909,35.2224854 C176.457244,37.8998911 176.480906,40.7647214 175.68991,43.4555597 C175.275874,44.8529838 174.028075,49.638788 172.201327,49.750241 C169.905976,49.890323 171.284086,45.9053418 168.427054,45.7348698 Z" id="Path" fill="#2F2E41"></path>
                </g>
            </g>
        </g>
    </g>
</svg>