<svg width="20" height="20" viewBox="0 0 20 20" fill="none" xmlns="http://www.w3.org/2000/svg">
<path fill-rule="evenodd" clip-rule="evenodd" d="M18.125 6.62969C19.1609 6.62969 20 7.46875 20 8.50391C20 9.49609 19.2266 10.3008 18.2531 10.3664C18.5589 10.7 18.75 11.1406 18.75 11.6289C18.75 12.543 18.0898 13.3047 17.2211 13.4656C17.3946 13.7496 17.5 14.0802 17.5 14.4375C17.5 15.2734 16.9531 15.9688 16.2013 16.2137C16.2312 16.3468 16.25 16.4838 16.25 16.6258C16.25 17.6613 15.4109 18.5 14.375 18.5H12.082C10.7305 18.5 9.41406 18.0625 8.33359 17.2492L7 16.2496C6.52785 15.8957 6.25 15.3398 6.25 14.75L6.25391 8.5C6.25781 7.95312 6.49219 7.41016 6.95312 7.03906L7.58984 6.53125C9.17048 5.26717 9.61847 3.90091 9.96551 2.84253C10.3204 1.76031 10.5697 1 11.8164 1C13.0273 1 13.75 1.95781 13.7508 2.87891C13.7508 3.47031 13.2918 5.14883 12.4023 6.62969H18.125ZM5 8.46484V17.2148C5 17.9375 4.44141 18.4648 3.75 18.3945H1.25C0.559766 18.3945 0 17.8699 0 17.1797V8.46484C0 7.80977 0.559766 7.25 1.25 7.25H3.75C4.44023 7.25 5 7.77461 5 8.46484Z" fill="#507A1F"/>
</svg>
