<?xml version="1.0" encoding="UTF-8"?>
<svg width="37px" height="11px" viewBox="0 0 37 11" version="1.1" xmlns="http://www.w3.org/2000/svg" xmlns:xlink="http://www.w3.org/1999/xlink">
    <!-- Generator: Sketch 47.1 (45422) - http://www.bohemiancoding.com/sketch -->
    <title>l'obs</title>
    <desc>Created with Sketch.</desc>
    <defs>
        <path d="M8.95321429,5.59114286 C8.95321429,2.24792857 11.5476429,0 14.5074286,0 C17.4727143,0 20.0608571,2.24792857 20.0608571,5.59114286 C20.0608571,8.93514286 17.4727143,11 14.5074286,11 C11.5413571,11 8.95321429,8.93514286 8.95321429,5.59114286 Z M10.8483571,5.59114286 C10.8483571,8.61928571 11.5177857,10.7996429 14.4390714,10.7996429 C14.4634286,10.7996429 14.4885714,10.7988571 14.5137143,10.7988571 C17.1702143,10.7674286 18.1782857,8.64521429 18.1782857,5.59114286 C18.1782857,2.53707143 17.2330714,0.201928571 14.5137143,0.201928571 C11.8627143,0.201928571 10.8483571,2.53707143 10.8483571,5.59114286 Z M28.9197857,2.915 C28.9197857,5.91878571 34.9454286,5.59742857 34.9454286,8.32464286 C34.9454286,9.70907143 33.6482143,10.6794286 32.0807143,10.6794286 C31.6525,10.6794286 31.1111429,10.6409286 30.5627143,10.3832143 C30.7143571,10.0744286 30.8463571,9.66507143 30.8463571,9.36885714 C30.8463571,8.70807143 30.4755,8.16671429 29.7699286,8.16671429 C29.3982857,8.16671429 28.9826429,8.45585714 28.9826429,9.01607143 C28.9826429,10.1247143 30.3427143,10.868 32.087,10.868 C34.1337857,10.868 36.2300714,9.92907143 36.2300714,7.75735714 C36.2300714,4.40157143 30.3112857,4.64671429 30.3112857,2.41135714 C30.3112857,1.10157143 31.6713571,0.409357143 32.7045714,0.409357143 C33.3834286,0.409357143 33.6419286,0.484785714 34.0072857,0.623071429 C33.8564286,0.931071429 33.7935714,1.25321429 33.7935714,1.56121429 C33.7935714,2.21021429 34.1337857,2.74528571 34.8134286,2.74528571 C35.1787857,2.739 35.5315714,2.46242857 35.5315714,1.92735714 C35.5315714,0.799857143 34.2398571,0.188571429 32.6975,0.188571429 C30.7709286,0.188571429 28.9197857,1.15814286 28.9197857,2.915 Z M19.6703571,0.308785714 L24.3925,0.308785714 C26.5390714,0.308785714 28.3092857,1.00728571 28.3092857,2.97235714 C28.3092857,4.40157143 26.8352857,5.2195 25.3306429,5.3515 C26.829,5.40807143 28.6746429,6.22757143 28.6746429,7.98442857 C28.6746429,9.98014286 27.1126429,10.7226429 24.7012857,10.7226429 L19.6703571,10.7226429 L19.6703571,10.6731429 C20.3877143,10.3769286 20.9298571,10.4837857 20.9235714,8.81492857 L20.9235714,2.2165 C20.9487143,0.641928571 20.3814286,0.648214286 19.6703571,0.352785714 L19.6703571,0.308785714 Z M22.5358571,0.572785714 L22.5358571,5.30121429 L24.2290714,5.30121429 C25.7588571,5.30121429 26.829,4.47071429 26.829,2.96607143 C26.829,1.46771429 25.7588571,0.572785714 24.2290714,0.572785714 L22.5358571,0.572785714 Z M22.5358571,5.57228571 L22.5358571,10.5144286 L24.4812857,10.5144286 C26.1933571,10.5144286 27.1566429,9.58964286 27.1566429,7.98442857 C27.1566429,6.37214286 26.1933571,5.57228571 24.4812857,5.57228571 L22.5358571,5.57228571 Z M5.95021429,1.34042857 C5.95021429,0.767642857 6.391,0.308785714 6.93864286,0.308785714 C7.60021429,0.308785714 7.97107143,0.817928571 7.97107143,1.606 C7.97107143,2.59364286 6.98264286,4.57128571 5.96907143,4.785 L5.61628571,4.785 C5.83707143,4.697 6.12071429,4.54614286 6.29671429,4.40785714 C6.46014286,4.27507143 7.02742857,3.67085714 7.02742857,3.27407143 C7.02742857,2.90242857 6.831,2.50642857 6.391,2.19685714 C6.14507143,2.02085714 5.95021429,1.73721429 5.95021429,1.34042857 Z M0,0.308785714 L3.72114286,0.308785714 L3.72114286,0.384214286 C3.01007143,0.680428571 2.739,1.22807143 2.739,2.21021429 L2.739,10.4460714 L4.92328571,10.4460714 C6.58585714,10.4460714 7.76364286,8.87857143 8.55092857,7.30321429 L8.70807143,7.30321429 L7.89564286,10.7171429 L0.0502857143,10.7171429 L0.0502857143,10.6472143 C0.762142857,10.351 1.1715,9.79785714 1.1715,8.81492857 L1.1715,2.21021429 C1.1715,1.23435714 0.711857143,0.661571429 0,0.364571429 L0,0.308785714 Z" id="path-1"></path>
    </defs>
    <g id="Symbols" stroke="none" stroke-width="1" fill="none" fill-rule="evenodd">
        <g id="logos" transform="translate(-157.000000, -51.000000)">
            <g id="medias" transform="translate(2.000000, 43.000000)">
                <g id="l'obs" transform="translate(155.000000, 8.000000)">
                    <path d="M35.5313357,1.92688571 C35.5313357,0.799385714 34.2404071,0.188885714 32.69805,0.188885714 C30.7706929,0.188885714 28.91955,1.15845714 28.91955,2.91531429 C28.91955,5.9191 34.9451929,5.59695714 34.9451929,8.32417143 C34.9451929,9.70938571 33.6487643,10.6789571 32.0804786,10.6789571 C31.6522643,10.6789571 31.1109071,10.6412429 30.5632643,10.3827429 C30.7141214,10.0747429 30.8469071,9.66538571 30.8469071,9.36917143 C30.8469071,8.7076 30.4752643,8.16702857 29.7696929,8.16702857 C29.39805,8.16702857 28.9831929,8.45617143 28.9831929,9.01638571 C28.9831929,10.1250286 30.3424786,10.8675286 32.0867643,10.8675286 C34.13355,10.8675286 36.2298357,9.92938571 36.2298357,7.75688571 C36.2298357,4.4011 30.31105,4.64702857 30.31105,2.41167143 C30.31105,1.10188571 31.6711214,0.408885714 32.7043357,0.408885714 C33.3839786,0.408885714 33.6424786,0.4851 34.0078357,0.623385714 C33.8561929,0.931385714 33.7933357,1.25352857 33.7933357,1.56152857 C33.7933357,2.20974286 34.13355,2.7456 34.8131929,2.7456 C35.17855,2.73931429 35.5313357,2.46195714 35.5313357,1.92688571 L35.5313357,1.92688571 Z M25.3311929,5.35181429 C26.8358357,5.21981429 28.30905,4.4011 28.30905,2.97188571 C28.30905,1.0076 26.5396214,0.308314286 24.39305,0.308314286 L19.6701214,0.308314286 L19.6701214,0.3531 C20.3819786,0.648528571 20.9484786,0.642242857 20.9233357,2.21681429 L20.9233357,8.81524286 C20.9296214,10.4833143 20.3882643,10.3764571 19.6701214,10.6726714 L19.6701214,10.7229571 L24.70105,10.7229571 C27.1131929,10.7229571 28.6744071,9.98045714 28.6744071,7.98395714 C28.6744071,6.2271 26.82955,5.40838571 25.3311929,5.35181429 L25.3311929,5.35181429 Z M24.2288357,5.30152857 L22.5348357,5.30152857 L22.5348357,0.5731 L24.2288357,0.5731 C25.7586214,0.5731 26.82955,1.46724286 26.82955,2.9656 C26.82955,4.47024286 25.7586214,5.30152857 24.2288357,5.30152857 L24.2288357,5.30152857 Z M27.1571929,7.98395714 C27.1571929,9.58917143 26.1931214,10.5147429 24.48105,10.5147429 L22.5348357,10.5147429 L22.5348357,5.5726 L24.48105,5.5726 C26.1931214,5.5726 27.1571929,6.37245714 27.1571929,7.98395714 L27.1571929,7.98395714 Z M20.0606214,5.59145714 C20.0606214,2.24824286 17.4732643,0.000314285714 14.5071929,0.000314285714 C11.5481929,0.000314285714 8.95376429,2.24824286 8.95376429,5.59145714 C8.95376429,8.93467143 11.5411214,10.9995286 14.5071929,10.9995286 C17.4732643,10.9995286 20.0606214,8.93467143 20.0606214,5.59145714 L20.0606214,5.59145714 Z M18.17805,5.59145714 C18.17805,8.64474286 17.1707643,10.7669571 14.5134786,10.7991714 C11.5293357,10.8361 10.8489071,8.64474286 10.8489071,5.59145714 C10.8489071,2.53738571 11.8624786,0.201457143 14.5134786,0.201457143 C17.2336214,0.201457143 18.17805,2.53738571 18.17805,5.59145714 L18.17805,5.59145714 Z M7.89619286,10.7166714 L8.70783571,7.30352857 L8.55069286,7.30352857 C7.76340714,8.8781 6.58640714,10.4456 4.92383571,10.4456 L2.73876429,10.4456 L2.73876429,2.20974286 C2.73876429,1.2276 3.00983571,0.679957143 3.72169286,0.384528571 L3.72169286,0.308314286 L-0.000235714286,0.308314286 L-0.000235714286,0.364885714 C0.711621429,0.6611 1.17126429,1.23388571 1.17126429,2.20974286 L1.17126429,8.81524286 C1.17126429,9.79738571 0.761907143,10.3513143 0.05005,10.6475286 L0.05005,10.7166714 L7.89619286,10.7166714 Z M7.97162143,1.60552857 C7.97162143,0.818242857 7.59997857,0.308314286 6.93840714,0.308314286 C6.39076429,0.308314286 5.94997857,0.767957143 5.94997857,1.34074286 C5.94997857,1.73752857 6.14562143,2.02117143 6.39076429,2.19717143 C6.83155,2.50595714 7.02719286,2.90274286 7.02719286,3.27438571 C7.02719286,3.67117143 6.45990714,4.27538571 6.29647857,4.40738571 C6.12047857,4.54567143 5.83683571,4.69731429 5.61683571,4.78531429 L5.96883571,4.78531429 C6.98319286,4.5716 7.97162143,2.59395714 7.97162143,1.60552857 L7.97162143,1.60552857 Z" id="Fill-1" fill="#000000"></path>
                    <g id="Group-5">
                        <mask id="mask-2" fill="white">
                            <use xlink:href="#path-1"></use>
                        </mask>
                        <g id="Clip-4"></g>
                        <polygon id="Fill-3" fill="#000000" mask="url(#mask-2)" points="-3.92857143 14.9285714 40.1586429 14.9285714 40.1586429 -3.92857143 -3.92857143 -3.92857143"></polygon>
                    </g>
                </g>
            </g>
        </g>
    </g>
</svg>