<svg xmlns="http://www.w3.org/2000/svg" width="148" height="67" viewBox="0 0 148 67">
  <g fill="none" fill-rule="evenodd">
    <rect width="148" height="67" fill="#FFF"/>
    <g fill="#1A1919" transform="translate(31 15)">
      <path d="M19.8109531,18.3929101 C19.8115538,18.4047238 19.8123547,18.4163373 19.8129554,18.4283512 C19.8123547,18.4163373 19.8115538,18.4047238 19.8109531,18.3929101 Z M85.0313177,25.2068047 C84.5469565,23.933129 83.8305265,22.4706346 82.5868856,22.4706346 C82.4174893,22.4706346 82.2390826,22.4974657 82.0396516,22.5549323 C80.3963476,23.1301988 78.6817611,23.4101231 76.8003813,23.4101231 C72.8145633,23.4101231 70.7071216,21.9778637 70.7071216,19.2685246 L70.6316342,1.15473789 L70.6316342,0.520603173 L70.4179866,0.452724529 C70.0509614,0.339192991 69.4726914,0.20223431 68.790501,0.20223431 C67.7773272,0.20223431 66.8578619,0.497776727 66.0559327,1.08045182 L65.9295864,1.1717576 L65.9295864,17.0361382 L58.5334171,17.0361382 L50.1242742,0.547634492 L50.071413,0.445716409 L49.9666917,0.403267227 C49.6835636,0.289335225 49.1026906,0.0971125151 48.3812548,0.0971125151 C46.5945847,0.0971125151 45.0734223,1.27367569 43.9875642,3.49524961 L37.2329383,17.0361382 L29.0128144,17.0361382 L28.9579508,0.897840242 L28.9349241,0.487965359 L28.7214768,0.420887643 C28.3550523,0.306154712 27.7775832,0.169996959 27.0939912,0.169996959 C26.0812178,0.169996959 25.1599504,0.46493868 24.3598234,1.04821447 L24.2328763,1.13952025 L24.2328763,17.0361382 L19.6405556,17.0361382 C19.010826,14.1479919 16.6863329,12.6536606 11.6390851,11.6446916 L11.5083336,11.6186614 C6.96206629,10.7220226 4.21848756,10.1809958 4.21848756,7.31006948 C4.21848756,3.86427717 8.65322567,3.86427717 10.1121159,3.86427717 C11.5249529,3.86427717 13.0349023,4.01785511 14.2477075,4.28436389 C16.0666149,4.70705362 16.8062718,3.06615246 17.3677223,1.51715779 L17.4824553,1.20119171 L17.1546755,1.1178952 C14.8488039,0.528211989 12.6951086,0.241680012 10.5742514,0.241680012 C3.75595166,0.241680012 0,2.89315202 0,7.70853114 C0,10.100102 0.928475737,11.865147 2.83928962,13.1061849 C4.59512393,14.2344922 7.01432683,14.7717146 9.82057817,15.3940356 L10.2024206,15.478934 C13.2257234,16.146107 15.4100542,16.6290665 15.4100542,19.2821404 C15.4100542,20.5259815 14.781526,23.4213361 8.95417435,23.4213361 C7.07339527,23.4213361 5.34879714,23.1386085 3.66364472,22.5507274 C3.50586191,22.5062759 3.33025845,22.4820478 3.16767008,22.4820478 C1.93103731,22.4820478 1.23883532,23.8650502 0.723037715,25.2186184 L0.616714529,25.5005451 L0.896438618,25.6116738 C3.31043549,26.5619748 6.15593229,27.0441335 9.35143462,27.0441335 C13.5665182,27.0441335 18.4928259,25.9448598 19.5957037,21.0734158 L24.2328763,21.0734158 L24.2328763,26.2836524 L29.0442508,26.2836524 L29.0264302,21.0734158 L35.2190049,21.0734158 L32.6726547,26.1781301 L37.1480399,26.1781301 L47.4922247,5.02221877 L53.2098492,16.6841303 L53.4016714,17.0419449 L45.7900526,17.0361382 L46.3933516,17.0361382 L44.7750766,17.0353372 L43.0160386,20.6220929 L42.8770776,21.0602005 L55.3693512,21.087432 L57.8668448,26.1781301 L63.195819,26.1781301 L60.5924027,21.0734158 L66.1636575,21.0734158 C67.2723421,25.9350485 72.1952458,27.0327202 76.403121,27.0327202 C79.6002252,27.0327202 82.4443204,26.5509621 84.8571159,25.5994597 L85.1378411,25.4885311 L85.0313177,25.2068047 L85.0313177,25.2068047 Z"/>
      <polyline points="53.398 17.036 46.393 17.036 53.402 17.042 53.398 17.036"/>
      <path fill-rule="nonzero" d="M2.02822992,36.694992 L2.02822992,32.1657444 L0.850865817,32.1657444 L0.850865817,36.694992 L2.02822992,36.694992 Z M4.16670757,36.694992 L4.16670757,33.9257836 L6.34122698,36.694992 L7.51258412,36.694992 L7.51258412,32.1657444 L6.34122698,32.1657444 L6.34122698,34.9349528 L4.16670757,32.1657444 L2.98934347,32.1657444 L2.98934347,36.694992 L4.16670757,36.694992 Z M9.86130536,36.8211382 C10.1376255,36.8211382 10.384912,36.7840953 10.6031649,36.7100094 C10.8214177,36.6359236 11.0056312,36.531803 11.1558052,36.3976475 C11.3059792,36.2634921 11.4201114,36.1023053 11.4982019,35.9140873 C11.5762924,35.7258692 11.6153376,35.5156256 11.6153376,35.2833565 C11.6153376,34.9389575 11.5262344,34.6596339 11.3480279,34.4453856 C11.1698214,34.2311374 10.8884955,34.0599391 10.50405,33.9317906 C10.4079387,33.8997535 10.3108262,33.8697187 10.2127125,33.8416862 C10.1145988,33.8136537 10.0264967,33.7806154 9.94840627,33.7425713 C9.8703158,33.7045273 9.80724272,33.6594751 9.75918704,33.6074148 C9.71113137,33.5553544 9.68710353,33.4892779 9.68710353,33.4091851 C9.68710353,33.2930505 9.7351592,33.1989415 9.83127056,33.126858 C9.92738191,33.0547745 10.0515257,33.0187327 10.2037021,33.0187327 C10.3238413,33.0187327 10.4479851,33.0437617 10.5761336,33.0938197 C10.704282,33.1438777 10.8324305,33.220967 10.960579,33.3250877 L10.960579,33.3250877 L11.4291218,32.4060228 C11.204862,32.2858836 10.9705906,32.1947781 10.7263076,32.1327062 C10.4820245,32.0706342 10.2477531,32.0395983 10.0234933,32.0395983 C9.78321488,32.0395983 9.56596317,32.07564 9.37173814,32.1477236 C9.17751311,32.2198071 9.01332288,32.3209242 8.87916745,32.451075 C8.74501202,32.5812258 8.64089138,32.7374068 8.56680554,32.9196179 C8.49271971,33.101829 8.45567679,33.3050645 8.45567679,33.5293243 C8.45567679,33.7535841 8.49071739,33.9387987 8.56079858,34.0849681 C8.63087978,34.2311374 8.7229865,34.3522778 8.83711873,34.4483891 C8.95125096,34.5445005 9.08140176,34.6215898 9.22757111,34.6796571 C9.37374046,34.7377243 9.5229133,34.7907858 9.67508961,34.8388415 C9.80323808,34.8828925 9.91236452,34.9229389 10.0024689,34.9589807 C10.0925733,34.9950224 10.165658,35.0340677 10.2217229,35.0761164 C10.2777879,35.1181651 10.3178343,35.1642185 10.3418621,35.2142765 C10.36589,35.2643345 10.3779039,35.3234029 10.3779039,35.3914818 C10.3779039,35.5036117 10.3308494,35.6037277 10.2367403,35.6918298 C10.1426313,35.7799318 9.99946543,35.8239829 9.80724272,35.8239829 C9.63904785,35.8239829 9.46885066,35.7859388 9.29665115,35.7098506 C9.12445164,35.6337625 8.9502498,35.5176279 8.77404565,35.361447 L8.77404565,35.361447 L8.26946104,36.3105466 C8.75802709,36.650941 9.28864187,36.8211382 9.86130536,36.8211382 Z M13.5435717,36.694992 L13.5435717,35.1932521 L14.240379,35.1932521 C14.7489682,35.1932521 15.1384194,35.061099 15.4087326,34.7967928 C15.6790458,34.5324865 15.8142024,34.160055 15.8142024,33.6794983 C15.8142024,33.1989415 15.6790458,32.82651 15.4087326,32.5622038 C15.1384194,32.2978975 14.7489682,32.1657444 14.240379,32.1657444 L14.240379,32.1657444 L12.3662076,32.1657444 L12.3662076,36.694992 L13.5435717,36.694992 Z M13.934024,34.2441525 L13.5435717,34.2441525 L13.5435717,33.1148441 L13.934024,33.1148441 C14.3665251,33.1148441 14.5827757,33.3030621 14.5827757,33.6794983 C14.5827757,34.0559344 14.3665251,34.2441525 13.934024,34.2441525 L13.934024,34.2441525 Z M17.6283042,36.694992 L17.6283042,32.1657444 L16.4509401,32.1657444 L16.4509401,36.694992 L17.6283042,36.694992 Z M19.7667819,36.694992 L19.7667819,34.9529737 L20.8900834,36.694992 L22.3557815,36.694992 L20.9321321,34.8388415 C21.2565079,34.7627533 21.5017921,34.6175851 21.6679846,34.4033369 C21.8341772,34.1890887 21.9172735,33.9097651 21.9172735,33.565366 C21.9172735,33.3731433 21.8862375,33.1929345 21.8241656,33.0247397 C21.7620937,32.8565448 21.669987,32.7083731 21.5478454,32.5802246 C21.4257039,32.4520762 21.2705241,32.350959 21.0823061,32.2768732 C20.894088,32.2027873 20.6738328,32.1657444 20.4215405,32.1657444 L20.4215405,32.1657444 L18.5894178,32.1657444 L18.5894178,36.694992 L19.7667819,36.694992 Z M19.9890394,34.1900898 L19.7667819,34.1900898 L19.7667819,33.0727953 L19.9890394,33.0727953 C20.2213085,33.0727953 20.399515,33.120851 20.5236588,33.2169624 C20.6478026,33.3130737 20.7098746,33.4512338 20.7098746,33.6314426 C20.7098746,33.8116514 20.6478026,33.9498115 20.5236588,34.0459228 C20.399515,34.1420342 20.2213085,34.1900898 19.9890394,34.1900898 L19.9890394,34.1900898 Z M25.4373518,36.694992 L25.4373518,35.6978367 L24.0377302,35.6978367 L24.0377302,34.916932 L25.3592614,34.916932 L25.3592614,33.9197767 L24.0377302,33.9197767 L24.0377302,33.1628997 L25.4373518,33.1628997 L25.4373518,32.1657444 L22.8603661,32.1657444 L22.8603661,36.694992 L25.4373518,36.694992 Z M29.5280914,36.694992 L29.5280914,34.916932 L30.8195877,34.916932 L30.8195877,33.9197767 L29.5280914,33.9197767 L29.5280914,33.1628997 L30.9457339,33.1628997 L30.9457339,32.1657444 L28.3507273,32.1657444 L28.3507273,36.694992 L29.5280914,36.694992 Z M33.9552207,36.8211382 C34.3196429,36.8211382 34.6560327,36.7600674 34.9643899,36.6379259 C35.2727472,36.5157844 35.5380546,36.3465884 35.7603121,36.1303378 C35.9825696,35.9140873 36.1557703,35.6607938 36.2799141,35.3704574 C36.4040579,35.080121 36.4661298,34.766758 36.4661298,34.4303682 C36.4661298,34.0939785 36.4040579,33.7806154 36.2799141,33.490279 C36.1557703,33.1999427 35.9825696,32.9466492 35.7603121,32.7303986 C35.5380546,32.5141481 35.2727472,32.3449521 34.9643899,32.2228105 C34.6560327,32.100669 34.3196429,32.0395983 33.9552207,32.0395983 C33.5867938,32.0395983 33.2494029,32.100669 32.943048,32.2228105 C32.636693,32.3449521 32.373388,32.5141481 32.1531328,32.7303986 C31.9328776,32.9466492 31.7606781,33.1999427 31.6365342,33.490279 C31.5123904,33.7806154 31.4503185,34.0939785 31.4503185,34.4303682 C31.4503185,34.766758 31.5123904,35.080121 31.6365342,35.3704574 C31.7606781,35.6607938 31.9328776,35.9140873 32.1531328,36.1303378 C32.373388,36.3465884 32.636693,36.5157844 32.943048,36.6379259 C33.2494029,36.7600674 33.5867938,36.8211382 33.9552207,36.8211382 Z M33.9552207,35.6798159 C33.7830212,35.6798159 33.6198321,35.6487799 33.4656535,35.586708 C33.3114748,35.5246361 33.1763182,35.4375351 33.0601837,35.3254052 C32.9440491,35.2132753 32.8519424,35.0811222 32.7838635,34.9289459 C32.7157847,34.7767696 32.6817452,34.610577 32.6817452,34.4303682 C32.6817452,34.2501594 32.7157847,34.0839669 32.7838635,33.9317906 C32.8519424,33.7796143 32.9440491,33.6474612 33.0601837,33.5353312 C33.1763182,33.4232013 33.3114748,33.3361004 33.4656535,33.2740285 C33.6198321,33.2119566 33.7830212,33.1809206 33.9552207,33.1809206 C34.1274202,33.1809206 34.2906093,33.2119566 34.4447879,33.2740285 C34.5989665,33.3361004 34.7351243,33.4232013 34.8532612,33.5353312 C34.971398,33.6474612 35.0645059,33.7796143 35.1325848,33.9317906 C35.2006637,34.0839669 35.2347031,34.2501594 35.2347031,34.4303682 C35.2347031,34.610577 35.2006637,34.7767696 35.1325848,34.9289459 C35.0645059,35.0811222 34.971398,35.2132753 34.8532612,35.3254052 C34.7351243,35.4375351 34.5989665,35.5246361 34.4447879,35.586708 C34.2906093,35.6487799 34.1274202,35.6798159 33.9552207,35.6798159 Z M39.5236723,36.8211382 C39.8880945,36.8211382 40.2244843,36.7600674 40.5328416,36.6379259 C40.8411988,36.5157844 41.1065062,36.3465884 41.3287637,36.1303378 C41.5510212,35.9140873 41.7242219,35.6607938 41.8483657,35.3704574 C41.9725096,35.080121 42.0345815,34.766758 42.0345815,34.4303682 C42.0345815,34.0939785 41.9725096,33.7806154 41.8483657,33.490279 C41.7242219,33.1999427 41.5510212,32.9466492 41.3287637,32.7303986 C41.1065062,32.5141481 40.8411988,32.3449521 40.5328416,32.2228105 C40.2244843,32.100669 39.8880945,32.0395983 39.5236723,32.0395983 C39.1552455,32.0395983 38.8178546,32.100669 38.5114996,32.2228105 C38.2051447,32.3449521 37.9418396,32.5141481 37.7215844,32.7303986 C37.5013292,32.9466492 37.3291297,33.1999427 37.2049859,33.490279 C37.0808421,33.7806154 37.0187701,34.0939785 37.0187701,34.4303682 C37.0187701,34.766758 37.0808421,35.080121 37.2049859,35.3704574 C37.3291297,35.6607938 37.5013292,35.9140873 37.7215844,36.1303378 C37.9418396,36.3465884 38.2051447,36.5157844 38.5114996,36.6379259 C38.8178546,36.7600674 39.1552455,36.8211382 39.5236723,36.8211382 Z M39.5236723,35.6798159 C39.3514728,35.6798159 39.1882837,35.6487799 39.0341051,35.586708 C38.8799265,35.5246361 38.7447699,35.4375351 38.6286353,35.3254052 C38.5125008,35.2132753 38.4203941,35.0811222 38.3523152,34.9289459 C38.2842363,34.7767696 38.2501969,34.610577 38.2501969,34.4303682 C38.2501969,34.2501594 38.2842363,34.0839669 38.3523152,33.9317906 C38.4203941,33.7796143 38.5125008,33.6474612 38.6286353,33.5353312 C38.7447699,33.4232013 38.8799265,33.3361004 39.0341051,33.2740285 C39.1882837,33.2119566 39.3514728,33.1809206 39.5236723,33.1809206 C39.6958718,33.1809206 39.8590609,33.2119566 40.0132395,33.2740285 C40.1674182,33.3361004 40.3035759,33.4232013 40.4217128,33.5353312 C40.5398497,33.6474612 40.6329575,33.7796143 40.7010364,33.9317906 C40.7691153,34.0839669 40.8031547,34.2501594 40.8031547,34.4303682 C40.8031547,34.610577 40.7691153,34.7767696 40.7010364,34.9289459 C40.6329575,35.0811222 40.5398497,35.2132753 40.4217128,35.3254052 C40.3035759,35.4375351 40.1674182,35.5246361 40.0132395,35.586708 C39.8590609,35.6487799 39.6958718,35.6798159 39.5236723,35.6798159 Z M44.5334767,36.694992 C44.8458386,36.694992 45.1371762,36.6329201 45.4074893,36.5087763 C45.6778025,36.3846325 45.9140763,36.2184399 46.1163106,36.0101986 C46.3185449,35.8019574 46.4767282,35.5606778 46.5908604,35.28636 C46.7049926,35.0120422 46.7620588,34.7267116 46.7620588,34.4303682 C46.7620588,34.1300202 46.7039915,33.8426873 46.5878569,33.5683695 C46.4717224,33.2940517 46.3125379,33.0537733 46.1103036,32.8475344 C45.9080693,32.6412954 45.6717956,32.476104 45.4014824,32.3519602 C45.1311692,32.2278163 44.841834,32.1657444 44.5334767,32.1657444 L44.5334767,32.1657444 L42.7914584,32.1657444 L42.7914584,36.694992 L44.5334767,36.694992 Z M44.2391357,35.6978367 L43.9688225,35.6978367 L43.9688225,33.1628997 L44.2391357,33.1628997 C44.4393677,33.1628997 44.6195765,33.1949369 44.7797621,33.2590111 C44.9399477,33.3230853 45.0751042,33.4111874 45.1852318,33.5233173 C45.2953594,33.6354472 45.380458,33.7696027 45.4405276,33.9257836 C45.5005972,34.0819646 45.530632,34.2501594 45.530632,34.4303682 C45.530632,34.6145817 45.5015984,34.7837777 45.4435311,34.9379563 C45.3854638,35.092135 45.3013664,35.2252892 45.1912388,35.3374191 C45.0811112,35.4495491 44.9459546,35.5376511 44.785769,35.6017254 C44.6255834,35.6657996 44.4433723,35.6978367 44.2391357,35.6978367 L44.2391357,35.6978367 Z M51.4715152,36.694992 C51.7117935,36.694992 51.9280441,36.6669596 52.1202668,36.6108946 C52.3124895,36.5548296 52.4756786,36.4707322 52.609834,36.3586023 C52.7439895,36.2464724 52.8481101,36.1083123 52.9221959,35.9441221 C52.9962818,35.7799318 53.0333247,35.5917138 53.0333247,35.3794679 C53.0333247,35.2433101 53.0173061,35.1151616 52.985269,34.9950224 C52.9532319,34.8748833 52.9001704,34.766758 52.8260846,34.6706466 C52.7519987,34.5745353 52.6558874,34.4934413 52.5377505,34.4273648 C52.4196136,34.3612882 52.2764478,34.3122314 52.1082529,34.2801942 C52.2764478,34.1760736 52.4015927,34.0489263 52.4836879,33.8987523 C52.565783,33.7485783 52.6068305,33.5593591 52.6068305,33.3310946 C52.6068305,32.9546585 52.4987053,32.6663244 52.2824547,32.4660924 C52.0662042,32.2658604 51.7498376,32.1657444 51.3333551,32.1657444 L51.3333551,32.1657444 L49.5793229,32.1657444 L49.5793229,36.694992 L51.4715152,36.694992 Z M50.9729375,33.9438045 L50.756687,33.9438045 L50.756687,33.0667884 L50.9729375,33.0667884 C51.3413644,33.0667884 51.5255778,33.2129577 51.5255778,33.5052964 C51.5255778,33.7976351 51.3413644,33.9438045 50.9729375,33.9438045 L50.9729375,33.9438045 Z M51.0149862,35.7819342 L50.756687,35.7819342 L50.756687,34.8208206 L51.0149862,34.8208206 C51.3113296,34.8208206 51.5235755,34.8588647 51.6517239,34.9349528 C51.7798724,35.011041 51.8439467,35.1331825 51.8439467,35.3013774 C51.8439467,35.4695723 51.7798724,35.5917138 51.6517239,35.6678019 C51.5235755,35.7438901 51.3113296,35.7819342 51.0149862,35.7819342 L51.0149862,35.7819342 Z M55.7244426,36.8211382 C56.3932175,36.8211382 56.8887916,36.6589503 57.2111651,36.3345745 C57.5335386,36.0101986 57.6947254,35.4956024 57.6947254,34.7907858 L57.6947254,34.7907858 L57.6947254,32.1657444 L56.5233683,32.1657444 L56.5233683,34.6285979 C56.5233683,34.760751 56.5183625,34.8959076 56.5083509,35.0340677 C56.4983393,35.1722278 56.4673033,35.2973728 56.415243,35.4095027 C56.3631827,35.5216326 56.284091,35.6127381 56.1779681,35.6828193 C56.0718451,35.7529005 55.92067,35.7879411 55.7244426,35.7879411 C55.5282153,35.7879411 55.376039,35.7529005 55.2679137,35.6828193 C55.1597884,35.6127381 55.0806968,35.5216326 55.0306388,35.4095027 C54.9805808,35.2973728 54.950546,35.1722278 54.9405344,35.0340677 C54.9305228,34.8959076 54.925517,34.760751 54.925517,34.6285979 L54.925517,34.6285979 L54.925517,32.1657444 L53.7481529,32.1657444 L53.7481529,34.7907858 C53.7481529,35.4956024 53.9103408,36.0101986 54.2347166,36.3345745 C54.5590924,36.6589503 55.0556678,36.8211382 55.7244426,36.8211382 Z M60.0434466,36.8211382 C60.3197668,36.8211382 60.5670533,36.7840953 60.7853062,36.7100094 C61.003559,36.6359236 61.1877725,36.531803 61.3379465,36.3976475 C61.4881204,36.2634921 61.6022527,36.1023053 61.6803432,35.9140873 C61.7584336,35.7258692 61.7974789,35.5156256 61.7974789,35.2833565 C61.7974789,34.9389575 61.7083756,34.6596339 61.5301692,34.4453856 C61.3519627,34.2311374 61.0706367,34.0599391 60.6861913,33.9317906 C60.59008,33.8997535 60.4929675,33.8697187 60.3948538,33.8416862 C60.2967401,33.8136537 60.208638,33.7806154 60.1305476,33.7425713 C60.0524571,33.7045273 59.989384,33.6594751 59.9413283,33.6074148 C59.8932726,33.5553544 59.8692448,33.4892779 59.8692448,33.4091851 C59.8692448,33.2930505 59.9173005,33.1989415 60.0134118,33.126858 C60.1095232,33.0547745 60.233667,33.0187327 60.3858433,33.0187327 C60.5059825,33.0187327 60.6301264,33.0437617 60.7582748,33.0938197 C60.8864233,33.1438777 61.0145718,33.220967 61.1427203,33.3250877 L61.1427203,33.3250877 L61.6112631,32.4060228 C61.3870033,32.2858836 61.1527319,32.1947781 60.9084488,32.1327062 C60.6641658,32.0706342 60.4298944,32.0395983 60.2056346,32.0395983 C59.9653562,32.0395983 59.7481045,32.07564 59.5538794,32.1477236 C59.3596544,32.2198071 59.1954642,32.3209242 59.0613087,32.451075 C58.9271533,32.5812258 58.8230327,32.7374068 58.7489468,32.9196179 C58.674861,33.101829 58.6378181,33.3050645 58.6378181,33.5293243 C58.6378181,33.7535841 58.6728587,33.9387987 58.7429399,34.0849681 C58.8130211,34.2311374 58.9051278,34.3522778 59.01926,34.4483891 C59.1333922,34.5445005 59.263543,34.6215898 59.4097124,34.6796571 C59.5558817,34.7377243 59.7050546,34.7907858 59.8572309,34.8388415 C59.9853794,34.8828925 60.0945058,34.9229389 60.1846102,34.9589807 C60.2747146,34.9950224 60.3477993,35.0340677 60.4038642,35.0761164 C60.4599292,35.1181651 60.4999756,35.1642185 60.5240034,35.2142765 C60.5480313,35.2643345 60.5600452,35.3234029 60.5600452,35.3914818 C60.5600452,35.5036117 60.5129907,35.6037277 60.4188816,35.6918298 C60.3247726,35.7799318 60.1816067,35.8239829 59.989384,35.8239829 C59.8211891,35.8239829 59.6509919,35.7859388 59.4787924,35.7098506 C59.3065929,35.6337625 59.1323911,35.5176279 58.9561869,35.361447 L58.9561869,35.361447 L58.4516023,36.3105466 C58.9401684,36.650941 59.4707831,36.8211382 60.0434466,36.8211382 Z M63.7257129,36.694992 L63.7257129,32.1657444 L62.5483488,32.1657444 L62.5483488,36.694992 L63.7257129,36.694992 Z M65.8641906,36.694992 L65.8641906,33.9257836 L68.03871,36.694992 L69.2100671,36.694992 L69.2100671,32.1657444 L68.03871,32.1657444 L68.03871,34.9349528 L65.8641906,32.1657444 L64.6868265,32.1657444 L64.6868265,36.694992 L65.8641906,36.694992 Z M72.7481664,36.694992 L72.7481664,35.6978367 L71.3485448,35.6978367 L71.3485448,34.916932 L72.6700759,34.916932 L72.6700759,33.9197767 L71.3485448,33.9197767 L71.3485448,33.1628997 L72.7481664,33.1628997 L72.7481664,32.1657444 L70.1711807,32.1657444 L70.1711807,36.694992 L72.7481664,36.694992 Z M74.9947693,36.8211382 C75.2710895,36.8211382 75.518376,36.7840953 75.7366288,36.7100094 C75.9548817,36.6359236 76.1390951,36.531803 76.2892691,36.3976475 C76.4394431,36.2634921 76.5535754,36.1023053 76.6316658,35.9140873 C76.7097563,35.7258692 76.7488015,35.5156256 76.7488015,35.2833565 C76.7488015,34.9389575 76.6596983,34.6596339 76.4814918,34.4453856 C76.3032854,34.2311374 76.0219594,34.0599391 75.637514,33.9317906 C75.5414027,33.8997535 75.4442901,33.8697187 75.3461765,33.8416862 C75.2480628,33.8136537 75.1599607,33.7806154 75.0818702,33.7425713 C75.0037798,33.7045273 74.9407067,33.6594751 74.892651,33.6074148 C74.8445953,33.5553544 74.8205675,33.4892779 74.8205675,33.4091851 C74.8205675,33.2930505 74.8686232,33.1989415 74.9647345,33.126858 C75.0608459,33.0547745 75.1849897,33.0187327 75.337166,33.0187327 C75.4573052,33.0187327 75.581449,33.0437617 75.7095975,33.0938197 C75.837746,33.1438777 75.9658945,33.220967 76.0940429,33.3250877 L76.0940429,33.3250877 L76.5625858,32.4060228 C76.338326,32.2858836 76.1040545,32.1947781 75.8597715,32.1327062 C75.6154885,32.0706342 75.3812171,32.0395983 75.1569572,32.0395983 C74.9166788,32.0395983 74.6994271,32.07564 74.5052021,32.1477236 C74.3109771,32.2198071 74.1467868,32.3209242 74.0126314,32.451075 C73.878476,32.5812258 73.7743553,32.7374068 73.7002695,32.9196179 C73.6261837,33.101829 73.5891407,33.3050645 73.5891407,33.5293243 C73.5891407,33.7535841 73.6241813,33.9387987 73.6942625,34.0849681 C73.7643437,34.2311374 73.8564505,34.3522778 73.9705827,34.4483891 C74.0847149,34.5445005 74.2148657,34.6215898 74.3610351,34.6796571 C74.5072044,34.7377243 74.6563773,34.7907858 74.8085536,34.8388415 C74.936702,34.8828925 75.0458285,34.9229389 75.1359329,34.9589807 C75.2260373,34.9950224 75.2991219,35.0340677 75.3551869,35.0761164 C75.4112519,35.1181651 75.4512983,35.1642185 75.4753261,35.2142765 C75.4993539,35.2643345 75.5113679,35.3234029 75.5113679,35.3914818 C75.5113679,35.5036117 75.4643133,35.6037277 75.3702043,35.6918298 C75.2760953,35.7799318 75.1329294,35.8239829 74.9407067,35.8239829 C74.7725118,35.8239829 74.6023146,35.7859388 74.4301151,35.7098506 C74.2579156,35.6337625 74.0837138,35.5176279 73.9075096,35.361447 L73.9075096,35.361447 L73.402925,36.3105466 C73.8914911,36.650941 74.4221058,36.8211382 74.9947693,36.8211382 Z M78.8872792,36.8211382 C79.1635993,36.8211382 79.4108859,36.7840953 79.6291387,36.7100094 C79.8473916,36.6359236 80.031605,36.531803 80.181779,36.3976475 C80.331953,36.2634921 80.4460852,36.1023053 80.5241757,35.9140873 C80.6022662,35.7258692 80.6413114,35.5156256 80.6413114,35.2833565 C80.6413114,34.9389575 80.5522082,34.6596339 80.3740017,34.4453856 C80.1957953,34.2311374 79.9144693,34.0599391 79.5300239,33.9317906 C79.4339125,33.8997535 79.3368,33.8697187 79.2386863,33.8416862 C79.1405727,33.8136537 79.0524706,33.7806154 78.9743801,33.7425713 C78.8962896,33.7045273 78.8332166,33.6594751 78.7851609,33.6074148 C78.7371052,33.5553544 78.7130774,33.4892779 78.7130774,33.4091851 C78.7130774,33.2930505 78.761133,33.1989415 78.8572444,33.126858 C78.9533558,33.0547745 79.0774996,33.0187327 79.2296759,33.0187327 C79.3498151,33.0187327 79.4739589,33.0437617 79.6021074,33.0938197 C79.7302559,33.1438777 79.8584044,33.220967 79.9865528,33.3250877 L79.9865528,33.3250877 L80.4550957,32.4060228 C80.2308359,32.2858836 79.9965644,32.1947781 79.7522814,32.1327062 C79.5079984,32.0706342 79.2737269,32.0395983 79.0494671,32.0395983 C78.8091887,32.0395983 78.591937,32.07564 78.397712,32.1477236 C78.203487,32.2198071 78.0392967,32.3209242 77.9051413,32.451075 C77.7709859,32.5812258 77.6668652,32.7374068 77.5927794,32.9196179 C77.5186935,33.101829 77.4816506,33.3050645 77.4816506,33.5293243 C77.4816506,33.7535841 77.5166912,33.9387987 77.5867724,34.0849681 C77.6568536,34.2311374 77.7489603,34.3522778 77.8630926,34.4483891 C77.9772248,34.5445005 78.1073756,34.6215898 78.253545,34.6796571 C78.3997143,34.7377243 78.5488871,34.7907858 78.7010634,34.8388415 C78.8292119,34.8828925 78.9383384,34.9229389 79.0284428,34.9589807 C79.1185471,34.9950224 79.1916318,35.0340677 79.2476968,35.0761164 C79.3037617,35.1181651 79.3438081,35.1642185 79.367836,35.2142765 C79.3918638,35.2643345 79.4038777,35.3234029 79.4038777,35.3914818 C79.4038777,35.5036117 79.3568232,35.6037277 79.2627142,35.6918298 C79.1686051,35.7799318 79.0254393,35.8239829 78.8332166,35.8239829 C78.6650217,35.8239829 78.4948245,35.7859388 78.322625,35.7098506 C78.1504255,35.6337625 77.9762236,35.5176279 77.8000195,35.361447 L77.8000195,35.361447 L77.2954349,36.3105466 C77.7840009,36.650941 78.3146157,36.8211382 78.8872792,36.8211382 Z"/>
    </g>
  </g>
</svg>
