<?xml version="1.0" encoding="UTF-8"?>
<svg width="238px" height="147px" viewBox="0 0 238 147" version="1.1" xmlns="http://www.w3.org/2000/svg" xmlns:xlink="http://www.w3.org/1999/xlink">
    <!-- Generator: Sketch 61 (89581) - https://sketch.com -->
    <title>illu-asso</title>
    <desc>Created with Sketch.</desc>
    <g id="reality" stroke="none" stroke-width="1" fill="none" fill-rule="evenodd">
        <g id="municipales---pourquoi-cette-consultation---desktop" transform="translate(-992.000000, -1034.000000)">
            <g id="Group-14" transform="translate(150.000000, 745.000000)">
                <g id="je-suis-une-asso" transform="translate(780.000000, 24.000000)">
                    <g id="illu-asso" transform="translate(54.000000, 255.000000)">
                        <g id="A-Human/Standing">
                            <g id="Head/Front/Short-1" transform="translate(30.340000, 0.000000)">
                                <g id="Head" stroke-width="1" transform="translate(19.980000, 11.424883)" fill="#D4A181">
                                    <path d="M14.1130363,3.36626166 C16.2571163,7.34695678 16.0023438,17.4443201 13.2313115,18.1557813 C12.126159,18.4395287 9.7717779,17.7444004 7.37564103,16.305732 L8.88,26.9037559 L0,26.9037559 L3.05769793,12.7119176 C1.35241108,10.7184112 0.198160122,8.27523802 0.391007244,5.53754991 C0.946582182,-2.34947941 11.9689563,-0.614433452 14.1130363,3.36626166 Z"></path>
                                </g>
                                <path d="M21.0273735,14.9466121 C23.0493325,6.65473409 34.5092408,11.8011831 36.7139917,10.4028264 C37.1958626,13.4113016 35.6417479,15.8371417 30.1778885,15.3685614 C28.9715862,16.0398874 28.1139226,17.2982269 27.081414,18.9488096 C26.8307411,18.849915 26.5567181,18.7957746 26.27,18.7957746 C25.0439279,18.7957746 24.05,19.7857929 24.05,21.0070423 C24.05,21.6270223 24.3061542,22.1874096 24.7187956,22.5889292 C24.2056665,23.3103764 23.6297402,24.0651696 22.9697429,24.8440302 C20.5343223,23.3886244 18.7162444,19.1765875 20.9535538,15.0788512 Z" id="Hair" fill="#191847"></path>
                            </g>
                            <g id="Bottom/Standing/Skinny-Jeans" transform="translate(0.000000, 68.917840)">
                                <polygon id="Leg" fill="#DB2721" points="47.36 3.66613365e-14 60.774336 46.8887905 70.5615742 81.4483568 77.7 81.4483568 67.2996604 3.66613365e-14"></polygon>
                                <path d="M43.7726066,0 C43.4623343,24.1670264 42.4043115,37.3483792 42.0785383,39.5440587 C41.7527651,41.7397381 36.8269036,55.7078375 27.3009537,81.4483568 L34.6958793,81.4483568 C46.8231423,56.7547267 53.5928908,42.7866273 55.0051248,39.5440587 C56.4173587,36.30149 60.7756505,23.1201371 67.34,0 L43.7726066,0 Z" id="Leg" fill="#FF4133"></path>
                                <g id="Accessories/Shoe/Flat-Pointy" transform="translate(26.640000, 73.340376)" fill="#191847">
                                    <path d="M0,14.741784 L0.37,7.00234742 L8.14,7.00234742 C11.8243132,9.58215962 16.6343132,11.670579 22.57,13.2676056 L22.57,14.741784 L8.51,14.741784 L3.7,14.0046948 L3.7,14.741784 L0,14.741784 Z" id="Shoe"></path>
                                </g>
                                <g id="Accessories/Shoe/Flat-Pointy" transform="translate(69.560000, 73.340376)" fill="#191847">
                                    <path d="M0,14.741784 L0.37,7.00234742 L8.14,7.00234742 C11.8243132,9.58215962 16.6343132,11.670579 22.57,13.2676056 L22.57,14.741784 L8.51,14.741784 L3.7,14.0046948 L3.7,14.741784 L0,14.741784 Z" id="Shoe"></path>
                                </g>
                            </g>
                            <g id="Body/Trench-Coat" transform="translate(8.140000, 30.220657)">
                                <path d="M20.1186788,25.9611058 L26.536655,27.5862067 C17.9453943,41.9728088 13.3510901,49.5759644 12.7537424,50.3956734 C11.4097103,52.2400188 12.3858874,55.7997072 12.7175397,57.6647415 C9.99591169,58.1479767 11.268447,54.1712239 7.82150559,54.8354674 C4.67529728,55.441758 1.93821385,57.2763269 -0.81786293,54.4655495 C-1.15670638,54.119981 -1.3635749,53.0843209 -0.122047498,52.6234842 C2.97105001,51.4753721 7.56798763,49.2631834 8.34247161,48.3515867 C9.3986189,47.1084618 13.3240213,39.6449682 20.1186788,25.9611058 L20.1186788,25.9611058 Z M73.1464009,33.259027 L84.3154506,42.6906917 C87.4484435,43.7713704 90.0413325,45.0250159 92.0941175,46.4516281 C92.567957,46.9462178 93.1143047,47.9190599 91.0267277,47.6121018 C88.9391507,47.3051436 86.7294734,47.0757864 86.3898112,47.768689 C86.0501489,48.4615915 87.2604012,49.4028157 86.6074448,50.3241641 C86.1721405,50.9383963 84.4412339,49.2016455 81.4147248,45.1139116 L70.0938356,39.4861842 L73.1464009,33.259027 Z" id="Skin" fill="#D4A181" transform="translate(45.726913, 41.833349) rotate(-4.000000) translate(-45.726913, -41.833349) "></path>
                                <path d="M51.15774,0.752363264 C56.6741072,12.1102242 64.1397863,23.0066933 75.2300119,32.3144296 C76.7483551,32.2048232 78.3995352,32.4554283 80.1697777,33.0495436 C81.0411964,33.3420026 81.5095998,34.2827332 81.2159859,35.1507242 C81.0455633,35.6545332 80.6558752,36.0231003 80.1884704,36.1864997 C80.5260078,36.4327212 80.8680872,36.6777603 81.2132087,36.9214139 L78.2357536,42.9758472 C65.7064686,36.7533052 53.9301394,32.0618473 48.563927,21.7889309 C46.7628874,18.3410746 47.372488,6.62947608 47.2005796,2.36884573 L51.15774,0.752363264 Z" id="Back-Arm" fill="#2026A2"></path>
                                <path d="M33.3,41.9808216 C44.9321806,43.2536542 54.0879828,43.2536542 60.7674065,41.9808216 C61.5949423,41.8231261 61.5586012,38.2698191 61.1748325,37.2993775 C55.1985548,22.1870757 51.2673117,11.1241622 51.2673117,0.627497798 C50.17074,1.19803897 48.2516361,1.2835417 45.51,0.884005976 C38.1418946,11.7011562 34.755039,24.1125983 33.3,41.9808216 Z" id="Shirt" fill="#F2F2F2"></path>
                                <path d="M46.7489171,-6.63006426e-15 C45.51,16.3194278 62.6223675,51.9481675 56.6805194,82.3763933 C45.697907,84.8193565 30.0188069,77.2184841 14.7566408,83.2910798 C15.3245787,71.0366084 26.7016608,56.6402703 31.1394345,43.7653431 C30.7444075,43.3947935 30.5390403,42.8392402 30.639604,42.2666629 C30.6397332,42.2659271 30.6398629,42.2651914 30.6399931,42.2644558 L30.8305971,41.1877393 C30.9615503,40.4479876 31.5616555,39.909034 32.2707878,39.8230398 C32.3982427,39.2705932 32.5054313,38.7208429 32.5939427,38.1751218 C33.3409404,33.5694738 32.0645374,29.0534916 32.1246324,24.6187787 C26.1761413,29.6738875 20.8382023,38.4051268 16.112741,50.8116279 L16.112741,50.8116279 L9.12463002,48.7634177 C9.39140536,47.7762159 9.66774268,46.8011454 9.95364197,45.8382062 C9.14776429,45.3858352 8.20373437,43.2916634 8.8824435,42.941402 C9.58303724,42.5798466 10.3252373,42.3253811 11.1068569,42.1756206 C17.5143169,22.9523364 27.992364,8.89398788 42.5409994,-1.54067682e-13 L42.5409994,-1.54067682e-13 Z" id="Coat-Front" fill="#1F28CF"></path>
                                <polygon id="Shade-Lapel" fill-opacity="0.1" fill="#000000" points="44.0691308 0.368544601 42.1602433 6.21566874 46.0043187 10.5989902 42.5302433 14.0435787 50.9350329 28.3779343 40.656927 14.0722166 44.0691308 10.5989902 40.656927 6.72537077"></polygon>
                                <path d="M50.69,47.9107981 C51.5073814,47.9107981 52.17,48.5708103 52.17,49.3849765 C52.17,50.1991428 51.5073814,50.8591549 50.69,50.8591549 C49.8726186,50.8591549 49.21,50.1991428 49.21,49.3849765 C49.21,48.5708103 49.8726186,47.9107981 50.69,47.9107981 Z M50.32,39.4342723 C51.1373814,39.4342723 51.8,40.0942845 51.8,40.9084507 C51.8,41.722617 51.1373814,42.3826291 50.32,42.3826291 C49.5026186,42.3826291 48.84,41.722617 48.84,40.9084507 C48.84,40.0942845 49.5026186,39.4342723 50.32,39.4342723 Z M48.47,30.9577465 C49.2873814,30.9577465 49.95,31.6177586 49.95,32.4319249 C49.95,33.2460911 49.2873814,33.9061033 48.47,33.9061033 C47.6526186,33.9061033 46.99,33.2460911 46.99,32.4319249 C46.99,31.6177586 47.6526186,30.9577465 48.47,30.9577465 Z" id="Buttons" fill-opacity="0.4" fill="#000000"></path>
                            </g>
                        </g>
                        <g id="A-Human/Sitting" transform="translate(208.282609, 80.000000) scale(-1, 1) translate(-208.282609, -80.000000) translate(143.000000, 3.000000)">
                            <g id="Head/Front/No-Hair" transform="translate(35.687826, 0.000000)" fill="#B28B67" stroke-width="1">
                                <g id="Head" transform="translate(23.501739, 13.524079)">
                                    <path d="M16.6006455,3.98477527 C19.1226479,8.69687939 18.8229685,20.6495223 15.5635051,21.4917067 C14.2637464,21.8275401 11.4949992,21.0049816 8.6769415,19.3024841 L10.4452174,31.8470255 L0,31.8470255 L3.59525403,15.0459414 C1.5901581,12.6864523 0.233141376,9.79496617 0.459927439,6.55501388 C1.11342981,-2.78117045 14.0786431,-0.72732885 16.6006455,3.98477527 Z"></path>
                                </g>
                            </g>
                            <g id="Bottom/Sitting/Skinny-Jeans-1" transform="translate(0.000000, 81.580737)">
                                <g id="Objects/Seat/Cube" transform="translate(4.352174, 18.322946)" stroke-width="1">
                                    <g id="Seat" transform="translate(23.936957, 0.000000)">
                                        <polygon id="Seat-Stuff" fill="#C5CFD6" points="12.021854 0 45.6443783 0 50.05 54.0963173 0 54.0963173"></polygon>
                                        <polygon id="Seat-Stuff" fill-opacity="0.1" fill="#000000" points="12.021854 0 22.3626887 0 28.5519032 54.0963173 0 54.0963173"></polygon>
                                    </g>
                                </g>
                                <path d="M112.26666,9.05604303 L112.311789,9.02772356 C115.901784,6.92101274 121.864982,9.68276254 121.860872,12.7555693 C121.848514,21.9888052 113.442321,65.5050127 113.003423,68.2559021 C112.564524,71.0067915 107.86282,71.7334052 107.589025,68.2649172 C107.15337,62.7459672 106.343977,43.6405119 107.153808,34.7973044 C107.488102,31.1468719 107.848119,27.6703287 108.202548,24.5687866 C103.791835,32.5534209 96.9698272,43.9860156 87.7368353,58.8662941 L82.7246302,56.5708638 C86.660559,43.5720091 89.8879615,34.3951635 92.4068377,29.0403271 C96.7197653,19.8715472 100.76384,12.0197096 102.46586,9.25396349 C105.143466,4.90291312 109.804508,6.42177399 112.26666,9.05604303 Z" id="Skin" fill="#B28B67"></path>
                                <path d="M90.8991459,53.7957107 L93.0929823,9.5249137 C94.6928202,1.87081241 108.286103,5.43412352 108.283668,9.53661321 C108.27814,18.8505348 102.718278,51.0207823 102.716631,53.7957107 L90.8991459,53.7957107 Z" id="LegLower" fill="#1F28CF" transform="translate(99.591407, 29.410050) rotate(20.000000) translate(-99.591407, -29.410050) "></path>
                                <g id="Accessories/Shoe/Flat-Simple" transform="translate(93.789348, 58.022663) rotate(30.000000) translate(-93.789348, -58.022663) translate(80.515217, 49.297450)" fill="#191847">
                                    <path d="M0,16.1416431 L0.431919606,9.16147309 C2.96074818,9.90286534 6.12815862,9.61202493 9.93415093,8.28895184 C13.7624878,11.0072461 18.5179254,12.9189972 24.2004637,14.0242051 C25.2847082,14.2350934 25.9927139,15.2849987 25.7818367,16.3692454 C25.771198,16.4239452 25.7582779,16.4781765 25.7431101,16.5317972 L25.4832567,17.4504249 L25.4832567,17.4504249 L9.93415093,17.4504249 L0.863839211,17.4504249 L0,16.1416431 Z" id="Shoe"></path>
                                </g>
                                <g id="Accessories/Shoe/Flat-Simple" transform="translate(105.322609, 54.968839)" fill="#191847">
                                    <path d="M0,16.1416431 L0.431919606,9.16147309 C2.96074818,9.90286534 6.12815862,9.61202493 9.93415093,8.28895184 C13.7624878,11.0072461 18.5179254,12.9189972 24.2004637,14.0242051 C25.2847082,14.2350934 25.9927139,15.2849987 25.7818367,16.3692454 C25.771198,16.4239452 25.7582779,16.4781765 25.7431101,16.5317972 L25.4832567,17.4504249 L25.4832567,17.4504249 L9.93415093,17.4504249 L0.863839211,17.4504249 L0,16.1416431 Z" id="Shoe"></path>
                                </g>
                                <path d="M123.066584,15.8942954 C123.066584,27.4844193 117.575545,54.5196181 117.57207,57.0716634 L105.757826,57.0807599 C107.487065,32.9575186 108.100241,20.7659589 107.597352,20.5060807 C106.843019,20.1162633 76.6747885,23.5253674 67.6268453,23.5253674 C54.5796665,23.5253674 49.1823099,15.2780203 48.7443478,-1.92188726e-13 L74.5903236,-1.92188726e-13 C79.8527963,0.564463195 107.302337,6.11430465 117.496552,8.02214045 C121.86087,8.83891762 123.066584,12.7015147 123.066584,15.8942954 Z" id="Leg-and-Butt" fill="#2B44FF"></path>
                            </g>
                            <g id="Body/Pregnant" transform="translate(9.574783, 35.773371)">
                                <path d="M49.2278783,-3.55271368e-14 L61.4098176,1.88812823 C61.4098176,8.75521328 66.8605873,15.1803173 70.308795,20.7084357 C75.669068,29.3019506 85.2071441,38.8270685 79.0917168,51.5937878 C73.5814036,63.0972559 59.2282363,64.9653483 36.0322149,57.1980647 C36.0322149,51.002122 41.1126448,44.7732727 41.2745459,37.2394458 C41.4286732,30.0673622 42.7665506,8.33676674 48.3502027,0.99705079 C48.4512471,0.66630067 48.5544418,0.333627419 48.6591453,4.26325641e-14 L48.6591453,4.26325641e-14 L49.0462149,0.183 L49.2278783,-3.55271368e-14 Z" id="Shirt" fill="#C1DEE2"></path>
                                <path d="M63.4821174,48.3321023 C64.2967876,44.1176971 64.8252833,41.3041095 65.0676047,39.8913395 C71.5575551,47.2427109 75.3068471,50.9610333 76.3154805,51.0463066 C78.2124107,51.2066796 79.6140886,49.5204888 80.0131985,49.9945281 C80.6728584,51.9577037 78.8096988,56.8718537 75.2483079,57.5864023 C73.5476721,57.9276136 70.9160366,54.41221 69.8317578,53.1666233 C69.4052924,52.6767127 67.2887456,51.0652057 63.4821174,48.3321023 L63.4821174,48.3321023 Z M74.692544,25.8625421 C76.3749004,25.8625421 77.2785831,26.5597269 78.2733173,27.9663307 C79.2680515,29.3729344 80.2093428,36.0067868 78.6122727,36.0067868 C77.0152026,36.0067868 70.323914,33.4423525 70.323914,31.7183331 C70.323914,29.9943136 74.8896606,29.2642073 74.8896606,27.9663307 C74.8896606,26.668454 73.0101875,25.8625421 74.692544,25.8625421 Z" id="Skin" fill="#B28B67"></path>
                                <path d="M60.0849762,54.7446892 L60.0465588,54.885801 C59.9591992,55.1992267 59.8703688,55.5177463 59.7800678,55.8413598 C40.7201811,42.4882677 40.710151,26.3064626 46.3781474,8.16871033 C42.1065004,26.0249568 43.8478839,41.084507 60.0849762,54.7446892 Z" id="Shade" fill-opacity="0.2" fill="#000000"></path>
                            </g>
                        </g>
                    </g>
                </g>
            </g>
        </g>
    </g>
</svg>