<?xml version="1.0" encoding="UTF-8"?>
<svg width="300px" height="300px" viewBox="0 0 300 300" version="1.1" xmlns="http://www.w3.org/2000/svg" xmlns:xlink="http://www.w3.org/1999/xlink">
    <!-- Generator: Sketch 59.1 (86144) - https://sketch.com -->
    <title>environnement/EDF</title>
    <desc>Created with Sketch.</desc>
    <g id="environnement/EDF" stroke="none" stroke-width="1" fill="none" fill-rule="evenodd">
        <g id="Plan-de-travail-1" transform="translate(0.000000, 50.000000)">
            <path d="M107.352073,74.337871 C107.626542,72.0262301 107.285998,68.6508251 109.100539,67.0654076 C109.608814,64.6003391 113.481869,65.1731351 112.882105,63.6030604 C112.511064,62.6211244 110.696523,63.0916354 109.964607,63.2706341 C109.410587,63.4036046 104.124527,65.0861929 102.091428,65.3163341 L99.5093907,64.5901106 C96.1954379,65.0401646 94.2792413,67.6944604 92.4342032,69.8066456 C90.9093783,71.5761761 88.7898717,75.9028315 90.4570136,78.5008705 C90.3655241,79.0685523 90.2689518,79.636234 90.1774623,80.2039158 L93.9488626,85.7477627 C95.2500465,86.6836704 95.42286,87.3792084 96.8206161,88.3048877 L97.6846836,89.6141357 C98.833385,90.3710447 102.208331,90.3812732 102.767433,89.8903052 C108.200893,90.4017302 107.611294,79.3242648 109.334346,77.0075095 C109.024607,75.9015062 108.318335,74.9503288 107.352073,74.337871 L107.352073,74.337871 Z M83.9256803,107.580496 C85.0794645,107.278755 87.0464886,107.125328 88.073204,106.608788 C89.7149321,105.78028 95.3567842,101.816736 93.5625736,98.5845301 C93.0085539,91.7825777 84.845658,97.5309946 81.3639745,95.1426399 C77.8467117,94.6874716 73.8974152,87.9826899 72.8402033,85.1289385 C72.6805718,84.5336246 72.4059587,83.975781 72.0320461,83.4872642 C72.0320461,83.3952077 71.6711709,83.7992335 71.6762536,83.7020627 C70.6597037,84.9090257 70.8274345,85.9625612 70.6597037,88.8981407 L69.2771958,88.8111984 C69.1907891,89.8749624 69.0840513,90.4579869 68.5859419,91.0000974 C68.4842869,91.1842104 68.3826319,91.3580949 68.2809769,91.5370937 C67.4067439,91.2455814 67.8438604,91.6649499 67.4880679,90.9284979 C64.2503564,91.0870397 64.4892456,94.3652739 63,96.2268609 C63.0762412,102.333275 75.1020269,109.876794 83.9256803,107.575382 L83.9256803,107.580496 Z M123.87101,89.0157684 C118.620529,89.8135914 115.413314,91.4961797 113.431042,92.8770271 C112.607434,93.4118496 111.898814,94.1074711 111.347115,94.9227271 C110.965656,95.6136202 110.841319,96.4186624 110.996405,97.1934541 C111.089017,98.1806343 111.577177,99.0872967 112.348416,99.7045508 C118.78826,99.2238113 129.975392,98.8146713 132.17114,104.261348 C132.288043,105.018257 132.455774,105.478539 132.476105,105.657538 C134.605777,105.146113 133.045373,105.314883 136.186512,105.81608 C136.908263,105.923479 138.682142,105.524567 139.86134,105.233055 C140.203668,105.136343 140.499714,104.918381 140.694911,104.619345 C140.644407,104.356514 140.620565,104.089201 140.623753,103.821522 C140.623753,103.821522 141.726709,103.90335 142.179074,103.550467 C145.157565,103.039042 143.592078,101.658194 145,100.072777 C144.13085,89.8698482 133.751875,87.5019504 123.87101,89.0106542 L123.87101,89.0157684 Z M112.368747,111.160471 C110.874419,112.306063 110.249241,112.024779 109.369925,113.799424 C109.283518,113.799424 109.507159,114.070479 109.410587,114.070479 C110.305151,115.860466 112.348416,116.581576 113.847827,117.839681 C114.320523,118.238593 115.586128,120.447949 116.185892,120.60649 C116.861898,121.419656 117.304097,123.67504 117.741214,123.67504 C118.203744,124.304093 117.705634,125.79234 118.157999,126.37025 C118.188496,129.02966 117.822538,129.218887 117.360007,129.730312 C117.360007,129.914425 117.614145,130.400279 117.614145,130.579278 C117.741214,130.707134 118.798426,131.469157 119.260956,131.377101 C120.699374,131.423129 126.600446,136.05664 127.073142,136.951633 C131.307072,137.268717 130.997025,135.969697 133.919606,134.72182 C134.707432,134.379166 135.337693,134.72182 135.856133,134.159253 C136.374574,133.596685 136.44065,132.502236 136.96444,131.934554 C137.035331,121.465684 122.864625,111.518468 112.368747,111.155356 L112.368747,111.160471 Z M95.7176595,113.548825 C95.1280605,114.177878 93.5066634,114.413134 93.0542986,115.129129 C92.3630447,116.223578 90.7721441,118.709104 89.5268704,119.89561 C85.5165809,123.726183 76.9318168,125.649141 72.6978863,121.992452 C72.4234178,121.992452 72.5809831,122.171451 72.9113618,123.219872 C73.2214095,125.199087 74.8123102,129.868397 74.2227112,131.03956 C74.6039174,132.359037 75.0054547,131.878297 75.7475361,132.609635 C76.2558111,133.12106 76.4438728,134.399623 77.0029753,134.747392 L78.9395029,134.614421 C79.0564061,134.972419 79.1783921,135.33553 79.2952954,135.708871 L81.7807599,135.524758 C82.2432902,135.632157 83.6512118,136.363495 84.0679973,136.476008 L86.8228476,136.281667 C88.9321887,136.844234 90.7670613,135.959469 92.5460237,134.747392 C93.5625736,134.082539 94.6197855,134.184824 95.504184,133.427915 C97.0038635,132.04806 98.2919426,130.452111 99.3264117,128.69212 C101.31885,125.040545 100.647927,116.31052 98.8181367,114.152307 C98.081138,113.380055 97.2424843,113.364712 95.7176595,113.548825 Z" id="Shape" fill="#FF5701"></path>
            <path d="M197.358312,89.0258565 C206.092397,89.0258565 212,94.6315449 212,104.663866 C212,117.271493 203.887232,121 195.382321,121 L184,121 C184.040742,120.301875 184,118.41435 184,116.097608 L184,93.9023917 C184,91.5649644 184.040742,90.0756303 184,89 L197.358312,89.0258565 Z M194.811932,114.928895 C199.634776,114.928895 203.556202,113.310278 203.556202,104.663866 C203.556202,97.3051067 199.634776,94.8383969 194.811932,94.8383969 L192.265551,94.8383969 L192.265551,114.882353 L194.811932,114.928895 Z" id="Shape" fill="#00327D" fill-rule="nonzero"></path>
            <path d="M225.364379,116.093644 C225.364379,118.432961 225.481756,121 225.481756,121 L217,121 C217,121 217.056137,118.412259 217.056137,116.093644 L217.056137,93.9063561 C217.056137,91.5670387 217,89 217,89 L237,89 L237,95.2105774 C237,95.2105774 232.529472,95.0967168 231.013779,95.0967168 L225.364379,95.0967168 L225.364379,101.540191 L231.034192,101.602297 C232.090584,101.602297 235.744578,101.540191 235.744578,101.540191 L235.744578,107.440239 C235.744578,107.440239 232.503955,107.347081 231.034192,107.347081 L225.364379,107.383309 L225.364379,116.093644 Z" id="Path" fill="#00327D" fill-rule="nonzero"></path>
            <path d="M167.907831,115.033676 C163.976238,115.033676 160.951935,112.337699 160.951935,108.118803 L160.951935,107.758653 C160.951935,107.758653 168.255626,107.578578 170.730513,107.578578 C174.944374,107.578578 176.678308,107.537418 180,107.491113 L180,105.114125 C180,94.2736202 175.493789,89 166.219262,89 C161.944914,89 152,90.6412535 152,105.81899 C152,115.944341 157.010261,122 165.765617,122 C172.635824,122 176.854725,120.209542 179.914311,117.930309 C179.576598,117.415809 177.010981,112.708138 176.678308,112.193639 C174.13303,114.084331 171.055416,115.080918 167.907831,115.033676 L167.907831,115.033676 Z M160.951935,101.656688 C161.077948,99.8147802 161.723132,95.5392891 166.274707,95.5392891 C170.942214,95.5392891 171.194239,99.5575304 171.194239,101.677268 L171.194239,102.109448 C171.194239,102.109448 168.079208,102.191768 166.219262,102.191768 C164.359316,102.191768 160.926733,102.109448 160.926733,102.109448 L160.951935,101.656688 Z" id="Shape" fill="#00327D" fill-rule="nonzero"></path>
            <rect id="Rectangle" x="0" y="0" width="300" height="200"></rect>
        </g>
    </g>
</svg>