<?xml version="1.0" encoding="UTF-8"?>
<svg width="300px" height="300px" viewBox="0 0 300 300" version="1.1" xmlns="http://www.w3.org/2000/svg" xmlns:xlink="http://www.w3.org/1999/xlink">
    <!-- Generator: Sketch 59.1 (86144) - https://sketch.com -->
    <title>environnement/expert/HommeEtEnvironnement</title>
    <desc>Created with Sketch.</desc>
    <g id="environnement/expert/HommeEtEnvironnement" stroke="none" stroke-width="1" fill="none" fill-rule="evenodd">
        <g id="L'Homme-et-l'Environnement-(1)" transform="translate(51.000000, 77.000000)">
            <g id="Group-19" transform="translate(24.700001, 0.949000)" fill-rule="nonzero">
                <path d="M52.2406329,81.1813645 C50.0644328,82.6035645 17.0236309,83.2106646 0.830830046,83.2106646 L106.756136,83.2106646 C99.9493355,83.2106646 65.9348336,82.7790646 64.6803336,79.9112644 C64.4242335,79.3275644 62.5951334,53.5342629 63.1554335,52.2472629 C63.6130335,51.1942628 69.6723338,48.6800627 70.2612339,48.6943627 C70.9320339,48.7112627 71.6392339,49.6121627 72.291834,49.7096627 C73.083534,49.8253627 73.407234,49.3430627 74.3224341,49.2013627 C76.8210342,48.8165627 79.9254344,49.8448627 81.4295345,49.7096627 C82.2017345,49.6394627 83.6200346,48.4005627 84.9824347,48.1873627 C85.9158347,48.0404626 87.0234348,48.4057627 87.5187348,48.1873627 C88.3260349,47.8311626 88.6601349,46.4999626 89.2958349,46.1567625 C90.108335,45.7173625 91.472035,46.2607625 92.0895351,45.6497625 C92.9826351,44.7618625 92.1467351,43.0783624 92.5952351,41.5872623 C92.8266351,40.8176622 93.5572351,40.4575622 93.6118352,39.8114622 C93.6521352,39.2992622 93.2140351,39.1276622 93.1048351,38.5426621 C92.8877351,37.4012621 93.6820352,36.276762 93.6118352,35.496762 C93.5429351,34.7375619 92.6927351,34.1252619 92.5952351,33.4661618 C92.3235351,31.6110617 93.6222352,30.3591617 92.5952351,28.8979616 C92.4275351,28.6548616 90.699835,28.0958615 90.565935,27.6291615 L92.5952351,23.8227613 C92.6459351,23.1870613 91.290035,21.0004612 90.060235,20.2698611 C89.3465349,19.8473611 88.1973349,20.1424611 87.5187348,19.7602611 C86.4722348,19.1674611 86.8453348,17.857061 86.5047348,16.7156609 C86.2369347,15.8160609 84.9447347,14.5342608 83.9658346,14.1767608 C83.6798346,14.0701608 82.9687346,14.6993608 82.6983346,14.6850608 C81.0941345,14.5992608 81.6648345,12.6674607 80.9225345,11.6391606 C80.8263344,11.5078606 79.9787344,11.3024606 79.3989344,10.8773606 C78.2913343,10.0700606 77.9689343,8.83636049 77.3696343,8.59456047 C76.3114342,8.16686045 74.9984341,8.96116049 73.8141341,8.59456047 C73.035434,8.35406046 72.485534,6.91496038 71.7848339,6.56396036 C70.0064339,5.67216031 67.6235337,6.43266035 65.4395336,6.05696033 C64.1551335,5.83466032 63.4752335,4.66206026 62.1414334,5.04166028 C61.1976334,5.30816029 61.0312334,7.3218604 59.8560333,7.57926042 C58.5742332,7.85876043 58.1569332,6.75246037 57.0636331,6.56396036 C52.8997329,5.83726032 51.9169329,8.85976049 48.4355327,9.60856053 C46.8274326,9.95566055 46.0773325,10.3209606 44.8813325,10.6238606 C40.3456322,11.7743606 34.5762319,11.8536607 33.7143319,16.2073609 C33.5713318,16.9327609 34.1186319,18.091061 33.7143319,18.746261 C32.9135318,20.0371611 31.3288317,18.845061 29.6531316,19.7602611 C29.5881316,19.7979611 27.7239315,22.1379612 27.6238315,22.3004612 C27.3599315,22.7138612 27.4236315,23.9033613 27.1168315,24.3297613 C26.8282315,24.7275614 26.1821314,24.6625614 26.1015314,24.8367614 C25.8324314,25.4100614 26.2250314,25.9001614 25.8467314,26.3603615 C25.3280314,26.9895615 23.3741313,27.5966615 23.0543313,28.3909616 C22.7085312,29.2463616 22.7995313,31.4394617 23.0543313,32.7043618 C23.1310313,33.0748618 23.9357313,33.3127618 24.0696313,33.7196619 C24.4986313,35.0105619 23.4534313,37.3258621 25.0849314,37.7808621 C24.6052314,38.4958621 23.9838313,38.3515621 24.0696313,39.3044622 C24.0943313,39.5592622 26.6709315,41.6106623 26.6098315,41.5872623 C27.2988315,41.8277623 28.2075316,41.3168623 28.6365316,41.5872623 C29.3463316,42.0318623 29.0642316,43.0497624 29.6531316,43.6178624 C30.0301317,43.9818624 31.0948317,43.6243624 31.6837317,44.1261624 C31.8904318,44.3016624 32.5040318,47.0095626 32.6990318,47.1707626 C33.6779319,47.9767626 35.474532,47.0368626 37.015032,47.1707626 C40.3274322,47.4632626 43.8881324,49.2169627 47.4202326,49.7096627 C48.6968327,49.8877627 50.3374328,49.3235627 51.4814328,49.7096627 C52.3953329,50.0190628 52.1041329,51.3450628 53.5120329,51.7402628 C55.6843331,52.3512629 56.1900331,51.3203628 56.5566331,53.0103629 C57.3730332,56.7725631 56.0938331,75.1181641 55.033033,80.1660644 C53.2949329,80.7952644 52.9309329,80.7315644 52.2406329,81.1813645" id="Fill-1" fill="#68BD49"></path>
                <path d="M65.0444636,15.4336008 C65.0444636,15.4336008 73.572464,17.746301 74.6293641,24.4231013 C74.6293641,24.4231013 79.4575644,24.0955013 81.8456645,29.4398016 C81.8456645,29.4398016 76.4493642,25.6516014 72.546764,27.0985015 C73.165564,21.8647012 65.0444636,15.4336008 65.0444636,15.4336008" id="Fill-3" fill="#FFFFFF"></path>
                <path d="M85.6273647,0.524940029 C85.6273647,0.524940029 94.1540652,2.83764016 95.2109652,9.51444052 C95.2109652,9.51444052 100.039166,9.18684051 102.428566,14.5311408 C102.428566,14.5311408 97.0322653,10.7429406 93.1283651,12.1898407 C93.7471652,6.95604038 85.6273647,0.524940029 85.6273647,0.524940029" id="Fill-5" fill="#68BD49"></path>
                <path d="M86.9298348,57.7972232 C86.9298348,59.4521233 85.5895347,60.7924233 83.9346346,60.7924233 C82.2823345,60.7924233 80.9394345,59.4521233 80.9394345,57.7972232 C80.9394345,56.1410231 82.2823345,54.800723 83.9346346,54.800723 C85.5895347,54.800723 86.9298348,56.1410231 86.9298348,57.7972232" id="Fill-7" fill="#68BD49"></path>
                <path d="M100.502486,59.5593733 C100.502486,60.9204734 99.3987855,62.0267734 98.0363854,62.0267734 C96.6739853,62.0267734 95.5676853,60.9204734 95.5676853,59.5593733 C95.5676853,58.1956732 96.6739853,57.0919731 98.0363854,57.0919731 C99.3987855,57.0919731 100.502486,58.1956732 100.502486,59.5593733" id="Fill-9" fill="#68BD49"></path>
                <path d="M112.033616,68.1954038 C112.033616,69.2107038 111.213316,70.0336039 110.196716,70.0336039 C109.181416,70.0336039 108.357216,69.2107038 108.357216,68.1954038 C108.357216,67.1801037 109.181416,66.3546037 110.196716,66.3546037 C111.213316,66.3546037 112.033616,67.1801037 112.033616,68.1954038" id="Fill-11" fill="#68BD49"></path>
                <path d="M80.1429244,72.866564 C80.1429244,72.866564 80.4094244,74.9790641 79.4370244,74.9790641 C78.4685243,74.9790641 78.4685243,73.9234641 78.4685243,72.866564 L78.4685243,63.0398635 C78.4685243,63.0398635 78.6895243,60.9689634 81.2440245,60.9689634 C81.4650245,60.9689634 82.5661245,61.1899634 82.5661245,61.1899634 L83.7777246,62.4002634 L85.2532247,60.9689634 L86.8379248,60.9689634 C87.8974248,60.9689634 89.3066249,61.8503634 89.3066249,63.9225635 L89.3066249,73.218864 C89.3066249,73.218864 89.3963249,74.8048641 88.4694249,74.8048641 C87.5464248,74.8048641 87.5464248,74.1002641 87.5464248,73.086264 L87.5464248,65.5072636 C87.5464248,64.8455636 86.7950248,64.6687636 86.7950248,65.8595636 L86.7950248,87.5825648 C86.7950248,88.8162649 86.3985248,89.0804318 85.8694247,89.0804318 C85.3416247,89.0804318 84.5486247,89.1256649 84.5486247,87.5396648 L84.5486247,75.1584641 C84.5486247,73.9689634 84.0208246,74.2341641 83.8440246,74.2341641 C83.6672246,74.2341641 83.0952246,74.1873641 83.0952246,75.2455641 L83.0952246,87.5396648 C83.0952246,88.5094649 82.7416246,89.0372649 82.0799245,89.0372649 C81.4182245,89.0372649 80.8904245,88.7304649 80.8904245,87.5396648 L80.8904245,65.8166636 C80.8904245,64.9352636 80.1429244,64.9794636 80.1429244,65.7711636 L80.1429244,72.866564 Z" id="Fill-13" fill="#68BD49"></path>
                <path d="M93.0959951,74.7949841 L93.0959951,65.6845836 C93.0959951,65.1983836 94.5493952,62.9961835 96.5786953,63.2600835 L97.9436954,64.8902836 L99.1344955,63.2600835 C99.8819955,63.2600835 102.350696,63.6591835 102.350696,65.4427836 L102.350696,74.8950841 C102.350696,75.5970842 101.293796,76.0832842 101.293796,74.5401841 L101.293796,66.0810836 C101.293796,66.0810836 100.873896,65.1567836 100.873896,66.5009837 L100.873896,80.7528844 L100.147196,80.7528844 L100.147196,87.4504848 C100.147196,89.2093849 98.2946954,89.2561849 98.2946954,87.4959848 L98.2946954,80.7957844 L97.3716954,80.7957844 L97.3716954,87.4959848 C97.3716954,89.0351849 95.2552952,89.0806849 95.2552952,87.4075848 L95.2552952,80.8867845 L94.7274952,80.8867845 L94.7274952,66.8285837 C94.7274952,66.0368836 94.2204952,65.7729836 94.2204952,66.5438837 L94.2204952,74.9275841 C94.2204952,75.7205842 93.0959951,75.6750842 93.0959951,74.7949841" id="Fill-15" fill="#68BD49"></path>
                <path d="M107.991396,73.7908641 L107.991396,78.9011643 C107.991396,79.4315644 106.847396,79.8280644 106.847396,78.8127643 L106.847396,72.028064 C106.847396,71.4560639 107.967996,70.0247639 108.430796,70.4862639 C108.893596,70.9490639 110.149396,72.866564 110.149396,72.866564 L111.428596,70.3536639 C111.428596,70.3536639 113.277196,70.6188639 113.277196,71.6757639 L113.277196,78.9908643 C113.277196,79.7396644 112.264496,79.7396644 112.264496,78.9011643 L112.264496,73.9663641 C112.264496,73.482764 111.758796,73.325464 111.758796,73.9637641 C111.758796,74.5994641 111.736696,87.5825648 111.736696,88.1532649 C111.736696,89.5221649 110.545896,89.4974649 110.545896,88.1285648 L110.545896,80.0204644 C110.545896,79.4042644 109.797096,79.3002644 109.797096,80.0919644 L109.797096,87.7801648 C109.797096,89.6976649 108.476296,89.4766649 108.476296,87.7801648 L108.476296,73.9247641 C108.476296,73.172064 107.991396,73.307264 107.991396,73.7908641" id="Fill-17" fill="#68BD49"></path>
            </g>
            <g id="-L'HOMME-et" transform="translate(36.400002, 93.300005)" fill="#68BD49" font-family="LucidaGrande, Lucida Grande" font-size="21.6392812" font-weight="normal">
                <text id="L">
                    <tspan x="0.620973504" y="21.0497562">L</tspan>
                </text>
                <text id="'HOMME-et">
                    <tspan x="10.0384563" y="21.0497562">'HOMME et</tspan>
                </text>
            </g>
            <g id="L'ENVIRONNEMENT" transform="translate(0.000000, 119.300007)" fill="#68BD49" font-family="LucidaGrande, Lucida Grande" font-size="21.6392812" font-weight="normal">
                <text id="L">
                    <tspan x="0.54999571" y="21.0168926">L</tspan>
                </text>
                <text id="'ENVI">
                    <tspan x="9.96747851" y="21.0168926">'ENVI</tspan>
                </text>
                <text id="R">
                    <tspan x="63.019642" y="21.0168926">R</tspan>
                </text>
                <text id="ONNEMENT">
                    <tspan x="76.7654375" y="21.0168926">ONNEMENT</tspan>
                </text>
            </g>
        </g>
    </g>
</svg>