<?xml version="1.0" encoding="UTF-8"?>
<svg width="300px" height="300px" viewBox="0 0 300 300" version="1.1" xmlns="http://www.w3.org/2000/svg" xmlns:xlink="http://www.w3.org/1999/xlink">
    <!-- Generator: Sketch 59.1 (86144) - https://sketch.com -->
    <title>environnement/Hop</title>
    <desc>Created with Sketch.</desc>
    <g id="environnement/Hop" stroke="none" stroke-width="1" fill="none" fill-rule="evenodd">
        <g id="Logo-hop-[Converti]" transform="translate(26.000000, 108.000000)" fill="#E75244" fill-rule="nonzero">
            <path d="M118.85039,22.5575981 C119.12357,22.5605001 119.383689,22.6749527 119.57039,22.874398 C119.771256,23.0600883 119.885993,23.3208529 119.88719,23.594398 L119.88719,28.9727975 C119.883217,29.077238 119.922255,29.178737 119.99519,29.2535975 C120.062924,29.3239115 120.156768,29.3630131 120.25439,29.3615975 L123.343189,29.3615975 C123.440811,29.3630131 123.534655,29.3239115 123.602389,29.2535975 C123.675324,29.178737 123.714362,29.077238 123.710389,28.9727975 L123.710389,23.651998 C123.71494,23.3791765 123.829122,23.1196719 124.027189,22.931998 C124.21389,22.7325526 124.474009,22.6181001 124.747189,22.6151981 C125.036336,22.6118944 125.31441,22.7262426 125.517589,22.931998 C125.711019,23.1222455 125.822169,23.3807342 125.827189,23.651998 L125.827189,37.3319968 C125.830767,37.6197916 125.719321,37.8971095 125.517589,38.1023967 C125.313676,38.3062193 125.035439,38.4180343 124.747189,38.4119967 C124.474906,38.4118093 124.21463,38.2998906 124.027189,38.1023967 C123.820007,37.9001784 123.705396,37.6214651 123.710389,37.3319968 L123.710389,31.9319973 C123.714362,31.8275568 123.675324,31.7260577 123.602389,31.6511973 C123.534655,31.5808832 123.440811,31.5417817 123.343189,31.5431973 L120.25439,31.5431973 C120.156768,31.5417817 120.062924,31.5808832 119.99519,31.6511973 C119.922255,31.7260577 119.883217,31.8275568 119.88719,31.9319973 L119.88719,37.3319968 C119.881045,37.6044667 119.767121,37.863385 119.57039,38.0519967 C119.382949,38.2494906 119.122673,38.3614093 118.85039,38.3615967 C118.56214,38.3676343 118.283903,38.2558193 118.07999,38.0519967 C117.878258,37.8467095 117.766812,37.5693916 117.77039,37.2815968 L117.77039,23.651998 C117.77541,23.3807342 117.88656,23.1222455 118.07999,22.931998 C118.27312,22.7049369 118.552527,22.5691503 118.85039,22.5575981 Z" id="Path"></path>
            <path d="M128.642389,38.3687967 C128.360819,38.3298892 128.113355,38.1622523 127.972789,37.9151967 C127.789719,37.7007323 127.724981,37.4094121 127.799989,37.1375968 C128.217589,34.862397 128.591989,32.8103972 128.923189,30.9815973 C129.067189,30.2039974 129.203989,29.4407975 129.340789,28.6919975 C129.477589,27.9431976 129.607189,27.2519977 129.707989,26.6759977 C129.808789,26.0999978 129.909589,25.5887978 129.981589,25.2359978 C130.053589,24.8831979 130.096789,24.6383979 130.111189,24.5951979 C130.206176,24.0282352 130.505924,23.5158443 130.953589,23.155198 C131.379747,22.7881774 131.924792,22.5885836 132.487189,22.5935058 C133.658999,22.5967771 134.664216,23.4299298 134.884788,24.5807979 C134.884788,24.6239979 134.920788,24.8327979 134.992788,25.2071978 C135.064788,25.5815978 135.151188,26.0711978 135.259188,26.6471977 C135.367188,27.2231977 135.496788,27.9143976 135.626388,28.6631975 C135.755988,29.4119975 135.907188,30.1751974 136.051188,30.9527973 C136.382388,32.7815972 136.763988,34.840797 137.195988,37.1303968 C137.270996,37.4022121 137.206259,37.6935323 137.023188,37.9079967 C136.882622,38.1550523 136.635158,38.3226892 136.353588,38.3615967 C136.289149,38.3712634 136.223628,38.3712634 136.159188,38.3615967 C135.896845,38.3741376 135.639519,38.2866467 135.439188,38.1167967 C135.246693,37.9506986 135.114968,37.7252459 135.064788,37.4759968 L134.395188,33.8759971 C134.389994,33.7858372 134.347406,33.7019365 134.277694,33.6445262 C134.207981,33.5871159 134.117471,33.5614064 134.027988,33.5735971 L130.895989,33.5735971 C130.705826,33.5522766 130.533334,33.6864372 130.507189,33.8759971 L129.859189,37.4759968 C129.806564,37.7260018 129.672326,37.9514206 129.477589,38.1167967 C129.289799,38.2788998 129.048826,38.36606 128.800789,38.3615967 C128.748475,38.3704004 128.695286,38.3728181 128.642389,38.3687967 L128.642389,38.3687967 Z M131.083189,31.0247973 C131.070691,31.1330711 131.101776,31.2418693 131.169589,31.3271973 C131.233363,31.4174008 131.34037,31.4667886 131.450389,31.4567973 L133.523989,31.4567973 C133.639386,31.4625728 133.750986,31.4147443 133.826388,31.3271973 C133.894201,31.2418693 133.925286,31.1330711 133.912788,31.0247973 C133.797588,30.4343974 133.689588,29.8583974 133.588788,29.2895975 C133.487989,28.7207975 133.394389,28.1879976 133.293589,27.6911976 C133.192789,27.1943977 133.120789,26.7479977 133.048789,26.3519977 L132.875989,25.3871978 C132.840272,25.2033368 132.674184,25.0741571 132.487189,25.0847978 C132.303853,25.0719259 132.142511,25.2047957 132.119989,25.3871978 L131.947189,26.3519977 C131.875189,26.7479977 131.788789,27.1943977 131.695189,27.6911976 L131.392789,29.2895975 C131.291989,29.8583974 131.183989,30.4343974 131.090389,31.0247973 L131.083189,31.0247973 Z" id="Shape"></path>
            <path d="M140.349588,22.5791981 C140.929303,22.5906809 141.396505,23.0578828 141.407988,23.637598 L141.407988,35.8775969 C141.406572,35.9752187 141.445674,36.0690625 141.515988,36.1367969 C141.590848,36.2097318 141.692347,36.2487699 141.796788,36.2447969 L144.475188,36.2447969 C145.054903,36.2562797 145.522105,36.7234816 145.533587,37.3031968 C145.538581,37.5926651 145.42397,37.8713784 145.216787,38.0735967 C145.028376,38.2696942 144.768724,38.3813444 144.496788,38.3832536 L140.371188,38.3832536 C140.087753,38.3861429 139.815141,38.2745015 139.615188,38.0735967 C139.403885,37.873627 139.286318,37.5940804 139.291188,37.3031968 L139.291188,23.651998 C139.295104,23.3775483 139.412376,23.1169441 139.615188,22.931998 C139.803103,22.7211123 140.067518,22.5940895 140.349588,22.5791981 L140.349588,22.5791981 Z" id="Path"></path>
            <path d="M148.751987,38.3903967 C148.477915,38.384793 148.217946,38.267807 148.031987,38.0663967 C147.839832,37.8752798 147.728915,37.6173333 147.722387,37.3463968 L147.722387,25.1063978 C147.728765,25.001456 147.689855,24.8988139 147.615513,24.8244719 C147.541171,24.7501299 147.438529,24.7112198 147.333587,24.7175979 L145.324787,24.7175979 C144.740249,24.7175979 144.266388,24.2437361 144.266388,23.659198 C144.266388,23.0746598 144.740249,22.6007981 145.324787,22.6007981 L152.215187,22.6007981 C152.794902,22.6122809 153.262104,23.0794828 153.273587,23.659198 C153.267442,23.9316678 153.153518,24.1905862 152.956787,24.3791979 C152.768375,24.5752953 152.508724,24.6869455 152.236787,24.6887979 L150.249587,24.6887979 C150.147013,24.6832494 150.047115,24.7226829 149.975987,24.7967979 C149.910317,24.8751471 149.876861,24.9755165 149.882387,25.0775978 L149.882387,37.3175968 C149.867249,37.9076803 149.392471,38.3824589 148.802387,38.3975967 L148.751987,38.3903967 Z" id="Path"></path>
            <path d="M157.370386,24.7823979 C157.297452,24.8572583 157.258413,24.9587574 157.262386,25.0631978 L157.262386,29.0159975 C157.256838,29.1185714 157.296272,29.2184697 157.370386,29.2895975 C157.448736,29.3552675 157.549105,29.388724 157.651186,29.3831975 L160.480786,29.3831975 C160.753608,29.3877478 161.013112,29.5019298 161.200786,29.6999974 C161.403964,29.8990708 161.51846,30.1715477 161.51846,30.4559974 C161.51846,30.7404471 161.403964,31.012924 161.200786,31.2119973 C161.012375,31.4080948 160.752723,31.519745 160.480786,31.5215973 L157.651186,31.5215973 C157.546245,31.5152192 157.443603,31.5541294 157.369261,31.6284713 C157.294919,31.7028133 157.256008,31.8054554 157.262386,31.9103973 L157.262386,35.8919969 C157.260971,35.9896187 157.300072,36.0834625 157.370386,36.1511969 C157.445247,36.2241318 157.546746,36.2631699 157.651186,36.2591969 L161.560786,36.2591969 C162.140501,36.2706797 162.607703,36.7378816 162.619186,37.3175968 C162.62418,37.6070651 162.509569,37.8857784 162.302386,38.0879967 C162.113975,38.2840942 161.854323,38.3957444 161.582386,38.3975967 L156.225587,38.3975967 C155.953989,38.3941344 155.694933,38.2827401 155.505587,38.0879967 C155.301046,37.8845583 155.189103,37.6060001 155.195987,37.3175968 L155.195987,23.651998 C155.197839,23.3800611 155.309489,23.1204095 155.505587,22.931998 C155.694198,22.7352667 155.953117,22.6213426 156.225587,22.6151981 L161.582386,22.6151981 C162.162101,22.6266809 162.629303,23.0938828 162.640786,23.673598 C162.634641,23.9460678 162.520717,24.2049862 162.323986,24.3935979 C162.135575,24.5896953 161.875923,24.7013455 161.603986,24.7031979 L157.694386,24.7031979 C157.579955,24.6785027 157.460521,24.7076978 157.370386,24.7823979 Z" id="Path"></path>
            <path d="M170.243985,38.3687967 C169.962416,38.3298892 169.714952,38.1622523 169.574385,37.9151967 C169.391315,37.7007323 169.326577,37.4094121 169.401585,37.1375968 C169.819185,34.862397 170.193585,32.8103972 170.524785,30.9815973 C170.668785,30.2039974 170.805585,29.4407975 170.949585,28.6919975 C171.093585,27.9431976 171.201585,27.2519977 171.316785,26.6759977 C171.431985,26.0999978 171.511185,25.5887978 171.583185,25.2359978 C171.655185,24.8831979 171.698385,24.6383979 171.712785,24.5951979 C171.807772,24.0282352 172.107521,23.5158443 172.555185,23.155198 C172.981344,22.7881774 173.526388,22.5885836 174.088785,22.5935058 C175.260595,22.5967771 176.265812,23.4299298 176.486385,24.5807979 C176.486385,24.6239979 176.522385,24.8327979 176.594385,25.2071978 C176.666385,25.5815978 176.759985,26.0711978 176.860785,26.6471977 C176.961585,27.2231977 177.091185,27.9143976 177.235185,28.6631975 C177.379185,29.4119975 177.508785,30.1751974 177.652785,30.9527973 C177.983985,32.7815972 178.365585,34.840797 178.797585,37.1303968 C178.872593,37.4022121 178.807855,37.6935323 178.624785,37.9079967 C178.484218,38.1550523 178.236754,38.3226892 177.955185,38.3615967 C177.890745,38.3712634 177.825224,38.3712634 177.760785,38.3615967 C177.51252,38.3674413 177.271066,38.2801069 177.083985,38.1167967 C176.889247,37.9514206 176.755009,37.7260018 176.702385,37.4759968 L176.032785,33.8759971 C176.027591,33.7858372 175.985003,33.7019365 175.91529,33.6445262 C175.845578,33.5871159 175.755068,33.5614064 175.665585,33.5735971 L172.533585,33.5735971 C172.343422,33.5522766 172.17093,33.6864372 172.144785,33.8759971 L171.496785,37.4759968 C171.446606,37.7252459 171.314881,37.9506986 171.122385,38.1167967 C170.922055,38.2866467 170.664729,38.3741376 170.402385,38.3615967 C170.350072,38.3704004 170.296882,38.3728181 170.243985,38.3687967 L170.243985,38.3687967 Z M176.450385,19.8359983 C176.548528,20.1120127 176.530338,20.4160545 176.399985,20.6783982 C176.279167,20.9308079 176.060813,21.1231671 175.795185,21.2111982 C175.532388,21.3041337 175.242739,21.2832581 174.995985,21.1535982 L172.360785,19.8791983 C172.099677,19.765978 171.900195,19.5454981 171.813585,19.2743983 C171.714769,19.0131318 171.73313,18.7219812 171.863985,18.4751984 C171.974482,18.2048728 172.198308,17.9968463 172.475985,17.9063985 C172.74257,17.8105534 173.036868,17.8287843 173.289585,17.9567985 L175.924785,19.2311983 C176.175498,19.3522059 176.36552,19.5708605 176.450385,19.8359983 L176.450385,19.8359983 Z M172.706385,31.0247973 C172.693887,31.1330711 172.724973,31.2418693 172.792785,31.3271973 C172.85656,31.4174008 172.963567,31.4667886 173.073585,31.4567973 L175.147185,31.4567973 C175.262583,31.4625728 175.374183,31.4147443 175.449585,31.3271973 C175.517397,31.2418693 175.548483,31.1330711 175.535985,31.0247973 C175.420785,30.4343974 175.312785,29.8583974 175.211985,29.2895975 C175.111185,28.7207975 175.010385,28.1879976 174.923985,27.6911976 C174.837585,27.1943977 174.743985,26.7479977 174.671985,26.3519977 L174.499185,25.3871978 C174.463469,25.2033368 174.29738,25.0741571 174.110385,25.0847978 C173.927049,25.0719259 173.765707,25.2047957 173.743185,25.3871978 L173.570385,26.3519977 C173.498385,26.7479977 173.411985,27.1943977 173.318385,27.6911976 C173.224785,28.1879976 173.131185,28.7207975 173.015985,29.2895975 C172.900785,29.8583974 172.785585,30.4343974 172.684785,31.0247973 L172.706385,31.0247973 Z" id="Shape"></path>
            <path d="M118.72799,45.6191961 C119.31485,45.6270741 119.786443,46.1050832 119.78639,46.691996 L119.78639,58.9319949 C119.784974,59.0296167 119.824076,59.1234605 119.89439,59.1911949 C119.96925,59.2641298 120.070749,59.3031679 120.17519,59.2991949 L122.853589,59.2991949 C123.431976,59.3186147 123.890715,59.7932826 123.890389,60.3719948 C123.893967,60.6597896 123.782521,60.9371075 123.580789,61.1423947 C123.390542,61.3358246 123.132053,61.4469747 122.860789,61.4520516 L118.73519,61.4520516 C118.451755,61.4549409 118.179143,61.3432995 117.97919,61.1423947 C117.767887,60.942425 117.65032,60.6628784 117.65519,60.3719948 L117.65519,46.691996 C117.659106,46.4175463 117.776377,46.1569422 117.97919,45.971996 C118.170548,45.7576221 118.440846,45.6302699 118.72799,45.6191961 Z" id="Path"></path>
            <path d="M126.503989,45.6191961 C126.793136,45.6158924 127.07121,45.7302406 127.274389,45.935996 C127.467819,46.1262436 127.578969,46.3847322 127.583989,46.655996 L127.583989,48.5135958 C127.584048,48.7980838 127.469578,49.0706178 127.266393,49.2697391 C127.063209,49.4688603 126.788418,49.5778016 126.503989,49.5719957 C125.922692,49.5642441 125.453341,49.0948928 125.445589,48.5135958 L125.445589,46.691996 C125.446786,46.4184509 125.561522,46.1576864 125.762389,45.971996 C125.947733,45.7537166 126.2177,45.6252856 126.503989,45.6191961 Z" id="Path"></path>
            <path d="M131.925589,60.6959948 C131.595667,60.4679924 131.297813,60.1967752 131.039989,59.8895948 C130.78114,59.5794619 130.570015,59.2324411 130.413589,58.8599949 C130.198599,58.3470165 130.088436,57.7962022 130.08958,57.2399951 L130.08958,49.7447957 C130.090232,49.3320733 130.153346,48.921826 130.276789,48.5279958 C130.39437,48.1382223 130.571676,47.7690368 130.802389,47.4335959 C131.23882,46.7478769 131.881707,46.2184405 132.638389,45.921596 C133.151367,45.7066059 133.702181,45.5964431 134.258388,45.5974409 C135.091779,45.5902788 135.906889,45.8418561 136.591188,46.317596 C137.26279,46.7546971 137.783242,47.3882917 138.081588,48.1319959 C138.304367,48.6433216 138.421903,49.1942714 138.427188,49.7519957 L138.427188,57.2471951 C138.426245,58.079356 138.175411,58.892056 137.707188,59.5799949 C137.47663,59.910104 137.20301,60.2079375 136.893588,60.4655948 C136.585976,60.7242723 136.241353,60.9354148 135.871188,61.0919947 C134.571948,61.6347285 133.086986,61.4886667 131.918389,60.7031948 L131.925589,60.6959948 Z M132.227989,57.2399951 C132.221016,57.6482939 132.341851,58.0485594 132.573589,58.384795 C132.789431,58.7086065 133.098139,58.9595883 133.459189,59.1047949 C133.713048,59.2072785 133.984636,59.25866 134.258388,59.2559949 C134.666788,59.2708371 135.0696,59.1575464 135.410388,58.9319949 C135.7342,58.7161524 135.985182,58.4074448 136.130388,58.046395 C136.232872,57.7925354 136.284253,57.5209476 136.281588,57.2471951 L136.281588,49.7447957 C136.290972,49.3428614 136.169701,48.9487313 135.935988,48.6215958 C135.720146,48.2977843 135.411438,48.0468025 135.050388,47.9015959 C134.798278,47.790965 134.526483,47.7321985 134.251188,47.7287959 C133.844669,47.7339638 133.44786,47.853755 133.106389,48.0743959 C132.778513,48.2952411 132.527009,48.6121353 132.386389,48.9815958 C132.32637,49.1018107 132.285093,49.2304988 132.263989,49.3631958 C132.253541,49.494989 132.253541,49.6274024 132.263989,49.7591957 L132.227989,57.2399951 Z" id="Shape"></path>
            <path d="M148.816787,52.5959955 C148.741576,52.7150815 148.657328,52.8282143 148.564787,52.9343954 C148.471187,53.0423954 148.377587,53.1431954 148.276787,53.2439954 C148.204969,53.3166426 148.165954,53.4154807 148.168787,53.5175954 C148.166234,53.6175395 148.205358,53.7140443 148.276787,53.7839954 C148.683215,54.1846253 149.006234,54.6618135 149.227187,55.1879952 C149.458897,55.7420125 149.576442,56.3370859 149.572787,56.9375951 C149.581729,57.8302806 149.317977,58.7044284 148.816787,59.4431949 C147.971453,60.6661186 146.58804,61.4060837 145.101588,61.4303947 L142.163988,61.4303947 C141.875884,61.4426781 141.597785,61.3234928 141.407988,61.1063947 C141.209256,60.9185189 141.092803,60.6597333 141.083983,60.3863948 L141.083983,46.691996 C141.083136,46.4061032 141.200375,46.1325469 141.407988,45.935996 C141.607248,45.7348695 141.880988,45.6253737 142.163988,45.6335961 L145.101588,45.6335961 C145.993625,45.6291638 146.866467,45.8925213 147.607187,46.389596 C148.319567,46.8812903 148.880607,47.5620185 149.227187,48.3551958 C149.458897,48.9092131 149.576442,49.5042865 149.572787,50.1047957 C149.578799,50.9925816 149.315177,51.8612796 148.816787,52.5959955 L148.816787,52.5959955 Z M147.261587,51.0119956 C147.389141,50.7189217 147.455301,50.4028233 147.455987,50.0831957 C147.448783,49.6136614 147.306287,49.1561726 147.045587,48.7655958 C146.600888,48.1287631 145.878184,47.7433208 145.101588,47.7287959 L143.611188,47.7287959 C143.506246,47.7224178 143.403604,47.761328 143.329262,47.8356699 C143.25492,47.9100119 143.21601,48.0126541 143.222388,48.1175959 L143.222388,52.0703955 C143.216839,52.1729694 143.256273,52.2728677 143.330388,52.3439955 C143.408737,52.4096655 143.509106,52.443122 143.611188,52.4375955 L145.101588,52.4375955 C145.568778,52.4356148 146.025765,52.3007663 146.419187,52.0487955 C146.794483,51.7920848 147.087138,51.4318944 147.261587,51.0119956 L147.261587,51.0119956 Z M147.261587,57.859195 C147.389141,57.5661212 147.455301,57.2500227 147.455987,56.9303951 C147.452991,56.4601972 147.310127,56.0015286 147.045587,55.6127952 C146.600888,54.9759625 145.878184,54.5905202 145.101588,54.5759953 L143.611188,54.5759953 C143.506246,54.5696172 143.403604,54.6085274 143.329262,54.6828694 C143.25492,54.7572113 143.21601,54.8598535 143.222388,54.9647953 L143.222388,58.9319949 C143.220972,59.0296167 143.260074,59.1234605 143.330388,59.1911949 C143.405248,59.2641298 143.506747,59.3031679 143.611188,59.2991949 L145.101588,59.2991949 C145.568778,59.2972142 146.025765,59.1623657 146.419187,58.9103949 C146.795571,58.6517558 147.088329,58.2889354 147.261587,57.866395 L147.261587,57.859195 Z" id="Shape"></path>
            <path d="M154.583987,48.0383959 C154.317601,48.2155309 154.107683,48.4654337 153.979187,48.7583958 C153.892119,48.9632576 153.84801,49.183805 153.849587,49.4063957 C153.845608,49.6546735 153.897272,49.9006916 154.000787,50.1263957 C154.111094,50.414016 154.264002,50.6834249 154.454387,50.9255956 C154.669539,51.2111599 154.910559,51.4762817 155.174387,51.7175955 C155.462387,51.9983955 155.822387,52.3223955 156.254387,52.6967955 L156.866386,53.2295954 C157.097755,53.429462 157.318839,53.6409336 157.528786,53.8631954 C157.738149,54.0724691 157.935276,54.2936358 158.119186,54.5255953 C158.284786,54.7343953 158.443186,54.9359953 158.587186,55.1375953 C159.07774,55.8759638 159.354352,56.7357028 159.386394,57.621595 C159.387902,58.3795297 159.153919,59.1192162 158.716786,59.7383949 C158.29944,60.3428072 157.724119,60.8209962 157.053586,61.1207947 C156.59764,61.3137074 156.108619,61.4164018 155.613587,61.4231947 C154.841216,61.4318012 154.085655,61.197577 153.453587,60.7535948 C152.841482,60.3447237 152.361246,59.7669397 152.071187,59.0903949 C151.886541,58.6327153 151.791225,58.1439171 151.790387,57.650395 C151.786376,57.0606804 152.259111,56.5782973 152.848787,56.5703951 C153.121608,56.5749454 153.381113,56.6891275 153.568787,56.8871951 C153.775584,57.0867031 153.890309,57.3630864 153.885587,57.650395 C153.889354,57.9803376 153.98673,58.3024284 154.166387,58.579195 C154.350305,58.8394289 154.598313,59.0477553 154.886387,59.1839949 C155.099187,59.2698162 155.326533,59.3138188 155.555987,59.3135949 C155.887137,59.3180246 156.211556,59.2199446 156.484787,59.0327949 C156.745021,58.8488764 156.953347,58.6008688 157.089586,58.312795 C157.175408,58.0999951 157.21941,57.8726488 157.219186,57.643195 C157.223165,57.3949173 157.171501,57.1488992 157.067986,56.9231951 C156.962819,56.6442493 156.817267,56.3822555 156.635987,56.1455952 C156.411993,55.8651993 156.171571,55.5983311 155.915987,55.3463952 C155.635187,55.0583953 155.275187,54.7271953 154.828787,54.3527953 L153.993587,53.6327954 C153.713974,53.3795672 153.451778,53.1077491 153.208787,52.8191955 C152.694982,52.2876925 152.284773,51.6650545 151.999187,50.9831956 C151.805082,50.502433 151.702521,49.9896325 151.69677,49.4711957 C151.695635,49.0900884 151.753936,48.7111334 151.869587,48.3479958 C151.983226,47.9903946 152.14297,47.6491226 152.344787,47.3327959 C152.767328,46.7298628 153.351252,46.2582319 154.029587,45.971996 C154.482998,45.771108 154.973668,45.6680673 155.469587,45.6695961 C156.239401,45.6561055 156.994324,45.8825823 157.629586,46.317596 C158.233999,46.7349427 158.712188,47.3102638 159.011986,47.9807959 C159.201616,48.4546086 159.296997,48.9608625 159.292786,49.4711957 C159.286642,49.7436656 159.172718,50.002584 158.975986,50.1911957 C158.787575,50.3872931 158.527923,50.4989433 158.255986,50.5007957 C157.671448,50.5007957 157.197586,50.0269339 157.197586,49.4423957 C157.195929,49.105389 157.098547,48.7757903 156.916786,48.4919958 C156.724217,48.2256432 156.462914,48.0166009 156.160787,47.8871959 C155.955925,47.8001283 155.735377,47.7560189 155.512787,47.7575959 C155.181503,47.7522134 154.856801,47.8503789 154.583987,48.0383959 Z" id="Path"></path>
            <path d="M163.439986,60.6959948 C163.110065,60.4679924 162.81221,60.1967752 162.554386,59.8895948 C162.295537,59.5794619 162.084412,59.2324411 161.927986,58.8599949 C161.712996,58.3470165 161.602833,57.7962022 161.603947,57.2399951 L161.603947,49.7447957 C161.602187,49.3324326 161.662875,48.9221769 161.783986,48.5279958 C161.904125,48.1379178 162.083847,47.7687579 162.316786,47.4335959 C162.753218,46.7478769 163.396105,46.2184405 164.152786,45.921596 C164.665764,45.7066059 165.216579,45.5964431 165.772786,45.5974409 C166.606176,45.5902788 167.421287,45.8418561 168.105586,46.317596 C168.777187,46.7546971 169.29764,47.3882917 169.595985,48.1319959 C169.818764,48.6433216 169.9363,49.1942714 169.941585,49.7519957 L169.941585,57.2471951 C169.940642,58.079356 169.689809,58.892056 169.221585,59.5799949 C168.993583,59.9099161 168.722366,60.2077707 168.415186,60.4655948 C166.990195,61.639252 164.962994,61.7359249 163.432786,60.7031948 L163.439986,60.6959948 Z M163.742386,57.2399951 C163.735414,57.6482939 163.856249,58.0485594 164.087986,58.384795 C164.303828,58.7086065 164.612536,58.9595883 164.973586,59.1047949 C165.227445,59.2072785 165.499033,59.25866 165.772786,59.2559949 C166.181085,59.2629671 166.58135,59.1421322 166.917586,58.9103949 C167.241397,58.6945524 167.492379,58.3858448 167.637586,58.024795 C167.740069,57.7709354 167.791451,57.4993476 167.788786,57.2255951 L167.788786,49.7447957 C167.798169,49.3428614 167.676898,48.9487313 167.443186,48.6215958 C167.227343,48.2977843 166.918635,48.0468025 166.557586,47.9015959 C166.305475,47.790965 166.03368,47.7321985 165.758386,47.7287959 C165.351866,47.7339638 164.955057,47.853755 164.613586,48.0743959 C164.28571,48.2952411 164.034207,48.6121353 163.893586,48.9815958 C163.836722,49.1030722 163.79559,49.2313076 163.771186,49.3631958 C163.764306,49.4951061 163.764306,49.6272854 163.771186,49.7591957 L163.742386,57.2399951 Z" id="Shape"></path>
            <path d="M173.570385,45.6191961 C174.164052,45.6191961 174.646427,46.0983422 174.650385,46.691996 L174.650385,58.9319949 C174.648969,59.0296167 174.688071,59.1234605 174.758385,59.1911949 C174.833245,59.2641298 174.934744,59.3031679 175.039185,59.2991949 L177.717585,59.2991949 C178.2973,59.3106778 178.764502,59.7778796 178.775985,60.3575948 C178.780978,60.6470631 178.666367,60.9257764 178.459185,61.1279947 C178.270773,61.3240922 178.011122,61.4357424 177.739185,61.4375947 L173.570385,61.4375947 C173.299449,61.4310666 173.041502,61.3201496 172.850385,61.1279947 C172.639082,60.928025 172.521515,60.6484784 172.526385,60.3575948 L172.526385,46.691996 C172.530301,46.4175463 172.647573,46.1569422 172.850385,45.971996 C173.03483,45.7645231 173.293405,45.6378215 173.570385,45.6191961 L173.570385,45.6191961 Z" id="Path"></path>
            <path d="M182.815184,47.8223959 C182.742249,47.8972563 182.703211,47.9987554 182.707184,48.1031959 L182.707184,52.0559955 C182.701636,52.1585694 182.741069,52.2584677 182.815184,52.3295955 C182.893533,52.3952655 182.993903,52.428722 183.095984,52.4231955 L185.925584,52.4231955 C186.198405,52.4277458 186.45791,52.5419278 186.645584,52.7399955 C186.848762,52.9390688 186.963258,53.2115457 186.963258,53.4959954 C186.963258,53.7804451 186.848762,54.052922 186.645584,54.2519953 C186.457172,54.4480928 186.197521,54.559743 185.925584,54.5615953 L183.095984,54.5615953 C182.991042,54.5552172 182.8884,54.5941274 182.814058,54.6684694 C182.739716,54.7428113 182.700806,54.8454535 182.707184,54.9503953 L182.707184,58.9319949 C182.705769,59.0296167 182.74487,59.1234605 182.815184,59.1911949 C182.890045,59.2641298 182.991544,59.3031679 183.095984,59.2991949 L187.005584,59.2991949 C187.585299,59.3106778 188.052501,59.7778796 188.063984,60.3575948 C188.068977,60.6470631 187.954366,60.9257764 187.747184,61.1279947 C187.558772,61.3240922 187.299121,61.4357424 187.027184,61.4375947 L181.670384,61.4375947 C181.398787,61.4341324 181.139731,61.3227382 180.950384,61.1279947 C180.745844,60.9245563 180.6339,60.6459981 180.640784,60.3575948 L180.640784,46.691996 C180.642637,46.4200591 180.754287,46.1604075 180.950384,45.971996 C181.138996,45.7752647 181.397914,45.6613406 181.670384,45.6551961 L187.027184,45.6551961 C187.606899,45.6666789 188.074101,46.1338808 188.085584,46.713596 C188.079439,46.9860659 187.965515,47.2449842 187.768784,47.4335959 C187.580372,47.6296934 187.320721,47.7413436 187.048784,47.7431959 L183.139184,47.7431959 C183.024753,47.7185008 182.905319,47.7476958 182.815184,47.8223959 L182.815184,47.8223959 Z" id="Path"></path>
            <path d="M192.902383,48.0383959 C192.635998,48.2155309 192.42608,48.4654337 192.297583,48.7583958 C192.210516,48.9632576 192.166406,49.183805 192.167983,49.4063957 C192.164005,49.6546735 192.215669,49.9006916 192.319183,50.1263957 C192.429491,50.414016 192.582398,50.6834249 192.772783,50.9255956 C192.987936,51.2111599 193.228956,51.4762817 193.492783,51.7175955 C193.780783,51.9983955 194.140783,52.3223955 194.572783,52.6967955 L195.184783,53.2295954 C195.416152,53.429462 195.637236,53.6409336 195.847183,53.8631954 C196.056546,54.0724691 196.253673,54.2936358 196.437583,54.5255953 C196.603183,54.7343953 196.761583,54.9359953 196.905583,55.1375953 C197.396137,55.8759638 197.672749,56.7357028 197.70479,57.621595 C197.706298,58.3795297 197.472316,59.1192162 197.035183,59.7383949 C196.617836,60.3428072 196.042515,60.8209962 195.371983,61.1207947 C194.916036,61.3137074 194.427015,61.4164018 193.931983,61.4231947 C193.159613,61.4318012 192.404051,61.197577 191.771983,60.7535948 C191.159879,60.3447237 190.679643,59.7669397 190.389584,59.0903949 C190.204938,58.6327153 190.109622,58.1439171 190.108784,57.650395 C190.104773,57.0606804 190.577508,56.5782973 191.167184,56.5703951 C191.440005,56.5749454 191.69951,56.6891275 191.887183,56.8871951 C192.093981,57.0867031 192.208706,57.3630864 192.203983,57.650395 C192.20775,57.9803376 192.305127,58.3024284 192.484783,58.579195 C192.668702,58.8394289 192.91671,59.0477553 193.204783,59.1839949 C193.417583,59.2698162 193.64493,59.3138188 193.874383,59.3135949 C194.205534,59.3180246 194.529952,59.2199446 194.803183,59.0327949 C195.063417,58.8488764 195.271744,58.6008688 195.407983,58.312795 C195.493805,58.0999951 195.537807,57.8726488 195.537583,57.643195 C195.541562,57.3949173 195.489898,57.1488992 195.386383,56.9231951 C195.281216,56.6442493 195.135664,56.3822555 194.954383,56.1455952 C194.730389,55.8651993 194.489968,55.5983311 194.234383,55.3463952 C193.953583,55.0583953 193.593583,54.7271953 193.147183,54.3527953 L192.311983,53.6327954 C192.032371,53.3795672 191.770174,53.1077491 191.527184,52.8191955 C191.013378,52.2876925 190.60317,51.6650545 190.317584,50.9831956 C190.123478,50.502433 190.020918,49.9896325 190.015167,49.4711957 C190.014031,49.0900884 190.072332,48.7111334 190.187984,48.3479958 C190.301623,47.9903946 190.461367,47.6491226 190.663184,47.3327959 C191.085725,46.7298628 191.669648,46.2582319 192.347983,45.971996 C192.801395,45.771108 193.292065,45.6680673 193.787983,45.6695961 C194.557797,45.6561055 195.31272,45.8825823 195.947983,46.317596 C196.552395,46.7349427 197.030584,47.3102638 197.330383,47.9807959 C197.520012,48.4546086 197.615393,48.9608625 197.611183,49.4711957 C197.605038,49.7436656 197.491114,50.002584 197.294383,50.1911957 C197.105972,50.3872931 196.84632,50.4989433 196.574383,50.5007957 C196.293678,50.5007957 196.02447,50.389286 195.825981,50.1907975 C195.627493,49.992309 195.515983,49.7231009 195.515983,49.4423957 C195.514325,49.105389 195.416944,48.7757903 195.235183,48.4919958 C195.042614,48.2256432 194.781311,48.0166009 194.479183,47.8871959 C194.274321,47.8001283 194.053774,47.7560189 193.831183,47.7575959 C193.499899,47.7522134 193.175198,47.8503789 192.902383,48.0383959 Z" id="Path"></path>
            <path d="M202.125583,48.7727958 C202.021761,48.9727435 201.969773,49.1955475 201.974383,49.4207957 L201.974383,57.628795 C201.975313,57.9624423 202.081098,58.287356 202.276783,58.557595 C202.453918,58.8239804 202.70382,59.0338988 202.996783,59.1623949 C203.200798,59.2521721 203.421931,59.2963987 203.644782,59.2919949 C203.975933,59.2964247 204.300351,59.1983446 204.573582,59.0111949 C204.844646,58.8393504 205.055905,58.5878516 205.178382,58.291195 C205.262694,58.0854914 205.306692,57.8655028 205.307982,57.643195 C205.309179,57.36965 205.423916,57.1088854 205.624782,56.9231951 C205.823787,56.7156606 206.100507,56.6007957 206.387982,56.6063951 C206.967697,56.617878 207.434899,57.0850799 207.446382,57.664795 C207.446345,58.0387411 207.388046,58.4103983 207.273582,58.7663949 C207.159943,59.1239962 207.000199,59.4652682 206.798382,59.7815949 C206.3931,60.4053995 205.804522,60.8883349 205.113582,61.1639947 C204.658485,61.3596041 204.168922,61.4624122 203.673582,61.4663971 C202.905564,61.4672435 202.154305,61.241866 201.513583,60.8183948 C200.899688,60.4077177 200.425114,59.8201504 200.152783,59.1335949 C199.957173,58.6784971 199.854365,58.1889345 199.850383,57.693595 L199.850383,49.4855957 C199.836892,48.7157816 200.063369,47.9608588 200.498383,47.3255959 C200.904349,46.7159911 201.48366,46.2420097 202.161583,45.964796 C202.631181,45.7590159 203.139317,45.6559158 203.651982,45.6623961 C204.407442,45.6554936 205.146644,45.8817799 205.768782,46.310396 C206.389155,46.7100086 206.871737,47.2906151 207.151182,47.9735959 C207.349289,48.4455904 207.452062,48.9521141 207.453582,49.4639957 C207.447438,49.7364656 207.333514,49.995384 207.136782,50.1839957 C206.948371,50.3800931 206.688719,50.4917433 206.416782,50.4935957 C206.130228,50.5019586 205.853326,50.3896306 205.653582,50.1839957 C205.454137,49.9972949 205.339684,49.7371755 205.336782,49.4639957 C205.343325,49.1258332 205.245255,48.793904 205.055982,48.5135958 C204.878847,48.2472104 204.628944,48.037292 204.335982,47.9087959 C204.131121,47.8217283 203.910573,47.7776189 203.687982,47.7791959 C203.35804,47.7829628 203.035949,47.880339 202.759183,48.0599959 C202.47315,48.2187308 202.249688,48.4701253 202.125583,48.7727958 L202.125583,48.7727958 Z" id="Path"></path>
            <path d="M212.018382,47.8223959 C211.945447,47.8972563 211.906409,47.9987554 211.910382,48.1031959 L211.910382,52.0559955 C211.904833,52.1585694 211.944267,52.2584677 212.018382,52.3295955 C212.096731,52.3952655 212.1971,52.428722 212.299182,52.4231955 L215.128781,52.4231955 C215.401603,52.4277458 215.661108,52.5419278 215.848781,52.7399955 C216.05196,52.9390688 216.166456,53.2115457 216.166456,53.4959954 C216.166456,53.7804451 216.05196,54.052922 215.848781,54.2519953 C215.66037,54.4480928 215.400718,54.559743 215.128781,54.5615953 L212.299182,54.5615953 C212.19424,54.5552172 212.091598,54.5941274 212.017256,54.6684694 C211.942914,54.7428113 211.904004,54.8454535 211.910382,54.9503953 L211.910382,58.9319949 C211.908966,59.0296167 211.948068,59.1234605 212.018382,59.1911949 C212.093242,59.2641298 212.194741,59.3031679 212.299182,59.2991949 L216.208781,59.2991949 C216.788497,59.3106778 217.255698,59.7778796 217.267181,60.3575948 C217.272175,60.6470631 217.157564,60.9257764 216.950381,61.1279947 C216.76197,61.3240922 216.502318,61.4357424 216.230381,61.4375947 L210.873582,61.4375947 C210.601985,61.4341324 210.342928,61.3227382 210.153582,61.1279947 C209.949042,60.9245563 209.837098,60.6459981 209.843982,60.3575948 L209.843982,46.691996 C209.845834,46.4200591 209.957484,46.1604075 210.153582,45.971996 C210.342194,45.7752647 210.601112,45.6613406 210.873582,45.6551961 L216.230381,45.6551961 C216.810097,45.6666789 217.277298,46.1338808 217.288781,46.713596 C217.282637,46.9860659 217.168713,47.2449842 216.971981,47.4335959 C216.78357,47.6296934 216.523918,47.7413436 216.251981,47.7431959 L212.342382,47.7431959 C212.227951,47.7185008 212.108516,47.7476958 212.018382,47.8223959 L212.018382,47.8223959 Z" id="Path"></path>
            <path d="M221.270381,61.0919947 C221.081969,61.2880922 220.822318,61.3997424 220.550381,61.4015947 C220.278784,61.3981324 220.019727,61.2867382 219.830381,61.0919947 C219.625841,60.8885563 219.513897,60.6099981 219.520781,60.3215948 L219.520781,46.691996 C219.517339,46.4543824 219.596198,46.2228936 219.743981,46.036796 C219.892564,45.8437752 220.103963,45.7087852 220.341581,45.6551961 C220.420512,45.645962 220.50025,45.645962 220.579181,45.6551961 C220.778345,45.6556978 220.973209,45.7131578 221.140781,45.8207961 C221.314038,45.9282968 221.45566,46.0798564 221.551181,46.259996 L225.410381,54.6119953 C225.45574,54.7117756 225.563467,54.7675803 225.671138,54.7470716 C225.778808,54.7265629 225.858478,54.6350634 225.863981,54.5255953 L225.863981,46.691996 C225.865833,46.4200591 225.977483,46.1604075 226.173581,45.971996 C226.362192,45.7752647 226.621111,45.6613406 226.89358,45.6551961 C227.484695,45.6389627 227.97895,46.1011227 228.00238,46.691996 L228.00238,60.3719948 C228.001909,60.6145603 227.920864,60.8500957 227.77198,61.0415947 C227.629029,61.2386993 227.419124,61.3769293 227.18158,61.430416 L227.05198,61.430416 L226.94398,61.430416 C226.741056,61.4316558 226.541726,61.3768401 226.367981,61.2719947 C226.188952,61.1627964 226.050041,60.9986277 225.971981,60.8039948 L222.019181,52.3799955 C221.99503,52.2948959 221.912623,52.2399581 221.824781,52.2503955 L221.759981,52.2503955 C221.649095,52.2721972 221.573757,52.3757864 221.587181,52.4879955 L221.587181,60.3503948 C221.584371,60.629881 221.470372,60.8967415 221.270381,61.0919947 L221.270381,61.0919947 Z" id="Path"></path>
            <path d="M232.88398,48.7727958 C232.780158,48.9727435 232.728171,49.1955475 232.73278,49.4207957 L232.73278,57.628795 C232.73371,57.9624423 232.839496,58.287356 233.03518,58.557595 C233.212315,58.8239804 233.462218,59.0338988 233.75518,59.1623949 C233.959195,59.2521721 234.180328,59.2963987 234.40318,59.2919949 C234.73433,59.2964247 235.058749,59.1983446 235.33198,59.0111949 C235.603043,58.8393504 235.814302,58.5878516 235.93678,58.291195 C236.021091,58.0854914 236.065089,57.8655028 236.06638,57.643195 C236.068232,57.3712582 236.179882,57.1116066 236.37598,56.9231951 C236.578198,56.7160126 236.856911,56.6014015 237.14638,56.6063951 C237.726095,56.617878 238.193297,57.0850799 238.204779,57.664795 C238.204743,58.0387411 238.146444,58.4103983 238.03198,58.7663949 C237.91834,59.1239962 237.758596,59.4652682 237.55678,59.7815949 C237.151497,60.4053995 236.56292,60.8883349 235.87198,61.1639947 C235.416882,61.3596041 234.927319,61.4624122 234.43198,61.4663971 C233.663961,61.4672435 232.912703,61.241866 232.27198,60.8183948 C231.658085,60.4077177 231.183511,59.8201504 230.91118,59.1335949 C230.715571,58.6784971 230.612763,58.1889345 230.60878,57.693595 L230.60878,49.4855957 C230.59529,48.7157816 230.821766,47.9608588 231.25678,47.3255959 C231.662747,46.7159911 232.242057,46.2420097 232.91998,45.964796 C233.389578,45.7590159 233.897714,45.6559158 234.41038,45.6623961 C235.16584,45.6554936 235.905042,45.8817799 236.52718,46.310396 C237.147552,46.7100086 237.630134,47.2906151 237.90958,47.9735959 C238.107686,48.4455904 238.210459,48.9521141 238.211979,49.4639957 C238.205835,49.7364656 238.091911,49.995384 237.89518,50.1839957 C237.706768,50.3800931 237.447116,50.4917433 237.17518,50.4935957 C236.886776,50.5004798 236.608211,50.3885358 236.40478,50.1839957 C236.210036,49.9946494 236.098642,49.7355929 236.09518,49.4639957 C236.101722,49.1258332 236.003652,48.793904 235.81438,48.5135958 C235.637245,48.2472104 235.387342,48.037292 235.09438,47.9087959 C234.889518,47.8217283 234.668971,47.7776189 234.44638,47.7791959 C234.116437,47.7829628 233.794346,47.880339 233.51758,48.0599959 C233.231547,48.2187308 233.008085,48.4701253 232.88398,48.7727958 L232.88398,48.7727958 Z" id="Path"></path>
            <path d="M242.776779,47.8223959 C242.703844,47.8972563 242.664806,47.9987554 242.668779,48.1031959 L242.668779,52.0559955 C242.663231,52.1585694 242.702664,52.2584677 242.776779,52.3295955 C242.855128,52.3952655 242.955498,52.428722 243.057579,52.4231955 L245.887179,52.4231955 C246.16,52.4277458 246.419505,52.5419278 246.607179,52.7399955 C246.810357,52.9390688 246.924853,53.2115457 246.924853,53.4959954 C246.924853,53.7804451 246.810357,54.052922 246.607179,54.2519953 C246.418767,54.4480928 246.159116,54.559743 245.887179,54.5615953 L243.057579,54.5615953 C242.952637,54.5552172 242.849995,54.5941274 242.775653,54.6684694 C242.701311,54.7428113 242.662401,54.8454535 242.668779,54.9503953 L242.668779,58.9319949 C242.667363,59.0296167 242.706465,59.1234605 242.776779,59.1911949 C242.85164,59.2641298 242.953139,59.3031679 243.057579,59.2991949 L246.967179,59.2991949 C247.546894,59.3106778 248.014096,59.7778796 248.025586,60.3575948 C248.026619,60.6315057 247.920702,60.8950046 247.730379,61.0919947 C247.541967,61.2880922 247.282316,61.3997424 247.010379,61.4015947 L241.610379,61.4015947 C241.338782,61.3981324 241.079726,61.2867382 240.890379,61.0919947 C240.685839,60.8885563 240.573895,60.6099981 240.580779,60.3215948 L240.580779,46.691996 C240.582632,46.4200591 240.694282,46.1604075 240.890379,45.971996 C241.078991,45.7752647 241.337909,45.6613406 241.610379,45.6551961 L246.967179,45.6551961 C247.546894,45.6666789 248.014096,46.1338808 248.025586,46.713596 C248.019434,46.9860659 247.90551,47.2449842 247.708779,47.4335959 C247.520367,47.6296934 247.260716,47.7413436 246.988779,47.7431959 L243.079179,47.7431959 C242.971694,47.7252039 242.861645,47.7540262 242.776779,47.8223959 L242.776779,47.8223959 Z" id="Path"></path>
            <path d="M119.85119,83.4119928 C119.852407,83.6789411 119.752016,83.9363533 119.57039,84.1319928 C119.382949,84.3294867 119.122673,84.4414053 118.85039,84.4415927 C118.579126,84.4365727 118.320637,84.3254226 118.13039,84.1319928 C117.928658,83.9267055 117.817212,83.6493876 117.82079,83.3615928 L117.82079,69.731994 C117.814841,69.4495071 117.924439,69.1768286 118.124232,68.9770359 C118.324024,68.7772432 118.596703,68.667645 118.87919,68.6735941 L121.29839,68.6735941 C122.29769,68.666438 123.27605,68.9599463 124.106389,69.515994 C125.488057,70.4430198 126.314861,71.9993564 126.309614,73.6631937 C126.311715,74.6649605 126.010503,75.6439002 125.445589,76.4711934 C124.905456,77.2742651 124.138485,77.8983688 123.242389,78.2639933 C122.632382,78.5418668 121.968662,78.6819854 121.29839,78.6743932 L120.32639,78.6743932 C120.228768,78.6729776 120.134924,78.7120792 120.06719,78.7823932 C119.985605,78.843582 119.93759,78.9396118 119.93759,79.0415932 L119.85119,83.4119928 Z M119.851153,76.1759934 C119.849774,76.2736152 119.888876,76.367459 119.95919,76.4351934 C120.03405,76.5081284 120.135549,76.5471665 120.23999,76.5431934 L121.21199,76.5431934 C121.78959,76.5437904 122.354025,76.3706969 122.831989,76.0463935 C123.307376,75.7404609 123.676944,75.295471 123.890389,74.7719936 C124.499001,73.3106227 123.814044,71.6319964 122.356789,71.0135939 C122.003205,70.856472 121.620512,70.7755179 121.23359,70.7759939 L120.26159,70.7759939 C120.156648,70.7696158 120.054006,70.808526 119.979664,70.882868 C119.905322,70.95721 119.866412,71.0598521 119.87279,71.1647939 L119.851153,76.1759934 Z" id="Shape"></path>
            <path d="M136.007988,75.6359935 C135.908189,75.7946561 135.797525,75.9462185 135.676788,76.0895934 C135.558784,76.2279088 135.431274,76.3578241 135.295188,76.4783934 C135.224365,76.5479767 135.178761,76.6391851 135.165588,76.7375934 C135.148901,76.829292 135.172512,76.9237357 135.230388,76.9967934 C135.618507,77.5074268 135.86668,78.1104882 135.950388,78.7463932 C135.993588,79.0055932 136.036788,79.3151932 136.087188,79.6679931 C136.137588,80.0207931 136.195188,80.3879931 136.245588,80.769593 C136.295988,81.151193 136.339188,81.489593 136.389588,81.871193 C136.439988,82.2527929 136.490388,82.5119929 136.533588,82.7423929 L136.598388,83.2391928 C136.642197,83.5207547 136.566515,83.8078248 136.389588,84.0311928 C136.21845,84.2648469 135.957381,84.416267 135.669588,84.4487927 C135.619734,84.4592816 135.568243,84.4592816 135.518388,84.4487927 C135.254001,84.4581017 134.996175,84.3652845 134.798388,84.1895928 C134.598,84.0189885 134.467313,83.7806773 134.431188,83.5199928 C134.431188,83.5199928 134.431188,83.3255928 134.351988,82.9727929 C134.272788,82.6199929 134.243988,82.2023929 134.179188,81.719993 C134.114388,81.237593 134.049588,80.747993 133.977588,80.2799931 C133.905588,79.8119931 133.847988,79.3727932 133.804788,79.0559932 C133.74551,78.6611545 133.546174,78.3008157 133.243189,78.0407933 C132.946584,77.7747221 132.561641,77.6284439 132.163189,77.6303933 L130.723189,77.6303933 C130.618247,77.6240152 130.515605,77.6629254 130.441263,77.7372674 C130.366921,77.8116094 130.328011,77.9142515 130.334389,78.0191933 L130.334389,83.4119928 C130.339382,83.7014611 130.224771,83.9801744 130.017589,84.1823928 C129.829177,84.3784902 129.569526,84.4901404 129.297589,84.4920171 C129.010567,84.4939256 128.73474,84.380761 128.53178,84.1778012 C128.328821,83.9748415 128.215656,83.6990148 128.217565,83.4119928 L128.217565,69.731994 C128.216738,69.4461012 128.333976,69.172545 128.541589,68.9759941 C128.732122,68.7838962 128.99103,68.6751546 129.261589,68.6735941 L132.199189,68.6735941 C133.091874,68.6646525 133.966022,68.928404 134.704788,69.429594 C135.43336,69.9091234 136.004368,70.5928303 136.346388,71.3951939 C136.459037,71.6746581 136.545801,71.9638709 136.605588,72.2591938 C136.663528,72.5508214 136.692469,72.8474665 136.691988,73.1447937 C136.728622,74.0261211 136.489525,74.8969384 136.007988,75.6359935 L136.007988,75.6359935 Z M134.474388,74.0519936 C134.585982,73.7549148 134.644472,73.4405287 134.647188,73.1231937 C134.645208,72.6560033 134.510359,72.1990167 134.258388,71.8055938 C133.809259,71.1626303 133.077047,70.7764084 132.292789,70.7687939 L130.802389,70.7687939 C130.697447,70.7624158 130.594805,70.801326 130.520463,70.875668 C130.446121,70.95001 130.407211,71.0526521 130.413589,71.1575939 L130.413589,75.1103935 C130.412173,75.2080153 130.451275,75.3018591 130.521589,75.3695935 C130.596449,75.4425284 130.697948,75.4815666 130.802389,75.4775935 L132.292789,75.4775935 C132.761182,75.4840817 133.220553,75.3485294 133.610388,75.0887935 C134.001736,74.8443483 134.304521,74.4810061 134.474388,74.0519936 L134.474388,74.0519936 Z" id="Shape"></path>
            <path d="M140.932788,83.7359928 C140.602867,83.5079904 140.305012,83.2367732 140.047188,82.9295929 C139.788339,82.61946 139.577214,82.2724392 139.420788,81.8999929 C139.205798,81.3870145 139.095635,80.8362002 139.096788,80.2799931 L139.096788,72.7847937 C139.093923,72.3718078 139.157121,71.9610209 139.283988,71.5679938 C139.398601,71.1770742 139.576125,70.8074342 139.809588,70.4735939 C140.24602,69.7878749 140.888907,69.2584385 141.645588,68.9615941 C142.158566,68.7466039 142.709381,68.6364411 143.265588,68.6374389 C144.098978,68.6302768 144.914089,68.8818541 145.598387,69.357594 C146.269989,69.7946951 146.790442,70.4282897 147.088787,71.1719939 C147.311566,71.6833196 147.429102,72.2342694 147.434387,72.7919937 L147.434387,80.2871931 C147.433444,81.1193541 147.18261,81.932054 146.714387,82.6199929 C146.483829,82.950102 146.210209,83.2479355 145.900787,83.5055928 C145.593176,83.7642704 145.248552,83.9754128 144.878388,84.1319928 C143.579147,84.6747265 142.094185,84.5286647 140.925588,83.7431928 L140.932788,83.7359928 Z M141.235188,80.2799931 C141.228216,80.6882919 141.349051,81.0885574 141.580788,81.424793 C141.79663,81.7486045 142.105338,81.9995863 142.466388,82.1447929 C142.720247,82.2472765 142.991835,82.298658 143.265588,82.2959929 C143.673886,82.3029651 144.074152,82.1821302 144.410388,81.9503929 C144.734199,81.7345504 144.985181,81.4258428 145.130388,81.064793 C145.232871,80.8109334 145.284253,80.5393457 145.281587,80.2655931 L145.281587,72.7847937 C145.290971,72.3828594 145.1697,71.9887293 144.935988,71.6615938 C144.720145,71.3377823 144.411437,71.0868005 144.050388,70.9415939 C143.798277,70.830963 143.526482,70.7721965 143.251188,70.7687939 C142.844668,70.7739618 142.447859,70.893753 142.106388,71.1143939 C141.778512,71.3352391 141.527008,71.6521333 141.386388,72.0215938 C141.326369,72.1418087 141.285092,72.2704969 141.263988,72.4031938 C141.25354,72.534987 141.25354,72.6674005 141.263988,72.7991937 L141.235188,80.2799931 Z" id="Shape"></path>
            <path d="M152.251187,72.0071938 C152.139312,72.2512798 152.080419,72.5162983 152.078387,72.7847937 L152.078387,80.2799931 C152.083555,80.686513 152.203346,81.0833215 152.423987,81.424793 C152.655205,81.7429032 152.968881,81.9918531 153.331187,82.1447929 C153.583422,82.2527097 153.856161,82.304309 154.130387,82.2959929 C154.939612,82.2924444 155.669466,81.8087039 155.987987,81.064793 C156.098617,80.8126828 156.157384,80.5408878 156.160787,80.2655931 L156.160787,78.9911932 C156.162202,78.8935714 156.123101,78.7997276 156.052787,78.7319932 C155.977926,78.6590583 155.876427,78.6200202 155.771987,78.6239932 L154.850387,78.6239932 C154.578789,78.620531 154.319733,78.5091367 154.130387,78.3143933 C153.925847,78.1109549 153.813903,77.8323966 153.820787,77.5439933 C153.822639,77.2720565 153.934289,77.0124048 154.130387,76.8239934 C154.318998,76.627262 154.577917,76.5133379 154.850387,76.5071934 L157.226386,76.5071934 C157.807683,76.5149451 158.277035,76.9842963 158.284786,77.5655933 L158.284786,80.2871931 C158.292104,81.1205837 158.040526,81.935694 157.564786,82.6199929 C157.11626,83.2864445 156.486795,83.810999 155.750387,84.1319928 C154.451146,84.6747265 152.966184,84.5286647 151.797587,83.7431928 C151.467666,83.5151904 151.169811,83.2439732 150.911987,82.9367929 C150.653138,82.62666 150.442013,82.2796392 150.285587,81.9071929 C150.070597,81.3942145 149.960434,80.8434002 149.961578,80.2871931 L149.961578,72.7847937 C149.960903,72.3730313 150.019091,71.9632858 150.134387,71.5679938 C150.248043,71.1740499 150.430894,70.8034736 150.674387,70.4735939 C151.110819,69.7878749 151.753706,69.2584385 152.510387,68.9615941 C153.014551,68.742636 153.559155,68.6322432 154.108787,68.6375941 L154.108787,68.6375941 C154.935171,68.632382 155.742772,68.8839713 156.419987,69.357594 C156.748069,69.5851272 157.045686,69.8537084 157.305586,70.156794 C157.565741,70.460683 157.777065,70.8031736 157.931986,71.1719939 C158.146977,71.6849724 158.257139,72.2357866 158.255986,72.7919937 C158.256217,73.0763161 158.142044,73.3487746 157.939186,73.5479937 C157.75424,73.7508061 157.493636,73.868078 157.219186,73.8719936 C156.945114,73.86639 156.685146,73.749404 156.499187,73.5479937 C156.298282,73.3480409 156.18664,73.0754283 156.189587,72.7919937 C156.180406,72.3928489 156.060778,72.0040586 155.843987,71.6687938 C155.612769,71.3506836 155.299092,71.1017337 154.936787,70.9487939 C154.692701,70.8369193 154.427682,70.7780263 154.159187,70.7759939 C153.751154,70.7709212 153.351452,70.8915861 153.014387,71.1215939 C152.673904,71.3300351 152.407068,71.639665 152.251187,72.0071938 Z" id="Path"></path>
            <path d="M168.602385,75.6359935 C168.500101,75.7947609 168.387035,75.9463174 168.263986,76.0895934 C168.148413,76.2277728 168.023307,76.3576904 167.889586,76.4783934 C167.818763,76.5479767 167.773158,76.6391851 167.759986,76.7375934 C167.743298,76.829292 167.766909,76.9237357 167.824786,76.9967934 C168.212904,77.5074268 168.461077,78.1104882 168.544785,78.7463932 C168.587985,79.0055932 168.631185,79.3151932 168.681585,79.6679931 C168.731985,80.0207931 168.782385,80.3879931 168.832785,80.769593 C168.883185,81.151193 168.933585,81.489593 168.983985,81.871193 C169.034385,82.2527929 169.084785,82.5119929 169.127985,82.7423929 L169.192785,83.2391928 C169.236594,83.5207547 169.160912,83.8078248 168.983985,84.0311928 C168.812847,84.2648469 168.551778,84.416267 168.263986,84.4487927 C168.214131,84.4592816 168.16264,84.4592816 168.112786,84.4487927 C167.848398,84.4581017 167.590573,84.3652845 167.392786,84.1895928 C167.192397,84.0189885 167.06171,83.7806773 167.025586,83.5199928 C167.025586,83.5199928 167.025586,83.3255928 166.946386,82.9727929 C166.867186,82.6199929 166.838386,82.2023929 166.773586,81.719993 C166.708786,81.237593 166.643986,80.747993 166.571986,80.2799931 C166.499986,79.8119931 166.442386,79.3727932 166.399186,79.0559932 C166.339907,78.6611545 166.140571,78.3008157 165.837586,78.0407933 C165.540981,77.7747221 165.156038,77.6284439 164.757586,77.6303933 L163.317586,77.6303933 C163.212644,77.6240152 163.110002,77.6629254 163.03566,77.7372674 C162.961318,77.8116094 162.922408,77.9142515 162.928786,78.0191933 L162.928786,83.4119928 C162.93378,83.7014611 162.819169,83.9801744 162.611986,84.1823928 C162.423575,84.3784902 162.163923,84.4901404 161.891986,84.4919927 C161.603771,84.4979372 161.325601,84.3860618 161.121759,84.1822196 C160.917917,83.9783775 160.806042,83.7002079 160.811986,83.4119928 L160.811986,69.731994 C160.811135,69.4461012 160.928373,69.172545 161.135986,68.9759941 C161.335247,68.7748676 161.608986,68.6653717 161.891986,68.6735941 L164.829586,68.6735941 C165.722271,68.6646525 166.596419,68.928404 167.335186,69.429594 C168.063757,69.9091234 168.634765,70.5928303 168.976785,71.3951939 C169.089435,71.6746581 169.176198,71.9638709 169.235985,72.2591938 C169.293925,72.5508214 169.322866,72.8474665 169.322385,73.1447937 C169.348386,74.0300016 169.096612,74.9011404 168.602385,75.6359935 L168.602385,75.6359935 Z M167.090386,74.0519936 C167.201979,73.7549148 167.260469,73.4405287 167.263186,73.1231937 C167.261205,72.6560033 167.126356,72.1990167 166.874386,71.8055938 C166.425256,71.1626303 165.693044,70.7764084 164.908786,70.7687939 L163.418386,70.7687939 C163.313444,70.7624158 163.210802,70.801326 163.13646,70.875668 C163.062118,70.95001 163.023208,71.0526521 163.029586,71.1575939 L163.029586,75.1103935 C163.02817,75.2080153 163.067272,75.3018591 163.137586,75.3695935 C163.212446,75.4425284 163.313945,75.4815666 163.418386,75.4775935 L164.908786,75.4775935 C165.377179,75.4840817 165.836551,75.3485294 166.226386,75.0887935 C166.617733,74.8443483 166.920519,74.4810061 167.090386,74.0519936 L167.090386,74.0519936 Z" id="Shape"></path>
            <path d="M171.777585,84.4487927 C171.496015,84.4098852 171.248552,84.2422484 171.107985,83.9951928 C170.924915,83.7807283 170.860177,83.4894081 170.935185,83.2175928 C171.352785,80.942393 171.727185,78.8903932 172.058385,77.0615934 C172.202385,76.2839934 172.339185,75.5207935 172.475985,74.7719936 L172.843185,72.7559937 C172.951185,72.1583938 173.044785,71.6687938 173.116785,71.3159939 C173.188785,70.9631939 173.231985,70.7183939 173.246385,70.6751939 C173.341372,70.1082313 173.641121,69.5958403 174.088785,69.235194 C174.514944,68.8681734 175.059988,68.6685797 175.622385,68.6735019 C176.794195,68.6767731 177.799412,69.5099259 178.019985,70.6607939 C178.019985,70.7039939 178.055985,70.9127939 178.127985,71.2871939 C178.199985,71.6615938 178.286385,72.1511938 178.394385,72.7271937 L178.761585,74.7431936 C178.898385,75.4631935 179.042385,76.2551934 179.186385,77.0327934 C179.517585,78.8615932 179.899185,80.920793 180.331184,83.2103928 C180.406193,83.4822081 180.341455,83.7735283 180.158384,83.9879928 C180.017818,84.2350484 179.770354,84.4026852 179.488785,84.4415927 C179.424345,84.4512594 179.358824,84.4512594 179.294385,84.4415927 C179.044104,84.4464809 178.800727,84.3593777 178.610385,84.1967928 C178.417889,84.0306946 178.286164,83.8052419 178.235985,83.5559928 L177.566385,79.9559931 C177.561191,79.8658333 177.518603,79.7819325 177.44889,79.7245222 C177.379178,79.6671119 177.288667,79.6414024 177.199185,79.6535931 L174.067185,79.6535931 C173.877022,79.6322727 173.70453,79.7664332 173.678385,79.9559931 L173.030385,83.5559928 C172.977761,83.8059978 172.843522,84.0314167 172.648785,84.1967928 C172.460995,84.3588958 172.220023,84.4460561 171.971985,84.4415927 C171.907904,84.4536527 171.842382,84.4560795 171.777585,84.4487927 L171.777585,84.4487927 Z M174.218385,77.1047934 C174.205887,77.2130672 174.236972,77.3218654 174.304785,77.4071933 C174.36856,77.4973969 174.475566,77.5467846 174.585585,77.5367933 L176.659185,77.5367933 C176.774582,77.5425688 176.886182,77.4947403 176.961585,77.4071933 C177.029397,77.3218654 177.060483,77.2130672 177.047985,77.1047934 C176.932785,76.5143934 176.824785,75.9383935 176.723985,75.3695935 C176.623185,74.8007936 176.522385,74.2679936 176.428785,73.7711936 C176.335185,73.2743937 176.255985,72.8279937 176.183985,72.4319938 L176.011185,71.4671938 C175.975469,71.2833328 175.80938,71.1541531 175.622385,71.1647939 C175.439049,71.151922 175.277707,71.2847918 175.255185,71.4671938 L175.082385,72.4319938 C175.010385,72.8279937 174.923985,73.2743937 174.830385,73.7711936 L174.527985,75.3695935 C174.419985,75.9383935 174.290385,76.5143934 174.218385,77.1047934 Z" id="Shape"></path>
            <path d="M191.087984,84.4703927 C190.816386,84.4669305 190.55733,84.3555362 190.367984,84.1607928 C190.163443,83.9573544 190.0515,83.6787961 190.058384,83.3903928 L190.058384,75.8303935 C190.067053,75.7239999 189.991285,75.6292903 189.885584,75.6143935 L189.820784,75.6143935 C189.735617,75.6139031 189.658688,75.6651891 189.626384,75.7439935 L188.186384,79.0487932 C188.102014,79.233544 187.967257,79.3907597 187.797584,79.5023932 C187.625023,79.6174124 187.42175,79.6776413 187.214384,79.6751931 C186.797001,79.6702973 186.419272,79.426872 186.242384,79.0487932 L184.802384,75.7439935 C184.785971,75.6918902 184.749117,75.648678 184.700257,75.624248 C184.651397,75.5998179 184.594714,75.5962618 184.543184,75.6143935 C184.437482,75.6292903 184.361715,75.7239999 184.370384,75.8303935 L184.370384,83.4119928 C184.375254,83.7028764 184.257687,83.982423 184.046384,84.1823928 C183.855267,84.3745476 183.597321,84.4854646 183.326384,84.4919927 C183.054787,84.4885305 182.795731,84.3771362 182.606384,84.1823928 C182.401844,83.9789544 182.2899,83.7003961 182.296784,83.4119928 L182.296784,69.731994 C182.291423,69.4872465 182.375954,69.2490221 182.534384,69.0623941 C182.690122,68.87682 182.902691,68.7477602 183.139184,68.6951941 C183.210813,68.6848554 183.283555,68.6848554 183.355184,68.6951941 C183.780434,68.672277 184.172376,68.9248618 184.327184,69.321594 L186.962384,75.4919935 C186.962384,75.5783935 187.027184,75.6215935 187.156784,75.6215935 C187.248611,75.6270312 187.334369,75.5755764 187.372784,75.4919935 L190.115984,69.271194 C190.194464,69.0786803 190.333463,68.9169358 190.511984,68.8103941 C190.685142,68.7033666 190.884422,68.6460735 191.087984,68.6447941 C191.159612,68.6344554 191.232355,68.6344554 191.303984,68.6447941 C191.541901,68.6988518 191.756325,68.8275062 191.915983,69.0119941 C192.081436,69.1954185 192.171449,69.4345982 192.167983,69.681594 L192.167983,83.3615928 C192.172853,83.6524764 192.055287,83.932023 191.843983,84.1319928 C191.648916,84.3435033 191.375676,84.4658106 191.087984,84.4703927 Z" id="Path"></path>
            <path d="M203.594382,84.4703927 C203.322785,84.4669305 203.063729,84.3555362 202.874383,84.1607928 C202.669842,83.9573544 202.557898,83.6787961 202.564783,83.3903928 L202.564783,75.8303935 C202.573452,75.7239999 202.497684,75.6292903 202.391983,75.6143935 L202.327183,75.6143935 C202.242015,75.6139031 202.165086,75.6651891 202.132783,75.7439935 L200.692783,79.0487932 C200.608413,79.233544 200.473656,79.3907597 200.303983,79.5023932 C200.131422,79.6174124 199.928149,79.6776413 199.720783,79.6751931 C199.303399,79.6702973 198.925671,79.426872 198.748783,79.0487932 L197.308783,75.7439935 C197.29237,75.6918902 197.255516,75.648678 197.206656,75.624248 C197.157796,75.5998179 197.101113,75.5962618 197.049583,75.6143935 C196.943881,75.6292903 196.868114,75.7239999 196.876783,75.8303935 L196.876783,83.4119928 C196.881653,83.7028764 196.764086,83.982423 196.552783,84.1823928 C196.35283,84.3832975 196.080218,84.4949389 195.796783,84.4920496 C195.525186,84.4885305 195.266129,84.3771362 195.076783,84.1823928 C194.872243,83.9789544 194.760299,83.7003961 194.767183,83.4119928 L194.767183,69.731994 C194.761822,69.4872465 194.846353,69.2490221 195.004783,69.0623941 C195.160521,68.87682 195.37309,68.7477602 195.609583,68.6951941 C195.681212,68.6848554 195.753954,68.6848554 195.825583,68.6951941 C196.250832,68.672277 196.642774,68.9248618 196.797583,69.321594 L199.490383,75.4919935 C199.490383,75.5783935 199.555183,75.6215935 199.684783,75.6215935 C199.77661,75.6270312 199.862368,75.5755764 199.900783,75.4919935 L202.643983,69.271194 C202.722463,69.0786803 202.861462,68.9169358 203.039983,68.8103941 C203.213141,68.7033666 203.412421,68.6460735 203.615982,68.6447941 C203.687611,68.6344554 203.760354,68.6344554 203.831982,68.6447941 C204.069899,68.6988518 204.284323,68.8275062 204.443982,69.0119941 C204.609435,69.1954185 204.699448,69.4345982 204.695982,69.681594 L204.695982,83.3615928 C204.700852,83.6524764 204.583286,83.932023 204.371982,84.1319928 C204.171801,84.3489801 203.889601,84.471789 203.594382,84.4703927 Z" id="Path"></path>
            <path d="M209.570382,70.8623939 C209.497447,70.9372543 209.458409,71.0387534 209.462382,71.1431939 L209.462382,75.0959935 C209.456834,75.1985674 209.496267,75.2984657 209.570382,75.3695935 C209.648731,75.4352635 209.749101,75.46872 209.851182,75.4631935 L212.680782,75.4631935 C212.953603,75.4677438 213.213108,75.5819259 213.400782,75.7799935 C213.60396,75.9790668 213.718456,76.2515437 213.718456,76.5359934 C213.718456,76.8204431 213.60396,77.09292 213.400782,77.2919933 C213.21237,77.4880908 212.952719,77.599741 212.680782,77.6015933 L209.851182,77.6015933 C209.74624,77.5952152 209.643598,77.6341254 209.569256,77.7084674 C209.494914,77.7828094 209.456004,77.8854515 209.462382,77.9903933 L209.462382,81.9719929 C209.460966,82.0696147 209.500068,82.1634585 209.570382,82.2311929 C209.645242,82.3041279 209.746741,82.343166 209.851182,82.3391929 L213.760782,82.3391929 C214.340497,82.3506758 214.807699,82.8178777 214.819182,83.3975928 C214.824175,83.6870611 214.709564,83.9657744 214.502382,84.1679928 C214.31397,84.3640902 214.054318,84.4757404 213.782382,84.4775927 L208.425582,84.4775927 C208.153985,84.4741305 207.894928,84.3627362 207.705582,84.1679928 C207.501042,83.9645544 207.389098,83.6859961 207.395982,83.3975928 L207.395982,69.731994 C207.397834,69.4600571 207.509485,69.2004055 207.705582,69.0119941 C207.894194,68.8152627 208.153112,68.7013386 208.425582,68.6951941 L213.782382,68.6951941 C214.362097,68.7066769 214.829299,69.1738788 214.840782,69.753594 C214.834637,70.0260639 214.720713,70.2849823 214.523982,70.4735939 C214.33557,70.6696914 214.075918,70.7813416 213.803982,70.7831939 L209.894382,70.7831939 C209.779951,70.7584988 209.660516,70.7876939 209.570382,70.8623939 L209.570382,70.8623939 Z M209.030382,65.3111944 L211.665582,64.0367945 C211.923915,63.9056377 212.224927,63.8869155 212.497522,63.9850497 C212.770117,64.0831839 212.990124,64.2894729 213.105582,64.5551944 C213.230474,64.8065497 213.248124,65.097801 213.154497,65.3623982 C213.06087,65.6269954 212.863968,65.8423284 212.608782,65.9591943 L209.973582,67.2335942 C209.726828,67.3632542 209.437179,67.3841298 209.174382,67.2911942 C208.908754,67.2031632 208.6904,67.010804 208.569582,66.7583943 C208.440797,66.4959748 208.420115,66.1935012 208.511982,65.9159943 C208.59323,65.6555886 208.774496,65.4380684 209.015982,65.3111944 L209.030382,65.3111944 Z" id="Shape"></path>
            <path d="M219.340781,70.8623939 C219.267846,70.9372543 219.228808,71.0387534 219.232781,71.1431939 L219.232781,75.0959935 C219.227233,75.1985674 219.266666,75.2984657 219.340781,75.3695935 C219.41913,75.4352635 219.5195,75.46872 219.621581,75.4631935 L222.451181,75.4631935 C222.724002,75.4677438 222.983507,75.5819259 223.171181,75.7799935 C223.374359,75.9790668 223.488855,76.2515437 223.488855,76.5359934 C223.488855,76.8204431 223.374359,77.09292 223.171181,77.2919933 C222.982769,77.4880908 222.723118,77.599741 222.451181,77.6015933 L219.650381,77.6015933 C219.545439,77.5952152 219.442797,77.6341254 219.368455,77.7084674 C219.294113,77.7828094 219.255203,77.8854515 219.261581,77.9903933 L219.261581,81.9719929 C219.260165,82.0696147 219.299267,82.1634585 219.369581,82.2311929 C219.444442,82.3041279 219.545941,82.343166 219.650381,82.3391929 L223.559981,82.3391929 C224.139696,82.3506758 224.606898,82.8178777 224.618381,83.3975928 C224.623374,83.6870611 224.508763,83.9657744 224.301581,84.1679928 C224.113169,84.3640902 223.853518,84.4757404 223.581581,84.4775927 L218.210381,84.4775927 C217.938784,84.4741305 217.679728,84.3627362 217.490381,84.1679928 C217.285841,83.9645544 217.173897,83.6859961 217.180781,83.3975928 L217.180781,69.731994 C217.182634,69.4600571 217.294284,69.2004055 217.490381,69.0119941 C217.678993,68.8152627 217.937911,68.7013386 218.210381,68.6951941 L223.567181,68.6951941 C224.146896,68.7066769 224.614098,69.1738788 224.625581,69.753594 C224.619436,70.0260639 224.505512,70.2849823 224.308781,70.4735939 C224.120369,70.6696914 223.860718,70.7813416 223.588781,70.7831939 L219.650381,70.7831939 C219.540564,70.7630294 219.427425,70.791972 219.340781,70.8623939 L219.340781,70.8623939 Z" id="Path"></path>
            <path d="M51.8903955,77.7599933 L44.8343961,77.7599933 C42.9177473,77.7599933 41.3639964,79.3137442 41.3639964,81.230393 C41.3639964,83.1470418 42.9177473,84.7007927 44.8343961,84.7007927 L51.8903955,84.7007927 C53.8070444,84.7007927 55.3607952,83.1470418 55.3607952,81.230393 C55.3607952,79.3137442 53.8070444,77.7599933 51.8903955,77.7599933 Z" id="Path"></path>
            <path d="M55.3247952,67.4063942 L41.3999964,67.4063942 C39.4833476,67.4063942 37.9295967,68.9601451 37.9295967,70.8767939 C37.9295967,72.7934427 39.4833476,74.3471936 41.3999964,74.3471936 L55.3247952,74.3471936 C57.2414441,74.3471936 58.7951949,72.7934427 58.7951949,70.8767939 C58.7951949,68.9601451 57.2414441,67.4063942 55.3247952,67.4063942 Z" id="Path"></path>
            <path d="M48.3623958,15.6383987 C50.2790447,15.6383987 51.8327955,14.0846478 51.8327955,12.167999 L51.8327955,3.4919997 C51.8327955,1.57535087 50.2790447,0.0215999981 48.3623958,0.0215999981 C46.445747,0.0215999981 44.8919961,1.57535087 44.8919961,3.4919997 L44.8919961,12.189599 C44.9038732,14.0978071 46.4541507,15.6383987 48.3623958,15.6383987 Z" id="Path"></path>
            <path d="M37.2671968,14.5439987 L32.2775972,7.41599936 C31.153643,5.91760248 29.0434369,5.58148787 27.5095813,6.65654759 C25.9757258,7.73160731 25.5717503,9.82987965 26.5967977,11.397599 L31.5863973,18.5255984 C32.2795146,19.58566 33.495084,20.1839423 34.7578811,20.0865481 C36.0206782,19.9891538 37.1301315,19.2115522 37.6525024,18.0577451 C38.1748732,16.903938 38.0271929,15.5571858 37.2671968,14.5439987 Z" id="Path"></path>
            <path d="M69.170394,6.60239943 C67.601451,5.50396295 65.4392613,5.884199 64.3391945,7.45199936 L59.3495949,14.5799987 C58.5895988,15.5931858 58.4419184,16.939938 58.9642893,18.0937451 C59.4866602,19.2475522 60.5961135,20.0251538 61.8589105,20.122548 C63.1217076,20.2199423 64.3372771,19.62166 65.0303944,18.5615984 L70.019994,11.433599 C70.5494142,10.6807422 70.7573825,9.74811252 70.5979753,8.84165318 C70.4385681,7.93519385 69.9248982,7.12946927 69.170394,6.60239943 Z" id="Path"></path>
            <path d="M80.1359931,22.2695981 L72.4103938,22.2695981 C70.4937449,22.2695981 68.9399941,23.823349 68.9399941,25.7399978 L68.9399941,81.251993 C68.9399941,83.1686418 70.4937449,84.7223927 72.4103938,84.7223927 C74.3270426,84.7223927 75.8807935,83.1686418 75.8807935,81.251993 L75.8807935,60.2495948 C75.8788688,59.8078996 76.0534802,59.383739 76.3658089,59.0714104 C76.6781375,58.7590817 77.1022981,58.5844703 77.5439933,58.586395 L80.1359931,58.586395 C90.1645996,58.586395 98.2943915,50.4566031 98.2943915,40.4279965 C98.2943915,30.39939 90.1645996,22.2695981 80.1359931,22.2695981 L80.1359931,22.2695981 Z M80.1359931,51.6455956 L77.4863933,51.6455956 C76.593188,51.6146497 75.8841266,50.8833307 75.8807935,49.9895957 L75.8807935,30.8519973 C75.8839373,29.9999163 76.5305401,29.2880315 77.3783933,29.2031975 L80.1359931,29.2031975 C86.331302,29.2031975 91.3535921,34.2254876 91.3535921,40.4207965 C91.3535921,46.6161054 86.331302,51.6383956 80.1359931,51.6383956 L80.1359931,51.6455956 Z" id="Shape"></path>
            <path d="M24.1847979,22.2695682 C22.2681491,22.2695682 20.7143982,23.823349 20.7143982,25.7399978 L20.7143982,48.6503958 C20.6417428,49.4551535 19.9942606,50.0873649 19.1879983,50.1407957 L8.47439927,50.1407957 C7.65918772,50.0863789 7.00677338,49.4431535 6.9407994,48.6287958 L6.9407994,25.7399978 C6.9407994,23.823349 5.38704853,22.2695682 3.4703997,22.2695682 C1.55375087,22.2695682 0,23.823349 0,25.7399978 L0,81.251993 C0,83.1686418 1.55375087,84.7223927 3.4703997,84.7223927 C5.38704853,84.7223927 6.9407994,83.1686418 6.9407994,81.251993 L6.9407994,58.571995 C7.01480083,57.8003117 7.61211715,57.1820893 8.38079928,57.0815951 L19.2455983,57.0815951 C19.9722509,57.14382 20.5735979,57.672188 20.7287982,58.384795 L20.7287982,81.251993 C20.7287982,83.1686418 22.2825491,84.7223927 24.1991979,84.7223927 C26.1158467,84.7223927 27.6695976,83.1686418 27.6695976,81.251993 L27.6695976,25.7399978 C27.6695976,24.8170902 27.3019992,23.9321911 26.6480552,23.2809494 C25.9941112,22.6297077 25.1076976,22.2657686 24.1847979,22.2695682 Z" id="Path"></path>
            <path d="M48.3335958,22.2695981 C40.6941493,22.2775352 34.5031341,28.4685503 34.495197,36.1079969 L34.495197,50.1551957 C34.495197,57.7979323 40.6908592,63.9935945 48.3335958,63.9935945 C55.9763325,63.9935945 62.1719946,57.7979323 62.1719946,50.1551957 L62.1719946,36.1079969 C62.1640576,28.4685503 55.9730424,22.2775352 48.3335958,22.2695981 Z M55.2311952,50.1551957 C55.2311952,53.9646346 52.1430348,57.0527951 48.3335958,57.0527951 C44.5241569,57.0527951 41.4359964,53.9646346 41.4359964,50.1551957 L41.4359964,36.1079969 C41.4359964,32.2985579 44.5241569,29.2103975 48.3335958,29.2103975 C52.1430348,29.2103975 55.2311952,32.2985579 55.2311952,36.1079969 L55.2311952,50.1551957 Z" id="Shape"></path>
        </g>
    </g>
</svg>