<?xml version="1.0" encoding="UTF-8"?>
<svg width="300px" height="300px" viewBox="0 0 300 300" version="1.1" xmlns="http://www.w3.org/2000/svg" xmlns:xlink="http://www.w3.org/1999/xlink">
    <!-- Generator: Sketch 59.1 (86144) - https://sketch.com -->
    <title>environnement/GoodPlanet</title>
    <desc>Created with Sketch.</desc>
    <g id="environnement/GoodPlanet" stroke="none" stroke-width="1" fill="none" fill-rule="evenodd">
        <g id="Plan-de-travail-1" transform="translate(38.000000, 123.000000)" fill="#194B49" fill-rule="nonzero">
            <polygon id="Path" points="64.2047923 0.41759995 64.2047923 1.14239986 57.8351931 1.14239986 57.8351931 6.23039926 63.3503924 6.23039926 63.3503924 6.95999917 57.8351931 6.95999917 57.8351931 12.5135985 56.9567932 12.5135985 56.9567932 0.41759995"></polygon>
            <path d="M78.3263907,6.46079923 C78.3385051,5.68808141 78.2200394,4.91886604 77.9759907,4.1855995 C77.7654767,3.55493119 77.4290787,2.97358313 76.9871908,2.4767997 C76.5634079,2.00981487 76.0401225,1.64400719 75.455991,1.40639983 C74.8234898,1.15039319 74.1462802,1.02311042 73.4639912,1.03199988 C72.7879697,1.02360356 72.1171335,1.15091552 71.4911915,1.40639983 C70.9062684,1.64509934 70.3816434,2.01069736 69.9551917,2.4767997 C69.5086875,2.97270653 69.1674075,3.55402562 68.9519918,4.1855995 C68.4783007,5.66705529 68.4783007,7.25934317 68.9519918,8.74079896 C69.1675065,9.37089302 69.5088119,9.95062241 69.9551917,10.4447988 C70.3803532,10.9123722 70.9053349,11.2782189 71.4911915,11.5151986 C72.1184517,11.765181 72.788815,11.8891412 73.4639912,11.8799986 C74.1451155,11.8910662 74.8218255,11.7687692 75.455991,11.5199986 C76.041079,11.284153 76.5647339,10.9180871 76.9871908,10.4495988 C77.4290638,9.95462354 77.7655007,9.37484146 77.9759907,8.74559896 C78.2203946,8.01076433 78.3388625,7.2399116 78.3263907,6.46559923 M79.2335906,6.46559923 C79.2453844,7.33158142 79.1040094,8.19283126 78.8159906,9.00959893 C78.5590794,9.73277056 78.1572807,10.3959018 77.6351907,10.9583987 C77.1233794,11.4999862 76.5014023,11.9255495 75.811191,12.2063985 C74.3067149,12.7950142 72.6356675,12.7950142 71.1311915,12.2063985 C70.4409801,11.9255495 69.8190031,11.4999862 69.3071917,10.9583987 C68.7834595,10.3971429 68.3814427,9.7336518 68.1263919,9.00959893 C67.556926,7.36469189 67.556926,5.57610657 68.1263919,3.93119953 C68.382565,3.20767792 68.78445,2.54440442 69.3071917,1.98239976 C69.8198783,1.44065369 70.441528,1.01367849 71.1311915,0.729599913 C71.8711689,0.426975702 72.6646027,0.276778366 73.4639912,0.287999966 C74.267599,0.27670281 75.0654436,0.425176955 75.811191,0.724799914 C76.502632,1.00558605 77.1249392,1.43301288 77.6351907,1.97759976 C78.1551789,2.54350456 78.5566617,3.20774641 78.8159906,3.93119953 C79.1028945,4.7449332 79.2442533,5.6028347 79.2335906,6.46559923" id="Shape"></path>
            <path d="M84.4031899,0.446399947 C84.4630819,0.478289783 84.5141896,0.524451498 84.5519899,0.580799931 L92.380789,11.0399987 C92.380789,10.8719987 92.356789,10.7039987 92.356789,10.5599987 L92.356789,0.41759995 L93.1199889,0.41759995 L93.1199889,12.5136246 L92.7023889,12.5136246 C92.5750948,12.5150993 92.45576,12.4518157 92.385589,12.3455985 L84.5231899,1.84319978 C84.5414441,2.00256288 84.5510581,2.16279728 84.5519899,2.32319972 L84.5519899,12.5136246 L83.78879,12.5136246 L83.78879,0.41759995 L84.21599,0.41759995 C84.2796834,0.414671316 84.3433221,0.424461882 84.4031899,0.446399947" id="Path"></path>
            <path d="M107.702387,6.46079923 C107.715119,5.69431789 107.596609,4.9313088 107.351987,4.2047995 C107.142449,3.5837224 106.805678,3.01317459 106.363187,2.5295997 C105.935795,2.07158523 105.410833,1.71559533 104.827188,1.48799982 C104.19262,1.24064812 103.516191,1.11840192 102.835188,1.12799987 L99.3071882,1.12799987 L99.3071882,11.8031986 L102.835188,11.8031986 C103.515656,11.8116018 104.191562,11.6910789 104.827188,11.4479986 C105.411136,11.2187161 105.936076,10.861101 106.363187,10.4015988 C106.805678,9.91802387 107.142449,9.34747606 107.351987,8.72639896 C107.597232,7.99673141 107.715744,7.23046242 107.702387,6.46079923 M108.609587,6.46079923 C108.623153,7.32105762 108.48002,8.1766013 108.187187,8.98559893 C107.932264,9.70007713 107.531818,10.3538662 107.011187,10.9055987 C106.496399,11.4330853 105.874391,11.8439378 105.187187,12.1103986 C104.436663,12.3971287 103.638545,12.5388353 102.835188,12.5279985 L98.4239883,12.5279985 L98.4239883,0.41759995 L102.835188,0.41759995 C103.638545,0.406763145 104.436663,0.548469738 105.187187,0.8351999 C105.874391,1.10166062 106.496399,1.51251317 107.011187,2.03999976 C107.531264,2.59215595 107.931634,3.24582245 108.187187,3.95999953 C108.479647,4.76410501 108.622796,5.61486188 108.609587,6.47039923" id="Shape"></path>
            <path d="M113.884786,8.12159903 L119.303986,8.12159903 L116.831986,2.00639976 C116.793586,1.91039977 116.750386,1.79999979 116.711986,1.6799998 C116.673586,1.55999981 116.630386,1.42559983 116.591986,1.29119985 C116.553586,1.42559983 116.515186,1.55519981 116.471986,1.6799998 C116.428786,1.80479978 116.395186,1.91519977 116.351986,2.01599976 L113.884786,8.12159903 Z M121.977585,12.5135985 L121.305586,12.5135985 C121.234471,12.5183029 121.164197,12.4960209 121.108786,12.4511985 C121.055795,12.4057202 121.01462,12.3480741 120.988786,12.2831985 L119.548786,8.76959895 L113.615986,8.76959895 L112.199987,12.2831985 C112.176195,12.3478361 112.134591,12.4044178 112.079987,12.4463985 C112.021656,12.4931687 111.948272,12.5170613 111.873587,12.5135985 L111.206387,12.5135985 L116.159986,0.41759995 L117.033586,0.41759995 L121.977585,12.5135985 Z" id="Shape"></path>
            <polygon id="Path" points="132.518384 0.41759995 132.518384 1.16159986 128.270385 1.16159986 128.270385 12.5135985 127.401585 12.5135985 127.401585 1.16159986 123.124785 1.16159986 123.124785 0.41759995"></polygon>
            <rect id="Rectangle" x="136.641584" y="0.41759995" width="1" height="12.0959986"></rect>
            <path d="M153.028782,6.46079923 C153.040896,5.68808141 152.922431,4.91886604 152.678382,4.1855995 C152.465007,3.55414195 152.125308,2.97273519 151.679982,2.4767997 C151.256199,2.00981487 150.732914,1.64400719 150.148782,1.40639983 C149.516281,1.15039319 148.839071,1.02311042 148.156782,1.03199988 C147.480761,1.02360356 146.809925,1.15091552 146.183983,1.40639983 C145.598172,1.64602034 145.072169,2.01143643 144.643183,2.4767997 C144.198182,2.97297264 143.858525,3.55430902 143.644783,4.1855995 C143.171092,5.66705529 143.171092,7.25934317 143.644783,8.74079896 C143.858624,9.37060924 144.198306,9.95035601 144.643183,10.4447988 C145.073283,10.9143919 145.603031,11.2817709 146.193583,11.5199986 C146.820843,11.769981 147.491206,11.8939412 148.166382,11.8847986 C148.847824,11.8943387 149.524545,11.7704091 150.158382,11.5199986 C150.740485,11.2814951 151.260783,10.9138396 151.679982,10.4447988 C152.121855,9.94982354 152.458292,9.37004146 152.668782,8.74079896 C152.913186,8.00596433 153.031654,7.2351116 153.019182,6.46079923 M153.926382,6.46079923 C153.938175,7.32678142 153.7968,8.18803126 153.508782,9.00479893 C153.25006,9.72710997 152.848471,10.3898953 152.327982,10.9535987 C151.81617,11.4951862 151.194193,11.9207495 150.503982,12.2015985 C148.997907,12.7905216 147.325258,12.7905216 145.819183,12.2015985 C145.131043,11.9194974 144.510884,11.4940584 143.999983,10.9535987 C143.476387,10.39137 143.072965,9.72825547 142.814383,9.00479893 C142.251181,7.35884408 142.251181,5.57235438 142.814383,3.92639953 C143.074175,3.2035205 143.477456,2.54063745 143.999983,1.97759976 C144.511932,1.43717948 145.131722,1.01035891 145.819183,0.724799914 C146.56095,0.422552773 147.355873,0.272382576 148.156782,0.283199966 C148.96039,0.27190281 149.758235,0.420376956 150.503982,0.719999914 C151.195423,1.00078605 151.81773,1.42821288 152.327982,1.97279976 C152.846428,2.53985956 153.247713,3.20377506 153.508782,3.92639953 C153.795686,4.7401332 153.937044,5.5980347 153.926382,6.46079923" id="Shape"></path>
            <path d="M159.105581,0.446399947 C159.165473,0.478289783 159.216581,0.524451498 159.254381,0.580799931 L167.08318,11.0399987 C167.074382,10.8801196 167.074382,10.7198778 167.08318,10.5599987 L167.08318,0.41759995 L167.85118,0.41759995 L167.85118,12.5136647 L167.43358,12.5136647 C167.306067,12.5160072 167.186322,12.4525059 167.11678,12.3455985 L159.225581,1.84319978 C159.243835,2.00256288 159.253449,2.16279728 159.254381,2.32319972 L159.254381,12.5136647 L158.491181,12.5136647 L158.491181,0.41759995 L158.918381,0.41759995 C158.982075,0.414671316 159.045713,0.424461882 159.105581,0.446399947" id="Path"></path>
            <path d="M16.689598,50.678394 C17.5040652,50.6812763 18.3180806,50.6396141 19.1279977,50.553594 C19.834919,50.4744367 20.5357052,50.3477499 21.2255975,50.174394 C21.8584217,50.0153353 22.4791768,49.811625 23.0831972,49.5647941 C23.6639972,49.3295941 24.2399971,49.0847941 24.825597,48.7535942 L24.825597,41.5103951 L19.7375976,41.5103951 C19.4799453,41.5247659 19.2273564,41.4348028 19.0367977,41.2607951 C18.8658372,41.1005645 18.7700455,40.8758893 18.7727978,40.6415952 L18.7727978,38.1215955 L28.8527966,38.1215955 L28.8527966,50.721594 C27.2072478,51.9218351 25.3653669,52.8265333 23.4095972,53.3951936 C22.3412173,53.703558 21.2496647,53.925079 20.1455976,54.0575936 C18.8904126,54.2070045 17.6272321,54.2791404 16.363198,54.2735935 C14.1199511,54.3005038 11.8934357,53.8845614 9.81119883,53.0495937 C7.88019559,52.2710347 6.13144249,51.100841 4.67519944,49.6127941 C3.20793748,48.0902875 2.06487477,46.2858814 1.31519984,44.3087947 C0.492731019,42.13496 0.0841054481,39.8264697 0.110399987,37.5023955 C0.0806450585,35.1661052 0.480905208,32.8442709 1.29119985,30.6527963 C2.7650333,26.616467 5.930377,23.4265722 9.95519881,21.9215974 C12.1768416,21.0838959 14.5363306,20.6719217 16.910398,20.7071975 C18.1227859,20.7002863 19.3335603,20.7966344 20.5295976,20.9951975 C21.5888933,21.1677785 22.6289595,21.4426646 23.6351972,21.8159974 C24.5582293,22.161681 25.4442634,22.5990699 26.2799969,23.1215972 C27.0859814,23.6317377 27.8456898,24.2115574 28.5503966,24.854397 L27.2879967,26.8703968 C27.0909233,27.2459845 26.7041055,27.4836012 26.2799969,27.4895967 C25.9952002,27.4760604 25.7188791,27.3883657 25.478397,27.2351968 C25.094397,27.0239968 24.6671971,26.7647968 24.1967971,26.4575968 C23.6466034,26.1122662 23.0667061,25.8166952 22.4639973,25.574397 C21.6878972,25.260943 20.8844779,25.0199172 20.0639976,24.854397 C18.9812079,24.641972 17.879332,24.5422402 16.775998,24.5567971 C15.0644387,24.5273977 13.3631803,24.8272363 11.7647986,25.439997 C10.310268,26.0120588 8.99931594,26.8969515 7.92479906,28.0319967 C6.84123483,29.2071776 6.01409869,30.5950009 5.49599934,32.1071962 C4.91209928,33.8384517 4.62643846,35.6562933 4.65119945,37.4831955 C4.62062493,39.3728324 4.91782403,41.2534693 5.52959934,43.0415949 C6.06572907,44.5753557 6.91212517,45.9822032 8.01599904,47.1743944 C9.08161288,48.3044455 10.3804956,49.1889306 11.8223986,49.7663941 C13.3682616,50.3766027 15.0181857,50.6798496 16.679998,50.659194" id="Path"></path>
            <path d="M43.4447948,51.0431939 C45.7359945,51.0431939 47.4463943,50.275194 48.5759942,48.7391942 C49.7055941,47.2031944 50.271994,45.0607946 50.275194,42.311995 C50.275194,39.5471953 49.7087941,37.3935955 48.5759942,35.8511957 C47.4431943,34.3087959 45.7327945,33.537596 43.4447948,33.537596 C42.4053578,33.5120008 41.3729999,33.715195 40.4207952,34.1327959 C39.5769779,34.5212152 38.841748,35.1113774 38.2799954,35.8511957 C37.669697,36.6751736 37.2321454,37.6139503 36.9935956,38.6111954 C36.697537,39.8220898 36.5556138,41.0655307 36.5711956,42.311995 C36.5546674,43.5553403 36.6966101,44.7957259 36.9935956,46.0031945 C37.2310098,46.9934889 37.6688126,47.9246367 38.2799954,48.7391942 C38.8436028,49.4748159 39.5785484,50.0614541 40.4207952,50.447994 C41.3729999,50.8655949 42.4053578,51.0687891 43.4447948,51.0431939 M43.4447948,30.3311964 C45.0165467,30.3092156 46.5773045,30.5962516 48.0383943,31.1759963 C49.3627418,31.7092703 50.5527587,32.5288412 51.5231939,33.575996 C52.5081111,34.6668697 53.2566077,35.9497733 53.7215936,37.3439955 C54.744112,40.5606911 54.744112,44.0152988 53.7215936,47.2319944 C53.2531568,48.6217832 52.504977,49.9008767 51.5231939,50.9903939 C50.5535971,52.0385174 49.3633478,52.8582483 48.0383943,53.3903936 C45.0772111,54.5038841 41.8123785,54.5038841 38.8511954,53.3903936 C37.5240797,52.8570943 36.3309351,52.0376268 35.3567958,50.9903939 C34.3675074,49.9022123 33.6112126,48.6232084 33.1343961,47.2319944 C32.0974719,44.0175491 32.0974719,40.5584409 33.1343961,37.3439955 C33.6077795,35.948339 34.3643919,34.6655297 35.3567958,33.575996 C36.3316575,32.529601 37.5246025,31.7102706 38.8511954,31.1759963 C40.3122851,30.5962516 41.8730429,30.3092156 43.4447948,30.3311964" id="Shape"></path>
            <path d="M68.5727918,51.0431939 C70.8607916,51.0431939 72.5711913,50.275194 73.7039912,48.7391942 C74.8367911,47.2031944 75.403191,45.0607946 75.403191,42.311995 C75.403191,39.5471953 74.8367911,37.3935955 73.7039912,35.8511957 C72.5711913,34.3087959 70.8607916,33.537596 68.5727918,33.537596 C67.5333548,33.5120008 66.500997,33.715195 65.5487922,34.1327959 C64.7049749,34.5212152 63.969745,35.1113774 63.4079924,35.8511957 C62.797694,36.6751736 62.3601424,37.6139503 62.1215926,38.6111954 C61.825534,39.8220898 61.6836108,41.0655307 61.6991926,42.311995 C61.6826644,43.5553403 61.8246071,44.7957259 62.1215926,46.0031945 C62.3590068,46.9934889 62.7968096,47.9246367 63.4079924,48.7391942 C63.9715998,49.4748159 64.7065454,50.0614541 65.5487922,50.447994 C66.500997,50.8655949 67.5333548,51.0687891 68.5727918,51.0431939 M68.5727918,30.3311964 C70.1445437,30.3092156 71.7053015,30.5962516 73.1663913,31.1759963 C74.4907388,31.7092703 75.6807557,32.5288412 76.6511909,33.575996 C77.6361081,34.6668697 78.3846047,35.9497733 78.8495906,37.3439955 C79.872109,40.5606911 79.872109,44.0152988 78.8495906,47.2319944 C78.3811538,48.6217832 77.632974,49.9008767 76.6511909,50.9903939 C75.6815941,52.0385174 74.4913448,52.8582483 73.1663913,53.3903936 C70.2052081,54.5038841 66.9403755,54.5038841 63.9791924,53.3903936 C62.6520767,52.8570943 61.4589321,52.0376268 60.4847928,50.9903939 C59.4938523,49.9034328 58.7373441,48.624068 58.2623931,47.2319944 C57.2254689,44.0175491 57.2254689,40.5584409 58.2623931,37.3439955 C58.7354389,35.9563965 59.4904642,34.6816784 60.4799928,33.599996 C61.4548545,32.553601 62.6477995,31.7342706 63.9743924,31.1999963 C65.4354821,30.6202516 66.9962399,30.3332156 68.5679918,30.3551964" id="Shape"></path>
            <path d="M93.0911889,50.9279939 C94.3189191,50.9561628 95.5298218,50.6384672 96.5855885,50.011194 C97.6657952,49.3321556 98.6072644,48.4542111 99.3599882,47.4239943 L99.3599882,36.1967957 C98.7322875,35.2923102 97.8849507,34.5622461 96.8975884,34.0751959 C95.9635469,33.6633729 94.951902,33.4571152 93.9311888,33.470396 C91.7615891,33.470396 90.0959893,34.2415959 88.9343894,35.7839957 C87.7727895,37.3263956 87.1919896,39.5263953 87.1919896,42.3839949 C87.1694762,43.6893923 87.3015958,44.9928646 87.5855896,46.2671945 C87.7878093,47.220096 88.17602,48.1237461 88.7279894,48.9263942 C89.1976711,49.592735 89.839807,50.1187222 90.5855892,50.447994 C91.3832801,50.7807955 92.241411,50.944249 93.1055889,50.9279939 M101.011188,54.1967935 C100.481171,54.2372412 100.006423,53.8702964 99.9119881,53.3471936 L99.5423881,50.241594 C98.5963906,51.4043195 97.4423617,52.3809307 96.1391885,53.1215937 C94.7981316,53.8644808 93.2847858,54.2403336 91.7519891,54.2111935 C90.5035516,54.226874 89.2672704,53.9645332 88.1327895,53.4431936 C87.04099,52.923716 86.0896124,52.1501044 85.3583898,51.1871939 C84.5381811,50.0733365 83.940096,48.81198 83.59679,47.4719943 C83.1604818,45.8054103 82.952184,44.0873576 82.9775901,42.3647949 C82.9630438,40.7393373 83.1944617,39.1210305 83.66399,37.5647955 C84.0799359,36.1725302 84.7522636,34.8702007 85.6463898,33.724796 C87.4144372,31.4650451 90.1459405,30.1731419 93.0143889,30.2399964 C94.2678276,30.2047238 95.5130935,30.4524645 96.6575885,30.9647963 C97.6819558,31.4571533 98.600022,32.1452953 99.3599882,32.9903961 L99.3599882,21.0719975 L103.439988,21.0719975 L103.439988,54.1919935 L101.011188,54.1967935 Z" id="Shape"></path>
            <path d="M112.598387,38.0975955 L117.878386,38.0975955 C119.018645,38.1179897 120.154293,37.9476426 121.238386,37.5935955 C122.140478,37.2978839 122.970966,36.8172471 123.676785,36.1823957 C124.332957,35.5840745 124.843578,34.8435914 125.169585,34.0175959 C125.513563,33.1352371 125.684669,32.1949677 125.673585,31.2479963 C125.673585,29.1551965 125.033585,27.5199967 123.753585,26.3423969 C122.473585,25.164797 120.523186,24.5775971 117.902386,24.5807841 L112.622387,24.5807841 L112.598387,38.0975955 Z M112.598387,41.625595 L112.627187,54.2303935 L108.206387,54.2303935 L108.172787,21.0719975 L117.868786,21.0719975 C119.701099,21.038394 121.528013,21.2811196 123.287985,21.7919974 C124.687878,22.2032155 125.986141,22.9030347 127.099185,23.8463972 C128.100325,24.7172456 128.875978,25.8173222 129.359985,27.0527968 C129.870876,28.3916129 130.123333,29.8151445 130.103984,31.2479963 C130.120548,32.6844227 129.847939,34.1094993 129.302385,35.4383958 C128.775726,36.6946256 127.971651,37.8154082 126.950385,38.7167954 C125.83039,39.6856825 124.523411,40.4143236 123.110385,40.8575951 C121.414642,41.3956995 119.642815,41.6550702 117.863986,41.625595 L112.598387,41.625595 Z" id="Shape"></path>
            <rect id="Rectangle" x="133.895984" y="21.0719975" width="4.07999951" height="33.158396"></rect>
            <path d="M149.726382,51.4079939 C150.390198,51.4140221 151.052397,51.3415185 151.699182,51.1919939 C152.283054,51.0521581 152.848515,50.844339 153.383982,50.572794 C153.919031,50.3045393 154.425604,49.9829056 154.895982,49.6127941 C155.397204,49.2138795 155.86736,48.7774208 156.302381,48.3071942 L156.302381,43.5071948 C154.695035,43.4837314 153.088767,43.6025952 151.502382,43.8623948 C150.397365,44.045854 149.320006,44.3684164 148.295982,44.8223947 C147.588642,45.1119781 146.968466,45.5800049 146.495983,46.1807945 C146.125709,46.68944 145.928817,47.3036743 145.934383,47.9327943 C145.921893,48.4773372 146.023256,49.0184875 146.231983,49.5215941 C146.413,49.9423095 146.687074,50.3164939 147.033582,50.615994 C147.38309,50.9065989 147.790551,51.1193296 148.228782,51.2399939 C148.713542,51.3723722 149.214297,51.4369859 149.716782,51.4319939 M160.319981,54.2399935 L158.510381,54.2399935 C158.180762,54.2518186 157.852694,54.1894857 157.550381,54.0575936 C157.275721,53.8873101 157.097738,53.597197 157.070381,53.2751936 L156.614381,50.8031939 C156.004781,51.3503939 155.409581,51.8447938 154.828782,52.2767938 C154.258371,52.7086429 153.643727,53.0787166 152.995182,53.3807936 C152.339597,53.6827254 151.652052,53.9097601 150.945582,54.0575936 C150.155131,54.2128063 149.351111,54.2883841 148.545582,54.2831935 C147.687691,54.2905575 146.834006,54.1625856 146.015983,53.9039936 C145.260329,53.6698938 144.560997,53.2826471 143.961583,52.7663937 C143.363686,52.2372048 142.89141,51.5812658 142.579183,50.8463939 C142.214956,49.9779144 142.038299,49.0422892 142.060783,48.1007943 C142.066353,47.1633269 142.328647,46.2453003 142.819183,45.4463946 C143.425079,44.4952776 144.264574,43.7152737 145.257583,43.1807949 C146.638732,42.4227862 148.125626,41.8759198 149.668782,41.558395 C151.860532,41.0987745 154.09689,40.886248 156.335981,40.9247951 L156.335981,39.1055953 C156.335981,37.2911956 155.950381,35.9183957 155.179182,34.9871958 C154.406382,34.0559959 153.259182,33.595196 151.751982,33.595196 C150.901333,33.5728278 150.053335,33.6995401 149.246382,33.969596 C148.630137,34.191787 148.038253,34.4764705 147.479982,34.8191958 C146.983982,35.1391958 146.556783,35.4223958 146.198383,35.6687957 C145.89035,35.9006085 145.518116,36.0313935 145.132783,36.0431957 C144.874526,36.0488589 144.621008,35.9733071 144.407983,35.8271957 C144.210028,35.6858839 144.046054,35.5022326 143.927983,35.2895958 L143.193583,33.9839959 C144.388073,32.8052271 145.795356,31.8637808 147.340782,31.2095963 C148.906269,30.5836269 150.579711,30.2720991 152.265582,30.2927964 C153.450742,30.2717532 154.627923,30.4905358 155.726381,30.9359963 C156.696017,31.3356983 157.564895,31.9455519 158.270381,32.7215961 C158.981014,33.5254676 159.512753,34.471144 159.830381,35.4959958 C160.192262,36.6514113 160.370433,37.8564939 160.358381,39.0671953 L160.319981,54.2399935 Z" id="Shape"></path>
            <path d="M164.36158,54.1967935 L164.36158,30.7199963 L166.79038,30.7199963 C167.319718,30.68181 167.793128,31.0477211 167.88958,31.5695962 L168.21118,34.0895959 C169.173906,33.0090554 170.309342,32.0958405 171.57118,31.3871963 C172.898301,30.6769704 174.386341,30.321494 175.891179,30.3551964 C177.042598,30.3303492 178.186667,30.5444535 179.251179,30.9839963 C180.188647,31.3821739 181.020289,31.9935787 181.679978,32.7695961 C182.354231,33.5892358 182.856974,34.5359608 183.158378,35.5535958 C183.506259,36.7214661 183.676166,37.9350914 183.662378,39.1535953 L183.662378,54.2351935 L179.582379,54.2351935 L179.582379,39.1295953 C179.582379,37.3727955 179.182379,36.0095957 178.382379,35.0399958 C177.580779,34.0799959 176.351979,33.599996 174.705579,33.599996 C173.529513,33.5959201 172.372263,33.8951518 171.34558,34.4687959 C170.259291,35.0879799 169.285557,35.8864415 168.46558,36.8303956 L168.46558,54.2111935 L164.36158,54.1967935 Z" id="Path"></path>
            <path d="M219.047974,54.2735935 C217.214374,54.2735935 215.804774,53.7615936 214.819174,52.7375937 C213.833575,51.7135938 213.340775,50.239994 213.340775,48.3167942 L213.340775,34.1087959 L210.547175,34.1087959 C210.321203,34.1156032 210.100683,34.0386778 209.927975,33.892796 C209.74604,33.7167164 209.652671,33.4683198 209.673575,33.215996 L209.673575,31.5887962 L213.479975,31.1087963 L214.415974,23.9375971 C214.441143,23.7196713 214.54738,23.5191911 214.713574,23.3759972 C214.893851,23.2263807 215.122615,23.1478497 215.356774,23.1551972 L217.439974,23.1551972 L217.439974,31.1567963 L224.063973,31.1567963 L224.063973,34.1087959 L217.439974,34.1087959 L217.439974,48.0287943 C217.37381,48.819743 217.629995,49.6038754 218.150374,50.203194 C218.637041,50.6833611 219.300834,50.9405377 219.983974,50.9135939 C220.360418,50.9207496 220.735345,50.8639424 221.092774,50.745594 C221.375213,50.6429941 221.648234,50.5161198 221.908774,50.366394 C222.134374,50.227194 222.331173,50.102394 222.489573,49.987194 C222.611087,49.8874895 222.760114,49.8272088 222.916773,49.8143941 C223.161945,49.8355236 223.378397,49.982857 223.487973,50.203194 L224.678373,52.1519938 C223.941107,52.8305976 223.076369,53.3559669 222.134374,53.6975936 C221.154495,54.0692641 220.115172,54.2595626 219.067174,54.2591935" id="Path"></path>
            <path d="M191.457577,38.7263954 L191.457577,38.7263954 C191.744709,37.3770421 192.401123,36.1340092 193.353577,35.1359958 C194.486377,33.9967959 196.036777,33.427196 198.004776,33.427196 C198.857672,33.4155755 199.703894,33.5789389 200.491176,33.907196 C201.198132,34.2054597 201.828311,34.6600418 202.334376,35.2367958 C202.852353,35.8311219 203.242812,36.5254528 203.481576,37.2767956 C203.724887,38.0359148 203.854294,38.8269161 203.865576,39.6239953 L191.174377,43.7615948 C191.000067,42.0808505 191.092405,40.3831198 191.447977,38.7311954 M207.532775,40.9919951 C207.532775,40.9343951 207.532775,40.8767951 207.532775,40.8143951 C207.557676,39.3128298 207.313838,37.8189128 206.812775,36.4031957 C206.37753,35.1906901 205.69418,34.0822903 204.806376,33.148796 C203.945738,32.2671605 202.906495,31.5797875 201.758376,31.1327963 C200.534036,30.6595916 199.230913,30.4234006 197.918376,30.4367964 C196.361879,30.4125123 194.817289,30.7116233 193.382377,31.3151963 C192.085108,31.8730778 190.921657,32.701075 189.969577,33.743996 C189.017304,34.8076825 188.287752,36.0513484 187.823978,37.4015955 C187.320102,38.8603527 187.068501,40.3943092 187.079978,41.937595 C187.047853,43.7430734 187.32714,45.540582 187.905578,47.2511944 C188.393668,48.6938562 189.178519,50.018291 190.209577,51.1391939 C191.18586,52.1883149 192.382566,53.0079761 193.713577,53.5391936 C195.125891,54.0933685 196.631703,54.3704118 198.148776,54.3551935 C199.001435,54.3523323 199.852375,54.2784771 200.692776,54.1343935 C201.539806,53.9933389 202.372099,53.774822 203.179176,53.4815936 C203.970439,53.1979101 204.727213,52.8259634 205.435176,52.3727938 C206.117052,51.9382313 206.72749,51.4006566 207.244775,50.7791939 L206.097575,49.2911941 C205.923736,49.0345166 205.629753,48.8857106 205.319976,48.8975942 C204.982836,48.9253818 204.661014,49.0504425 204.393576,49.2575941 C203.959396,49.5355967 203.510765,49.7903551 203.049576,50.020794 C202.432779,50.3313684 201.790411,50.5883154 201.129576,50.7887939 C200.270153,51.0439398 199.376255,51.1637739 198.479976,51.1439939 C197.462464,51.1599167 196.451608,50.9773104 195.503977,50.606394 C194.622613,50.2505854 193.836831,49.6933045 193.209577,48.9791942 C192.638404,48.3166366 192.18687,47.5597488 191.875177,46.7423944 L206.399975,41.985595 C207.019175,41.783995 207.417575,41.654395 207.508775,41.2223951 L207.508775,41.2223951 L207.508775,41.1263951 C207.513664,41.0801239 207.513664,41.0334663 207.508775,40.9871951" id="Shape"></path>
        </g>
    </g>
</svg>