<?xml version="1.0" encoding="UTF-8"?>
<svg width="300px" height="300px" viewBox="0 0 300 300" version="1.1" xmlns="http://www.w3.org/2000/svg" xmlns:xlink="http://www.w3.org/1999/xlink">
    <!-- Generator: Sketch 59.1 (86144) - https://sketch.com -->
    <title>environnement/media/youmatter</title>
    <desc>Created with Sketch.</desc>
    <g id="environnement/media/youmatter" stroke="none" stroke-width="1" fill="none" fill-rule="evenodd">
        <g id="Logo_YouMatter_BtoC_Quadri" transform="translate(41.000000, 131.000000)" fill-rule="nonzero">
            <path d="M1.17360009,37.119603 C0.599851793,36.9225153 0.211158883,36.3869828 0.201600016,35.7804028 C0.207474183,35.0432299 0.803627196,34.4470769 1.54080012,34.4412027 C1.80513267,34.4523173 2.06564856,34.508316 2.31120018,34.6068028 C3.04087648,34.8612944 3.81019168,34.9832144 4.58280036,34.9668028 C6.53040052,34.9668028 7.66440061,33.7896027 8.7984007,31.2336025 L8.96400071,30.9096025 L0.201600016,12.333601 C0.0767840161,12.0659719 0.00817097715,11.7755917 -7.10542736e-15,11.4804009 C0.00183917034,11.06542 0.170220399,10.6685541 0.467358183,10.3788616 C0.764495967,10.0891692 1.16550611,9.93091098 1.58040013,9.93960079 C2.43360019,9.93960079 2.88000023,10.4688008 3.16080025,11.1564009 L10.4544008,27.6300022 L16.9344013,11.1204009 C17.1792014,10.4724008 17.6256014,9.94320079 18.4356015,9.94320079 C19.2865619,9.94320079 19.9764016,10.6330405 19.9764016,11.4840009 C19.96242,11.7487829 19.9077807,12.0098371 19.8144016,12.258001 L11.6208009,31.8060025 C9.81360078,36.1476029 7.78680062,37.7316219 4.62240037,37.7316219 C3.44558958,37.7339014 2.2777681,37.526668 1.17360009,37.119603 Z" id="Path" fill="#4DAFA9"></path>
            <path d="M21.2544017,20.7324016 L21.2544017,20.6532016 C21.3376328,14.691176 26.182567,9.89527584 32.1451308,9.87261406 C38.1076946,9.85011234 42.9888159,14.6091775 43.1172034,20.5704016 L43.1172034,20.6532016 C43.1366645,23.5723559 41.9829154,26.3770218 39.9149962,28.4374951 C37.847077,30.4979685 35.0382676,31.6415932 32.1192026,31.6116025 C29.2254167,31.6438207 26.4409549,30.507501 24.3959681,28.4598039 C22.3509814,26.4121067 21.2183507,23.6261423 21.2544017,20.7324016 Z M39.9132032,20.7324016 L39.9132032,20.6532016 C39.9132032,16.1496013 36.5472029,12.459601 32.1264026,12.459601 C27.5832022,12.459601 24.4584019,16.1496013 24.4584019,20.5704016 L24.4584019,20.6532016 C24.4584019,25.153202 27.7848022,28.8036023 32.2056026,28.8036023 C36.7344029,28.8036023 39.9060032,25.153202 39.9060032,20.7324016 L39.9132032,20.7324016 Z" id="Shape" fill="#4DAFA9"></path>
            <path d="M65.0412052,29.7360024 C65.0412052,30.5869628 64.3513655,31.2768025 63.500405,31.2768025 C62.6494446,31.2768025 61.9596049,30.5869628 61.9596049,29.7360024 L61.9596049,27.4680022 C60.5412048,29.7360024 58.3920046,31.5612025 54.7812044,31.5612025 C49.712404,31.5612025 46.7496037,28.1556022 46.7496037,23.1660018 L46.7496037,11.5272009 C46.7338267,11.1099776 46.8896459,10.7045029 47.1807688,10.4052177 C47.4718917,10.1059325 47.8729039,9.93896372 48.2904038,9.94312207 C49.1644017,9.94518041 49.8724243,10.6532031 49.874404,11.5272009 L49.874404,22.3956018 C49.874404,26.2908021 51.9840041,28.7244023 55.6740044,28.7244023 C59.2416047,28.7244023 61.9596049,26.0856021 61.9596049,22.1544018 L61.9596049,11.5272009 C61.9438279,11.1099776 62.0996471,10.7045029 62.39077,10.4052177 C62.6818929,10.1059325 63.0829051,9.93896372 63.500405,9.94312207 C63.9157146,9.94600089 64.3125656,10.1151836 64.6021527,10.41289 C64.8917399,10.7105964 65.0498872,11.1119727 65.0412052,11.5272009 L65.0412052,29.7360024 Z" id="Path" fill="#4DAFA9"></path>
            <path d="M70.3151872,11.5272009 C70.3110918,10.6660575 70.9986341,9.96088589 71.8596057,9.94320079 C72.2808617,9.93830663 72.6862424,10.1037376 72.9837964,10.4019693 C73.2813503,10.7002011 73.4458585,11.1059572 73.4400058,11.5272009 L73.4400058,13.6872011 C74.8188059,11.6172009 76.6800061,9.72720077 80.2116064,9.72720077 C83.6208066,9.72720077 85.8096068,11.5524009 86.9472069,13.9032011 C88.444807,11.5920009 90.6768072,9.72720077 94.3272075,9.72720077 C99.1548079,9.72720077 102.114008,12.967201 102.114008,18.1620014 L102.114008,29.7612024 C102.141654,30.3366337 101.850399,30.8805892 101.356159,31.1765831 C100.861919,31.472577 100.244897,31.472577 99.7506568,31.1765831 C99.256417,30.8805892 98.9651624,30.3366337 98.9928079,29.7612024 L98.9928079,18.8676015 C98.9928079,14.8104012 96.9660077,12.538801 93.5568074,12.538801 C90.3924072,12.538801 87.796807,14.8932012 87.796807,19.0188015 L87.796807,29.7252024 C87.8244525,30.3006336 87.5331979,30.8445892 87.038958,31.1405831 C86.5447181,31.436577 85.9276956,31.436577 85.4334557,31.1405831 C84.9392158,30.8445892 84.6479613,30.3006336 84.6756067,29.7252024 L84.6756067,18.7848015 C84.6756067,14.8536012 82.6056066,12.538801 79.2756063,12.538801 C75.945606,12.538801 73.4544058,15.3000012 73.4544058,19.1520015 L73.4544058,29.7360024 C73.4701829,30.1532257 73.3143637,30.5587003 73.0232408,30.8579856 C72.7321179,31.1572708 72.3311057,31.3242396 71.9136057,31.3200025 C71.4917295,31.3258763 71.085411,31.160878 70.7870706,30.8625375 C70.4887301,30.564197 70.3237317,30.1578786 70.3296056,29.7360024 L70.3151872,11.5272009 Z" id="Path" fill="#192E4D"></path>
            <path d="M105.559208,25.034402 L105.559208,24.951602 C105.559208,20.5308016 109.213209,18.1800014 114.523209,18.1800014 C116.705517,18.1594148 118.879046,18.4590028 120.97441,19.0692015 L120.97441,18.3492015 C120.97441,14.5764012 118.663209,12.628801 114.728409,12.628801 C112.852928,12.6265751 110.998941,13.0280678 109.292409,13.8060011 C109.111632,13.8804171 108.918994,13.9218709 108.723609,13.9284011 C107.979602,13.9231074 107.371775,13.3327373 107.344809,12.589201 C107.350847,12.0265047 107.684107,11.5188805 108.198009,11.2896009 C110.350774,10.3344427 112.682949,9.85082326 115.038009,9.87120078 C117.997209,9.87120078 120.26881,10.6416008 121.80961,12.182401 C123.23161,13.6008011 123.96961,15.6312012 123.96961,18.3024015 L123.96961,29.7828024 C123.985438,30.1891979 123.833692,30.5842641 123.549877,30.8755661 C123.266062,31.166868 122.87508,31.3288463 122.46841,31.3236025 C122.072229,31.3405057 121.686612,31.1932868 121.402493,30.9166624 C121.118374,30.6400379 120.960901,30.2584933 120.96721,29.8620024 L120.96721,27.9576022 C119.505609,29.8620024 117.072009,31.5576069 113.382009,31.5576069 C109.494009,31.5612025 105.559208,29.3328023 105.559208,25.034402 Z M121.01401,23.4108019 L121.01401,21.3840017 C119.013894,20.7941735 116.93968,20.4935277 114.854409,20.4912016 C110.919609,20.4912016 108.734409,22.1940018 108.734409,24.811202 L108.734409,24.894002 C108.734409,27.5292022 111.168009,29.0700023 114.008409,29.0700023 C117.849609,29.0916023 121.01401,26.7372021 121.01401,23.4108019 Z" id="Shape" fill="#192E4D"></path>
            <path d="M129.52441,25.560002 L129.52441,12.891601 L127.81441,12.891601 C127.061677,12.8708633 126.456348,12.265534 126.43561,11.5128009 C126.443407,10.7545639 127.056173,10.1417982 127.81441,10.1340008 L129.51721,10.1340008 L129.51721,5.19840041 C129.508528,4.78412703 129.666296,4.38366636 129.955208,4.08663499 C130.24412,3.78960362 130.640056,3.62080023 131.05441,3.61800029 C131.921413,3.6333126 132.621126,4.33143481 132.638411,5.19840041 L132.638411,10.1484008 L138.070811,10.1484008 C138.842801,10.1477033 139.478002,10.7559077 139.510811,11.5272009 C139.504216,11.9014976 139.348416,12.2576611 139.078023,12.5165617 C138.807631,12.7754623 138.445041,12.915658 138.070811,12.906001 L132.649211,12.906001 L132.649211,25.146002 C132.649211,27.7020022 134.067611,28.6344023 136.177211,28.6344023 C136.82052,28.6097335 137.459163,28.5143596 138.081611,28.3500023 C138.818784,28.3558764 139.414937,28.9520294 139.420811,29.6892024 C139.41333,30.2437534 139.054759,30.7324519 138.528011,30.9060025 C137.549522,31.3009322 136.501412,31.4943917 135.446411,31.4748025 C132.08041,31.4820025 129.52441,29.8116024 129.52441,25.560002 Z" id="Path" fill="#192E4D"></path>
            <path d="M144.784812,25.560002 L144.784812,12.891601 L143.082011,12.891601 C142.33241,12.8622476 141.730919,12.262323 141.699611,11.5128009 C141.709351,10.753982 142.32317,10.1417618 143.082011,10.1340008 L144.784812,10.1340008 L144.784812,5.19840041 C144.776122,4.78350639 144.93438,4.38249625 145.224072,4.08535847 C145.513765,3.78822069 145.910631,3.61983946 146.325612,3.61800029 C147.191209,3.63522166 147.88879,4.3328032 147.906012,5.19840041 L147.906012,10.1484008 L153.342012,10.1484008 C154.105628,10.1591694 154.728031,10.764196 154.760412,11.5272009 C154.748568,12.2992343 154.114072,12.9160164 153.342012,12.906001 L147.906012,12.906001 L147.906012,25.146002 C147.906012,27.7020022 149.328012,28.6344023 151.434012,28.6344023 C152.078489,28.6095619 152.718306,28.514193 153.342012,28.3500023 C154.079185,28.3558764 154.675338,28.9520294 154.681212,29.6892024 C154.672645,30.2433889 154.314486,30.731525 153.788412,30.9060025 C152.809923,31.3009322 151.761813,31.4943917 150.706812,31.4748025 C147.340812,31.4820025 144.784812,29.8116024 144.784812,25.560002 Z" id="Path" fill="#192E4D"></path>
            <path d="M166.125613,31.6116025 C160.365613,31.6116025 155.664012,27.1908022 155.664012,20.7000016 L155.664012,20.6172016 C155.664012,14.5764012 159.922813,9.70920077 165.722413,9.70920077 C171.925214,9.70920077 175.442529,14.7780012 175.442529,20.3364016 C175.447318,20.7251968 175.294786,21.0994516 175.019506,21.3740539 C174.744226,21.6486563 174.369596,21.8002651 173.980814,21.7944017 L158.824813,21.7944017 C159.271213,26.3376021 162.475213,28.8936023 166.208413,28.8936023 C168.464861,28.9089072 170.636481,28.0345681 172.252814,26.4600021 C172.642682,26.0912319 173.214314,25.9891962 173.70769,26.2003082 C174.201067,26.4114202 174.521964,26.895362 174.524414,27.4320022 C174.518494,27.8259465 174.339403,28.1972969 174.034814,28.4472023 C172.047614,30.3444024 169.696813,31.6116025 166.125613,31.6116025 Z M172.332014,19.4832015 C172.008014,15.6708012 169.812013,12.344401 165.639613,12.344401 C161.989213,12.344401 159.231613,15.3864012 158.824813,19.4832015 L172.332014,19.4832015 Z" id="Shape" fill="#192E4D"></path>
            <path d="M179.333996,11.5272009 C179.329864,10.6674285 180.015256,9.96282051 180.874814,9.94320079 C181.296691,9.93732695 181.703009,10.1023253 182.00135,10.4006658 C182.29969,10.6990062 182.464688,11.1053247 182.458815,11.5272009 L182.458815,15.4620012 C183.999615,11.973601 187.041615,9.86400078 189.676815,9.86400078 C190.095898,9.85234911 190.50076,10.0164763 190.793427,10.3166644 C191.086093,10.6168525 191.239896,11.0257483 191.217615,11.4444009 C191.239437,12.250464 190.64019,12.9388931 189.838815,13.028401 C185.781615,13.5144011 182.458815,16.5564013 182.458815,22.6008018 L182.458815,29.7360024 C182.458815,30.5988921 181.759304,31.2984025 180.896414,31.2984025 C180.033525,31.2984025 179.333996,30.5988921 179.333996,29.7360024 L179.333996,11.5272009 Z" id="Path" fill="#192E4D"></path>
            <path d="M212.842817,19.1808019 C212.562671,19.1733667 212.312293,19.0040551 212.201061,18.7468309 C212.089829,18.4896068 212.137956,18.1912121 212.324417,17.9820014 C213.937164,16.2739969 215.255816,14.310617 216.226817,12.171601 C216.305724,11.9015184 216.53473,11.7021477 216.813106,11.6611843 C217.091481,11.6202208 217.368212,11.7451714 217.521575,11.981075 C217.674938,12.2169786 217.67683,12.5206051 217.526417,12.758401 C216.489834,15.0416911 215.082406,17.1376264 213.361217,18.9612015 C213.225384,19.1017271 213.03826,19.180995 212.842817,19.1808019 L212.842817,19.1808019 Z" id="Path" fill="#4DAFA9"></path>
            <path d="M206.074816,20.8728017 C205.754295,20.866919 205.47627,20.649834 205.39284,20.3403053 C205.309409,20.0307767 205.44067,19.703372 205.714816,19.5372016 C210.958415,16.649857 214.472922,11.3955483 215.139617,5.44680043 C215.231918,5.10312626 215.561442,4.87843008 215.915086,4.91802375 C216.268729,4.95761742 216.540404,5.24962345 216.554417,5.60520045 C215.836854,12.0131549 212.051014,17.6731197 206.402416,20.7828017 C206.302346,20.8394487 206.189781,20.8703731 206.074816,20.8728017 Z" id="Path" fill="#4DAFA9"></path>
            <path d="M202.118416,19.5264016 C201.782076,19.5075 201.503802,19.2579144 201.448561,18.9256039 C201.39332,18.5932934 201.57588,18.2671016 201.888016,18.1404014 C208.187164,15.9836238 212.417804,10.0601487 212.414417,3.40200027 C212.414417,3.08880025 212.414417,2.77200022 212.382017,2.43000019 C212.323971,2.15354302 212.432952,1.86868282 212.660701,1.70156464 C212.888449,1.53444645 213.192883,1.51594919 213.43919,1.65426402 C213.685497,1.79257884 213.828165,2.06214894 213.804017,2.34360019 C213.825617,2.70360021 213.836418,3.06360024 213.836418,3.40200027 C213.839286,10.6724561 209.215293,17.1388098 202.334416,19.4868015 C202.264794,19.5106998 202.191988,19.5240476 202.118416,19.5264016 Z" id="Path" fill="#4DAFA9"></path>
            <path d="M204.004816,11.9196049 C203.816703,11.9202327 203.636289,11.8449521 203.504416,11.7108009 C201.365199,9.59969779 199.824738,6.95855265 199.040416,4.05720032 C199.006644,3.70553182 199.233011,3.38131182 199.574781,3.29184325 C199.916551,3.20237469 200.272745,3.37409174 200.415616,3.69720029 C201.133058,6.35042564 202.540365,8.7663239 204.494416,10.6992009 C204.693223,10.9047141 204.751578,11.2083944 204.6431,11.472955 C204.534622,11.7375155 204.279872,11.9128136 203.994016,11.9196049 L204.004816,11.9196049 Z" id="Path" fill="#4DAFA9"></path>
            <path d="M198.684016,14.5368012 C198.47481,14.5357667 198.276399,14.4437881 198.140416,14.2848011 C197.719216,13.7880011 197.316016,13.2696011 196.945216,12.751201 C196.77633,12.4321178 196.869862,12.0372926 197.163944,11.827884 C197.458027,11.6184753 197.861727,11.6592344 198.108016,11.9232009 C198.468016,12.412801 198.828016,12.898801 199.227616,13.3632011 C199.398692,13.576695 199.433991,13.8687004 199.318716,14.11681 C199.20344,14.3649196 198.957509,14.5262612 198.684016,14.5332012 L198.684016,14.5368012 Z" id="Path" fill="#4DAFA9"></path>
            <path d="M199.533616,17.2836014 C199.185144,17.2573489 198.905838,16.9846589 198.871242,16.6369166 C198.836645,16.2891743 199.056748,15.9667983 199.393216,15.8724013 C202.452407,15.2392222 205.175235,13.5110524 207.050416,11.0124009 C204.08725,8.82197732 202.092551,5.56461474 201.488416,1.92960015 C201.399773,1.65982006 201.47798,1.36313699 201.688093,1.17210988 C201.898206,0.981082768 202.200974,0.931397751 202.461119,1.04525425 C202.721264,1.15911075 202.890189,1.41523902 202.892416,1.69920014 C203.479158,5.19677249 205.494045,8.29278711 208.454417,10.2456008 C208.611358,10.3497944 208.721213,10.5113461 208.760417,10.6956009 C208.796406,10.8816464 208.757601,11.0743795 208.652417,11.2320009 C206.576523,14.3435768 203.358755,16.5124661 199.695616,17.2692014 C199.642082,17.2782805 199.587912,17.2830956 199.533616,17.2836014 Z" id="Path" fill="#4DAFA9"></path>
            <path d="M201.632416,13.5576011 C201.438223,13.5568209 201.25258,13.4776303 201.117616,13.3380011 C199.463752,11.6164477 198.136582,9.60861386 197.200816,7.41240059 C197.111003,7.06725341 197.287397,6.70836693 197.615527,6.56864102 C197.943658,6.42891511 198.324632,6.55046067 198.511216,6.85440054 C199.379986,8.8931202 200.612,10.756999 202.147216,12.355201 C202.335627,12.5637535 202.385461,12.8628753 202.274841,13.1212468 C202.16422,13.3796184 201.91337,13.5500038 201.632416,13.5576011 L201.632416,13.5576011 Z" id="Path" fill="#4DAFA9"></path>
            <path d="M209.372417,9.00360072 C209.225603,9.00325313 209.082404,8.9580324 208.962017,8.87400071 C206.279246,6.99490693 204.545155,4.04300987 204.210016,0.784800062 C204.224323,0.426556982 204.500025,0.133425973 204.85672,0.0972132669 C205.213415,0.0610005611 205.542404,0.292741694 205.628416,0.640800051 C205.885309,3.15758866 207.102492,5.47848757 209.026817,7.12080057 C209.627823,5.13687881 209.737777,3.03663327 209.347217,1.00080008 C209.328595,0.642073219 209.577227,0.324498833 209.929941,0.256494842 C210.282655,0.188490851 210.631535,0.390863722 210.747617,0.730800058 C210.917141,1.61474825 211.002722,2.51274317 211.003237,3.41280027 C211.006228,5.17435663 210.677711,6.92074672 210.034817,8.56080068 C209.954894,8.76452412 209.786655,8.9208406 209.577617,8.98560071 C209.510267,9.00034806 209.441305,9.0063974 209.372417,9.00360072 Z" id="Path" fill="#4DAFA9"></path>
        </g>
    </g>
</svg>