<?xml version="1.0" encoding="UTF-8"?>
<svg width="4px" height="306px" viewBox="0 0 4 306" version="1.1" xmlns="http://www.w3.org/2000/svg" xmlns:xlink="http://www.w3.org/1999/xlink">
    <!-- Generator: Sketch 59 (86127) - https://sketch.com -->
    <title>Rectangle</title>
    <desc>Created with Sketch.</desc>
    <g id="Produit-(modifier-la-couleur)" stroke="none" stroke-width="1" fill="none" fill-rule="evenodd">
        <g id="about" transform="translate(-151.000000, -4275.000000)" fill="#A4D693">
            <rect id="Rectangle" x="151" y="4275" width="4" height="306"></rect>
        </g>
    </g>
</svg>