<?xml version="1.0" encoding="UTF-8"?>
<svg width="300px" height="300px" viewBox="0 0 300 300" version="1.1" xmlns="http://www.w3.org/2000/svg" xmlns:xlink="http://www.w3.org/1999/xlink">
    <!-- Generator: Sketch 59.1 (86144) - https://sketch.com -->
    <title>environnement/expert/Agreenium</title>
    <desc>Created with Sketch.</desc>
    <defs>
        <path d="M12.8744002,0.427200006 C4.75520007,1.93040003 -0.737600011,10.9568002 0.921600014,22.2664003 L0.921600014,22.2664003 C11.2744002,14.4184002 31.9576005,15.1384002 31.9576005,15.1384002 L31.9576005,15.1384002 C27.5704004,3.31280005 19.3504003,0.285600004 14.5640002,0.285600004 L14.5640002,0.285600004 C13.9384002,0.285600004 13.3608002,0.336000005 12.8744002,0.427200006 M28.5032004,17.7320003 C12.8880002,19.4440003 8.31520012,31.8424005 12.9784002,36.9120006 L12.9784002,36.9120006 C18.2672003,42.6528006 26.3928004,40.3896006 29.9992004,33.5952005 L29.9992004,33.5952005 C32.1392005,29.5800004 33.0512005,25.0904004 32.7432005,20.5800003 L32.7432005,20.5800003 C32.6568005,19.3368003 34.8664005,19.2792003 37.7264006,19.0728003 L37.7264006,19.0728003 C40.5816006,18.8552003 40.7640006,17.8760003 37.4472006,17.6240003 L37.4472006,17.6240003 C35.8880005,17.5048003 34.5960005,17.4352003 33.2968005,17.4352003 L33.2968005,17.4352003 C31.8280005,17.4352003 30.3592005,17.5232003 28.5032004,17.7320003" id="path-1"></path>
        <linearGradient x1="0.0004043686%" y1="50.0005953%" x2="99.9996687%" y2="50.0005953%" id="linearGradient-3">
            <stop stop-color="#96C13D" offset="0%"></stop>
            <stop stop-color="#0B8746" offset="100%"></stop>
        </linearGradient>
        <path d="M12.8744002,0.427200006 C4.75520007,1.93040003 -0.737600011,10.9568002 0.921600014,22.2664003 L0.921600014,22.2664003 C11.2744002,14.4184002 31.9576005,15.1384002 31.9576005,15.1384002 L31.9576005,15.1384002 C27.5704004,3.31280005 19.3504003,0.285600004 14.5640002,0.285600004 L14.5640002,0.285600004 C13.9384002,0.285600004 13.3608002,0.336000005 12.8744002,0.427200006 M28.5032004,17.7320003 C12.8880002,19.4440003 8.31520012,31.8424005 12.9784002,36.9120006 L12.9784002,36.9120006 C18.2672003,42.6528006 26.3928004,40.3896006 29.9992004,33.5952005 L29.9992004,33.5952005 C32.1392005,29.5800004 33.0512005,25.0904004 32.7432005,20.5800003 L32.7432005,20.5800003 C32.6568005,19.3368003 34.8664005,19.2792003 37.7264006,19.0728003 L37.7264006,19.0728003 C40.5816006,18.8552003 40.7640006,17.8760003 37.4472006,17.6240003 L37.4472006,17.6240003 C35.8880005,17.5048003 34.5960005,17.4352003 33.2968005,17.4352003 L33.2968005,17.4352003 C31.8280005,17.4352003 30.3592005,17.5232003 28.5032004,17.7320003" id="path-4"></path>
        <linearGradient x1="-21.9137059%" y1="53.0944546%" x2="120.658993%" y2="53.0944546%" id="linearGradient-6">
            <stop stop-color="#95C13D" offset="0%"></stop>
            <stop stop-color="#0F8747" offset="100%"></stop>
        </linearGradient>
        <path d="M25.2616004,0.722400011 C25.0408004,0.731200011 25.1504004,0.888800013 25.2616004,0.903200013 L25.2616004,0.903200013 C30.5576005,1.06080002 35.8464005,2.76720004 40.2248006,6.4336001 L40.2248006,6.4336001 C50.5856008,15.1240002 51.9392008,30.5656005 43.2520006,40.9232006 L43.2520006,40.9232006 C34.5648005,51.2744008 19.1232003,52.6312008 8.76640013,43.9496007 L8.76640013,43.9496007 C4.38320007,40.2728006 1.79120003,35.4024005 0.708000011,30.2072005 L0.708000011,30.2072005 C0.68400001,30.0848004 0.515200008,30.0400004 0.534400008,30.2072005 L0.534400008,30.2072005 C1.43520002,36.1816005 4.43040007,41.8696006 9.42240014,46.0560007 L9.42240014,46.0560007 C20.2848003,55.1688008 36.4800005,53.7432008 45.5904007,42.8808006 L45.5904007,42.8808006 C54.7056008,32.0152005 53.2776008,15.8288002 42.4144006,6.7192001 L42.4144006,6.7192001 C37.6112006,2.67600004 31.7472005,0.716800011 25.9280004,0.716800011 L25.9280004,0.716800011 C25.7016004,0.716800011 25.4832004,0.716800011 25.2616004,0.722400011" id="path-7"></path>
        <linearGradient x1="8.55818659e-05%" y1="50.0005832%" x2="99.9996975%" y2="50.0005832%" id="linearGradient-9">
            <stop stop-color="#1093D1" offset="0%"></stop>
            <stop stop-color="#005299" offset="100%"></stop>
        </linearGradient>
        <path d="M25.2616004,0.722400011 C25.0408004,0.731200011 25.1504004,0.888800013 25.2616004,0.903200013 L25.2616004,0.903200013 C30.5576005,1.06080002 35.8464005,2.76720004 40.2248006,6.4336001 L40.2248006,6.4336001 C50.5856008,15.1240002 51.9392008,30.5656005 43.2520006,40.9232006 L43.2520006,40.9232006 C34.5648005,51.2744008 19.1232003,52.6312008 8.76640013,43.9496007 L8.76640013,43.9496007 C4.38320007,40.2728006 1.79120003,35.4024005 0.708000011,30.2072005 L0.708000011,30.2072005 C0.68400001,30.0848004 0.515200008,30.0400004 0.534400008,30.2072005 L0.534400008,30.2072005 C1.43520002,36.1816005 4.43040007,41.8696006 9.42240014,46.0560007 L9.42240014,46.0560007 C20.2848003,55.1688008 36.4800005,53.7432008 45.5904007,42.8808006 L45.5904007,42.8808006 C54.7056008,32.0152005 53.2776008,15.8288002 42.4144006,6.7192001 L42.4144006,6.7192001 C37.6112006,2.67600004 31.7472005,0.716800011 25.9280004,0.716800011 L25.9280004,0.716800011 C25.7016004,0.716800011 25.4832004,0.716800011 25.2616004,0.722400011" id="path-10"></path>
        <linearGradient x1="-52.5474563%" y1="53.023237%" x2="158.595102%" y2="53.023237%" id="linearGradient-12">
            <stop stop-color="#0A93D2" offset="0%"></stop>
            <stop stop-color="#00539A" offset="100%"></stop>
        </linearGradient>
        <polygon id="path-13" points="0 124.800002 249.448804 124.800002 249.448804 0.0752000011 0 0.0752000011"></polygon>
        <polygon id="path-15" points="0 124.800002 249.448804 124.800002 249.448804 0.0752000011 0 0.0752000011"></polygon>
        <polygon id="path-17" points="0 124.800002 249.448804 124.800002 249.448804 0.0752000011 0 0.0752000011"></polygon>
        <polygon id="path-19" points="0 124.800002 249.448804 124.800002 249.448804 0.0752000011 0 0.0752000011"></polygon>
        <polygon id="path-21" points="0 124.800002 249.448804 124.800002 249.448804 0.0752000011 0 0.0752000011"></polygon>
        <polygon id="path-23" points="0 124.800002 249.448804 124.800002 249.448804 0.0752000011 0 0.0752000011"></polygon>
        <polygon id="path-25" points="0 124.800002 249.448804 124.800002 249.448804 0.0752000011 0 0.0752000011"></polygon>
        <polygon id="path-27" points="0 124.800002 249.448804 124.800002 249.448804 0.0752000011 0 0.0752000011"></polygon>
        <polygon id="path-29" points="0 124.800002 249.448804 124.800002 249.448804 0.0752000011 0 0.0752000011"></polygon>
        <polygon id="path-31" points="0 124.800002 249.448804 124.800002 249.448804 0.0752000011 0 0.0752000011"></polygon>
        <polygon id="path-33" points="0 124.800002 249.448804 124.800002 249.448804 0.0752000011 0 0.0752000011"></polygon>
        <polygon id="path-35" points="0 124.800002 249.448804 124.800002 249.448804 0.0752000011 0 0.0752000011"></polygon>
        <polygon id="path-37" points="0 124.800002 249.448804 124.800002 249.448804 0.0752000011 0 0.0752000011"></polygon>
        <polygon id="path-39" points="0 124.800002 249.448804 124.800002 249.448804 0.0752000011 0 0.0752000011"></polygon>
        <polygon id="path-41" points="0 124.800002 249.448804 124.800002 249.448804 0.0752000011 0 0.0752000011"></polygon>
        <polygon id="path-43" points="0 124.800002 249.448804 124.800002 249.448804 0.0752000011 0 0.0752000011"></polygon>
        <polygon id="path-45" points="0 124.800002 249.448804 124.800002 249.448804 0.0752000011 0 0.0752000011"></polygon>
        <polygon id="path-47" points="0 124.800002 249.448804 124.800002 249.448804 0.0752000011 0 0.0752000011"></polygon>
        <polygon id="path-49" points="0 124.800002 249.448804 124.800002 249.448804 0.0752000011 0 0.0752000011"></polygon>
        <polygon id="path-51" points="0 124.800002 249.448804 124.800002 249.448804 0.0752000011 0 0.0752000011"></polygon>
        <polygon id="path-53" points="0 124.800002 249.448804 124.800002 249.448804 0.0752000011 0 0.0752000011"></polygon>
        <polygon id="path-55" points="0 124.800002 249.448804 124.800002 249.448804 0.0752000011 0 0.0752000011"></polygon>
        <polygon id="path-57" points="0 124.800002 249.448804 124.800002 249.448804 0.0752000011 0 0.0752000011"></polygon>
        <polygon id="path-59" points="0 124.800002 249.448804 124.800002 249.448804 0.0752000011 0 0.0752000011"></polygon>
        <polygon id="path-61" points="0 124.800002 249.448804 124.800002 249.448804 0.0752000011 0 0.0752000011"></polygon>
        <polygon id="path-63" points="0 124.800002 249.448804 124.800002 249.448804 0.0752000011 0 0.0752000011"></polygon>
        <polygon id="path-65" points="0 124.800002 249.448804 124.800002 249.448804 0.0752000011 0 0.0752000011"></polygon>
        <polygon id="path-67" points="0 124.800002 249.448804 124.800002 249.448804 0.0752000011 0 0.0752000011"></polygon>
        <polygon id="path-69" points="0 124.800002 249.448804 124.800002 249.448804 0.0752000011 0 0.0752000011"></polygon>
        <polygon id="path-71" points="0 124.800002 249.448804 124.800002 249.448804 0.0752000011 0 0.0752000011"></polygon>
        <polygon id="path-73" points="0 124.800002 249.448804 124.800002 249.448804 0.0752000011 0 0.0752000011"></polygon>
        <polygon id="path-75" points="0 124.800002 249.448804 124.800002 249.448804 0.0752000011 0 0.0752000011"></polygon>
        <polygon id="path-77" points="0 124.800002 249.448804 124.800002 249.448804 0.0752000011 0 0.0752000011"></polygon>
        <polygon id="path-79" points="0 124.800002 249.448804 124.800002 249.448804 0.0752000011 0 0.0752000011"></polygon>
        <polygon id="path-81" points="0 124.800002 249.448804 124.800002 249.448804 0.0752000011 0 0.0752000011"></polygon>
        <polygon id="path-83" points="0 124.800002 249.448804 124.800002 249.448804 0.0752000011 0 0.0752000011"></polygon>
        <polygon id="path-85" points="0 124.800002 249.448804 124.800002 249.448804 0.0752000011 0 0.0752000011"></polygon>
        <polygon id="path-87" points="0 124.800002 249.448804 124.800002 249.448804 0.0752000011 0 0.0752000011"></polygon>
        <polygon id="path-89" points="0 124.800002 249.448804 124.800002 249.448804 0.0752000011 0 0.0752000011"></polygon>
        <polygon id="path-91" points="0 124.800002 249.448804 124.800002 249.448804 0.0752000011 0 0.0752000011"></polygon>
        <polygon id="path-93" points="0 124.800002 249.448804 124.800002 249.448804 0.0752000011 0 0.0752000011"></polygon>
        <polygon id="path-95" points="0 124.800002 249.448804 124.800002 249.448804 0.0752000011 0 0.0752000011"></polygon>
        <polygon id="path-97" points="0 124.800002 249.448804 124.800002 249.448804 0.0752000011 0 0.0752000011"></polygon>
        <polygon id="path-99" points="0 124.800002 249.448804 124.800002 249.448804 0.0752000011 0 0.0752000011"></polygon>
        <polygon id="path-101" points="0 124.800002 249.448804 124.800002 249.448804 0.0752000011 0 0.0752000011"></polygon>
        <polygon id="path-103" points="0 124.800002 249.448804 124.800002 249.448804 0.0752000011 0 0.0752000011"></polygon>
        <polygon id="path-105" points="0 124.800002 249.448804 124.800002 249.448804 0.0752000011 0 0.0752000011"></polygon>
        <polygon id="path-107" points="0 124.800002 249.448804 124.800002 249.448804 0.0752000011 0 0.0752000011"></polygon>
        <polygon id="path-109" points="0 124.800002 249.448804 124.800002 249.448804 0.0752000011 0 0.0752000011"></polygon>
        <polygon id="path-111" points="0 124.800002 249.448804 124.800002 249.448804 0.0752000011 0 0.0752000011"></polygon>
        <polygon id="path-113" points="0 124.800002 249.448804 124.800002 249.448804 0.0752000011 0 0.0752000011"></polygon>
        <polygon id="path-115" points="0 124.800002 249.448804 124.800002 249.448804 0.0752000011 0 0.0752000011"></polygon>
        <polygon id="path-117" points="0 124.800002 249.448804 124.800002 249.448804 0.0752000011 0 0.0752000011"></polygon>
        <polygon id="path-119" points="0 124.800002 249.448804 124.800002 249.448804 0.0752000011 0 0.0752000011"></polygon>
    </defs>
    <g id="environnement/expert/Agreenium" stroke="none" stroke-width="1" fill="none" fill-rule="evenodd">
        <g id="Group-7" transform="translate(25.000000, 88.000000)">
            <g id="Group-3" transform="translate(14.400000, 24.000000)">
                <g id="Fill-1-Clipped">
                    <mask id="mask-2" fill="white">
                        <use xlink:href="#path-1"></use>
                    </mask>
                    <g id="path-1"></g>
                    <path d="M12.8744002,0.427200006 C4.75520007,1.93040003 -0.737600011,10.9568002 0.921600014,22.2664003 L0.921600014,22.2664003 C11.2744002,14.4184002 31.9576005,15.1384002 31.9576005,15.1384002 L31.9576005,15.1384002 C27.5704004,3.31280005 19.3504003,0.285600004 14.5640002,0.285600004 L14.5640002,0.285600004 C13.9384002,0.285600004 13.3608002,0.336000005 12.8744002,0.427200006 M28.5032004,17.7320003 C12.8880002,19.4440003 8.31520012,31.8424005 12.9784002,36.9120006 L12.9784002,36.9120006 C18.2672003,42.6528006 26.3928004,40.3896006 29.9992004,33.5952005 L29.9992004,33.5952005 C32.1392005,29.5800004 33.0512005,25.0904004 32.7432005,20.5800003 L32.7432005,20.5800003 C32.6568005,19.3368003 34.8664005,19.2792003 37.7264006,19.0728003 L37.7264006,19.0728003 C40.5816006,18.8552003 40.7640006,17.8760003 37.4472006,17.6240003 L37.4472006,17.6240003 C35.8880005,17.5048003 34.5960005,17.4352003 33.2968005,17.4352003 L33.2968005,17.4352003 C31.8280005,17.4352003 30.3592005,17.5232003 28.5032004,17.7320003" id="Fill-1" fill="url(#linearGradient-3)" fill-rule="nonzero" mask="url(#mask-2)"></path>
                </g>
            </g>
            <g id="Group-6" transform="translate(14.400000, 24.000000)">
                <g id="Fill-4-Clipped">
                    <mask id="mask-5" fill="white">
                        <use xlink:href="#path-4"></use>
                    </mask>
                    <g id="path-4"></g>
                    <path d="M12.8744002,0.427200006 C4.75520007,1.93040003 -0.737600011,10.9568002 0.921600014,22.2664003 L0.921600014,22.2664003 C11.2744002,14.4184002 31.9576005,15.1384002 31.9576005,15.1384002 L31.9576005,15.1384002 C27.5704004,3.31280005 19.3504003,0.285600004 14.5640002,0.285600004 L14.5640002,0.285600004 C13.9384002,0.285600004 13.3608002,0.336000005 12.8744002,0.427200006 M28.5032004,17.7320003 C12.8880002,19.4440003 8.31520012,31.8424005 12.9784002,36.9120006 L12.9784002,36.9120006 C18.2672003,42.6528006 26.3928004,40.3896006 29.9992004,33.5952005 L29.9992004,33.5952005 C32.1392005,29.5800004 33.0512005,25.0904004 32.7432005,20.5800003 L32.7432005,20.5800003 C32.6568005,19.3368003 34.8664005,19.2792003 37.7264006,19.0728003 L37.7264006,19.0728003 C40.5816006,18.8552003 40.7640006,17.8760003 37.4472006,17.6240003 L37.4472006,17.6240003 C35.8880005,17.5048003 34.5960005,17.4352003 33.2968005,17.4352003 L33.2968005,17.4352003 C31.8280005,17.4352003 30.3592005,17.5232003 28.5032004,17.7320003" id="Fill-4" fill="url(#linearGradient-6)" fill-rule="nonzero" mask="url(#mask-5)"></path>
                </g>
            </g>
            <g id="Group-9" transform="translate(12.800000, 18.400000)">
                <g id="Fill-7-Clipped">
                    <mask id="mask-8" fill="white">
                        <use xlink:href="#path-7"></use>
                    </mask>
                    <g id="path-7"></g>
                    <path d="M25.2616004,0.722400011 C25.0408004,0.731200011 25.1504004,0.888800013 25.2616004,0.903200013 L25.2616004,0.903200013 C30.5576005,1.06080002 35.8464005,2.76720004 40.2248006,6.4336001 L40.2248006,6.4336001 C50.5856008,15.1240002 51.9392008,30.5656005 43.2520006,40.9232006 L43.2520006,40.9232006 C34.5648005,51.2744008 19.1232003,52.6312008 8.76640013,43.9496007 L8.76640013,43.9496007 C4.38320007,40.2728006 1.79120003,35.4024005 0.708000011,30.2072005 L0.708000011,30.2072005 C0.68400001,30.0848004 0.515200008,30.0400004 0.534400008,30.2072005 L0.534400008,30.2072005 C1.43520002,36.1816005 4.43040007,41.8696006 9.42240014,46.0560007 L9.42240014,46.0560007 C20.2848003,55.1688008 36.4800005,53.7432008 45.5904007,42.8808006 L45.5904007,42.8808006 C54.7056008,32.0152005 53.2776008,15.8288002 42.4144006,6.7192001 L42.4144006,6.7192001 C37.6112006,2.67600004 31.7472005,0.716800011 25.9280004,0.716800011 L25.9280004,0.716800011 C25.7016004,0.716800011 25.4832004,0.716800011 25.2616004,0.722400011" id="Fill-7" fill="url(#linearGradient-9)" fill-rule="nonzero" mask="url(#mask-8)"></path>
                </g>
            </g>
            <g id="Group-12" transform="translate(12.800000, 18.400000)">
                <g id="Fill-10-Clipped">
                    <mask id="mask-11" fill="white">
                        <use xlink:href="#path-10"></use>
                    </mask>
                    <g id="path-10"></g>
                    <path d="M25.2616004,0.722400011 C25.0408004,0.731200011 25.1504004,0.888800013 25.2616004,0.903200013 L25.2616004,0.903200013 C30.5576005,1.06080002 35.8464005,2.76720004 40.2248006,6.4336001 L40.2248006,6.4336001 C50.5856008,15.1240002 51.9392008,30.5656005 43.2520006,40.9232006 L43.2520006,40.9232006 C34.5648005,51.2744008 19.1232003,52.6312008 8.76640013,43.9496007 L8.76640013,43.9496007 C4.38320007,40.2728006 1.79120003,35.4024005 0.708000011,30.2072005 L0.708000011,30.2072005 C0.68400001,30.0848004 0.515200008,30.0400004 0.534400008,30.2072005 L0.534400008,30.2072005 C1.43520002,36.1816005 4.43040007,41.8696006 9.42240014,46.0560007 L9.42240014,46.0560007 C20.2848003,55.1688008 36.4800005,53.7432008 45.5904007,42.8808006 L45.5904007,42.8808006 C54.7056008,32.0152005 53.2776008,15.8288002 42.4144006,6.7192001 L42.4144006,6.7192001 C37.6112006,2.67600004 31.7472005,0.716800011 25.9280004,0.716800011 L25.9280004,0.716800011 C25.7016004,0.716800011 25.4832004,0.716800011 25.2616004,0.722400011" id="Fill-10" fill="url(#linearGradient-12)" fill-rule="nonzero" mask="url(#mask-11)"></path>
                </g>
            </g>
            <g id="Group-79">
                <path d="M81.3941612,43.9517607 C79.1541612,44.1709607 78.2701612,45.2333607 78.2701612,47.2541607 C78.2701612,49.3853607 79.1877612,50.6309608 81.0613612,50.6309608 C83.7773612,50.6309608 86.8253613,49.4941607 86.8253613,49.4941607 L86.8253613,43.4357606 L81.3941612,43.9517607 Z M89.5781613,49.1637607 C89.6501613,50.2285607 90.5293613,50.6309608 91.7069614,50.7781608 L91.5965614,52.9445608 C89.6501613,52.9445608 88.3277613,52.5757608 87.2285613,51.4773608 C87.2285613,51.4773608 83.9245613,52.9445608 80.6213612,52.9445608 C77.2805612,52.9445608 75.4453611,51.0349608 75.4453611,47.3277607 C75.4453611,43.8061607 77.2805612,42.2637606 81.0613612,41.8949606 L86.8253613,41.3453606 L86.8253613,39.7669606 C86.8253613,37.1965606 85.7221613,36.2789605 83.5197612,36.2789605 C80.9517612,36.2789605 76.5821611,36.7565605 76.5821611,36.7565605 L76.4725611,34.6669605 C76.4725611,34.6669605 80.5117612,33.8581605 83.6693612,33.8581605 C87.8165613,33.8581605 89.5781613,35.7653605 89.5781613,39.7669606 L89.5781613,49.1637607 Z" id="Fill-13" fill="#565655" fill-rule="nonzero"></path>
                <path d="M113.882802,34.2244005 L116.598802,34.2244005 L116.598802,36.7188005 C116.598802,36.7188005 119.791602,34.5196005 123.314802,33.8204005 L123.314802,36.6116005 C119.863602,37.3084006 116.635602,39.1076006 116.635602,39.1076006 L116.635602,52.5756008 L113.882802,52.5756008 L113.882802,34.2244005 Z" id="Fill-15" fill="#565655" fill-rule="nonzero"></path>
                <path d="M137.703122,42.3392806 C137.703122,37.7840806 136.307122,36.1696805 133.075922,36.1696805 C129.958322,36.1696805 128.196722,37.8952806 128.160722,42.3392806 L137.703122,42.3392806 Z M139.759122,50.1928807 L139.832722,52.3568808 C139.832722,52.3568808 135.648722,52.9440808 132.674322,52.9440808 C127.205522,52.9440808 125.407922,49.7504807 125.407922,43.5120806 C125.407922,36.5376805 128.418322,33.8584805 133.075922,33.8584805 C137.959122,33.8584805 140.455922,36.4264805 140.455922,42.4464806 L140.311122,44.5392807 L128.196722,44.5392807 C128.196722,48.4648807 129.409522,50.5232808 133.004722,50.5232808 C135.757522,50.5232808 139.759122,50.1928807 139.759122,50.1928807 L139.759122,50.1928807 Z" id="Fill-17" fill="#565655" fill-rule="nonzero"></path>
                <path d="M156.239042,42.3392806 C156.239042,37.7840806 154.846242,36.1696805 151.617442,36.1696805 C148.496642,36.1696805 146.735042,37.8952806 146.697442,42.3392806 L156.239042,42.3392806 Z M158.295842,50.1928807 L158.369442,52.3568808 C158.369442,52.3568808 154.185442,52.9440808 151.212642,52.9440808 C145.743842,52.9440808 143.946242,49.7504807 143.946242,43.5120806 C143.946242,36.5376805 146.955842,33.8584805 151.617442,33.8584805 C156.498242,33.8584805 158.992642,36.4264805 158.992642,42.4464806 L158.847842,44.5392807 L146.735042,44.5392807 C146.735042,48.4648807 147.946242,50.5232808 151.540642,50.5232808 C154.294242,50.5232808 158.295842,50.1928807 158.295842,50.1928807 L158.295842,50.1928807 Z" id="Fill-19" fill="#565655" fill-rule="nonzero"></path>
                <path d="M163.291442,52.5756008 L163.291442,34.2244005 L166.007442,34.2244005 L166.007442,35.5084005 C166.007442,35.5084005 168.981043,33.8588005 171.696243,33.8588005 C176.763443,33.8588005 177.900243,36.3548005 177.900243,42.8868006 L177.900243,52.5756008 L175.181843,52.5756008 L175.181843,42.9588006 C175.181843,38.1148006 174.633043,36.3172005 171.218643,36.3172005 C168.578643,36.3172005 166.044242,37.6748006 166.044242,37.6748006 L166.044242,52.5756008 L163.291442,52.5756008 Z" id="Fill-21" fill="#565655" fill-rule="nonzero"></path>
                <g id="Fill-23-Clipped">
                    <mask id="mask-14" fill="white">
                        <use xlink:href="#path-13"></use>
                    </mask>
                    <g id="path-13"></g>
                    <path d="M183.004803,52.5760008 L185.755203,52.5760008 L185.755203,34.2248005 L183.004803,34.2248005 L183.004803,52.5760008 Z M183.004803,30.0776004 L185.755203,30.0776004 L185.755203,26.8840004 L183.004803,26.8840004 L183.004803,30.0776004 Z" id="Fill-23" fill="#565655" fill-rule="nonzero" mask="url(#mask-14)"></path>
                </g>
                <g id="Fill-25-Clipped">
                    <mask id="mask-16" fill="white">
                        <use xlink:href="#path-15"></use>
                    </mask>
                    <g id="path-13"></g>
                    <path d="M205.248403,34.2244005 L205.248403,52.5756008 L202.494803,52.5756008 L202.494803,51.2916008 C202.494803,51.2916008 199.741203,52.9444008 197.059603,52.9444008 C191.921203,52.9444008 190.858803,50.5588008 190.858803,43.8068007 L190.858803,34.2244005 L193.609203,34.2244005 L193.609203,43.7668007 C193.609203,48.8332007 194.051603,50.4836008 197.465203,50.4836008 C200.181203,50.4836008 202.494803,49.1252007 202.494803,49.1252007 L202.494803,34.2244005 L205.248403,34.2244005 Z" id="Fill-25" fill="#565655" fill-rule="nonzero" mask="url(#mask-16)"></path>
                </g>
                <g id="Fill-26-Clipped">
                    <mask id="mask-18" fill="white">
                        <use xlink:href="#path-17"></use>
                    </mask>
                    <g id="path-13"></g>
                    <path d="M210.535923,52.5756008 L210.535923,34.2244005 L213.251923,34.2244005 L213.251923,35.5084005 C213.251923,35.5084005 216.002323,33.8588005 218.608723,33.8588005 C221.069523,33.8588005 222.427123,34.4092005 223.380723,35.7292005 C223.380723,35.7292005 226.647923,33.8588005 229.915123,33.8588005 C234.907924,33.8588005 236.115924,36.2428005 236.115924,42.8868006 L236.115924,52.5756008 L233.364723,52.5756008 L233.364723,42.9588006 C233.364723,38.1148006 232.815123,36.3172005 229.510323,36.3172005 C226.792723,36.3172005 224.334323,37.6748006 224.334323,37.6748006 C224.664723,38.5188006 224.811923,40.8300006 224.811923,43.0340006 L224.811923,52.5756008 L222.058323,52.5756008 L222.058323,43.1052006 C222.058323,38.0428006 221.545523,36.3172005 218.206323,36.3172005 C215.600723,36.3172005 213.288723,37.6748006 213.288723,37.6748006 L213.288723,52.5756008 L210.535923,52.5756008 Z" id="Fill-26" fill="#565655" fill-rule="nonzero" mask="url(#mask-18)"></path>
                </g>
                <g id="Fill-27-Clipped">
                    <mask id="mask-20" fill="white">
                        <use xlink:href="#path-19"></use>
                    </mask>
                    <g id="path-13"></g>
                    <path d="M97.1753614,40.1330406 C97.1753614,37.2346406 98.4249615,36.0962405 101.286562,36.0962405 C104.370562,36.0962405 105.508962,37.2346406 105.508962,40.1330406 C105.508962,43.0338406 104.370562,44.1370407 101.286562,44.1370407 C98.4249615,44.1370407 97.1753614,43.0338406 97.1753614,40.1330406 M94.2049614,55.6602408 C94.2049614,56.1034408 94.2337614,56.5090408 94.2809614,56.8906408 L96.9209614,56.8906408 L96.9209614,55.1298408 L96.9361614,55.1298408 C97.0113614,53.9122408 97.5529615,53.2610408 98.9753615,52.2090408 C98.9753615,52.2090408 101.654562,52.3930408 102.940962,52.3930408 C106.132962,52.3930408 107.343362,52.6674408 107.444162,55.1298408 L107.453762,55.1298408 L107.453762,56.8906408 L110.084962,56.8906408 C110.188162,56.4234408 110.244962,55.9178408 110.244962,55.3650408 C110.244962,51.0010408 108.373762,49.9698407 103.159362,49.9698407 C99.0105615,49.9698407 98.7185615,49.7506407 98.7185615,48.2818407 C98.7185615,47.8058407 99.3793615,46.1890407 99.3793615,46.1890407 C99.7833615,46.2650407 100.810562,46.3362407 101.176962,46.3362407 C105.875362,46.3362407 108.261762,44.9050407 108.261762,40.1330406 C108.261762,38.1882406 107.748162,37.1634406 107.049762,36.4642405 L110.536162,36.5378405 L110.536162,34.1882405 L105.104962,34.3362405 C105.104962,34.3362405 103.124162,33.8586405 101.286562,33.8586405 C97.2129614,33.8586405 94.4241614,35.6202405 94.4241614,40.1330406 C94.4241614,43.5122406 95.7841614,44.9794407 97.3225615,45.6778407 C97.3225615,45.6778407 96.0745614,47.8778407 96.0745614,48.5786407 C96.0745614,49.7154407 96.4425614,50.6682408 97.1041614,51.1082408 C95.1945614,52.5418408 94.2049614,53.5322408 94.2049614,55.6602408" id="Fill-27" fill="#565655" fill-rule="nonzero" mask="url(#mask-20)"></path>
                </g>
                <g id="Fill-28-Clipped">
                    <mask id="mask-22" fill="white">
                        <use xlink:href="#path-21"></use>
                    </mask>
                    <g id="path-13"></g>
                    <polygon id="Fill-28" fill="#39AA49" fill-rule="nonzero" mask="url(#mask-22)" points="76.6152011 73.5984011 77.7408012 73.5984011 77.7408012 62.8264009 76.6152011 62.8264009"></polygon>
                </g>
                <g id="Fill-29-Clipped">
                    <mask id="mask-24" fill="white">
                        <use xlink:href="#path-23"></use>
                    </mask>
                    <g id="path-13"></g>
                    <polygon id="Fill-29" fill="#39AA49" fill-rule="nonzero" mask="url(#mask-24)" points="80.9516012 62.9764009 82.1364012 62.9764009 81.1764012 66.261201 80.2916012 66.261201"></polygon>
                </g>
                <g id="Fill-30-Clipped">
                    <mask id="mask-26" fill="white">
                        <use xlink:href="#path-25"></use>
                    </mask>
                    <g id="path-13"></g>
                    <path d="M84.4024013,73.5984011 L85.5272013,73.5984011 L85.5272013,66.096801 L84.4024013,66.096801 L84.4024013,73.5984011 Z M84.4024013,64.401601 L85.5272013,64.401601 L85.5272013,63.0968009 L84.4024013,63.0968009 L84.4024013,64.401601 Z" id="Fill-30" fill="#39AA49" fill-rule="nonzero" mask="url(#mask-26)"></path>
                </g>
                <g id="Fill-31-Clipped">
                    <mask id="mask-28" fill="white">
                        <use xlink:href="#path-27"></use>
                    </mask>
                    <g id="path-13"></g>
                    <path d="M88.2734413,73.5982411 L88.2734413,66.096641 L89.3838413,66.096641 L89.3838413,66.621441 C89.3838413,66.621441 90.5982414,65.947041 91.7086414,65.947041 C93.7790414,65.947041 94.2446414,66.967041 94.2446414,69.637441 L94.2446414,73.5982411 L93.1342414,73.5982411 L93.1342414,69.667841 C93.1342414,67.687041 92.9094414,66.951841 91.5142414,66.951841 C90.4334413,66.951841 89.3982413,67.507041 89.3982413,67.507041 L89.3982413,73.5982411 L88.2734413,73.5982411 Z" id="Fill-31" fill="#39AA49" fill-rule="nonzero" mask="url(#mask-28)"></path>
                </g>
                <g id="Fill-32-Clipped">
                    <mask id="mask-30" fill="white">
                        <use xlink:href="#path-29"></use>
                    </mask>
                    <g id="path-13"></g>
                    <path d="M101.896882,67.192001 C101.896882,67.192001 100.231281,66.952001 99.2712815,66.952001 C98.3416815,66.952001 97.6360815,67.207201 97.6360815,68.092001 C97.6360815,68.797601 97.9960815,68.992001 99.5864815,69.262401 C101.461682,69.576801 102.166482,69.952001 102.166482,71.4080011 C102.166482,73.1632011 101.056882,73.7480011 99.2560815,73.7480011 C98.2960815,73.7480011 96.6152814,73.4632011 96.6152814,73.4632011 L96.6760814,72.4880011 C96.6760814,72.4880011 98.3856815,72.7424011 99.1512815,72.7424011 C100.380881,72.7424011 101.041682,72.4736011 101.041682,71.4528011 C101.041682,70.6728011 100.651281,70.4768011 99.0160815,70.222401 C97.3208815,69.952001 96.5112814,69.637601 96.5112814,68.137601 C96.5112814,66.486401 97.8464815,65.946401 99.2112815,65.946401 C100.336881,65.946401 101.926482,66.232001 101.926482,66.232001 L101.896882,67.192001 Z" id="Fill-32" fill="#39AA49" fill-rule="nonzero" mask="url(#mask-30)"></path>
                </g>
                <g id="Fill-33-Clipped">
                    <mask id="mask-32" fill="white">
                        <use xlink:href="#path-31"></use>
                    </mask>
                    <g id="path-13"></g>
                    <path d="M105.978482,67.071681 L105.978482,70.6572811 C105.978482,72.2924811 106.083282,72.7572811 107.058482,72.7572811 C107.478482,72.7572811 108.393682,72.6676811 108.393682,72.6676811 L108.468882,73.5980811 C108.468882,73.5980811 107.463282,73.7628811 106.938482,73.7628811 C105.393682,73.7628811 104.868082,73.1780811 104.868082,71.0180811 L104.868082,67.071681 L103.803282,67.071681 L103.803282,66.096481 L104.868082,66.096481 L104.868082,63.801281 L105.978482,63.801281 L105.978482,66.096481 L108.364082,66.096481 L108.364082,67.071681 L105.978482,67.071681 Z" id="Fill-33" fill="#39AA49" fill-rule="nonzero" mask="url(#mask-32)"></path>
                </g>
                <g id="Fill-34-Clipped">
                    <mask id="mask-34" fill="white">
                        <use xlink:href="#path-33"></use>
                    </mask>
                    <g id="path-13"></g>
                    <path d="M110.329602,73.5984011 L111.454402,73.5984011 L111.454402,66.096801 L110.329602,66.096801 L110.329602,73.5984011 Z M110.329602,64.401601 L111.454402,64.401601 L111.454402,63.0968009 L110.329602,63.0968009 L110.329602,64.401601 Z" id="Fill-34" fill="#39AA49" fill-rule="nonzero" mask="url(#mask-34)"></path>
                </g>
                <g id="Fill-35-Clipped">
                    <mask id="mask-36" fill="white">
                        <use xlink:href="#path-35"></use>
                    </mask>
                    <g id="path-13"></g>
                    <path d="M115.701602,67.071681 L115.701602,70.6572811 C115.701602,72.2924811 115.806402,72.7572811 116.781602,72.7572811 C117.201602,72.7572811 118.117602,72.6676811 118.117602,72.6676811 L118.192002,73.5980811 C118.192002,73.5980811 117.186402,73.7628811 116.661602,73.7628811 C115.116802,73.7628811 114.591202,73.1780811 114.591202,71.0180811 L114.591202,67.071681 L113.525602,67.071681 L113.525602,66.096481 L114.591202,66.096481 L114.591202,63.801281 L115.701602,63.801281 L115.701602,66.096481 L118.086402,66.096481 L118.086402,67.071681 L115.701602,67.071681 Z" id="Fill-35" fill="#39AA49" fill-rule="nonzero" mask="url(#mask-36)"></path>
                </g>
                <g id="Fill-36-Clipped">
                    <mask id="mask-38" fill="white">
                        <use xlink:href="#path-37"></use>
                    </mask>
                    <g id="path-13"></g>
                    <path d="M125.858562,66.096641 L125.858562,73.5982411 L124.733762,73.5982411 L124.733762,73.0734411 C124.733762,73.0734411 123.608162,73.7478411 122.512962,73.7478411 C120.412162,73.7478411 119.977762,72.7734411 119.977762,70.012641 L119.977762,66.096641 L121.103362,66.096641 L121.103362,69.997441 C121.103362,72.0678411 121.282562,72.7430411 122.677762,72.7430411 C123.788162,72.7430411 124.733762,72.1878411 124.733762,72.1878411 L124.733762,66.096641 L125.858562,66.096641 Z" id="Fill-36" fill="#39AA49" fill-rule="nonzero" mask="url(#mask-38)"></path>
                </g>
                <g id="Fill-37-Clipped">
                    <mask id="mask-40" fill="white">
                        <use xlink:href="#path-39"></use>
                    </mask>
                    <g id="path-13"></g>
                    <path d="M130.105442,67.071681 L130.105442,70.6572811 C130.105442,72.2924811 130.211042,72.7572811 131.186242,72.7572811 C131.606242,72.7572811 132.521442,72.6676811 132.521442,72.6676811 L132.595842,73.5980811 C132.595842,73.5980811 131.590242,73.7628811 131.065442,73.7628811 C129.520642,73.7628811 128.995042,73.1780811 128.995042,71.0180811 L128.995042,67.071681 L127.930242,67.071681 L127.930242,66.096481 L128.995042,66.096481 L128.995042,63.801281 L130.105442,63.801281 L130.105442,66.096481 L132.490242,66.096481 L132.490242,67.071681 L130.105442,67.071681 Z" id="Fill-37" fill="#39AA49" fill-rule="nonzero" mask="url(#mask-40)"></path>
                </g>
                <g id="Fill-38-Clipped">
                    <mask id="mask-42" fill="white">
                        <use xlink:href="#path-41"></use>
                    </mask>
                    <g id="path-13"></g>
                    <path d="M140.293762,70.072481 C139.377762,70.162081 139.018562,70.5972811 139.018562,71.4220811 C139.018562,72.2924811 139.393762,72.8028811 140.158562,72.8028811 C141.268962,72.8028811 142.513762,72.3380811 142.513762,72.3380811 L142.513762,69.862081 L140.293762,70.072481 Z M143.639362,72.2028811 C143.668962,72.6380811 144.028962,72.8028811 144.509762,72.8628811 L144.464162,73.7484811 C143.668962,73.7484811 143.128962,73.5980811 142.678562,73.1484811 C142.678562,73.1484811 141.328962,73.7484811 139.977762,73.7484811 C138.612962,73.7484811 137.863362,72.9676811 137.863362,71.4532811 C137.863362,70.012481 138.612962,69.382881 140.158562,69.232481 L142.513762,69.007681 L142.513762,68.362081 C142.513762,67.312481 142.064162,66.937281 141.164162,66.937281 C140.112962,66.937281 138.328162,67.131681 138.328162,67.131681 L138.282562,66.277281 C138.282562,66.277281 139.933762,65.946881 141.223362,65.946881 C142.918562,65.946881 143.639362,66.726881 143.639362,68.362081 L143.639362,72.2028811 Z" id="Fill-38" fill="#39AA49" fill-rule="nonzero" mask="url(#mask-42)"></path>
                </g>
                <g id="Fill-39-Clipped">
                    <mask id="mask-44" fill="white">
                        <use xlink:href="#path-43"></use>
                    </mask>
                    <g id="path-13"></g>
                    <path d="M150.735922,68.512321 C150.735922,67.327521 150.271122,66.861921 149.011122,66.861921 C147.840722,66.861921 147.330322,67.327521 147.330322,68.512321 C147.330322,69.697121 147.840722,70.147521 149.011122,70.147521 C150.271122,70.147521 150.735922,69.697121 150.735922,68.512321 M148.065522,73.4483211 C147.435922,73.9131211 147.225522,74.1835211 147.225522,74.7683211 C147.225522,75.8035211 147.660722,76.1787211 149.355922,76.1787211 C150.855922,76.1787211 151.531122,75.7731211 151.531122,74.7835211 C151.531122,73.6427211 151.051922,73.5235211 149.686322,73.5235211 C149.160722,73.5235211 148.065522,73.4483211 148.065522,73.4483211 M146.115922,74.8587211 C146.115922,73.9883211 146.519922,73.5835211 147.300722,72.9979211 C147.030322,72.8179211 146.880722,72.4283211 146.880722,71.9627211 C146.880722,71.6779211 147.390322,70.7779211 147.390322,70.7779211 C146.760722,70.4931211 146.205522,69.893121 146.205522,68.512321 C146.205522,66.666721 147.345522,65.946721 149.011122,65.946721 C149.760722,65.946721 150.571122,66.141921 150.571122,66.141921 L152.791122,66.081921 L152.791122,67.041921 L151.366322,67.012321 C151.651922,67.296321 151.861522,67.717121 151.861522,68.512321 C151.861522,70.462721 150.885522,71.0475211 148.965522,71.0475211 C148.815922,71.0475211 148.395922,71.0179211 148.231122,70.9875211 C148.231122,70.9875211 147.960722,71.6475211 147.960722,71.8427211 C147.960722,72.4427211 148.081522,72.5323211 149.776722,72.5323211 C151.906322,72.5323211 152.671922,72.9531211 152.671922,74.7379211 C152.671922,76.4331211 151.455922,77.1235211 149.340722,77.1235211 C146.970322,77.1235211 146.115922,76.5979211 146.115922,74.8587211" id="Fill-39" fill="#39AA49" fill-rule="nonzero" mask="url(#mask-44)"></path>
                </g>
                <g id="Fill-40-Clipped">
                    <mask id="mask-46" fill="white">
                        <use xlink:href="#path-45"></use>
                    </mask>
                    <g id="path-13"></g>
                    <path d="M154.742962,66.096641 L155.853362,66.096641 L155.853362,67.116641 C155.853362,67.116641 157.158962,66.216641 158.598162,65.931841 L158.598162,67.071841 C157.188562,67.356641 155.867762,68.091841 155.867762,68.091841 L155.867762,73.5982411 L154.742962,73.5982411 L154.742962,66.096641 Z" id="Fill-40" fill="#39AA49" fill-rule="nonzero" mask="url(#mask-46)"></path>
                </g>
                <g id="Fill-41-Clipped">
                    <mask id="mask-48" fill="white">
                        <use xlink:href="#path-47"></use>
                    </mask>
                    <g id="path-13"></g>
                    <path d="M165.305442,69.757601 C165.305442,67.672801 164.855842,66.921601 163.250242,66.921601 C161.659842,66.921601 161.195042,67.672801 161.195042,69.757601 C161.195042,71.8880011 161.479842,72.7736011 163.250242,72.7736011 C165.035842,72.7736011 165.305442,71.8880011 165.305442,69.757601 M166.460642,69.757601 C166.460642,72.4880011 165.786242,73.7480011 163.250242,73.7480011 C160.729442,73.7480011 160.039842,72.4880011 160.039842,69.757601 C160.039842,67.176801 160.879842,65.946401 163.250242,65.946401 C165.635842,65.946401 166.460642,67.176801 166.460642,69.757601" id="Fill-41" fill="#39AA49" fill-rule="nonzero" mask="url(#mask-48)"></path>
                </g>
                <g id="Fill-42-Clipped">
                    <mask id="mask-50" fill="white">
                        <use xlink:href="#path-49"></use>
                    </mask>
                    <g id="path-13"></g>
                    <path d="M168.878163,73.5982411 L168.878163,66.096641 L169.987763,66.096641 L169.987763,66.621441 C169.987763,66.621441 171.202963,65.947041 172.313363,65.947041 C174.383763,65.947041 174.848563,66.967041 174.848563,69.637441 L174.848563,73.5982411 L173.738163,73.5982411 L173.738163,69.667841 C173.738163,67.687041 173.513363,66.951841 172.118163,66.951841 C171.037363,66.951841 170.002963,67.507041 170.002963,67.507041 L170.002963,73.5982411 L168.878163,73.5982411 Z" id="Fill-42" fill="#39AA49" fill-rule="nonzero" mask="url(#mask-50)"></path>
                </g>
                <g id="Fill-43-Clipped">
                    <mask id="mask-52" fill="white">
                        <use xlink:href="#path-51"></use>
                    </mask>
                    <g id="path-13"></g>
                    <path d="M182.456243,69.757601 C182.456243,67.672801 182.005843,66.921601 180.400243,66.921601 C178.809843,66.921601 178.345043,67.672801 178.345043,69.757601 C178.345043,71.8880011 178.630643,72.7736011 180.400243,72.7736011 C182.185843,72.7736011 182.456243,71.8880011 182.456243,69.757601 M183.610643,69.757601 C183.610643,72.4880011 182.936243,73.7480011 180.400243,73.7480011 C177.879443,73.7480011 177.189843,72.4880011 177.189843,69.757601 C177.189843,67.176801 178.029843,65.946401 180.400243,65.946401 C182.785843,65.946401 183.610643,67.176801 183.610643,69.757601" id="Fill-43" fill="#39AA49" fill-rule="nonzero" mask="url(#mask-52)"></path>
                </g>
                <g id="Fill-44-Clipped">
                    <mask id="mask-54" fill="white">
                        <use xlink:href="#path-53"></use>
                    </mask>
                    <g id="path-13"></g>
                    <path d="M186.028163,73.5982411 L186.028163,66.096641 L187.138563,66.096641 L187.138563,66.621441 C187.138563,66.621441 188.263363,65.947041 189.328163,65.947041 C190.333763,65.947041 190.888963,66.171841 191.278563,66.712641 C191.278563,66.712641 192.613763,65.947041 193.948963,65.947041 C195.988963,65.947041 196.484163,66.921441 196.484163,69.637441 L196.484163,73.5982411 L195.359363,73.5982411 L195.359363,69.667841 C195.359363,67.687041 195.134563,66.951841 193.784163,66.951841 C192.673763,66.951841 191.668963,67.507041 191.668963,67.507041 C191.804163,67.851841 191.864163,68.797441 191.864163,69.697441 L191.864163,73.5982411 L190.739363,73.5982411 L190.739363,69.727041 C190.739363,67.656641 190.528163,66.951841 189.163363,66.951841 C188.098563,66.951841 187.152963,67.507041 187.152963,67.507041 L187.152963,73.5982411 L186.028163,73.5982411 Z" id="Fill-44" fill="#39AA49" fill-rule="nonzero" mask="url(#mask-54)"></path>
                </g>
                <g id="Fill-45-Clipped">
                    <mask id="mask-56" fill="white">
                        <use xlink:href="#path-55"></use>
                    </mask>
                    <g id="path-13"></g>
                    <path d="M199.156803,73.5984011 L200.281603,73.5984011 L200.281603,66.096801 L199.156803,66.096801 L199.156803,73.5984011 Z M199.156803,64.401601 L200.281603,64.401601 L200.281603,63.0968009 L199.156803,63.0968009 L199.156803,64.401601 Z" id="Fill-45" fill="#39AA49" fill-rule="nonzero" mask="url(#mask-56)"></path>
                </g>
                <g id="Fill-46-Clipped">
                    <mask id="mask-58" fill="white">
                        <use xlink:href="#path-57"></use>
                    </mask>
                    <g id="path-13"></g>
                    <path d="M203.838323,69.967761 C203.838323,71.8429611 204.318323,72.7429611 205.638323,72.7429611 C206.673523,72.7429611 207.633523,72.3077611 207.633523,72.3077611 L207.633523,67.012561 C207.633523,67.012561 206.703923,66.921361 206.253523,66.921361 C204.287923,66.921361 203.838323,67.897361 203.838323,69.967761 M202.698323,69.967761 C202.698323,67.012561 203.598323,65.946961 206.238323,65.946961 C207.019123,65.946961 208.743923,66.096561 208.743923,66.096561 L208.743923,76.9285611 L207.633523,76.9285611 L207.633523,73.2525611 C207.633523,73.2525611 206.583923,73.7485611 205.519123,73.7485611 C203.478323,73.7485611 202.698323,72.6229611 202.698323,69.967761" id="Fill-46" fill="#39AA49" fill-rule="nonzero" mask="url(#mask-58)"></path>
                </g>
                <g id="Fill-47-Clipped">
                    <mask id="mask-60" fill="white">
                        <use xlink:href="#path-59"></use>
                    </mask>
                    <g id="path-13"></g>
                    <path d="M217.310963,66.096641 L217.310963,73.5982411 L216.186163,73.5982411 L216.186163,73.0734411 C216.186163,73.0734411 215.060563,73.7478411 213.965363,73.7478411 C211.865363,73.7478411 211.430163,72.7734411 211.430163,70.012641 L211.430163,66.096641 L212.555763,66.096641 L212.555763,69.997441 C212.555763,72.0678411 212.735763,72.7430411 214.130963,72.7430411 C215.240563,72.7430411 216.186163,72.1878411 216.186163,72.1878411 L216.186163,66.096641 L217.310963,66.096641 Z" id="Fill-47" fill="#39AA49" fill-rule="nonzero" mask="url(#mask-60)"></path>
                </g>
                <g id="Fill-48-Clipped">
                    <mask id="mask-62" fill="white">
                        <use xlink:href="#path-61"></use>
                    </mask>
                    <g id="path-13"></g>
                    <path d="M224.753923,69.412321 C224.753923,67.552321 224.183523,66.892321 222.863523,66.892321 C221.588323,66.892321 220.868323,67.596321 220.853123,69.412321 L224.753923,69.412321 Z M225.593923,72.6235211 L225.623523,73.5083211 C225.623523,73.5083211 223.913123,73.7483211 222.698723,73.7483211 C220.462723,73.7483211 219.728323,72.4427211 219.728323,69.893121 C219.728323,67.041921 220.957923,65.946721 222.863523,65.946721 C224.858723,65.946721 225.878723,66.996321 225.878723,69.457921 L225.818723,70.312321 L220.868323,70.312321 C220.868323,71.9179211 221.363523,72.7579211 222.833923,72.7579211 C223.958723,72.7579211 225.593923,72.6235211 225.593923,72.6235211 L225.593923,72.6235211 Z" id="Fill-48" fill="#39AA49" fill-rule="nonzero" mask="url(#mask-62)"></path>
                </g>
                <g id="Fill-49-Clipped">
                    <mask id="mask-64" fill="white">
                        <use xlink:href="#path-63"></use>
                    </mask>
                    <g id="path-13"></g>
                    <polygon id="Fill-49" fill="#39AA49" fill-rule="nonzero" mask="url(#mask-64)" points="228.340643 71.9928011 229.586243 71.9928011 228.580643 75.4432011 227.650243 75.4432011"></polygon>
                </g>
                <g id="Fill-50-Clipped">
                    <mask id="mask-66" fill="white">
                        <use xlink:href="#path-65"></use>
                    </mask>
                    <g id="path-13"></g>
                    <polygon id="Fill-50" fill="#39AA49" fill-rule="nonzero" mask="url(#mask-66)" points="77.0203211 82.1021612 78.7755212 88.6277613 79.3307212 88.6277613 81.1459212 82.1021612 82.3011212 82.1021612 80.1859212 89.6029613 77.9355212 89.6029613 75.8203211 82.1021612"></polygon>
                </g>
                <g id="Fill-51-Clipped">
                    <mask id="mask-68" fill="white">
                        <use xlink:href="#path-67"></use>
                    </mask>
                    <g id="path-13"></g>
                    <path d="M88.5281613,78.5013612 L88.9177613,79.4613612 L85.6025613,80.7365612 L85.2873613,79.9717612 L88.5281613,78.5013612 Z M88.8881613,85.4181613 C88.8881613,83.5565612 88.3177613,82.8965612 86.9977613,82.8965612 C85.7225613,82.8965612 85.0025613,83.6021612 84.9873613,85.4181613 L88.8881613,85.4181613 Z M89.7281613,88.6277613 L89.7585613,89.5133613 C89.7585613,89.5133613 88.0481613,89.7525613 86.8329613,89.7525613 C84.5977613,89.7525613 83.8625612,88.4485613 83.8625612,85.8973613 C83.8625612,83.0469612 85.0929613,81.9517612 86.9977613,81.9517612 C88.9937613,81.9517612 90.0129613,83.0021612 90.0129613,85.4621613 L89.9537613,86.3181613 L85.0025613,86.3181613 C85.0025613,87.9221613 85.4977613,88.7629613 86.9681613,88.7629613 C88.0929613,88.7629613 89.7281613,88.6277613 89.7281613,88.6277613 L89.7281613,88.6277613 Z" id="Fill-51" fill="#39AA49" fill-rule="nonzero" mask="url(#mask-68)"></path>
                </g>
                <g id="Fill-52-Clipped">
                    <mask id="mask-70" fill="white">
                        <use xlink:href="#path-69"></use>
                    </mask>
                    <g id="path-13"></g>
                    <path d="M93.8101614,83.0771212 L93.8101614,86.6619213 C93.8101614,88.2979213 93.9149614,88.7627213 94.8909614,88.7627213 C95.3101614,88.7627213 96.2261614,88.6731213 96.2261614,88.6731213 L96.3005614,89.6027213 C96.3005614,89.6027213 95.2949614,89.7675213 94.7701614,89.7675213 C93.2253614,89.7675213 92.6997614,89.1835213 92.6997614,87.0227213 L92.6997614,83.0771212 L91.6349614,83.0771212 L91.6349614,82.1019212 L92.6997614,82.1019212 L92.6997614,79.8067212 L93.8101614,79.8067212 L93.8101614,82.1019212 L96.1957614,82.1019212 L96.1957614,83.0771212 L93.8101614,83.0771212 Z" id="Fill-52" fill="#39AA49" fill-rule="nonzero" mask="url(#mask-70)"></path>
                </g>
                <g id="Fill-53-Clipped">
                    <mask id="mask-72" fill="white">
                        <use xlink:href="#path-71"></use>
                    </mask>
                    <g id="path-13"></g>
                    <path d="M102.497682,78.5013612 L102.887282,79.4613612 L99.5720815,80.7365612 L99.2568815,79.9717612 L102.497682,78.5013612 Z M102.857682,85.4181613 C102.857682,83.5565612 102.287282,82.8965612 100.967282,82.8965612 C99.6920815,82.8965612 98.9720815,83.6021612 98.9568815,85.4181613 L102.857682,85.4181613 Z M103.697682,88.6277613 L103.728082,89.5133613 C103.728082,89.5133613 102.016882,89.7525613 100.802482,89.7525613 C98.5664815,89.7525613 97.8320815,88.4485613 97.8320815,85.8973613 C97.8320815,83.0469612 99.0616815,81.9517612 100.967282,81.9517612 C102.962482,81.9517612 103.982482,83.0021612 103.982482,85.4621613 L103.922482,86.3181613 L98.9720815,86.3181613 C98.9720815,87.9221613 99.4672815,88.7629613 100.937682,88.7629613 C102.062482,88.7629613 103.697682,88.6277613 103.697682,88.6277613 L103.697682,88.6277613 Z" id="Fill-53" fill="#39AA49" fill-rule="nonzero" mask="url(#mask-72)"></path>
                </g>
                <g id="Fill-54-Clipped">
                    <mask id="mask-74" fill="white">
                        <use xlink:href="#path-73"></use>
                    </mask>
                    <g id="path-13"></g>
                    <path d="M106.324242,82.1021612 L107.434642,82.1021612 L107.434642,83.1213612 C107.434642,83.1213612 108.740242,82.2213612 110.179442,81.9365612 L110.179442,83.0773612 C108.769842,83.3621612 107.449042,84.0973613 107.449042,84.0973613 L107.449042,89.6029613 L106.324242,89.6029613 L106.324242,82.1021612 Z" id="Fill-54" fill="#39AA49" fill-rule="nonzero" mask="url(#mask-74)"></path>
                </g>
                <g id="Fill-55-Clipped">
                    <mask id="mask-76" fill="white">
                        <use xlink:href="#path-75"></use>
                    </mask>
                    <g id="path-13"></g>
                    <path d="M112.100802,89.6032013 L113.225602,89.6032013 L113.225602,82.1024012 L112.100802,82.1024012 L112.100802,89.6032013 Z M112.100802,80.4072012 L113.225602,80.4072012 L113.225602,79.1016012 L112.100802,79.1016012 L112.100802,80.4072012 Z" id="Fill-55" fill="#39AA49" fill-rule="nonzero" mask="url(#mask-76)"></path>
                </g>
                <g id="Fill-56-Clipped">
                    <mask id="mask-78" fill="white">
                        <use xlink:href="#path-77"></use>
                    </mask>
                    <g id="path-13"></g>
                    <path d="M115.971842,89.6029613 L115.971842,82.1021612 L117.083042,82.1021612 L117.083042,82.6269612 C117.083042,82.6269612 118.297442,81.9525612 119.407842,81.9525612 C121.478242,81.9525612 121.943042,82.9717612 121.943042,85.6429613 L121.943042,89.6029613 L120.832642,89.6029613 L120.832642,85.6725613 C120.832642,83.6917612 120.607842,82.9565612 119.212642,82.9565612 C118.132642,82.9565612 117.096642,83.5125612 117.096642,83.5125612 L117.096642,89.6029613 L115.971842,89.6029613 Z" id="Fill-56" fill="#39AA49" fill-rule="nonzero" mask="url(#mask-78)"></path>
                </g>
                <g id="Fill-57-Clipped">
                    <mask id="mask-80" fill="white">
                        <use xlink:href="#path-79"></use>
                    </mask>
                    <g id="path-13"></g>
                    <path d="M126.564882,86.0779213 C125.649682,86.1675213 125.289682,86.6027213 125.289682,87.4275213 C125.289682,88.2979213 125.664882,88.8075213 126.429682,88.8075213 C127.540082,88.8075213 128.784882,88.3427213 128.784882,88.3427213 L128.784882,85.8675213 L126.564882,86.0779213 Z M129.910482,88.2075213 C129.940882,88.6427213 130.300082,88.8075213 130.780882,88.8675213 L130.736082,89.7531213 C129.940882,89.7531213 129.400082,89.6027213 128.949682,89.1531213 C128.949682,89.1531213 127.600082,89.7531213 126.249682,89.7531213 C124.884082,89.7531213 124.134482,88.9731213 124.134482,87.4579213 C124.134482,86.0179213 124.884082,85.3875213 126.429682,85.2371213 L128.784882,85.0123213 L128.784882,84.3667213 C128.784882,83.3171212 128.335282,82.9419212 127.435282,82.9419212 C126.384082,82.9419212 124.600082,83.1371212 124.600082,83.1371212 L124.554482,82.2819212 C124.554482,82.2819212 126.204882,81.9523212 127.495282,81.9523212 C129.190482,81.9523212 129.910482,82.7315212 129.910482,84.3667213 L129.910482,88.2075213 Z" id="Fill-57" fill="#39AA49" fill-rule="nonzero" mask="url(#mask-80)"></path>
                </g>
                <g id="Fill-58-Clipped">
                    <mask id="mask-82" fill="white">
                        <use xlink:href="#path-81"></use>
                    </mask>
                    <g id="path-13"></g>
                    <path d="M132.716802,89.6032013 L133.841602,89.6032013 L133.841602,82.1024012 L132.716802,82.1024012 L132.716802,89.6032013 Z M132.716802,80.4072012 L133.841602,80.4072012 L133.841602,79.1016012 L132.716802,79.1016012 L132.716802,80.4072012 Z" id="Fill-58" fill="#39AA49" fill-rule="nonzero" mask="url(#mask-82)"></path>
                </g>
                <g id="Fill-59-Clipped">
                    <mask id="mask-84" fill="white">
                        <use xlink:href="#path-83"></use>
                    </mask>
                    <g id="path-13"></g>
                    <path d="M136.588322,82.1021612 L137.698722,82.1021612 L137.698722,83.1213612 C137.698722,83.1213612 139.003522,82.2213612 140.443522,81.9365612 L140.443522,83.0773612 C139.033922,83.3621612 137.713122,84.0973613 137.713122,84.0973613 L137.713122,89.6029613 L136.588322,89.6029613 L136.588322,82.1021612 Z" id="Fill-59" fill="#39AA49" fill-rule="nonzero" mask="url(#mask-84)"></path>
                </g>
                <g id="Fill-60-Clipped">
                    <mask id="mask-86" fill="white">
                        <use xlink:href="#path-85"></use>
                    </mask>
                    <g id="path-13"></g>
                    <path d="M146.910962,85.4177613 C146.910962,83.5569612 146.340562,82.8969612 145.020562,82.8969612 C143.745362,82.8969612 143.025362,83.6017612 143.010162,85.4177613 L146.910962,85.4177613 Z M147.750962,88.6281613 L147.781362,89.5129613 C147.781362,89.5129613 146.070162,89.7529613 144.855762,89.7529613 C142.620562,89.7529613 141.885362,88.4481613 141.885362,85.8977613 C141.885362,83.0465612 143.114962,81.9521612 145.020562,81.9521612 C147.015762,81.9521612 148.035762,83.0017612 148.035762,85.4625613 L147.975762,86.3177613 L143.025362,86.3177613 C143.025362,87.9225613 143.520562,88.7633613 144.990962,88.7633613 C146.115762,88.7633613 147.750962,88.6281613 147.750962,88.6281613 L147.750962,88.6281613 Z" id="Fill-60" fill="#39AA49" fill-rule="nonzero" mask="url(#mask-86)"></path>
                </g>
                <g id="Fill-61-Clipped">
                    <mask id="mask-88" fill="white">
                        <use xlink:href="#path-87"></use>
                    </mask>
                    <g id="path-13"></g>
                    <path d="M157.083602,83.1068012 L157.518802,83.5268012 C158.838802,82.9572012 159.364402,82.5068012 159.364402,81.4420012 C159.364402,80.5420012 158.929202,80.0612012 157.894002,80.0612012 C156.948402,80.0612012 156.408402,80.5116012 156.408402,81.4716012 C156.408402,82.0268012 156.558802,82.5524012 157.083602,83.1068012 M159.949202,87.3828013 L156.783602,84.2324013 C155.478002,84.6372013 154.953202,85.2076013 154.953202,86.4828013 C154.953202,87.9532013 155.643602,88.7324013 157.414002,88.7324013 C158.538802,88.7324013 159.468402,88.3132013 159.949202,87.3828013 M160.489202,81.3668012 C160.489202,82.7916012 159.799602,83.4524012 158.178802,84.2020013 L160.459602,86.4532013 C160.624402,85.9724013 160.834002,84.7420013 160.879602,84.0228013 L161.974802,84.0372013 C161.869202,85.0876013 161.569202,86.4532013 161.284402,87.1572013 L163.220402,88.9884013 L162.544402,89.7380013 L160.730002,88.0428013 C160.038802,89.1836013 158.929202,89.7532013 157.503602,89.7532013 C154.698802,89.7532013 153.813202,88.5380013 153.813202,86.5572013 C153.813202,84.7724013 154.563602,84.0372013 156.138802,83.5268012 C155.388402,82.6716012 155.283602,82.1612012 155.283602,81.2916012 C155.283602,79.9716012 156.229202,79.0868012 157.894002,79.0868012 C159.649202,79.0868012 160.489202,79.9716012 160.489202,81.3668012" id="Fill-61" fill="#39AA49" fill-rule="nonzero" mask="url(#mask-88)"></path>
                </g>
                <g id="Fill-62-Clipped">
                    <mask id="mask-90" fill="white">
                        <use xlink:href="#path-89"></use>
                    </mask>
                    <g id="path-13"></g>
                    <path d="M170.497683,89.6029613 L169.372883,89.6029613 L169.372883,83.0773612 L168.427283,83.0773612 L168.427283,82.1021612 L169.372883,82.1021612 L169.372883,81.4269612 C169.372883,79.2661612 169.928083,78.6813612 171.397683,78.6813612 C171.908083,78.6813612 172.913683,78.7861612 172.913683,78.7861612 L172.898483,79.7165612 C172.898483,79.7165612 172.057683,79.6861612 171.608083,79.6861612 C170.768083,79.6861612 170.497683,80.0469612 170.497683,81.4421612 L170.497683,82.1021612 L172.673683,82.1021612 L172.673683,83.0773612 L170.497683,83.0773612 L170.497683,89.6029613 Z" id="Fill-62" fill="#39AA49" fill-rule="nonzero" mask="url(#mask-90)"></path>
                </g>
                <g id="Fill-63-Clipped">
                    <mask id="mask-92" fill="white">
                        <use xlink:href="#path-91"></use>
                    </mask>
                    <g id="path-13"></g>
                    <path d="M179.410163,85.7623213 C179.410163,83.6775212 178.960563,82.9271212 177.354963,82.9271212 C175.763763,82.9271212 175.298963,83.6775212 175.298963,85.7623213 C175.298963,87.8927213 175.584563,88.7783213 177.354963,88.7783213 C179.139763,88.7783213 179.410163,87.8927213 179.410163,85.7623213 M180.565363,85.7623213 C180.565363,88.4927213 179.890963,89.7527213 177.354963,89.7527213 C174.834163,89.7527213 174.144563,88.4927213 174.144563,85.7623213 C174.144563,83.1815212 174.984563,81.9519212 177.354963,81.9519212 C179.740563,81.9519212 180.565363,83.1815212 180.565363,85.7623213" id="Fill-63" fill="#39AA49" fill-rule="nonzero" mask="url(#mask-92)"></path>
                </g>
                <g id="Fill-64-Clipped">
                    <mask id="mask-94" fill="white">
                        <use xlink:href="#path-93"></use>
                    </mask>
                    <g id="path-13"></g>
                    <path d="M182.982003,82.1021612 L184.092403,82.1021612 L184.092403,83.1213612 C184.092403,83.1213612 185.398003,82.2213612 186.837203,81.9365612 L186.837203,83.0773612 C185.427603,83.3621612 184.106803,84.0973613 184.106803,84.0973613 L184.106803,89.6029613 L182.982003,89.6029613 L182.982003,82.1021612 Z" id="Fill-64" fill="#39AA49" fill-rule="nonzero" mask="url(#mask-94)"></path>
                </g>
                <g id="Fill-65-Clipped">
                    <mask id="mask-96" fill="white">
                        <use xlink:href="#path-95"></use>
                    </mask>
                    <g id="path-13"></g>
                    <path d="M193.304723,85.4177613 C193.304723,83.5569612 192.734323,82.8969612 191.414323,82.8969612 C190.139123,82.8969612 189.419123,83.6017612 189.403923,85.4177613 L193.304723,85.4177613 Z M194.144723,88.6281613 L194.175123,89.5129613 C194.175123,89.5129613 192.463923,89.7529613 191.249523,89.7529613 C189.014323,89.7529613 188.279123,88.4481613 188.279123,85.8977613 C188.279123,83.0465612 189.508723,81.9521612 191.414323,81.9521612 C193.409523,81.9521612 194.429523,83.0017612 194.429523,85.4625613 L194.369523,86.3177613 L189.419123,86.3177613 C189.419123,87.9225613 189.914323,88.7633613 191.384723,88.7633613 C192.509523,88.7633613 194.144723,88.6281613 194.144723,88.6281613 L194.144723,88.6281613 Z" id="Fill-65" fill="#39AA49" fill-rule="nonzero" mask="url(#mask-96)"></path>
                </g>
                <g id="Fill-66-Clipped">
                    <mask id="mask-98" fill="white">
                        <use xlink:href="#path-97"></use>
                    </mask>
                    <g id="path-13"></g>
                    <path d="M201.751603,83.1974412 C201.751603,83.1974412 200.086803,82.9566412 199.126803,82.9566412 C198.197203,82.9566412 197.491603,83.2126412 197.491603,84.0974413 C197.491603,84.8022413 197.851603,84.9974413 199.441203,85.2678413 C201.317203,85.5822413 202.022003,85.9574413 202.022003,87.4134413 C202.022003,89.1678413 200.911603,89.7526413 199.111603,89.7526413 C198.151603,89.7526413 196.470803,89.4678413 196.470803,89.4678413 L196.531603,88.4926413 C196.531603,88.4926413 198.241203,88.7478413 199.006003,88.7478413 C200.236403,88.7478413 200.897203,88.4782413 200.897203,87.4574413 C200.897203,86.6782413 200.506803,86.4822413 198.871603,86.2278413 C197.176403,85.9574413 196.366803,85.6430413 196.366803,84.1422413 C196.366803,82.4918412 197.702003,81.9518412 199.066803,81.9518412 C200.192403,81.9518412 201.782003,82.2374412 201.782003,82.2374412 L201.751603,83.1974412 Z" id="Fill-66" fill="#39AA49" fill-rule="nonzero" mask="url(#mask-98)"></path>
                </g>
                <g id="Fill-67-Clipped">
                    <mask id="mask-100" fill="white">
                        <use xlink:href="#path-99"></use>
                    </mask>
                    <g id="path-13"></g>
                    <path d="M205.833603,83.0771212 L205.833603,86.6619213 C205.833603,88.2979213 205.939203,88.7627213 206.914403,88.7627213 C207.334403,88.7627213 208.249603,88.6731213 208.249603,88.6731213 L208.324003,89.6027213 C208.324003,89.6027213 207.318403,89.7675213 206.793603,89.7675213 C205.248803,89.7675213 204.723203,89.1835213 204.723203,87.0227213 L204.723203,83.0771212 L203.658403,83.0771212 L203.658403,82.1019212 L204.723203,82.1019212 L204.723203,79.8067212 L205.833603,79.8067212 L205.833603,82.1019212 L208.218403,82.1019212 L208.218403,83.0771212 L205.833603,83.0771212 Z" id="Fill-67" fill="#39AA49" fill-rule="nonzero" mask="url(#mask-100)"></path>
                </g>
                <g id="Fill-68-Clipped">
                    <mask id="mask-102" fill="white">
                        <use xlink:href="#path-101"></use>
                    </mask>
                    <g id="path-13"></g>
                    <path d="M210.184803,89.6032013 L211.309603,89.6032013 L211.309603,82.1024012 L210.184803,82.1024012 L210.184803,89.6032013 Z M210.184803,80.4072012 L211.309603,80.4072012 L211.309603,79.1016012 L210.184803,79.1016012 L210.184803,80.4072012 Z" id="Fill-68" fill="#39AA49" fill-rule="nonzero" mask="url(#mask-102)"></path>
                </g>
                <g id="Fill-69-Clipped">
                    <mask id="mask-104" fill="white">
                        <use xlink:href="#path-103"></use>
                    </mask>
                    <g id="path-13"></g>
                    <path d="M218.752323,85.4177613 C218.752323,83.5569612 218.181923,82.8969612 216.861923,82.8969612 C215.586723,82.8969612 214.866723,83.6017612 214.851523,85.4177613 L218.752323,85.4177613 Z M219.592323,88.6281613 L219.622723,89.5129613 C219.622723,89.5129613 217.912323,89.7529613 216.697123,89.7529613 C214.461923,89.7529613 213.726723,88.4481613 213.726723,85.8977613 C213.726723,83.0465612 214.956323,81.9521612 216.861923,81.9521612 C218.857923,81.9521612 219.877123,83.0017612 219.877123,85.4625613 L219.817123,86.3177613 L214.866723,86.3177613 C214.866723,87.9225613 215.361923,88.7633613 216.832323,88.7633613 C217.957123,88.7633613 219.592323,88.6281613 219.592323,88.6281613 L219.592323,88.6281613 Z" id="Fill-69" fill="#39AA49" fill-rule="nonzero" mask="url(#mask-104)"></path>
                </g>
                <g id="Fill-70-Clipped">
                    <mask id="mask-106" fill="white">
                        <use xlink:href="#path-105"></use>
                    </mask>
                    <g id="path-13"></g>
                    <path d="M222.218723,82.1021612 L223.329123,82.1021612 L223.329123,83.1213612 C223.329123,83.1213612 224.634723,82.2213612 226.073923,81.9365612 L226.073923,83.0773612 C224.664323,83.3621612 223.343523,84.0973613 223.343523,84.0973613 L223.343523,89.6029613 L222.218723,89.6029613 L222.218723,82.1021612 Z" id="Fill-70" fill="#39AA49" fill-rule="nonzero" mask="url(#mask-106)"></path>
                </g>
                <g id="Fill-71-Clipped">
                    <mask id="mask-108" fill="white">
                        <use xlink:href="#path-107"></use>
                    </mask>
                    <g id="path-13"></g>
                    <path d="M81.1757612,104.198242 L81.1757612,99.1126415 C80.9357612,99.0670415 80.0053612,98.9318415 79.3909612,98.9318415 C77.8149612,98.9318415 77.3501612,99.9670415 77.3501612,101.917442 C77.3501612,104.347842 78.1453612,104.752642 79.0301612,104.752642 C80.0957612,104.752642 81.1757612,104.198242 81.1757612,104.198242 L81.1757612,104.198242 Z M82.2861612,105.608642 L81.1757612,105.608642 L81.1757612,105.098242 C81.1757612,105.098242 80.0205612,105.758242 78.8949612,105.758242 C77.4253612,105.758242 76.1949611,105.158242 76.1949611,101.917442 C76.1949611,99.2774415 77.0501611,97.9566415 79.3301612,97.9566415 C79.9757612,97.9566415 80.9509612,98.1070415 81.1757612,98.1518415 L81.1757612,94.8366414 L82.2861612,94.8366414 L82.2861612,105.608642 Z" id="Fill-71" fill="#39AA49" fill-rule="nonzero" mask="url(#mask-108)"></path>
                </g>
                <g id="Fill-72-Clipped">
                    <mask id="mask-110" fill="white">
                        <use xlink:href="#path-109"></use>
                    </mask>
                    <g id="path-13"></g>
                    <path d="M89.7433613,101.422482 C89.7433613,99.5624815 89.1737613,98.9024815 87.8529613,98.9024815 C86.5777613,98.9024815 85.8577613,99.6064815 85.8433613,101.422482 L89.7433613,101.422482 Z M90.5833613,104.633682 L90.6129614,105.518482 C90.6129614,105.518482 88.9033613,105.758482 87.6881613,105.758482 C85.4521613,105.758482 84.7177613,104.452882 84.7177613,101.903282 C84.7177613,99.0520815 85.9473613,97.9568815 87.8529613,97.9568815 C89.8481613,97.9568815 90.8689614,99.0064815 90.8689614,101.468082 L90.8089614,102.322482 L85.8577613,102.322482 C85.8577613,103.928082 86.3529613,104.768082 87.8233613,104.768082 C88.9481613,104.768082 90.5833613,104.633682 90.5833613,104.633682 L90.5833613,104.633682 Z" id="Fill-72" fill="#39AA49" fill-rule="nonzero" mask="url(#mask-110)"></path>
                </g>
                <g id="Fill-73-Clipped">
                    <mask id="mask-112" fill="white">
                        <use xlink:href="#path-111"></use>
                    </mask>
                    <g id="path-13"></g>
                    <polygon id="Fill-73" fill="#39AA49" fill-rule="nonzero" mask="url(#mask-112)" points="97.2910414 95.2264014 103.502242 95.2264014 103.502242 96.2464014 98.4462415 96.2464014 98.4462415 100.297601 102.722242 100.297601 102.722242 101.317602 98.4462415 101.317602 98.4462415 105.608802 97.2910414 105.608802"></polygon>
                </g>
                <g id="Fill-74-Clipped">
                    <mask id="mask-114" fill="white">
                        <use xlink:href="#path-113"></use>
                    </mask>
                    <g id="path-13"></g>
                    <path d="M105.258562,98.1068015 L106.368962,98.1068015 L106.368962,99.1268015 C106.368962,99.1268015 107.673762,98.2268015 109.113762,97.9420015 L109.113762,99.0820015 C107.704162,99.3668015 106.383362,100.102001 106.383362,100.102001 L106.383362,105.608402 L105.258562,105.608402 L105.258562,98.1068015 Z" id="Fill-74" fill="#39AA49" fill-rule="nonzero" mask="url(#mask-114)"></path>
                </g>
                <g id="Fill-75-Clipped">
                    <mask id="mask-116" fill="white">
                        <use xlink:href="#path-115"></use>
                    </mask>
                    <g id="path-13"></g>
                    <path d="M112.985922,102.082642 C112.069922,102.172242 111.709922,102.607442 111.709922,103.432242 C111.709922,104.302642 112.085122,104.813042 112.850722,104.813042 C113.961122,104.813042 115.205922,104.348242 115.205922,104.348242 L115.205922,101.872242 L112.985922,102.082642 Z M116.331522,104.213042 C116.361122,104.648242 116.721122,104.813042 117.201922,104.873042 L117.156322,105.758642 C116.361122,105.758642 115.821122,105.608242 115.370722,105.158642 C115.370722,105.158642 114.020322,105.758642 112.669922,105.758642 C111.305122,105.758642 110.554722,104.977842 110.554722,103.463442 C110.554722,102.022642 111.305122,101.393042 112.850722,101.242642 L115.205922,101.017842 L115.205922,100.372241 C115.205922,99.3226415 114.756322,98.9474415 113.855522,98.9474415 C112.805122,98.9474415 111.020322,99.1418415 111.020322,99.1418415 L110.974722,98.2874415 C110.974722,98.2874415 112.625922,97.9570415 113.915522,97.9570415 C115.610722,97.9570415 116.331522,98.7370415 116.331522,100.372241 L116.331522,104.213042 Z" id="Fill-75" fill="#39AA49" fill-rule="nonzero" mask="url(#mask-116)"></path>
                </g>
                <g id="Fill-76-Clipped">
                    <mask id="mask-118" fill="white">
                        <use xlink:href="#path-117"></use>
                    </mask>
                    <g id="path-13"></g>
                    <path d="M119.137522,105.608402 L119.137522,98.1068015 L120.247922,98.1068015 L120.247922,98.6316015 C120.247922,98.6316015 121.462322,97.9572015 122.573522,97.9572015 C124.643922,97.9572015 125.108722,98.9772015 125.108722,101.647602 L125.108722,105.608402 L123.998322,105.608402 L123.998322,101.678002 C123.998322,99.6972015 123.773522,98.9620015 122.378322,98.9620015 C121.298322,98.9620015 120.262322,99.5172015 120.262322,99.5172015 L120.262322,105.608402 L119.137522,105.608402 Z" id="Fill-76" fill="#39AA49" fill-rule="nonzero" mask="url(#mask-118)"></path>
                </g>
                <g id="Fill-77-Clipped">
                    <mask id="mask-120" fill="white">
                        <use xlink:href="#path-119"></use>
                    </mask>
                    <g id="path-13"></g>
                    <path d="M132.625762,98.1818415 L132.580962,99.0978415 C132.580962,99.0978415 131.380962,98.9626415 130.810562,98.9626415 C129.084962,98.9626415 128.620162,99.7122415 128.620162,101.722642 C128.620162,103.942642 128.965762,104.753042 130.825762,104.753042 C131.395362,104.753042 132.596162,104.617842 132.596162,104.617842 L132.640962,105.548242 C132.640962,105.548242 131.244962,105.758642 130.555362,105.758642 C128.170562,105.758642 127.464962,104.663442 127.464962,101.722642 C127.464962,99.0066415 128.349762,97.9570415 130.585762,97.9570415 C131.276162,97.9570415 132.625762,98.1818415 132.625762,98.1818415" id="Fill-77" fill="#39AA49" fill-rule="nonzero" mask="url(#mask-120)"></path>
                </g>
                <g id="Fill-78-Clipped" transform="translate(134.400002, 97.600001)" fill="#39AA49" fill-rule="nonzero">
                    <path d="M5.11328008,3.82248006 C5.11328008,1.96248003 4.54288007,1.30248002 3.22288005,1.30248002 C1.94768003,1.30248002 1.22768002,2.00648003 1.21248002,3.82248006 L5.11328008,3.82248006 Z M5.95328009,7.0336801 L5.98288009,7.91848012 C5.98288009,7.91848012 4.27248006,8.15848012 3.05808005,8.15848012 C0.822080012,8.15848012 0.0876800013,6.8528801 0.0876800013,4.30328006 C0.0876800013,1.45208002 1.31728002,0.356880005 3.22288005,0.356880005 C5.21808008,0.356880005 6.23808009,1.40648002 6.23808009,3.86808006 L6.17808009,4.72248007 L1.22768002,4.72248007 C1.22768002,6.32808009 1.72288003,7.16808011 3.19328005,7.16808011 C4.31808006,7.16808011 5.95328009,7.0336801 5.95328009,7.0336801 L5.95328009,7.0336801 Z" id="Fill-78"></path>
                </g>
            </g>
        </g>
    </g>
</svg>