<svg xmlns="http://www.w3.org/2000/svg" width="70" height="60" fill="none" viewBox="0 0 70 60">
  <g clip-path="url(#clip0)">
    <path fill="#FA2863" d="M15.771 44.121A16 16 0 019.28 28.415l4.083-24.084A4 4 0 0117.307 1h37.742a4 4 0 013.944 3.33l4.029 23.757a16 16 0 01-6.25 15.531l-18.11 13.417a4 4 0 01-4.702.044L15.771 44.121z"/>
    <path stroke="#fff" stroke-width=".8" d="M17.188 40.914a11.6 11.6 0 01-4.75-11.418l4-23.59a1.6 1.6 0 011.578-1.332h36.133a1.6 1.6 0 011.578 1.332l3.947 23.276A11.6 11.6 0 0155.1 40.475L37.137 53.652a1.6 1.6 0 01-1.869.017l-18.08-12.755z"/>
    <path fill="#2854C3" d="M43.145 20.771v-.742a.742.742 0 00-.743-.742h-3.71a.742.742 0 00-.743.742v.742h-.742v1.485h6.68V20.77h-.742zM26.698 18.683a.742.742 0 10.83 1.23l5.536-3.74-.831-1.23-5.535 3.74zM31.802 11.652l.83 1.23 4.306-2.908-.831-1.23-4.305 2.908zM35.125 16.572l.83 1.23 4.306-2.908-.831-1.23-4.305 2.908z"/>
    <path fill="#FA2863" d="M33.247 12.467l2.493 3.69 3.075-2.077-2.493-3.69-3.075 2.077z"/>
    <g>
      <path fill="#fff" d="M44.629 22.627h-2.412a.371.371 0 010-.742h1.299v-.742h-1.114a.371.371 0 010-.743h.371v-.37a.372.372 0 00-.37-.372H38.69a.371.371 0 00-.37.371v.371h.37a.371.371 0 010 .743h-1.113v.742h1.299a.371.371 0 010 .742h-2.412a.371.371 0 010-.742h.371V20.77c0-.204.166-.37.371-.37h.371v-.372c0-.614.5-1.113 1.113-1.113h3.711c.614 0 1.114.5 1.114 1.113v.371h.37c.206 0 .372.167.372.372v1.113h.37a.371.371 0 010 .742zM26.49 18.375l5.535-3.74c.17-.114.4-.07.515.1l.208.308 1.23-.83-.83-1.23-.308.207a.371.371 0 01-.515-.1l-.831-1.23a.371.371 0 01.1-.515l4.305-2.908c.169-.115.4-.07.515.1l.83 1.23c.115.17.07.4-.099.515l-.307.207 2.077 3.075.307-.207c.17-.115.4-.07.515.1l.831 1.23c.115.17.07.4-.1.515l-4.305 2.908c-.169.114-.4.07-.515-.1l-.83-1.23a.371.371 0 01.1-.515l.306-.208-.83-1.23-1.23.831.207.308c.115.17.07.4-.1.515l-5.534 3.739a1.113 1.113 0 11-1.246-1.845zm9.517-9.116l-3.69 2.493.415.615 3.69-2.493-.415-.615zm.049 8.028l3.69-2.493-.416-.614-3.69 2.492.416.615zm-.216-1.645l2.46-1.662-2.077-3.075-2.46 1.662 2.077 3.075zm-9.034 3.863c.114.17.346.214.515.1l5.228-3.532-.416-.614-5.227 3.53a.37.37 0 00-.1.516zM44.629 18.173h-2.227a.371.371 0 010-.742h2.227a.371.371 0 010 .742zM42.236 15.986l1.485-.742a.371.371 0 01.332.664l-1.485.742a.371.371 0 11-.332-.663z"/>
      <path fill="#fff" d="M40.547 22.627a.371.371 0 110-.742.371.371 0 010 .742z"/>
    </g>
    <g>
      <path fill="#fff" d="M18.484 28.168V32.5h.648v-3.384h.012l.672 3.384h.36l.672-3.384h.012V32.5h.648v-4.332h-.978l-.528 2.532h-.012l-.528-2.532h-.978zm4.85-.06c-.744 0-1.14.468-1.14 1.098v2.262c0 .618.39 1.092 1.14 1.092.756 0 1.14-.48 1.14-1.092V29.2c0-.63-.402-1.092-1.14-1.092zm-.396 1.104c0-.336.132-.456.396-.456.336 0 .396.21.396.462v2.232c0 .282-.084.462-.396.462-.282 0-.396-.144-.396-.462v-2.238zm2.256-1.044V32.5h.672v-2.706h.012l.948 2.706h.648v-4.332h-.672v2.478h-.012l-.906-2.478h-.69zM33.98 26.695l.261 3.276h-1.08l.82-3.276zm.495 5.796h2.736l-.81-6.498h-4.707L29.741 32.5l2.736-.009.171-.711h1.782l.045.711zm3.09.009h2.322l.594-6.777h-2.322l-.594 6.777zm3.129 0h2.322l.594-6.777h-2.322l-.594 6.777zm3.192 0h2.322l.414-4.707H44.3l-.414 4.707zm.459-6.165c-.063.693.432 1.188 1.143 1.188.729 0 1.287-.495 1.35-1.188.063-.702-.414-1.197-1.143-1.197-.711 0-1.287.495-1.35 1.197zm5.23 3.357c.081-.306.198-.495.414-.495.234 0 .37.27.324.495h-.738zm.765 1.161c-.072.135-.153.243-.378.243-.252 0-.36-.117-.44-.351h2.987c.018-.081.054-.405.072-.558.135-1.557-.783-2.574-2.42-2.574-1.63 0-2.854 1.008-2.989 2.547-.135 1.521.873 2.52 2.484 2.52 1.323 0 2.421-.666 2.664-1.584l-1.98-.243zm2.025-5.247h-1.944l-1.116 1.647h1.467l1.593-1.647z"/>
    </g>
    <g>
      <path fill="#2854C3" d="M67.233 35H3.624L0 48h69.545l-2.312-13z"/>
      <path fill="#fff" d="M9.81 41.81c.16 0 .27.17.24.44L9.81 45h2.58l.31-3.47c.1-1.14-.48-1.96-1.32-1.96-.83 0-1.47.72-1.76 1.81l.14-1.61H7.18L6.72 45H9.3l.24-2.77c.03-.26.11-.42.27-.42zm6.344 1.15c-.15 0-.26-.17-.23-.44l.24-2.75h-2.58l-.3 3.47c-.1 1.14.47 1.96 1.3 1.96.84 0 1.48-.72 1.77-1.81l-.14 1.61h2.58l.46-5.23h-2.58l-.24 2.77c-.03.26-.12.42-.28.42zm11.594-3.39c-.83 0-1.61.74-1.94 1.86.03-1.09-.5-1.86-1.31-1.86-.83 0-1.57.75-1.89 1.88l.15-1.68h-2.59l-.46 5.23h2.58l.24-2.76c.03-.26.13-.43.3-.43.19 0 .29.17.26.43l-.24 2.76h2.58l.24-2.76c.03-.26.15-.43.36-.43.26.04.34.23.32.43l-.24 2.76h2.58l.32-3.6c.09-1.06-.44-1.83-1.26-1.83zm4.375 2.31c.09-.34.22-.55.46-.55.26 0 .41.3.36.55h-.82zm.85 1.29c-.08.15-.17.27-.42.27-.28 0-.4-.13-.49-.39h3.32c.02-.09.06-.45.08-.62.15-1.73-.87-2.86-2.69-2.86-1.81 0-3.17 1.12-3.32 2.83-.15 1.69.97 2.8 2.76 2.8 1.47 0 2.69-.74 2.96-1.76l-2.2-.27zm2.25-5.83h-2.16l-1.24 1.83h1.63l1.77-1.83zm5.172 2.23c-.6 0-1.16.74-1.43 1.88l.15-1.68h-2.59l-.46 5.23h2.58l.23-2.56c.03-.44.37-.72.82-.72.27 0 .66.1.98.24l.2-2.28c-.16-.07-.33-.11-.48-.11zM40.9 45h2.58l.46-5.23h-2.58l-.46 5.23zm.51-6.85c-.07.77.48 1.32 1.27 1.32.81 0 1.43-.55 1.5-1.32.07-.78-.46-1.33-1.27-1.33-.79 0-1.43.55-1.5 1.33zm5.821 4.24c.03-.34.24-.59.52-.59s.46.25.43.59c-.03.33-.25.58-.53.58s-.45-.25-.42-.58zm.95-1.39c-.17-.89-.65-1.43-1.42-1.43-1.13 0-1.96 1.12-2.11 2.82-.15 1.7.49 2.81 1.62 2.81.75 0 1.34-.55 1.67-1.46l-.31 3.56h2.59l.66-7.53h-2.59L48.18 41zm6.09 1.96c-.15 0-.26-.17-.23-.44l.24-2.75H51.7l-.3 3.47c-.1 1.14.47 1.96 1.3 1.96.84 0 1.48-.72 1.77-1.81L54.33 45h2.58l.46-5.23h-2.58l-.24 2.77c-.03.26-.12.42-.28.42zm6.263-1.08c.09-.34.21-.55.45-.55.26 0 .42.3.37.55h-.82zm.84 1.29c-.07.15-.16.27-.41.27-.28 0-.4-.13-.5-.39h3.32c.03-.09.07-.45.09-.62.15-1.73-.87-2.86-2.69-2.86-1.81 0-3.17 1.12-3.32 2.83-.15 1.69.97 2.8 2.76 2.8 1.47 0 2.69-.74 2.96-1.76l-2.21-.27z"/>
    </g>
    <path fill="#FA2863" d="M21 3h4l-.63.945a1 1 0 000 1.11L25 6h-4l.63-.945a1 1 0 000-1.11L21 3z"/>
  </g>
  <defs>
    <clipPath id="clip0">
      <path fill="#fff" d="M0 0h70v60H0z"/>
    </clipPath>
  </defs>
</svg>
