<?xml version="1.0" encoding="UTF-8"?>
<svg width="77px" height="35px" viewBox="0 0 77 35" version="1.1" xmlns="http://www.w3.org/2000/svg" xmlns:xlink="http://www.w3.org/1999/xlink">
    <!-- Generator: Sketch 47.1 (45422) - http://www.bohemiancoding.com/sketch -->
    <title>kering</title>
    <desc>Created with Sketch.</desc>
    <defs>
        <polygon id="path-1" points="0 34.7434252 76.8318898 34.7434252 76.8318898 0 0 0"></polygon>
    </defs>
    <g id="Symbols" stroke="none" stroke-width="1" fill="none" fill-rule="evenodd">
        <g id="logos" transform="translate(-370.000000, 0.000000)">
            <g id="fondateurs" transform="translate(370.000000, 0.000000)">
                <g id="kering">
                    <path d="M39.020563,22.063752 C39.020563,22.063752 40.6162323,22.0100118 41.5014291,22.8618622 C41.9462323,23.2904055 42.1562323,23.8308386 42.1562323,24.5283583 C42.1562323,25.2870591 41.6921378,26.1480039 40.8835551,26.7804843 C40.6143031,26.9918622 40.1736339,27.3385551 39.5607205,27.6430827 C39.8779252,27.7378858 40.2069803,27.809815 40.543752,27.8478465 C41.522374,26.9094606 42.7589488,25.9809961 44.2333583,25.0781614 C47.361311,23.1622559 50.5264685,22.0094606 50.5581614,21.9973346 L50.849185,21.8928858 L50.8095,22.1993425 C50.8037126,22.243437 50.6593031,23.3072165 49.834185,24.5454449 C49.0760354,25.6833583 47.5743425,27.1878071 44.7228071,27.8933189 C43.1001299,28.2945787 41.7574528,28.3607205 40.6696969,28.2518622 C40.4814685,28.4376102 40.3028858,28.6239094 40.135878,28.8099331 C39.7850512,29.1996181 39.4819016,29.5906811 39.225878,29.9809173 C39.795248,30.9824134 40.0286732,31.9775709 40.0352874,32.9914685 C40.0352874,33.0394213 40.0019409,34.0464291 39.610878,34.4678071 C39.4107992,34.6827677 39.2592244,34.7433976 39.020563,34.7433976 C38.781626,34.7433976 38.6300512,34.6827677 38.430248,34.4678071 C38.039185,34.0464291 38.005563,33.0394213 38.005563,32.9914685 C38.0121772,31.9775709 38.245878,30.9824134 38.815248,29.9809173 C38.5592244,29.5906811 38.2563504,29.1996181 37.9057992,28.8099331 C37.7379646,28.6239094 37.5593819,28.4376102 37.3714291,28.2518622 C36.2842244,28.3607205 34.9409961,28.2945787 33.3180433,27.8933189 C30.4665079,27.1878071 28.964815,25.6833583 28.2066654,24.5454449 C27.3807205,23.3072165 27.2374134,22.243437 27.2313504,22.1993425 L27.1919409,21.8928858 L27.482689,21.9973346 C27.5143819,22.0094606 30.679815,23.1622559 33.8074921,25.0781614 C35.2819016,25.9809961 36.5184764,26.9094606 37.4970984,27.8478465 C37.8338701,27.809815 38.1629252,27.7378858 38.4801299,27.6430827 C37.8674921,27.3385551 37.4270984,26.9918622 37.1572953,26.7804843 C36.3487126,26.1480039 35.8846181,25.2870591 35.8846181,24.5283583 C35.8846181,23.8308386 36.0946181,23.2904055 36.540248,22.8618622 C37.4246181,22.0100118 39.020563,22.063752 39.020563,22.063752 Z M33.4299331,27.5267835 C34.6915866,27.8393031 35.9088701,27.9578071 37.0131614,27.8919409 C36.0965472,27.0511142 34.9660748,26.2169016 33.636626,25.4022559 C31.116626,23.8592244 28.5707205,22.8147362 27.6946181,22.4738307 C27.7946575,22.8640669 28.0283583,23.5662717 28.5417835,24.3362717 C29.2621772,25.4187913 30.6955236,26.8507598 33.4299331,27.5267835 Z M41.027689,27.8919409 C42.1319803,27.9578071 43.3500906,27.8393031 44.6109173,27.5267835 C47.3453268,26.8507598 48.7786732,25.4187913 49.4993425,24.3362717 C50.0127677,23.5662717 50.2467441,22.8640669 50.3470591,22.4738307 C49.4695787,22.8147362 46.9242244,23.8592244 44.4042244,25.4022559 C43.0756024,26.2169016 41.9443031,27.0511142 41.027689,27.8919409 Z M39.020563,22.4178858 C39.020563,22.4178858 37.5693031,22.3533976 36.7797362,23.1145787 C36.4156811,23.4662323 36.2467441,23.9419016 36.2467441,24.5283583 C36.2467441,25.1660748 36.6551693,25.9446181 37.3678465,26.502689 C37.8333189,26.8667441 38.3957992,27.2048937 39.020563,27.4548543 C39.6450512,27.2048937 40.2078071,26.8667441 40.6730039,26.502689 C41.3856811,25.9446181 41.7949331,25.1660748 41.7949331,24.5283583 C41.7949331,23.9419016 41.6251693,23.4662323 41.2613898,23.1145787 C40.4715472,22.3533976 39.020563,22.4178858 39.020563,22.4178858 Z M39.020563,34.494815 C39.8352087,34.494815 39.7886339,33.0700118 39.7886339,33.0554055 C39.7828465,32.1506417 39.5620984,31.2326496 39.020563,30.3119016 C38.4795787,31.2326496 38.2582795,32.1506417 38.2522165,33.0554055 C38.2522165,33.0700118 38.2064685,34.494815 39.020563,34.494815 Z M39.020563,27.8800906 C38.6702874,28.013752 38.2789488,28.1242638 37.8437913,28.1920591 C37.9609173,28.3133189 38.0747362,28.4343031 38.1838701,28.5561142 C38.5118228,28.9193425 38.7879646,29.2811929 39.020563,29.6419409 C39.253437,29.2811929 39.5298543,28.9193425 39.8569803,28.5561142 C39.9663898,28.4343031 40.0802087,28.3133189 40.1973346,28.1920591 C39.7619016,28.1242638 39.3711142,28.013752 39.020563,27.8800906 Z" id="Fill-1" fill="#000000"></path>
                    <path d="M37.5581142,24.2999764 C37.5581142,24.560685 37.6956339,24.3415906 38.0290984,24.3415906 C38.3774449,24.3415906 38.5003583,24.560685 38.5003583,24.2999764 C38.5003583,24.0403701 38.2898071,23.8289921 38.0290984,23.8289921 C37.7692165,23.8289921 37.5581142,24.0403701 37.5581142,24.2999764" id="Fill-3" fill="#000000"></path>
                    <path d="M40.4824882,24.2999764 C40.4824882,24.560685 40.3449685,24.3415906 40.0112283,24.3415906 C39.6628819,24.3415906 39.5399685,24.560685 39.5399685,24.2999764 C39.5399685,24.0403701 39.7505197,23.8289921 40.0112283,23.8289921 C40.2711102,23.8289921 40.4824882,24.0403701 40.4824882,24.2999764" id="Fill-5" fill="#000000"></path>
                    <path d="M39.0200394,23.3370354 C39.0200394,23.3370354 39.2722047,22.9611299 40.0289764,22.9862087 C40.8505118,23.0123898 41.2669291,23.7154213 41.2669291,24.3575472 C41.2669291,25.2829803 40.377874,26.4569961 39.0200394,26.8315236 C37.6633071,26.4569961 36.7734252,25.2829803 36.7734252,24.3575472 C36.7734252,23.7154213 37.1898425,23.0123898 38.011378,22.9862087 C38.7681496,22.9611299 39.0200394,23.3370354 39.0200394,23.3370354 M38.1166535,23.315815 C37.4235433,23.315815 37.0925591,23.8016811 37.0925591,24.3773898 C37.0925591,25.1449094 37.7972441,26.150815 39.0200394,26.5837677 C40.2428346,26.150815 40.9477953,25.1449094 40.9477953,24.3773898 C40.9477953,23.8016811 40.616811,23.315815 39.9237008,23.315815 C39.3452362,23.315815 39.0307874,23.6831772 39.0200394,23.6917205 C39.0103937,23.6831772 38.6951181,23.315815 38.1166535,23.315815" id="Fill-7" fill="#000000"></path>
                    <path d="M39.0200394,24.6393386 L39.0200394,24.6393386 C39.1597638,24.6393386 39.2727559,24.7112677 39.2727559,24.9209921 C39.2727559,25.1309921 39.1228346,25.514063 39.0200394,25.514063 C38.9175197,25.514063 38.7673228,25.1309921 38.7673228,24.9209921 C38.7673228,24.7112677 38.8811417,24.6393386 39.0200394,24.6393386" id="Fill-9" fill="#000000"></path>
                    <polygon id="Fill-11" fill="#000000" points="0 11.1984016 3.01220472 11.1984016 3.01220472 11.6958425 0.585629921 11.6958425 0.585629921 13.3965118 2.52275591 13.3965118 2.52275591 13.8928504 0.585629921 13.8928504 0.585629921 16.3103307 0 16.3103307"></polygon>
                    <path d="M10.6826339,13.7389882 C10.6826339,12.4442638 10.1438543,11.6298937 9.21649213,11.6298937 C8.34535039,11.6298937 7.80822441,12.4109173 7.80822441,13.7704055 C7.80822441,15.0659567 8.34535039,15.8795 9.27298819,15.8795 C10.1438543,15.8795 10.6826339,15.098752 10.6826339,13.7389882 M7.18924803,13.7954843 C7.18924803,12.1427677 7.99535039,11.1335551 9.24129528,11.1335551 C10.486689,11.1335551 11.2999567,12.0859961 11.2999567,13.7136339 C11.2999567,15.3660748 10.486689,16.3758386 9.24129528,16.3758386 C7.99535039,16.3758386 7.18924803,15.4228465 7.18924803,13.7954843" id="Fill-13" fill="#000000"></path>
                    <path d="M16.2392559,11.1984016 L16.8163425,11.1984016 L16.8163425,14.4878504 C16.8163425,15.497063 17.3217756,15.8795827 18.0300433,15.8795827 C18.7463031,15.8795827 19.2434685,15.4887953 19.2434685,14.4878504 L19.2434685,11.1984016 L19.829374,11.1984016 L19.829374,14.4545039 C19.829374,15.8145433 19.1285472,16.3759213 18.0300433,16.3759213 C16.9389803,16.3759213 16.2392559,15.8145433 16.2392559,14.4545039 L16.2392559,11.1984016 Z" id="Fill-15" fill="#000000"></path>
                    <polygon id="Fill-17" fill="#000000" points="25.149126 11.1984016 25.6462913 11.1984016 28.0144409 14.9265906 28.153063 15.1875748 28.153063 11.1984016 28.7315276 11.1984016 28.7315276 16.3103307 28.2429055 16.3103307 25.865937 12.5826929 25.7361339 12.3299764 25.7361339 16.3103307 25.149126 16.3103307"></polygon>
                    <path d="M35.5254961,15.8146535 C36.6416378,15.8146535 37.2195512,15.0578819 37.2195512,13.7309134 C37.2195512,12.3460709 36.6168346,11.6956772 35.493252,11.6956772 L34.7527402,11.6956772 L34.7527402,15.8146535 L35.5254961,15.8146535 Z M34.1660079,11.1985118 L35.4692756,11.1985118 C37.0489606,11.1985118 37.8379764,12.0859134 37.8379764,13.7309134 C37.8379764,15.2937874 37.0558504,16.3104409 35.493252,16.3104409 L34.1660079,16.3104409 L34.1660079,11.1985118 Z" id="Fill-19" fill="#000000"></path>
                    <path d="M45.1785512,14.4384646 L44.2743386,11.7522835 L43.4034724,14.4384646 L45.1785512,14.4384646 Z M42.2391024,16.2212598 L43.9736693,11.1983465 L44.6086299,11.1983465 L46.3985906,16.2212598 L46.3985906,16.3102756 L45.812685,16.3102756 L45.3491417,14.9348031 L43.2488661,14.9348031 L42.7927638,16.3102756 L42.2391024,16.3102756 L42.2391024,16.2212598 Z" id="Fill-21" fill="#000000"></path>
                    <polygon id="Fill-23" fill="#000000" points="51.7190039 11.6957323 50.0985315 11.6957323 50.0985315 11.1982913 53.9171142 11.1982913 53.9171142 11.6957323 52.295815 11.6957323 52.295815 16.3104961 51.7190039 16.3104961"></polygon>
                    <mask id="mask-2" fill="white">
                        <use xlink:href="#path-1"></use>
                    </mask>
                    <g id="Clip-26"></g>
                    <polygon id="Fill-25" fill="#000000" mask="url(#mask-2)" points="58.6514567 16.3102756 59.2370866 16.3102756 59.2370866 11.1983465 58.6514567 11.1983465"></polygon>
                    <path d="M67.7804764,13.7389882 C67.7804764,12.4442638 67.2425236,11.6298937 66.3146102,11.6298937 C65.4437441,11.6298937 64.9063425,12.4109173 64.9063425,13.7704055 C64.9063425,15.0659567 65.4437441,15.8795 66.3713819,15.8795 C67.2425236,15.8795 67.7804764,15.098752 67.7804764,13.7389882 M64.2873661,13.7954843 C64.2873661,12.1427677 65.0934685,11.1335551 66.3388622,11.1335551 C67.5848071,11.1335551 68.3989016,12.0859961 68.3989016,13.7136339 C68.3989016,15.3660748 67.5848071,16.3758386 66.3388622,16.3758386 C65.0934685,16.3758386 64.2873661,15.4228465 64.2873661,13.7954843" id="Fill-27" fill="#000000" mask="url(#mask-2)"></path>
                    <polygon id="Fill-28" fill="#000000" mask="url(#mask-2)" points="73.2492402 11.1984016 73.7466811 11.1984016 76.1142795 14.9265906 76.2531772 15.1875748 76.2531772 11.1984016 76.8313661 11.1984016 76.8313661 16.3103307 76.3430197 16.3103307 73.9655 12.5826929 73.8351457 12.3299764 73.8351457 16.3103307 73.2492402 16.3103307"></polygon>
                    <path d="M72.9287008,8.26162598 C69.1704724,8.26162598 67.4620866,6.32587795 67.4620866,4.10985433 C67.4620866,1.86379134 69.211811,-2.75590551e-05 72.7627953,-2.75590551e-05 C74.0467717,-2.75590551e-05 75.3098031,0.248279528 76.4485433,0.7245 L76.4485433,1.61520866 C75.3409449,1.10784646 74.0674409,0.797255906 72.7523228,0.797255906 C69.8123228,0.797255906 68.3941339,2.30887008 68.3941339,4.1310748 C68.3941339,5.99434252 69.905748,7.46434252 72.9287008,7.46434252 C74.1399213,7.46434252 75.2579921,7.19481496 75.962126,6.87402756 L75.962126,4.92780709 L72.7214567,4.92780709 L72.8250787,4.1310748 L76.8318898,4.1310748 L76.8318898,7.40233465 C75.8273622,7.90969685 74.4609843,8.26162598 72.9287008,8.26162598 L72.9287008,8.26162598 Z M60.1707874,8.03398819 L52.9541732,1.4391063 L52.9335039,1.4391063 L52.9335039,8.03398819 L52.0742126,8.03398819 L52.0742126,0.227885827 L52.8720472,0.227885827 L60.0875591,6.83268898 L60.1082283,6.83268898 L60.1082283,0.227885827 L60.9677953,0.227885827 L60.9677953,8.03398819 L60.1707874,8.03398819 Z M43.7612992,8.03426378 L44.6205906,8.03426378 L44.6205906,0.227885827 L43.7612992,0.227885827 L43.7612992,8.03426378 Z M32.9738583,1.02516929 L29.8990945,1.02516929 L29.8990945,4.34796457 L32.9738583,4.34796457 C34.205748,4.34796457 35.0859843,3.77887008 35.0859843,2.6814685 C35.0859843,1.60473622 34.1850787,1.02516929 32.9738583,1.02516929 L32.9738583,1.02516929 Z M37.0732677,8.03398819 C36.2762598,8.03398819 35.800315,7.78512992 35.1788583,6.92611417 L34.6508268,6.18064173 C34.1335433,5.45583858 33.636378,5.15572047 32.5599213,5.15572047 L29.8990945,5.15572047 L29.8990945,8.03398819 L29.0398031,8.03398819 L29.0398031,0.227885827 L32.9738583,0.227885827 C34.9305512,0.227885827 36.0174803,1.25280709 36.0174803,2.65032677 C36.0174803,3.78934252 35.2516142,4.49320079 34.2782283,4.79359449 L34.2782283,4.80379134 C34.7337795,4.97934252 35.0548425,5.32162598 35.3965748,5.78737402 L35.8623228,6.40827953 C36.2972047,6.99804331 36.6077953,7.23670472 37.0840157,7.23670472 L37.3425197,7.23670472 L37.2496457,8.03398819 L37.0732677,8.03398819 Z M14.6597638,8.03398819 L14.6597638,0.227885827 L21.4409449,0.227885827 L21.5340945,1.02516929 L15.5193307,1.02516929 L15.5193307,3.70638976 L21.2028346,3.70638976 L21.2028346,4.5656811 L15.5193307,4.5656811 L15.5193307,7.17442126 L21.9585039,7.17442126 L21.8033465,8.03398819 L14.6597638,8.03398819 Z M8.08582677,8.03398819 C7.27807087,8.03398819 6.80185039,7.78512992 6.18066929,6.92611417 L5.16622047,5.52859449 C4.65913386,4.83493307 4.1619685,4.53481496 3.06456693,4.53481496 L0.859566929,4.53481496 L0.859566929,8.03398819 L0.000275590551,8.03398819 L0.000275590551,0.227885827 L0.859566929,0.227885827 L0.859566929,3.73725591 L2.44338583,3.73725591 C3.47850394,3.73725591 3.97566929,3.35446063 4.58637795,2.55772835 L6.35677165,0.227885827 L7.43350394,0.227885827 L5.5388189,2.71233465 C5.06287402,3.3437126 4.74181102,3.68572047 4.20358268,3.96544488 L4.20358268,3.97536614 C5.03145669,4.14127165 5.44566929,4.48245276 5.94255906,5.15572047 L6.8746063,6.40827953 C7.30948819,6.98784646 7.61980315,7.23670472 8.08582677,7.23670472 L8.3446063,7.23670472 L8.26165354,8.03398819 L8.08582677,8.03398819 Z" id="Fill-29" fill="#000000" mask="url(#mask-2)"></path>
                </g>
            </g>
        </g>
    </g>
</svg>