<?xml version="1.0" encoding="UTF-8"?>
<svg width="230px" height="72px" viewBox="0 0 230 72" version="1.1" xmlns="http://www.w3.org/2000/svg" xmlns:xlink="http://www.w3.org/1999/xlink">
    <!-- Generator: Sketch 63 (92445) - https://sketch.com -->
    <title>medias/le parisien</title>
    <desc>Created with Sketch.</desc>
    <g id="medias/le-parisien" stroke="none" stroke-width="1" fill="none" fill-rule="evenodd">
        <g id="Logo_Le_Parisien_2016">
            <rect id="Cartouche_blanc_2_" fill="#FFFFFF" x="0" y="0" width="230" height="72"></rect>
            <rect id="Cartouche_bleu_2_" fill="#1EA0E6" x="0" y="0" width="230" height="64.8"></rect>
            <rect id="Filet_rouge_3_" fill="#F03333" x="0" y="67.2" width="230" height="4.8"></rect>
            <g id="Le_Parisien_2_" transform="translate(25.156250, 8.400000)" fill="#FFFFFF" fill-rule="nonzero">
                <polygon id="L_2_" points="16.7708333 54 0 54 0 14.4 7.1875 14.4 7.1875 49.2 16.7708333 49.2"></polygon>
                <path d="M32.703125,31.44 C32.703125,39.24 25.3958333,42.72 22.28125,42.96 C22.640625,47.52 24.6770833,49.32 26.8333333,49.32 C27.671875,49.32 28.2708333,49.32 28.8697917,49.2 L28.8697917,53.88 C28.2708333,54 27.3125,54.12 26.3541667,54.12 C21.6822917,54.12 15.453125,51.48 15.453125,38.16 C15.453125,24.36 21.203125,22.32 24.9166667,22.32 C28.2708333,22.44 32.703125,24.84 32.703125,31.44 L32.703125,31.44 Z M26.59375,31.08 C26.59375,28.2 25.875,27.12 24.796875,27.12 C23.2395833,27.12 21.921875,28.92 21.921875,36.6 C21.921875,37.2 21.921875,37.68 22.0416667,38.16 C23.8385417,37.92 26.59375,35.28 26.59375,31.08 L26.59375,31.08 Z" id="e_5_"></path>
                <path d="M63.25,16.44 C63.25,30.84 51.5104167,35.88 47.9166667,36.6 L47.9166667,54 L39.53125,54 L39.53125,0 L46.5989583,0 C55.2239583,0 63.25,4.2 63.25,16.44 L63.25,16.44 Z M54.7447917,16.44 C54.7447917,8.28 51.5104167,6.12 47.9166667,6.12 L47.9166667,29.76 C50.3125,29.52 54.7447917,26.16 54.7447917,16.44 L54.7447917,16.44 Z" id="P_2_"></path>
                <path d="M80.2604167,54 L73.0729167,54 L73.0729167,51.6 L70.9166667,54 C70.4375,54.12 70.1979167,54.12 69.9583333,54.12 C65.1666667,54.12 60.8541667,49.2 60.8541667,42.36 C60.8541667,31.2 70.1979167,27.24 73.1927083,26.76 L73.1927083,26.04 C73.1927083,24 71.9947917,23.04 69.9583333,23.04 C68.0416667,23.04 66.84375,23.28 65.1666667,23.64 L65.2864583,18.12 C65.2864583,18.12 67.0833333,17.52 70.4375,17.52 C76.1875,17.52 80.3802083,20.04 80.3802083,27.96 L80.3802083,54 L80.2604167,54 Z M73.0729167,46.44 L73.0729167,32.52 C71.875,32.64 68.1614583,35.76 68.1614583,42.48 C68.1614583,46.8 69.5989583,48.48 70.9166667,48.48 C71.9947917,48.48 73.0729167,47.28 73.0729167,46.44 L73.0729167,46.44 Z" id="a_2_"></path>
                <path d="M97.03125,24 L97.03125,24 C93.3177083,24 91.0416667,27 91.0416667,31.2 L91.0416667,54 L83.8541667,54 L83.8541667,18.36 L89.84375,18 L89.84375,20.88 C91.0416667,19.92 92.8385417,18.12 96.4322917,18.12 L97.03125,18.12 L97.03125,24 L97.03125,24 Z" id="r_2_"></path>
                <path d="M99.4270833,14.4 L99.4270833,7.2 L106.614583,7.2 L106.614583,14.4 L99.4270833,14.4 Z M106.614583,54 L106.614583,18 L99.4270833,18 L99.4270833,54 L106.614583,54 L106.614583,54 Z" id="i_5_"></path>
                <path d="M126.859375,43.68 C126.859375,49.92 121.46875,54.12 115.119792,54.12 C112.364583,54.12 110.088542,53.76 108.171875,52.92 L111.166667,47.52 C112.244792,48 113.203125,48.12 114.401042,48.12 C116.796875,48.12 118.713542,46.56 118.713542,44.4 C118.713542,41.88 117.755208,40.08 115,36.84 C110.208333,32.28 109.010417,30.12 109.010417,26.4 C109.010417,21.36 113.5625,17.4 119.3125,17.4 C121.947917,17.4 123.744792,17.88 125.302083,18.48 L122.546875,23.52 C121.828125,23.16 120.989583,23.04 119.671875,23.04 C117.994792,23.04 116.557292,24.24 116.557292,25.8 C116.557292,27.24 117.15625,28.56 120.270833,31.44 C124.703125,35.64 126.859375,38.64 126.859375,43.68 L126.859375,43.68 Z" id="s_1_"></path>
                <path d="M128.177083,14.4 L128.177083,7.2 L135.364583,7.2 L135.364583,14.4 L128.177083,14.4 Z M135.364583,54 L135.364583,18 L128.177083,18 L128.177083,54 L135.364583,54 L135.364583,54 Z" id="i_4_"></path>
                <path d="M157.526042,27.96 C157.526042,36.96 149.020833,40.92 145.427083,41.28 C145.786458,46.56 147.703125,48.6 150.21875,48.6 C151.177083,48.6 152.015625,48.6 152.015625,48.48 L152.015625,53.88 C152.015625,54 150.697917,54.12 149.5,54.12 C144.109375,54.12 137.161458,51.12 137.161458,35.76 C137.161458,19.8 143.869792,17.52 148.182292,17.52 C152.375,17.64 157.526042,20.4 157.526042,27.96 L157.526042,27.96 Z M150.458333,27.48 C150.458333,24.24 149.739583,22.92 148.302083,22.92 C146.505208,22.92 145.067708,24.96 145.067708,33.84 C145.067708,34.56 145.067708,35.04 145.1875,35.52 C147.34375,35.52 150.458333,32.4 150.458333,27.48 L150.458333,27.48 Z" id="e_4_"></path>
                <path d="M179.6875,54 L172.5,54 L172.5,28.2 C172.5,25.68 171.302083,23.52 169.505208,23.52 C167.708333,23.52 166.510417,25.68 166.510417,28.2 L166.510417,54 L159.322917,54 L159.322917,18 L165.3125,18 L165.3125,19.8 L167.947917,17.64 C168.307292,17.52 168.546875,17.52 169.265625,17.52 C175.734375,17.52 179.807292,21.48 179.807292,30 L179.807292,54 L179.6875,54 Z" id="n_1_"></path>
            </g>
        </g>
    </g>
</svg>