<?xml version="1.0" encoding="UTF-8"?>
<svg width="110px" height="110px" viewBox="0 0 110 110" version="1.1" xmlns="http://www.w3.org/2000/svg" xmlns:xlink="http://www.w3.org/1999/xlink">
    <title>independant</title>
    <g id="Page-1" stroke="none" stroke-width="1" fill="none" fill-rule="evenodd">
        <g id="-" transform="translate(-125.000000, -533.000000)">
            <g id="independant" transform="translate(125.000000, 533.000000)">
                <circle id="Oval" fill="#FFFFFF" cx="55" cy="55" r="55"></circle>
                <g id="599c3cd67488150001d54a58_icon-independent" transform="translate(13.000000, 13.000000)" fill-rule="nonzero">
                    <path d="M42.5,82.0940171 C64.3671719,82.0940171 82.0940171,64.3671719 82.0940171,42.5 C82.0940171,20.6328281 64.3671719,2.90598291 42.5,2.90598291 C20.6328281,2.90598291 2.90598291,20.6328281 2.90598291,42.5 C2.90598291,64.3671719 20.6328281,82.0940171 42.5,82.0940171 Z M42.5,85 C19.0278981,85 0,65.9721019 0,42.5 C0,19.0278981 19.0278981,0 42.5,0 C65.9721019,0 85,19.0278981 85,42.5 C85,65.9721019 65.9721019,85 42.5,85 Z" id="Oval-2" fill-opacity="0.1" fill="#000000"></path>
                    <path d="M55.4319328,58 C70.2647375,58 78.1373383,28.0000715 43.0522779,28.0000715 C8.47426588,28.0000715 15.1171639,58 30.672623,58 C33.7898336,58 36.7249309,56.383564 38.5960355,53.6359204 L40.6062236,50.6835807 C41.8295941,48.8875492 44.2757247,48.8875492 45.4991715,50.6835807 L47.5092833,53.6359204 C49.3796249,56.383564 52.3147986,58 55.4319328,58 Z M32.3749657,47.0906785 C29.1671944,47.0906785 27.0812467,45.0859835 26.1187245,43.8835938 C25.7101714,43.3734937 25.7101714,42.6265778 26.1187245,42.1156385 C27.0812467,40.9125621 29.1663552,38.9086301 32.3749657,38.9086301 C35.5835762,38.9086301 37.6686848,40.913325 38.6312069,42.1156385 C39.03976,42.6258149 39.03976,43.3726545 38.6312069,43.8835938 C37.6686848,45.0867465 35.582737,47.0906785 32.3749657,47.0906785 Z M53.6249151,47.0906785 C50.4171438,47.0906785 48.331196,45.0859835 47.3686739,43.8835938 C46.9601208,43.3734937 46.9601208,42.6265778 47.3686739,42.1156385 C48.331196,40.9125621 50.4163045,38.9086301 53.6249151,38.9086301 C56.8335256,38.9086301 58.9186341,40.913325 59.8811563,42.1156385 C60.2897094,42.6258149 60.2897094,43.3726545 59.8811563,43.8835938 C58.9186341,45.0867465 56.8326863,47.0906785 53.6249151,47.0906785 Z" id="" fill="#253186"></path>
                </g>
            </g>
        </g>
    </g>
</svg>