<?xml version="1.0" encoding="UTF-8"?>
<svg width="389px" height="207px" viewBox="0 0 389 207" version="1.1" xmlns="http://www.w3.org/2000/svg" xmlns:xlink="http://www.w3.org/1999/xlink">
    <!-- Generator: Sketch 60.1 (88133) - https://sketch.com -->
    <title>logo-PlaceLibre</title>
    <desc>Created with Sketch.</desc>
    <g id="logo-action" stroke="none" stroke-width="1" fill="none" fill-rule="evenodd">
        <g id="PlaceLibre" transform="translate(-317.000000, -238.000000)">
            <g id="logo-PlaceLibre" transform="translate(316.598360, 237.838990)">
                <g id="Group-4">
                    <path d="M384,64.259357 C365.74578,67.9784459 351.966271,84.1602369 351.966271,103.497497 C351.966271,122.835759 365.74578,139.01755 384,142.740643 L384,185.991195 C384,190.406049 380.406216,194 375.991568,194 L14.0084322,194 C9.58977972,194 6,190.406049 6,185.991195 L6,142.740643 C24.253219,139.01755 38.0337286,122.835759 38.0337286,103.497497 C38.0337286,84.1602369 24.253219,67.9824503 6,64.259357 L6,21.0088053 C6,16.589947 9.58977972,13 14.0084322,13 L375.991568,13 C380.406216,13 384,16.589947 384,21.0088053 L384,64.259357 Z" id="Fill-5" fill="#FFD978" transform="translate(195.000000, 103.500000) rotate(-4.000000) translate(-195.000000, -103.500000) "></path>
                    <path d="M374,57.3496234 C357.383053,61.7181598 341.816189,80.7257028 341.816189,103.43974 C341.816189,126.154954 357.383053,145.162497 374,149.535737 L374,173.592654 C374,178.778453 370.728553,183 366.709867,183 C222.166318,183 113.758656,183 41.4868813,183 C38.5542706,183 34.1553545,183 28.2901331,183 C24.2678022,183 21,178.778453 21,173.592654 L21,149.535737 C37.6160359,145.162497 54.0854708,126.154954 54.0854708,103.43974 C54.0854708,80.7257028 37.6160359,61.7228635 21,57.3496234 L21,32.4073462 C21,27.2168429 24.2678022,23 28.2901331,23 L366.709867,23 C370.728553,23 374,27.2168429 374,32.4073462 C374,42.3064504 374,49.7307786 374,54.6803307 C374,55.2735069 374,56.1632711 374,57.3496234 Z" id="Fill-5" stroke="#FFFFFF" stroke-width="5.1299998" transform="translate(197.500000, 103.000000) rotate(-4.000000) translate(-197.500000, -103.000000) "></path>
                </g>
                <g id="Group-5" transform="translate(92.000000, 53.000000)" fill="#000000" fill-rule="nonzero">
                    <g id="Group-6">
                        <path d="M21.7028499,53.4004875 L21.7028499,46.6612873 L9.53484944,46.6612873 L9.53484944,8.34768574 L1.79724913,8.34768574 L1.79724913,53.4004875 L21.7028499,53.4004875 Z M30.9380503,53.4004875 L32.3108503,43.4164871 L40.7972507,43.4164871 L42.1700507,53.4004875 L49.658051,53.4004875 L41.3588507,8.34768574 L31.7492503,8.34768574 L23.45005,53.4004875 L30.9380503,53.4004875 Z M39.6740506,36.6772869 L33.4340504,36.6772869 L36.4916505,17.3332861 L36.6164505,17.3332861 L39.6740506,36.6772869 Z M75.7412521,53.4004875 L75.7412521,34.9300868 L79.3604522,34.9300868 C87.5972525,34.9300868 93.0884528,32.0596867 93.0884528,21.6388863 C93.0884528,12.0292859 88.5332526,8.34768574 79.3604522,8.34768574 L68.0036518,8.34768574 L68.0036518,53.4004875 L75.7412521,53.4004875 Z M78.3620522,28.5652865 L75.7412521,28.5652865 L75.7412521,14.712486 L78.1748522,14.712486 C83.2292524,14.712486 85.3508524,15.586086 85.3508524,21.6388863 C85.3508524,27.4420865 83.4164524,28.5652865 78.3620522,28.5652865 Z M118.734854,53.4004875 L118.734854,46.6612873 L106.566853,46.6612873 L106.566853,8.34768574 L98.829253,8.34768574 L98.829253,53.4004875 L118.734854,53.4004875 Z M127.970054,53.4004875 L129.342854,43.4164871 L137.829255,43.4164871 L139.202055,53.4004875 L146.690055,53.4004875 L138.390855,8.34768574 L128.781254,8.34768574 L120.482054,53.4004875 L127.970054,53.4004875 Z M136.706054,36.6772869 L130.466054,36.6772869 L133.523654,17.3332861 L133.648454,17.3332861 L136.706054,36.6772869 Z M163.038856,54.0244876 C170.464456,54.0244876 174.520456,49.0324874 174.520456,42.6676871 L174.520456,37.3012869 L166.782856,37.3012869 L166.782856,42.9172871 C166.782856,45.2884872 166.096456,47.2852873 163.038856,47.2852873 C160.106055,47.2852873 158.920455,45.7876872 158.920455,42.4804871 L158.920455,19.2052862 C158.920455,15.898086 160.106055,14.462886 163.038856,14.462886 C165.410056,14.462886 166.782856,16.5844861 166.782856,19.9540862 L166.782856,23.3860863 L174.520456,23.3860863 L174.520456,19.9540862 C174.520456,12.7780859 170.214856,7.72368571 163.038856,7.72368571 C155.363655,7.72368571 151.182855,12.5284859 151.182855,19.0804862 L151.182855,42.6676871 C151.182855,49.0948874 155.238855,54.0244876 163.038856,54.0244876 Z M203.973257,53.4004875 L203.973257,46.6612873 L190.120457,46.6612873 L190.120457,33.4324867 L200.104457,33.4324867 L200.104457,26.6932865 L190.120457,26.6932865 L190.120457,15.086886 L203.099657,15.086886 L203.099657,8.34768574 L182.382856,8.34768574 L182.382856,53.4004875 L203.973257,53.4004875 Z" id="LAPLACE" transform="translate(102.885253, 30.874087) rotate(-4.000000) translate(-102.885253, -30.874087) "></path>
                        <path d="M20.0428212,98.8000028 L20.0428212,94.2640026 L10.7188209,94.2640026 L10.7188209,85.3600023 L17.4388211,85.3600023 L17.4388211,80.8240021 L10.7188209,80.8240021 L10.7188209,73.0120018 L19.4548212,73.0120018 L19.4548212,68.4760016 L5.51082065,68.4760016 L5.51082065,98.8000028 L20.0428212,98.8000028 Z M33.9539454,99.2200028 C38.9939456,99.2200028 42.1859457,96.3220027 42.1859457,91.4500025 C42.1859457,88.7620024 41.3879457,85.9060023 35.2979455,80.9920021 C32.8199454,78.976002 31.6019453,77.380002 31.6019453,75.5320019 C31.6019453,73.6840018 32.5259454,72.5920018 34.2059454,72.5920018 C35.6759455,72.5920018 36.8099455,73.7260018 36.9779455,75.9520019 L41.9339457,75.4060019 C41.3879457,70.7860017 38.7419456,68.0560016 34.6679454,68.0560016 C29.5859452,68.0560016 26.6459451,70.7860017 26.6459451,75.6160019 C26.6459451,79.8580021 28.9139452,82.3780022 33.5339454,86.1160023 C35.9279455,88.0480024 37.2299455,89.8540025 37.2299455,91.9120025 C37.2299455,93.7180026 36.0119455,94.6840027 34.2479454,94.6840027 C32.5259454,94.6840027 31.3079453,93.2140026 31.0979453,90.1060025 L26.1419451,90.8200025 C26.3939451,95.9020027 29.5859452,99.2200028 33.9539454,99.2200028 Z M57.69307,98.8000028 L57.69307,73.0120018 L62.7330702,73.0120018 L62.7330702,68.4760016 L47.4450696,68.4760016 L47.4450696,73.0120018 L52.4850698,73.0120018 L52.4850698,98.8000028 L57.69307,98.8000028 Z M94.9233188,98.8000028 L94.9233188,94.2640026 L86.7333184,94.2640026 L86.7333184,68.4760016 L81.5253182,68.4760016 L81.5253182,98.8000028 L94.9233188,98.8000028 Z M107.364443,98.8000028 L107.364443,68.4760016 L102.156443,68.4760016 L102.156443,98.8000028 L107.364443,98.8000028 Z M124.845567,98.8000028 C129.801567,98.8000028 132.825568,95.7760027 132.825568,90.0220025 C132.825568,86.4940023 131.565568,84.1420022 128.625567,82.8400022 C130.893567,82.0000021 132.237568,79.480002 132.237568,76.4980019 C132.237568,71.2480017 129.591567,68.4760016 124.383567,68.4760016 L116.445567,68.4760016 L116.445567,98.8000028 L124.845567,98.8000028 Z M123.543567,80.9080021 L121.653567,80.9080021 L121.653567,72.7600018 L123.501567,72.7600018 C126.231567,72.7600018 127.029567,74.5240019 127.029567,77.0020019 C127.029567,79.438002 125.685567,80.9080021 123.543567,80.9080021 Z M124.005567,94.5160026 L121.653567,94.5160026 L121.653567,85.1920023 L123.333567,85.1920023 C126.525567,85.1920023 127.617567,86.8300023 127.617567,89.8540025 C127.617567,92.5840026 126.777567,94.5160026 124.005567,94.5160026 Z M145.980692,98.8000028 L145.980692,86.3680023 C147.156692,86.3680023 147.996692,86.3260023 148.668692,86.2420023 L152.364692,98.8000028 L157.656692,98.8000028 L153.246692,85.0660023 C155.724692,83.8900022 156.900692,81.3700021 156.900692,77.422002 C156.900692,71.0380017 153.960692,68.4760016 148.290692,68.4760016 L140.772692,68.4760016 L140.772692,98.8000028 L145.980692,98.8000028 Z M147.954692,82.0840022 L145.980692,82.0840022 L145.980692,72.7600018 L147.744692,72.7600018 C150.810692,72.7600018 151.692692,73.8940018 151.692692,77.422002 C151.692692,80.9500021 150.726692,82.0840022 147.954692,82.0840022 Z M179.631817,98.8000028 L179.631817,94.2640026 L170.307816,94.2640026 L170.307816,85.3600023 L177.027817,85.3600023 L177.027817,80.8240021 L170.307816,80.8240021 L170.307816,73.0120018 L179.043817,73.0120018 L179.043817,68.4760016 L165.099816,68.4760016 L165.099816,98.8000028 L179.631817,98.8000028 Z M204.766065,89.8960025 L205.690065,68.4760016 L200.398065,68.4760016 L201.322065,89.8960025 L204.766065,89.8960025 Z M205.522065,98.8000028 L205.522065,93.8440026 L200.566065,93.8440026 L200.566065,98.8000028 L205.522065,98.8000028 Z" id="ESTLIBRE!" transform="translate(105.600443, 83.638002) rotate(-4.000000) translate(-105.600443, -83.638002) "></path>
                    </g>
                </g>
            </g>
        </g>
    </g>
</svg>