<?xml version="1.0" encoding="UTF-8"?>
<svg width="4px" height="505px" viewBox="0 0 4 505" version="1.1" xmlns="http://www.w3.org/2000/svg" xmlns:xlink="http://www.w3.org/1999/xlink">
    <!-- Generator: Sketch 53.2 (72643) - https://sketchapp.com -->
    <title>timeline-background</title>
    <desc>Created with Sketch.</desc>
    <g id="intégration" stroke="none" stroke-width="1" fill="none" fill-rule="evenodd">
        <g id="assets-webflow" fill="#EE6380" fill-rule="nonzero">
            <g id="timeline-background">
                <polygon id="Rectangle-3" points="0 0 4 0 4 505 0 505"></polygon>
            </g>
        </g>
    </g>
</svg>