<?xml version="1.0" encoding="UTF-8"?>
<svg width="148px" height="67px" viewBox="0 0 148 67" version="1.1" xmlns="http://www.w3.org/2000/svg" xmlns:xlink="http://www.w3.org/1999/xlink" style="background: #FFFFFF;">
    <title>hauts de france</title>
    <defs>
        <rect id="path-1" x="0" y="0" width="141.878704" height="59.8399977"></rect>
        <polygon id="path-3" points="0 0 376.510905 0 376.510905 266.105007 0 266.105007"></polygon>
        <polygon id="path-5" points="0 0 376.510905 0 376.510905 266.105007 0 266.105007"></polygon>
    </defs>
    <g id="hauts-de-france" stroke="none" stroke-width="1" fill="none" fill-rule="evenodd">
        <rect fill="#FFFFFF" x="0" y="0" width="148" height="67"></rect>
        <g id="logo-hdf-partenaire" transform="translate(3.000000, 4.000000)">
            <mask id="mask-2" fill="white">
                <use xlink:href="#path-1"></use>
            </mask>
            <g id="Mask"></g>
            <g mask="url(#mask-2)">
                <g transform="translate(-219.184409, -59.026664)">
                    <polygon id="path60" stroke="none" fill="#0050A3" fill-rule="nonzero" points="359.146211 105.306083 251.981616 105.306083 251.981616 75.366374 359.146211 75.366374"></polygon>
                    <polygon id="path62" stroke="#0050A3" stroke-width="0.550000012" fill="none" points="251.016169 105.306083 221.087318 105.306083 221.087318 75.366374 251.016169 75.366374"></polygon>
                    <g id="g64" stroke="none" stroke-width="1" fill="none" fill-rule="evenodd" transform="translate(188.500000, 134.059990) scale(-1, 1) rotate(-180.000000) translate(-188.500000, -134.059990) translate(0.000000, 0.559990)">
                        <g id="g66-Clipped">
                            <mask id="mask-4" fill="white">
                                <use xlink:href="#path-3"></use>
                            </mask>
                            <g id="path70"></g>
                            <g id="g66" mask="url(#mask-4)">
                                <g transform="translate(224.504952, 164.506284)">
                                    <g id="g72" transform="translate(5.646121, 8.755579)">
                                        <path d="M11.6277465,16.093006 C10.2444919,16.093006 8.97885643,15.5409265 8.06920887,14.6249663 C8.41178018,14.3223283 8.80399301,13.981693 9.15953372,13.6853135 C9.80084867,14.3022121 10.6738241,14.6727983 11.6277465,14.6727983 C13.5776302,14.6727983 15.1639231,13.1131177 15.1639231,11.1949208 C15.1639231,10.253033 14.8048047,9.40144472 14.1254759,8.73313794 L7.48647988,2.19267207 L1.99550019,7.60215724 C1.48477379,7.43049851 0.960183531,7.29057876 0.369851784,7.19446775 L6.97575348,0.686634924 C7.11126145,0.553420596 7.34023861,0.38936134 7.48647988,0.38936134 C7.63942947,0.38936134 7.86214554,0.553420596 7.99720629,0.686634924 L15.1460343,7.7295602 C16.1017456,8.66965997 16.6071054,9.86814189 16.6071054,11.1949208 C16.6071054,13.8954167 14.3732364,16.093006 11.6277465,16.093006" id="path74" fill="#8DC63F" fill-rule="nonzero"></path>
                                    </g>
                                    <g id="g76" transform="translate(0.234702, 0.001028)">
                                        <path d="M24.1499351,16.9870619 C23.4768675,17.0988189 22.8395775,17.2329273 22.2246486,17.388493 C21.8623996,16.7934988 21.6611501,16.5351167 21.3082927,16.1600602 C21.8100747,16.0179053 22.3234845,15.8909494 22.854783,15.7814276 C22.7823332,15.6701176 22.7112251,15.5597017 22.6405642,15.4506269 C20.24659,11.7537058 18.6424082,9.27538284 21.0220713,4.53688662 C20.5328115,3.99732389 19.791319,3.47296011 18.8454466,2.9977694 C17.4872363,3.52392129 16.262298,3.78990292 15.2010425,3.78990292 C13.0999981,3.78990292 11.9470623,2.75369214 11.4873191,1.61690008 C7.92341482,1.93428992 5.71772075,3.71390817 4.91406457,4.48816057 C6.535688,7.08136968 6.95026188,9.50470817 6.14615849,11.6964862 C5.28346914,14.0491943 3.15067209,15.3415521 1.87832829,15.8972078 C1.85820334,16.1014996 1.82913397,16.523941 1.79514518,16.7590777 C2.47939334,16.6388272 3.16051095,16.5775843 3.8295536,16.5775843 L3.83044804,16.5775843 C6.87602319,16.5775843 9.82857637,17.8614486 12.442136,20.3040093 C12.1201369,20.5489806 11.7592295,20.858771 11.3527056,21.2418739 C9.02536742,19.0889873 6.50035753,17.9977921 3.83044804,17.9968981 L3.8295536,17.9968981 C2.93690044,17.9968981 2.01607236,18.1220659 1.09300817,18.3692723 C0.851956044,18.4331973 0.452140452,18.5302024 0.265649286,18.3580966 C0.0845247729,18.1918022 0.146688495,17.7863479 0.195882807,17.5449528 C0.339440755,16.8382016 0.455270999,15.7318075 0.466004303,15.3978776 C0.481657039,14.9097231 0.522354152,14.8748549 0.979861256,14.717501 C1.51786814,14.5319844 3.9189978,13.5856263 4.78839547,11.2154841 C5.47756306,9.33617864 5.00887543,7.17971583 3.40379919,4.80063311 C3.13725546,4.4054604 3.14933043,4.33527701 3.43912965,3.96603193 C3.55451267,3.81940677 6.37334676,0.42199438 11.98284,0.16093006 C12.6509882,0.13053216 12.6152105,0.196692296 12.7238853,0.738490166 C12.931843,1.77380689 13.8267323,2.37014217 15.2010425,2.37014217 C16.1500455,2.37014217 17.2886702,2.08985564 18.5976861,1.56504484 C18.8763048,1.45284082 18.9156603,1.45284082 19.1871234,1.57979676 C20.7121471,2.29370039 21.8149942,3.12785453 22.4665952,4.04649696 C22.7013862,4.37774467 22.696914,4.44390481 22.5135534,4.78498713 C20.2103651,9.06349159 21.4344091,10.9454792 23.8578998,14.6879972 C24.1101324,15.0773585 24.3717567,15.484154 24.6441143,15.9110657 C24.9415163,16.3782099 24.989369,16.8480362 24.1499351,16.9870619" id="path78" fill="#0050A3" fill-rule="nonzero"></path>
                                    </g>
                                    <g id="g80" transform="translate(3.826155, 17.127160)">
                                        <path d="M1.78888408,1.78811178 C1.68423436,2.11935949 1.62922618,2.46714723 1.62922618,2.8234285 C1.62922618,4.74117839 3.21551914,6.30130592 5.16495557,6.30130592 C5.97084785,6.30130592 6.71860139,6.03934754 7.31966644,5.58293201 C8.54952425,4.60259973 9.07769228,4.00894661 10.0334036,3.21010768 C11.5423273,1.94814779 13.1169925,0.925794875 14.6818189,0.17612901 C14.9564126,0.460885812 15.3231338,0.854270404 15.70193,1.27224153 C14.0413984,2.01609603 12.2399921,3.21815418 10.7690822,4.45865673 C9.96095379,5.1412684 8.95649538,6.04560593 8.6483601,6.32544543 C8.6483601,6.32589246 8.64791288,6.32589246 8.64791288,6.32589246 C7.74407919,7.19759695 6.51064362,7.7215137 5.16495557,7.7215137 C2.41946572,7.7215137 0.186043945,5.52392432 0.186043945,2.8234285 C0.186043945,2.42557363 0.234343815,2.03576526 0.327813008,1.65892071 C0.800972848,1.65668557 1.3125937,1.70228242 1.78888408,1.78811178" id="path82" fill="#0050A3" fill-rule="nonzero"></path>
                                    </g>
                                    <g id="g84" transform="translate(30.842240, 15.462026)">
                                        <path d="M6.70831531,0 L4.70208181,0 C3.62383193,1.86634167 3.12383883,2.44613692 2.69450665,2.44613692 L1.97537525,2.44613692 L1.97537525,0 L0.3680629,0 L0.3680629,6.84623298 L4.25217746,6.84623298 C5.68015418,6.84623298 6.1591279,5.97184632 6.1591279,4.8422067 C6.1591279,3.86053334 5.74052902,3.0058159 4.42212145,2.9369736 C4.89170352,2.77023218 5.41047991,2.15065145 6.70831531,0 M1.97537525,3.74207093 L3.76336489,3.74207093 C4.11264451,3.74207093 4.37292714,3.9879363 4.37292714,4.59678836 C4.37292714,5.21547504 4.14216109,5.50023184 3.78304261,5.50023184 L1.97537525,5.50023184 L1.97537525,3.74207093 L1.97537525,3.74207093 Z" id="path86" fill="#8DC63F" fill-rule="nonzero"></path>
                                    </g>
                                    <g id="g88" transform="translate(37.939280, 15.152191)">
                                        <path d="M4.47221021,0.447027945 C3.96371991,0.280286522 3.20478583,0.172999815 2.62563461,0.172999815 C1.18737181,0.172999815 0.119408013,0.791239463 0.119408013,2.8538264 C0.119408013,4.87707488 1.05857216,5.47609233 2.5254571,5.47609233 C4.2231081,5.47609233 4.96191722,4.96603345 4.82193704,2.38176489 L1.69675655,2.38176489 C1.7168815,1.57666756 2.08628606,1.42959537 2.82420075,1.42959537 C3.19449975,1.42959537 3.86398962,1.49843767 4.24323304,1.59633679 L4.47221021,0.447027945 Z M1.61670399,5.88914615 L2.84477291,7.15602335 L4.41272981,7.15602335 L2.91543383,5.88914615 L1.61670399,5.88914615 Z M1.70614819,3.49173528 L3.48385175,3.49173528 C3.46417403,4.1895459 3.23474964,4.33706513 2.6359207,4.33706513 C1.99639464,4.33706513 1.79693406,4.13053822 1.70614819,3.49173528" id="path90" fill="#8DC63F" fill-rule="nonzero"></path>
                                    </g>
                                    <g id="g92" transform="translate(43.429991, 13.119421)">
                                        <path d="M2.2361051,2.23513973 C0.918144755,2.23513973 0.178888408,2.78453707 0.178888408,4.81762017 C0.178888408,6.87081952 0.957947426,7.50917543 2.69495387,7.50917543 C3.49369061,7.50917543 4.45253248,7.36210323 5.01155876,7.15557632 L5.01155876,2.74564564 C5.01155876,0.731784747 3.80316756,0.338847183 2.18601635,0.338847183 C1.52636534,0.338847183 0.788003438,0.467144203 0.319315809,0.633438599 L0.588542863,1.81269832 C1.11760533,1.67501371 1.62743729,1.58650218 2.15649976,1.58650218 C2.98520031,1.58650218 3.47446011,1.79258206 3.47446011,2.51900247 C3.17482203,2.37237731 2.73565098,2.23513973 2.2361051,2.23513973 M3.47446011,6.17345593 C3.23474964,6.27180207 2.92482547,6.31069351 2.69495387,6.31069351 C1.96643083,6.31069351 1.72672036,6.13367044 1.72672036,4.84757104 C1.72672036,3.78677373 1.93646702,3.50201692 2.6551512,3.50201692 C3.10460833,3.50201692 3.47446011,3.6392545 3.47446011,3.85561603 L3.47446011,6.17345593 Z" id="path94" fill="#8DC63F" fill-rule="nonzero"></path>
                                    </g>
                                    <g id="g96" transform="translate(49.607231, 15.249285)">
                                        <path d="M1.78888408,6.70541918 C1.78888408,6.02683076 1.56885134,5.90926241 0.919933639,5.90926241 C0.261177076,5.90926241 0.0518776384,6.02683076 0.0518776384,6.70541918 C0.0518776384,7.32365883 0.261177076,7.42200498 0.919933639,7.42200498 C1.56885134,7.42200498 1.78888408,7.32365883 1.78888408,6.70541918 M1.68915379,0.212785302 L0.151160705,0.212785302 L0.151160705,5.24140266 L1.68915379,5.24140266 L1.68915379,0.212785302 Z" id="path98" fill="#8DC63F" fill-rule="nonzero"></path>
                                    </g>
                                    <g id="g100" transform="translate(52.393821, 15.323939)">
                                        <path d="M0,2.68216767 C0,4.73492 0.848825497,5.3044336 2.47581557,5.3044336 C4.13366389,5.3044336 4.97265053,4.73492 4.97265053,2.68216767 C4.97265053,0.619580732 4.14305553,0.000894055891 2.47581557,0.000894055891 C0.828700551,0.000894055891 0,0.619580732 0,2.68216767 M1.54738473,2.65266383 C1.54738473,1.3853396 1.75757861,1.17925972 2.47581557,1.17925972 C3.20478583,1.17925972 3.41497971,1.3853396 3.41497971,2.65266383 C3.41497971,3.9687141 3.20478583,4.12606794 2.47581557,4.12606794 C1.75757861,4.12606794 1.54738473,3.9687141 1.54738473,2.65266383" id="path102" fill="#8DC63F" fill-rule="nonzero"></path>
                                    </g>
                                    <g id="g104" transform="translate(58.232068, 15.462026)">
                                        <path d="M1.78888408,0 L0.250890993,0 L0.250890993,4.71480374 C0.910541998,4.94994044 1.92886426,5.16630196 2.84700902,5.16630196 C4.25530801,5.16630196 4.95476169,4.58695375 4.95476169,2.77961976 L4.95476169,0 L3.41587416,0 L3.41587416,2.66205141 C3.41587416,3.57488248 3.26650233,3.82074785 2.51740713,3.82074785 C2.26830502,3.82074785 2.03843341,3.791244 1.78888408,3.73268334 L1.78888408,0 Z" id="path106" fill="#8DC63F" fill-rule="nonzero"></path>
                                    </g>
                                </g>
                            </g>
                        </g>
                    </g>
                    <g id="g108" stroke="none" stroke-width="1" fill="none" fill-rule="evenodd" transform="translate(260.343403, 96.942895) scale(-1, 1) rotate(-180.000000) translate(-260.343403, -96.942895) translate(255.843403, 92.442895)">
                        <polygon id="path110" fill="#FFFFFF" fill-rule="nonzero" points="2.30718768 0 0.109822134 0 0.109822134 8.85402244 2.30718768 8.85402244 2.30718768 5.62718407 5.88332858 5.62718407 5.88332858 8.85402244 8.08023269 8.85402244 8.08023269 0 5.88332858 0 5.88332858 3.73504343 2.30718768 3.73504343"></polygon>
                    </g>
                    <g id="g112" stroke="none" stroke-width="1" fill="none" fill-rule="evenodd" transform="translate(188.500000, 134.059990) scale(-1, 1) rotate(-180.000000) translate(-188.500000, -134.059990) translate(0.000000, 0.559990)">
                        <g id="g114-Clipped">
                            <mask id="mask-6" fill="white">
                                <use xlink:href="#path-5"></use>
                            </mask>
                            <g id="path118"></g>
                            <g id="g114" mask="url(#mask-6)">
                                <g transform="translate(264.754844, 165.847368)">
                                    <g id="g120" transform="translate(0.265247, 0.023335)">
                                        <path d="M6.26109429,0.894055891 C5.34831619,0.570854686 4.03885304,0.376844558 3.04602237,0.376844558 C0.811258931,0.376844558 0.150266263,0.842200649 0.150266263,2.57264583 C0.150266263,4.43272911 1.18111072,4.73000269 2.79513138,4.73000269 C3.29780781,4.73000269 3.81434808,4.66563067 4.3295467,4.56147315 C4.3295467,5.47922153 4.11801116,5.73715665 2.79513138,5.73715665 C2.0147307,5.73715665 1.26116328,5.59544879 0.69229814,5.42736628 L0.374771215,7.00403385 C1.15561912,7.19625586 2.27903832,7.35226862 3.28528562,7.35226862 C5.30851351,7.35226862 6.26109429,6.74520467 6.26109429,4.78185793 L6.26109429,0.894055891 Z M3.20568028,1.85024867 C3.58894869,1.85024867 4.01291422,1.91417366 4.3295467,2.03040093 L4.3295467,3.28342026 C4.02633085,3.36075609 3.64216799,3.37416693 3.23206632,3.37416693 C2.50399049,3.37416693 2.23968287,3.29593704 2.23968287,2.63746488 C2.23968287,1.96513485 2.41186296,1.85024867 3.20568028,1.85024867" id="path122" fill="#FFFFFF" fill-rule="nonzero"></path>
                                    </g>
                                    <g id="g124" transform="translate(7.874265, 0.041663)">
                                        <path d="M4.47221021,7.15244713 L6.48336314,7.15244713 L6.48336314,0.939652741 C5.62290989,0.642379158 4.26112188,0.34599963 3.05809734,0.34599963 C1.17932183,0.34599963 0.279513138,1.12159311 0.279513138,3.48458283 L0.279513138,7.15244713 L2.29066607,7.15244713 L2.29066607,3.6392545 C2.29066607,2.45150125 2.50264883,2.11533624 3.49413783,2.11533624 C3.82508139,2.11533624 4.11622227,2.16719148 4.47221021,2.24452731 L4.47221021,7.15244713 Z" id="path126" fill="#FFFFFF" fill-rule="nonzero"></path>
                                    </g>
                                    <g id="g128" transform="translate(14.894159, 0.125704)">
                                        <path d="M3.57776816,5.36433534 L3.57776816,2.89674109 C3.57776816,2.22485808 3.7763343,1.95440618 4.49054627,1.95440618 C4.91361735,1.95440618 5.25842476,2.03129498 5.57550446,2.13455844 L5.9060008,0.610640173 C5.40287715,0.404113263 4.59609043,0.274475158 3.86890905,0.274475158 C2.3742964,0.274475158 1.54067642,0.713456601 1.54067642,2.68976715 L1.54067642,5.36433534 L0.443196031,5.36433534 L0.443196031,7.06840587 L1.54067642,7.06840587 L1.54067642,8.05007924 L3.57776816,8.85070629 L3.57776816,7.06840587 L5.69446526,7.06840587 L5.69446526,5.36433534 L3.57776816,5.36433534 Z" id="path130" fill="#FFFFFF" fill-rule="nonzero"></path>
                                    </g>
                                    <g id="g132" transform="translate(21.370814, 0.177515)">
                                        <path d="M4.91943123,5.36433534 C4.38992154,5.50559618 3.60952086,5.64819809 2.92169493,5.64819809 C2.2870883,5.64819809 1.9700086,5.59634285 1.9700086,5.07957854 C1.9700086,4.73089675 2.1551581,4.6405971 3.19941918,4.51140602 C4.77318995,4.31650184 5.47443251,3.85203981 5.47443251,2.49665107 C5.47443251,0.700939818 4.15244718,0.222619917 2.44585176,0.222619917 C1.71777594,0.222619917 0.659651005,0.364327775 0.0380137868,0.584712553 L0.434698832,2.0827032 C0.93782248,1.94099534 1.6913899,1.81135723 2.35327701,1.81135723 C3.1466471,1.81135723 3.51694611,1.87617629 3.51694611,2.39338762 C3.51694611,2.7545862 3.29199393,2.89718811 2.16812751,3.00045157 C0.752672978,3.12919562 -0.00134166306,3.52928563 -0.00134166306,4.93831771 C-0.00134166306,6.73224086 1.30767426,7.19804398 3.00085305,7.19804398 C3.72892887,7.19804398 4.68106242,7.05544206 5.31611627,6.83505728 L4.91943123,5.36433534 Z" id="path134" fill="#FFFFFF" fill-rule="nonzero"></path>
                                    </g>
                                </g>
                            </g>
                        </g>
                    </g>
                    <polygon id="path136" stroke="none" fill="#FFFFFF" fill-rule="nonzero" points="292.530382 97.5797065 295.426722 97.5797065 295.426722 99.5113006 292.530382 99.5113006"></polygon>
                    <g id="g138" stroke="none" stroke-width="1" fill="none" fill-rule="evenodd" transform="translate(304.400006, 96.559986) scale(-1, 1) rotate(-180.000000) translate(-304.400006, -96.559986) translate(295.900006, 90.559986)">
                        <g id="g140-Clipped" transform="translate(0.000000, 0.000000)" fill="#FFFFFF" fill-rule="nonzero">
                            <g id="g140" transform="translate(0.607530, 0.400336)">
                                <g id="g146" transform="translate(0.025626, 0.418597)">
                                    <path d="M6.70831531,0.894055891 C5.96727008,0.6222629 4.69805682,0.4286998 3.63903744,0.4286998 C1.33808529,0.4286998 0.30679362,1.22932685 0.30679362,3.94278648 C0.30679362,6.60260275 1.49729598,7.40412386 3.17661091,7.40412386 C3.8380508,7.40412386 4.28795515,7.27403873 4.67167078,7.11892003 L4.67167078,9.93564311 L6.70831531,9.93564311 L6.70831531,0.894055891 Z M4.67167078,5.2852114 C4.67167078,5.57041523 4.2083498,5.78901189 3.61309863,5.78901189 C2.66051785,5.78901189 2.35640756,5.37595807 2.35640756,3.9687141 C2.35640756,2.36567189 2.6743817,2.09432592 3.63903744,2.09432592 C3.98339763,2.09432592 4.42033257,2.14707522 4.67167078,2.25033868 L4.67167078,5.2852114 L4.67167078,5.2852114 Z" id="path148"></path>
                                </g>
                                <g id="g150" transform="translate(8.169521, 0.762272)">
                                    <path d="M5.81387327,0.447027945 C5.13991119,0.226643168 4.13455834,0.0849353096 3.36712706,0.0849353096 C1.46196552,0.0849353096 0.0469582072,0.899420226 0.0469582072,3.6119858 C0.0469582072,6.2722491 1.29023264,7.06035937 3.23474964,7.06035937 C5.48292971,7.06035937 6.46279097,6.38802934 6.27719425,2.99151101 L2.13637482,2.99151101 C2.16320808,1.93250181 2.65246787,1.73849168 3.63188191,1.73849168 C4.12158893,1.73849168 5.00708655,1.82968538 5.50976297,1.95887646 L5.81387327,0.447027945 Z M2.15023867,4.45061022 L4.50441012,4.45061022 C4.4784713,5.36791157 4.17391379,5.56236872 3.38009647,5.56236872 C2.53350708,5.56236872 2.26875224,5.29057573 2.15023867,4.45061022" id="path152"></path>
                                </g>
                            </g>
                        </g>
                    </g>
                    <polygon id="path154" stroke="none" fill="#FFFFFF" fill-rule="nonzero" points="312.804765 97.5797065 315.701105 97.5797065 315.701105 99.5113006 312.804765 99.5113006"></polygon>
                    <g id="g156" stroke="none" stroke-width="1" fill="none" fill-rule="evenodd" transform="translate(318.735658, 97.408692) scale(-1, 1) rotate(-180.000000) translate(-318.735658, -97.408692) translate(314.735658, 92.408692)">
                        <polygon id="path158" fill="#FFFFFF" fill-rule="nonzero" points="7.50019106 9.23209887 7.50019106 7.44151131 2.68928726 7.44151131 2.68928726 5.38231364 6.25234677 5.38231364 6.25234677 3.63041298 2.68928726 3.63041298 2.68928726 0.37807643 0.457511655 0.37807643 0.457511655 9.23209887"></polygon>
                    </g>
                    <g id="g160" stroke="none" stroke-width="1" fill="none" fill-rule="evenodd" transform="translate(341.339988, 97.119996) scale(-1, 1) rotate(-180.000000) translate(-341.339988, -97.119996) translate(323.839988, 92.119996)">
                        <g id="g162-Clipped" fill="#FFFFFF" fill-rule="nonzero">
                            <g id="g162" transform="translate(0.395252, 0.407374)">
                                <g id="g168" transform="translate(0.107109, 0.488691)">
                                    <path d="M-1.19163618e-15,6.70541918 L2.03753897,6.70541918 L2.03753897,6.18865488 C2.2615967,6.57712216 2.69808442,6.88691253 3.67749845,6.88691253 C3.87606459,6.88691253 4.11398617,6.87394872 4.35190775,6.8480211 L4.35190775,5.00134865 C4.08715291,5.07823746 3.73027053,5.10371805 3.40022142,5.10371805 C2.6721456,5.10371805 2.03753897,4.87171055 2.03753897,4.43228208 L2.03753897,0.0920877567 L-1.19163618e-15,0.0920877567 L-1.19163618e-15,6.70541918 Z" id="path170"></path>
                                </g>
                                <g id="g172" transform="translate(4.944565, 0.023335)">
                                    <path d="M6.26109429,0.894055891 C5.34786896,0.570854686 4.03885304,0.376844558 3.04646959,0.376844558 C0.81081171,0.376844558 0.149819042,0.842200649 0.149819042,2.57264583 C0.149819042,4.43272911 1.18111072,4.73000269 2.79513138,4.73000269 C3.29780781,4.73000269 3.81434808,4.66563067 4.3295467,4.56147315 C4.3295467,5.47922153 4.11801116,5.73715665 2.79513138,5.73715665 C2.01517792,5.73715665 1.26116328,5.59544879 0.691850919,5.42736628 L0.374323994,7.00403385 C1.1551719,7.19625586 2.27993276,7.35226862 3.28528562,7.35226862 C5.30896074,7.35226862 6.26109429,6.74520467 6.26109429,4.78185793 L6.26109429,0.894055891 Z M3.20523305,1.85024867 C3.58894869,1.85024867 4.01291422,1.91417366 4.3295467,2.03040093 L4.3295467,3.28342026 C4.02588363,3.36075609 3.64216799,3.37416693 3.23206632,3.37416693 C2.50488494,3.37416693 2.23923565,3.29593704 2.23923565,2.63746488 C2.23923565,1.96513485 2.41231019,1.85024867 3.20523305,1.85024867" id="path174"></path>
                                </g>
                                <g id="g176" transform="translate(12.687213, 0.580823)">
                                    <path d="M2.2361051,0 L0.199013354,0 L0.199013354,6.20072463 C1.07154157,6.50962094 2.42125461,6.79482477 3.638143,6.79482477 C5.5039491,6.79482477 6.42880217,6.0321951 6.42880217,3.65624157 L6.42880217,0 L4.39215764,0 L4.39215764,3.50112287 C4.39215764,4.70273399 4.19359151,5.02504113 3.20210251,5.02504113 C2.87115895,5.02504113 2.56660144,4.9861497 2.2361051,4.9092609 L2.2361051,0 Z" id="path178"></path>
                                </g>
                                <g id="g180" transform="translate(20.207771, 0.289138)">
                                    <path d="M5.81387327,0.447027945 C5.27228861,0.227090196 4.35861607,0.111309958 3.68420677,0.111309958 C1.66097887,0.111309958 0.310818609,0.925347847 0.310818609,3.63791342 C0.310818609,6.32365732 1.67394828,7.08628699 3.68420677,7.08628699 C4.38544933,7.08628699 5.2848108,6.98257651 5.81387327,6.80153019 L5.38990774,5.12294025 C5.00708655,5.26509514 4.41228259,5.39383919 3.85593964,5.39383919 C2.86489786,5.39383919 2.36266865,5.22620371 2.36266865,3.59857496 C2.36266865,2.04828205 2.86489786,1.81627454 3.85593964,1.81627454 C4.43777419,1.81627454 5.00708655,1.95842943 5.38990774,2.1131011 L5.81387327,0.447027945 Z" id="path182"></path>
                                </g>
                                <g id="g184" transform="translate(26.716313, 0.315244)">
                                    <path d="M5.81387327,0.447027945 C5.13991119,0.226643168 4.13321667,0.0849353096 3.36667984,0.0849353096 C1.46196552,0.0849353096 0.0465109861,0.899420226 0.0465109861,3.6119858 C0.0465109861,6.2722491 1.29023264,7.06035937 3.23474964,7.06035937 C5.48292971,7.06035937 6.46144931,6.38802934 6.27674702,2.99151101 L2.13637482,2.99151101 C2.16276086,1.93250181 2.65291509,1.73849168 3.63098747,1.73849168 C4.12069448,1.73849168 5.00708655,1.82968538 5.50931575,1.95887646 L5.81387327,0.447027945 Z M2.15023867,4.45061022 L4.50441012,4.45061022 C4.47802408,5.36791157 4.17346656,5.56236872 3.38009647,5.56236872 C2.53350708,5.56236872 2.26875224,5.29057573 2.15023867,4.45061022" id="path186"></path>
                                </g>
                            </g>
                        </g>
                    </g>
                </g>
            </g>
        </g>
    </g>
</svg>