<?xml version="1.0" encoding="UTF-8"?>
<svg width="200px" height="200px" viewBox="0 0 200 200" version="1.1" xmlns="http://www.w3.org/2000/svg" xmlns:xlink="http://www.w3.org/1999/xlink">
    <title>Grandes Causes/Environnement/Actions/Des incroyables engagements</title>
    <defs>
        <path d="M187.5,0 L12.5,0 C5.60820312,0 0,5.61941514 0,12.5249902 L0,129.425029 C0,136.330604 5.60820312,141.95002 12.5,141.95002 L83.3332031,141.95002 L83.3332031,150.942963 L36.8164062,158.708456 C34.5496094,159.084206 33.0164063,161.238505 33.3914063,163.509833 C33.7332031,165.555712 35.4996094,167 37.4996094,167 C37.7246094,167 37.9496094,166.98317 38.1828125,166.941681 L87.8332031,158.649746 L112.158203,158.649746 L161.808203,166.941289 C162.041406,166.98317 162.275,167 162.5,167 C164.508203,167 166.275,165.554929 166.6,163.509442 C166.983203,161.238113 165.441797,159.083815 163.175,158.708065 L116.666797,150.942571 L116.666797,141.949628 L187.5,141.949628 C194.391797,141.949628 200,136.330213 200,129.424638 L200,12.5249902 C200,5.61941514 194.391797,0 187.5,0 Z M108.333203,150.299883 L91.6664062,150.299883 L91.6664062,141.95002 L108.333203,141.95002 L108.333203,150.299883 Z" id="path-1"></path>
        <rect id="path-3" x="8.92857082" y="9.50557228" width="181.91963" height="123.013288" rx="8.48724862"></rect>
    </defs>
    <g id="Grandes-Causes/Environnement/Actions/Des-incroyables-engagements" stroke="none" stroke-width="1" fill="none" fill-rule="evenodd">
        <g id="des-incroyables-engagements" transform="translate(0.000000, 16.000000)">
            <mask id="mask-2" fill="white">
                <use xlink:href="#path-1"></use>
            </mask>
            <use id="Mask" fill="#2B9297" fill-rule="nonzero" xlink:href="#path-1"></use>
            <mask id="mask-4" fill="white">
                <use xlink:href="#path-3"></use>
            </mask>
            <rect stroke="#FFFFFF" stroke-width="3.34143646" x="10.5992891" y="11.1762905" width="178.578194" height="119.671852" rx="8.48724862"></rect>
            <path d="M34.5553144,116.680637 L34.5553144,113.791055 L28.6209232,113.791055 L28.6209232,108.118912 L32.8979619,108.118912 L32.8979619,105.22933 L28.6209232,105.22933 L28.6209232,100.252827 L34.1810735,100.252827 L34.1810735,97.3632451 L25.3062182,97.3632451 L25.3062182,116.680637 L34.5553144,116.680637 Z M41.5055022,116.680637 L41.5055022,104.613956 L41.5589652,104.613956 L45.7825409,116.680637 L48.669542,116.680637 L48.669542,97.3632451 L45.6756149,97.3632451 L45.6756149,108.413221 L45.622152,108.413221 L41.5856967,97.3632451 L38.5115752,97.3632451 L38.5115752,116.680637 L41.5055022,116.680637 Z M57.6780548,116.948191 C59.0413608,116.948191 59.8700371,116.573616 60.9927597,115.235846 L61.607584,116.680637 L63.2114735,116.680637 L63.2114735,106.888164 L57.7849807,106.888164 L57.7849807,109.510192 L59.8967686,109.510192 L59.8967686,111.490091 C59.8967686,113.175681 59.4690647,114.058609 58.0790271,114.058609 C56.87611,114.058609 56.5286006,113.175681 56.5286006,112.105465 L56.5286006,102.018683 C56.5286006,100.841446 56.9563045,99.9852734 57.9988327,99.9852734 C59.4957962,99.9852734 59.8967686,101.109 59.8967686,103.516985 L59.8967686,103.624007 L63.0510846,103.624007 L63.0510846,102.312992 C63.0510846,99.4234102 61.2868061,97.0956912 58.0790271,97.0956912 C54.9247111,97.0956912 53.2138956,99.2361224 53.2138956,101.965172 L53.2138956,112.105465 C53.2138956,114.861271 54.8445166,116.948191 57.6780548,116.948191 Z M69.8408835,116.680637 L70.4289763,112.399775 L74.0644592,112.399775 L74.652552,116.680637 L77.860331,116.680637 L74.3050426,97.3632451 L70.1883929,97.3632451 L66.6331045,116.680637 L69.8408835,116.680637 Z M73.5832924,109.510192 L70.9101432,109.510192 L72.2199863,101.216021 L72.2734493,101.216021 L73.5832924,109.510192 Z M85.5857322,116.948191 C86.9490382,116.948191 87.7777145,116.573616 88.9004371,115.235846 L89.5152615,116.680637 L91.119151,116.680637 L91.119151,106.888164 L85.6926581,106.888164 L85.6926581,109.510192 L87.804446,109.510192 L87.804446,111.490091 C87.804446,113.175681 87.3767421,114.058609 85.9867045,114.058609 C84.7837874,114.058609 84.436278,113.175681 84.436278,112.105465 L84.436278,102.018683 C84.436278,100.841446 84.8639819,99.9852734 85.9065101,99.9852734 C87.4034736,99.9852734 87.804446,101.109 87.804446,103.516985 L87.804446,103.624007 L90.958762,103.624007 L90.958762,102.312992 C90.958762,99.4234102 89.1944836,97.0956912 85.9867045,97.0956912 C82.8323885,97.0956912 81.1215731,99.2361224 81.1215731,101.965172 L81.1215731,112.105465 C81.1215731,114.861271 82.752194,116.948191 85.5857322,116.948191 Z M105.07299,116.680637 L105.07299,113.791055 L99.1385985,113.791055 L99.1385985,108.118912 L103.415637,108.118912 L103.415637,105.22933 L99.1385985,105.22933 L99.1385985,100.252827 L104.698749,100.252827 L104.698749,97.3632451 L95.8238935,97.3632451 L95.8238935,116.680637 L105.07299,116.680637 Z M111.729131,116.680637 L111.729131,101.590597 L111.782594,101.590597 L114.776521,116.680637 L116.380411,116.680637 L119.374338,101.590597 L119.427801,101.590597 L119.427801,116.680637 L122.314802,116.680637 L122.314802,97.3632451 L117.957569,97.3632451 L115.605197,108.65402 L115.551734,108.65402 L113.199363,97.3632451 L108.84213,97.3632451 L108.84213,116.680637 L111.729131,116.680637 Z M135.947863,116.680637 L135.947863,113.791055 L130.013472,113.791055 L130.013472,108.118912 L134.29051,108.118912 L134.29051,105.22933 L130.013472,105.22933 L130.013472,100.252827 L135.573622,100.252827 L135.573622,97.3632451 L126.698767,97.3632451 L126.698767,116.680637 L135.947863,116.680637 Z M142.898051,116.680637 L142.898051,104.613956 L142.951514,104.613956 L147.175089,116.680637 L150.06209,116.680637 L150.06209,97.3632451 L147.068163,97.3632451 L147.068163,108.413221 L147.0147,108.413221 L142.978245,97.3632451 L139.904123,97.3632451 L139.904123,116.680637 L142.898051,116.680637 Z M159.845816,116.680637 L159.845816,100.252827 L163.053595,100.252827 L163.053595,97.3632451 L153.323332,97.3632451 L153.323332,100.252827 L156.531111,100.252827 L156.531111,116.680637 L159.845816,116.680637 Z M170.458219,116.948191 C173.665998,116.948191 175.697591,115.102069 175.697591,111.998444 C175.697591,110.286099 175.189693,108.466732 171.313626,105.336352 C169.736468,104.052093 168.961255,103.035388 168.961255,101.858151 C168.961255,100.680914 169.549348,99.9852734 170.618608,99.9852734 C171.55421,99.9852734 172.27596,100.707669 172.382886,102.125705 L175.537202,101.777885 C175.189693,98.8347916 173.505609,97.0956912 170.912654,97.0956912 C167.678143,97.0956912 165.806939,98.8347916 165.806939,101.911662 C165.806939,104.613956 167.25044,106.219279 170.190904,108.600509 C171.714599,109.831257 172.543275,110.981739 172.543275,112.292753 C172.543275,113.443235 171.768062,114.058609 170.645339,114.058609 C169.549348,114.058609 168.774135,113.12217 168.640477,111.142271 L165.486161,111.597113 C165.64655,114.834515 167.678143,116.948191 170.458219,116.948191 Z" id="ENGAGEMENTS" fill="#FFFFFF" fill-rule="nonzero" mask="url(#mask-4)" transform="translate(100.501905, 107.021941) rotate(-1.000000) translate(-100.501905, -107.021941) "></path>
            <path d="M88.132935,40.2065267 C91.4209085,40.2065267 93.2653814,38.2801386 93.2653814,34.5076285 L93.2653814,26.5880328 C93.2653814,22.8422781 91.4209085,20.8891346 88.132935,20.8891346 L83.1074145,20.8891346 L83.1074145,40.2065267 L88.132935,40.2065267 Z M87.5448422,37.4774768 L86.4221195,37.4774768 L86.4221195,23.6181844 L87.5448422,23.6181844 C89.3358521,23.6181844 89.9506764,24.3138246 89.9506764,26.2134574 L89.9506764,34.8822039 C89.9506764,36.6748151 89.4427781,37.4774768 87.5448422,37.4774768 Z M107.058831,40.2065267 L107.058831,37.3169445 L101.12444,37.3169445 L101.12444,31.6448017 L105.401479,31.6448017 L105.401479,28.7552195 L101.12444,28.7552195 L101.12444,23.7787168 L106.68459,23.7787168 L106.68459,20.8891346 L97.809735,20.8891346 L97.809735,40.2065267 L107.058831,40.2065267 Z M115.131742,40.4740806 C118.339521,40.4740806 120.371114,38.6279586 120.371114,35.5243333 C120.371114,33.8119883 119.863216,31.9926217 115.987149,28.862241 C114.409991,27.5779823 113.634778,26.5612774 113.634778,25.3840402 C113.634778,24.206803 114.222871,23.5111629 115.292131,23.5111629 C116.227733,23.5111629 116.949483,24.2335584 117.056409,25.6515941 L120.210725,25.3037741 C119.863216,22.3606811 118.179132,20.6215807 115.586177,20.6215807 C112.351667,20.6215807 110.480462,22.3606811 110.480462,25.437551 C110.480462,28.1398455 111.923963,29.7451689 114.864427,32.1263987 C116.388122,33.3571467 117.216798,34.5076285 117.216798,35.8186426 C117.216798,36.9691244 116.441585,37.5844984 115.318862,37.5844984 C114.222871,37.5844984 113.447658,36.6480597 113.314,34.6681608 L110.159684,35.1230025 C110.320073,38.3604047 112.351667,40.4740806 115.131742,40.4740806 Z" id="DES" fill="#FFFFFF" fill-rule="nonzero" mask="url(#mask-4)"></path>
            <g id="Group-2" mask="url(#mask-4)" fill-rule="nonzero">
                <g transform="translate(5.243908, 46.415381)">
                    <polygon id="Rectangle" fill="#A4D693" transform="translate(96.597602, 21.813396) rotate(-1.000000) translate(-96.597602, -21.813396) " points="0.33760362 1.69107699 192.860547 1.67695316 192.857601 41.935715 0.334657422 41.9498388"></polygon>
                    <path d="M31.113026,33.1190023 C31.1547642,33.0772268 31.2382408,33.0145634 31.3634555,32.9310123 C31.4678012,32.8474611 31.5408431,32.7952417 31.5825814,32.7743539 C31.7077961,32.7534661 31.7912726,32.6490272 31.8330109,32.4610371 L31.8956183,32.2103837 L31.9895293,31.9910619 C32.0312676,31.9075108 32.0521367,31.8344035 32.0521367,31.7717402 L32.020833,31.3957601 C32.020833,31.2495456 32.0312676,31.1242189 32.0521367,31.0197799 C32.0730058,30.8109021 32.0834404,30.5393609 32.0834404,30.2051563 L32.0521367,29.7978445 L32.0521367,29.0145526 L32.020833,28.6699041 L32.020833,26.6020134 L31.9895293,25.8500532 L31.9582256,25.0980929 L31.9582256,24.3461327 L31.9895293,23.4688457 L32.0521367,22.6228904 C32.0730058,22.2886858 32.0625713,22.0067008 32.020833,21.7769351 L32.0521367,21.6829401 L32.0521367,21.6202767 L32.1147441,21.1189699 L32.1460478,20.6489947 L32.1147441,19.5210544 L32.1147441,18.4244456 L32.1460478,17.6724854 L32.1460478,16.8891935 L32.1773515,16.5758767 L32.2086552,16.2312282 L32.2086552,15.8552481 L32.2399589,15.479268 L32.427781,14.601981 C32.5112575,14.2468887 32.5529958,13.9440158 32.5529958,13.6933624 L32.5529958,13.6620307 L32.5842995,13.630699 L32.6156031,13.1920555 L32.6156031,12.8787388 C32.6156031,12.753412 32.6260377,12.659417 32.6469068,12.5967537 C32.7095142,12.3878758 32.6886451,12.178998 32.5842995,11.9701201 L32.3651736,11.59414 L32.1147441,11.2494915 C32.093875,11.207716 31.926922,11.0823893 31.613885,10.8735114 C31.3217173,10.6646336 31.1338951,10.5393068 31.0504186,10.4975313 L30.8625965,10.4348679 L30.706078,10.3722046 C30.372172,10.2468779 30.1113079,10.1842145 29.9234858,10.1842145 L29.7356636,10.1842145 L29.5791452,10.2155462 L29.2661082,10.3095412 L28.984375,10.4035362 C28.7339455,10.4661996 28.5461234,10.5497507 28.4209086,10.6541897 L28.3269975,10.6855213 C28.1183063,10.7481847 28.0139606,10.8735114 28.0139606,11.0615015 L27.9826569,11.2181599 C27.8783113,11.6776911 27.8261385,12.1058907 27.8261385,12.5027586 C27.8261385,12.6489731 27.8052694,12.7638559 27.7635311,12.8474071 C27.7009237,13.0145094 27.6487509,13.2233872 27.6070126,13.4740406 L27.5444053,14.0693425 L27.4817979,14.601981 L27.4504942,15.1032878 L27.3565831,15.7299214 L27.2939757,16.3565549 L27.2626721,17.3278369 C27.2418029,17.7038171 27.2418029,18.0171338 27.2626721,18.2677873 L27.2626721,18.9570842 L27.2313684,19.6777127 L27.2313684,20.6803264 L27.2000647,21.2442966 L27.1374573,21.6202767 C27.1374573,21.7664912 27.1478919,21.8918179 27.168761,21.9962569 L27.168761,22.2155786 L27.1374573,22.4975637 L27.1061536,22.8108805 L27.1374573,23.3121873 L27.1061536,23.8448258 C27.1061536,24.2625815 27.1165882,24.5967861 27.1374573,24.8474395 L27.1374573,24.9101029 L27.1061536,25.8500532 L27.1374573,26.7586718 L27.1374573,27.6359588 L27.168761,28.293924 L27.168761,29.0145526 L27.2313684,29.7665128 L27.2626721,30.5184731 C27.2835412,31.1242189 27.335714,31.6150818 27.4191905,31.9910619 C27.4400596,32.0746131 27.5548398,32.2208276 27.7635311,32.4297054 L28.0139606,32.6803588 C28.0974371,32.76391 28.14961,32.8265733 28.1704791,32.8683489 C28.3374321,33.1190023 28.5356888,33.2547729 28.7652492,33.2756607 C28.8487257,33.2756607 28.9113331,33.2861046 28.9530713,33.3069924 C29.057417,33.348768 29.1826317,33.3800996 29.3287156,33.4009874 L29.7043599,33.3696557 L29.9547894,33.3696557 C30.4765176,33.4949824 30.8625965,33.4114313 31.113026,33.1190023 Z M43.2901616,33.7769675 C43.3318999,33.7560798 43.4049418,33.735192 43.5092875,33.7143042 L43.759717,33.6829725 C43.9475391,33.6203092 44.0518848,33.5889775 44.0727539,33.5889775 C44.1770995,33.5889775 44.3544871,33.5158702 44.6049166,33.3696557 L44.7614351,33.3069924 L44.8866499,33.2129974 C44.9492572,33.1712218 44.9909955,33.150334 45.0118646,33.150334 C45.2205559,33.0876706 45.3770743,32.9414561 45.48142,32.7116905 C45.648373,32.273047 45.7214149,31.6359696 45.7005458,30.8004582 L45.6692421,30.2991514 L45.7005458,28.6072408 L45.7005458,27.5732954 C45.6588076,27.1764275 45.6379384,26.6855646 45.6379384,26.1007066 L45.6379384,24.3461327 L45.9196717,21.4322867 L46.0135827,20.523668 L46.1387975,19.5837177 L46.2953159,18.2051239 L46.2953159,17.5471587 L46.389227,16.7951984 L46.4518344,16.0432382 L46.4831381,15.1659512 L46.5770492,14.2573326 L46.6396565,13.8186891 L46.7022639,13.3487139 L46.7335676,12.9100704 C46.7544367,12.7429682 46.7544367,12.6071975 46.7335676,12.5027586 C46.7126985,12.2103296 46.629222,11.8761251 46.4831381,11.5001449 C46.462269,11.4165938 46.4309653,11.3434866 46.389227,11.2808232 C46.3683579,11.2181599 46.3266196,11.1554965 46.2640122,11.0928331 L46.1074938,10.9361748 L46.0761901,10.9048431 L45.9196717,10.8421797 L45.7631532,10.716853 L45.7005458,10.716853 L45.0118646,10.622858 L44.7927388,10.622858 L44.7927388,10.622858 C44.7301314,10.6437458 44.6883932,10.6959652 44.667524,10.7795164 L44.667524,10.8421797 L44.6362203,10.8421797 C44.573613,10.8421797 44.4901364,10.9570625 44.3857908,11.1868282 L44.2918797,11.3121549 L44.166665,11.4374816 L44.0727539,11.59414 C44.0101465,11.78213 43.9684083,11.9701201 43.9475391,12.1581102 L43.8536281,12.9100704 C43.7701516,13.2024994 43.7179787,13.4218212 43.6971096,13.5680357 C43.6762405,13.6515868 43.6762405,13.7455818 43.6971096,13.8500207 L43.759717,14.1633375 L43.7284133,14.9152978 C43.6866751,15.1032878 43.6553714,15.280834 43.6345022,15.4479363 L43.6345022,15.8865798 L43.6031985,16.0119065 L43.6031985,16.1059015 L43.5718949,16.6072084 L43.5405912,17.0771835 L43.4779838,17.5471587 L43.4153764,18.0171338 C43.3736382,18.393114 43.3110308,18.7064307 43.2275543,18.9570842 L43.2275543,19.0824109 L42.9771247,21.400955 L42.9771247,22.2469103 L42.9145174,23.5628407 L42.9145174,23.6255041 L42.85191,23.5001774 L42.8206063,23.4061823 L42.7893026,23.0302022 C42.7684335,22.8630999 42.7371298,22.7377732 42.6953915,22.6542221 L42.5701768,22.0275885 L42.444962,21.4322867 C42.3614855,21.0980821 42.3093127,20.816097 42.2884435,20.5863314 C42.2675744,20.4610047 42.2362707,20.3252341 42.1945325,20.1790196 L42.0693177,19.8030394 L41.9441029,19.4270593 C41.9023647,19.2808448 41.8814956,19.1555181 41.8814956,19.0510792 C41.8814956,18.9048647 41.8606264,18.7064307 41.8188882,18.4557773 L41.7249771,17.8918071 L41.7249771,17.7978121 L41.6936734,17.7664804 C41.5684587,17.6202659 41.5162858,17.421832 41.537155,17.1711785 L41.5058513,16.9831885 L41.3493328,16.0119065 C41.3284637,15.9283553 41.3075946,15.8239164 41.2867254,15.6985897 L41.2554218,15.2912779 C41.2345526,14.9570733 41.2032489,14.7273077 41.1615107,14.601981 C41.1615107,14.5184299 41.130207,14.403547 41.0675996,14.2573326 L40.9423848,13.8500207 C40.8171701,13.4949284 40.7545627,13.244275 40.7545627,13.0980605 L40.6919553,12.7847437 L40.5980442,12.4714269 L40.5667406,12.2834369 C40.3789184,11.8447934 39.9511013,11.4374816 39.2832892,11.0615015 L38.9389486,10.9048431 L38.5633044,10.7481847 C38.3546131,10.6437458 38.1667909,10.6333019 37.9998379,10.716853 L37.6554973,10.8735114 L37.3424604,11.0615015 L37.1233346,11.1868282 L36.8102977,11.3434866 L36.7476903,11.4061499 C36.5807373,11.6568033 36.4659571,11.8552373 36.4033497,12.0014518 L36.1529202,12.659417 L35.9337943,13.3173822 C35.8503178,13.5053723 35.798145,13.8709085 35.7772759,14.4139909 L35.7459722,15.0406245 C35.7251031,15.2703901 35.704234,15.4374924 35.6833648,15.5419313 L35.5894538,16.1372332 L35.464239,16.7012034 C35.4016316,16.9936324 35.3494588,17.317393 35.3077205,17.6724854 L35.2451132,18.6124357 L35.2451132,19.6463811 L35.2138095,20.335678 L35.1825058,21.0249749 L35.0885947,22.8735438 L34.9946836,23.8761575 L34.9320762,24.8474395 L34.9007726,25.2234196 L34.8694689,25.5993998 C34.8068615,26.058931 34.7964269,26.7273401 34.8381652,27.6046271 C34.8799034,28.1685973 34.9007726,28.680348 34.9007726,29.1398793 L34.8381652,29.7665128 L34.7755578,30.4244781 C34.7755578,30.528917 34.7651232,30.6333559 34.7442541,30.7377948 L34.7129504,30.9884483 C34.6920813,31.1555505 34.6816467,31.3330967 34.6816467,31.5210868 C34.6607776,31.9388425 34.650343,32.2208276 34.650343,32.3670421 L34.8381652,33.056339 C34.8799034,33.1816657 34.9633799,33.244329 35.0885947,33.244329 L35.1825058,33.244329 L35.2764168,33.3383241 C35.3390242,33.442763 35.4329353,33.4845386 35.5581501,33.4636508 L35.6520611,33.4949824 L35.7459722,33.5576458 C35.9337943,33.6411969 36.0903128,33.6098653 36.2155276,33.4636508 L36.372046,33.2756607 L36.4972608,33.0876706 C36.5807373,32.9414561 36.6329101,32.7847978 36.6537792,32.6176955 C36.6537792,32.5759199 36.6642138,32.5341443 36.6850829,32.4923688 C36.7685594,32.3461543 36.7894286,32.1477203 36.7476903,31.8970669 C36.7268212,31.6881891 36.7268212,31.5628623 36.7476903,31.5210868 L36.778994,31.4270917 C36.7998631,31.3644284 36.8102977,31.2808772 36.8102977,31.1764383 L36.8102977,30.8631216 L36.778994,30.4871414 C36.7581249,30.3409269 36.7581249,30.2260441 36.778994,30.142493 C36.8624705,29.4949716 36.8729051,28.9518892 36.8102977,28.5132458 L36.778994,28.3565874 L36.778994,28.2312607 L36.6850829,26.5080184 C36.6642138,26.1111505 36.7059521,25.7351704 36.8102977,25.380078 L36.8729051,25.0040979 L36.9668161,23.5628407 L37.0920309,21.2442966 L37.185942,20.1476879 L37.3111567,19.1137425 C37.3111567,18.9884158 37.352895,18.9257525 37.4363715,18.9257525 C37.519848,18.9257525 37.5824554,18.9884158 37.6241936,19.1137425 L37.9685342,20.8683165 L38.1563564,21.9649252 L38.3441785,22.9362072 L38.4380896,23.343519 L38.500697,23.7508308 L38.6259117,24.3461327 L38.7511265,24.9727662 L39.1580745,26.9779936 L39.2519856,27.416637 L39.3458966,27.8239488 C39.3667658,27.9910511 39.3980694,28.1790412 39.4398077,28.387919 L39.5650225,28.9518892 L39.8467557,29.8605079 L39.9406667,30.1738246 L40.0345778,30.5184731 C40.1597926,30.7900143 40.316311,31.0928872 40.5041332,31.4270917 L41.0675996,32.3043787 L41.3806365,32.8056855 L41.6936734,33.3069924 C41.7980191,33.4949824 41.9545375,33.5889775 42.1632288,33.5889775 C42.1840979,33.5889775 42.2571399,33.5994214 42.3823546,33.6203092 L42.5388731,33.6516408 L42.6953915,33.6829725 C43.0292976,33.7665237 43.2275543,33.7978553 43.2901616,33.7769675 Z M55.905549,33.4323191 C56.2811932,33.4323191 56.6255338,33.3174363 56.9385707,33.0876706 L57.2829113,32.8056855 C57.4289952,32.7012466 57.5750791,32.6281394 57.721163,32.5863638 C57.8672469,32.5237005 57.9715925,32.4610371 58.0341999,32.3983737 L58.3159331,32.085057 L58.62897,31.7404085 C58.7124465,31.6359696 58.8167922,31.5628623 58.9420069,31.5210868 C59.1298291,31.4166479 59.2654784,31.2704334 59.3489549,31.0824433 L59.849814,29.7665128 L59.9750287,29.4218644 L60.3193693,28.2625923 L60.5697989,27.3539737 L60.5697989,26.9466619 C60.5697989,26.8004474 60.5593643,26.6855646 60.5384952,26.6020134 C60.517626,26.4766867 60.4758878,26.3826917 60.4132804,26.3200283 C60.3298039,26.2364772 60.2254583,26.1738138 60.1002435,26.1320383 L59.7245992,26.1320383 L59.7245992,26.1320383 C59.3698241,26.1529261 59.10896,26.2469211 58.9420069,26.4140234 L58.7854885,26.5706818 L58.6602737,26.7586718 L58.535059,26.8839985 L58.4411479,27.0093252 L58.3472368,27.2599787 L58.2220221,27.7612855 L58.0968073,28.199929 L57.9402888,28.6385725 L57.721163,29.0772159 L57.5020372,29.4845277 C57.2516077,29.9022834 56.9177016,30.2469319 56.5003191,30.5184731 C56.3333661,30.5184731 56.1455439,30.5498048 55.9368526,30.6124681 L55.4046899,30.8004582 C55.258606,30.8631216 55.1229567,30.8840093 54.9977419,30.8631216 C54.4342755,30.821346 53.9960238,30.5498048 53.6829869,30.0484979 C53.4742957,29.7142934 53.3595155,29.4009766 53.3386463,29.1085476 C53.3386463,28.9832209 53.3073426,28.8683381 53.2447353,28.7638992 C53.0986514,28.4088068 52.9525675,27.8866122 52.8064836,27.1973153 L52.7438762,26.6333451 L52.6499651,26.0693749 L52.5873578,25.3174147 C52.5664886,25.0040979 52.5247504,24.7534445 52.462143,24.5654544 L52.462143,23.1868606 C52.462143,23.0615339 52.4725776,22.9466511 52.4934467,22.8422121 C52.5560541,22.6333343 52.5664886,22.466232 52.5247504,22.3409053 C52.4830121,22.173803 52.4830121,21.985813 52.5247504,21.7769351 L52.5247504,21.5889451 L52.5873578,21.0249749 C52.6082269,20.7952092 52.6395306,20.6072192 52.6812688,20.4610047 L52.8064836,20.0850245 L52.8377873,19.7717078 L52.9003947,19.458391 L52.963002,19.2077376 L53.0256094,18.9257525 L53.1195205,18.487109 L53.1821279,18.0484655 L53.2447353,17.609822 L53.3386463,17.2025102 L53.4951648,16.5758767 L53.5890759,16.1998966 L53.7142906,15.8552481 C53.7560289,15.6045947 53.8186362,15.4270485 53.9021128,15.3226096 L53.9960238,15.1659512 L54.0586312,15.0092928 L54.1212386,14.7899711 L54.2151497,14.601981 L54.3716681,14.2573326 L54.5281866,13.9440158 C54.590794,13.7351379 54.6951396,13.5575918 54.8412235,13.4113773 L54.9351345,13.3487139 L54.9977419,13.2860506 L55.1229567,13.1920555 C55.2064332,13.1085044 55.2899097,13.0353971 55.3733862,12.9727338 C55.4777319,12.9100704 55.5820775,12.8891826 55.6864231,12.9100704 C56.166413,12.951846 56.5420573,13.0980605 56.813356,13.3487139 L57.0011781,13.536704 C57.0846546,13.5993673 57.1681311,13.6620307 57.2516077,13.724694 L57.4394298,13.8500207 L57.5959482,14.0066791 C57.721163,14.1111181 57.8776815,14.2260009 58.0655036,14.3513276 C58.128111,14.3931032 58.2220221,14.4453226 58.3472368,14.507986 L58.4411479,14.5393177 L58.5663627,14.5706493 C58.62897,14.5497615 58.7124465,14.4870982 58.8167922,14.3826593 C58.9002687,14.2782203 58.9420069,14.1946692 58.9420069,14.1320058 C58.9211378,14.0066791 58.8793996,13.8813524 58.8167922,13.7560257 L58.7228811,13.5993673 L58.6915774,13.4740406 C58.6498392,13.3487139 58.6081009,13.244275 58.5663627,13.1607238 L58.4724516,13.0040655 L58.3472368,12.8160754 C58.2637603,12.6489731 58.1489801,12.4923147 58.0028962,12.3461002 C57.3350842,11.8030178 56.7611832,11.4479255 56.2811932,11.2808232 C55.7177268,11.0928331 55.1333913,11.0301698 54.5281866,11.0928331 L54.4342755,11.0615015 C54.1629768,11.0197259 53.943851,11.0510576 53.776898,11.1554965 L53.0569131,11.5628083 L52.7751799,11.7507984 L52.462143,11.9387884 C52.3577974,11.980564 52.2743208,12.0536712 52.2117135,12.1581102 L51.9925876,12.5027586 L51.7421581,12.8474071 L51.3039064,13.4740406 L50.8656548,14.1006742 L50.5213142,14.7899711 L50.239581,15.4479363 C50.0100206,15.9492431 49.8535021,16.4714378 49.7700256,17.0145202 L49.6761145,17.421832 L49.5508998,17.8291438 L49.3630776,18.5497724 L49.1752555,19.3017326 L49.0813444,19.7717078 L49.018737,20.2730146 L48.9561296,20.4923363 L48.8935223,20.6803264 L48.8309149,21.2756283 C48.8030894,21.4288054 48.7752639,21.5680573 48.7474384,21.693384 L48.7057001,21.8709302 L48.6743964,22.9048755 L48.6430927,23.9074892 L48.6430927,24.8161078 L48.6743964,25.7560581 L48.7057001,25.8500532 L48.7683075,26.2886967 L48.8309149,26.7586718 L48.924826,27.1659836 L49.018737,27.6046271 L49.3004702,28.6699041 L49.6135071,29.7665128 C49.6969837,30.0171663 49.8221984,30.2782636 49.9891514,30.5498048 L50.3021883,30.9257849 L50.6465289,31.301765 L51.0221732,31.7404085 L51.4291212,32.1163886 C51.5960742,32.2626031 51.7525927,32.377486 51.8986766,32.4610371 C52.0238913,32.5445882 52.1908443,32.6176955 52.3995356,32.6803588 L52.9316983,32.8683489 L53.9960238,33.244329 L54.3403644,33.3696557 C54.4655792,33.4114313 54.5803594,33.4218752 54.684705,33.4009874 C54.851658,33.3800996 55.0499147,33.3800996 55.2794751,33.4009874 L55.905549,33.4323191 Z M72.903453,33.8709626 L73.4982231,33.3696557 L73.5295268,33.2756607 L73.5295268,32.8996806 C73.4877885,32.1477203 73.3625738,31.5837501 73.1538825,31.20777 L72.9660603,30.8631216 L72.8095419,30.5184731 L72.5591124,29.9545029 L72.2773791,29.4218644 L71.9017349,28.7952308 L71.4947869,28.1685973 L71.0252315,27.4479687 L70.5869799,26.7273401 L69.460047,25.2234196 C69.3139631,25.0145418 69.1991829,24.8056639 69.1157064,24.5967861 L69.053099,24.2521376 L69.0217953,23.9074892 C68.9800571,23.7612747 69.0217953,23.6463919 69.1470101,23.5628407 L69.460047,23.343519 L69.7730839,23.0928656 L70.5869799,22.466232 L70.7121946,22.3409053 L70.8687131,22.2155786 C71.0356661,22.0902519 71.2443574,21.9022618 71.4947869,21.6516084 L71.7765201,21.3382916 L72.089557,21.0563065 L72.1521644,20.9623115 C72.4652013,20.5027802 72.6738926,20.0119173 72.7782382,19.4897227 L72.8408456,19.1450742 L72.9347566,18.7690941 C72.997364,18.4975529 73.0286677,18.2573434 73.0286677,18.0484655 L73.0912751,17.609822 L73.1538825,17.1398469 L73.1851862,16.8265301 L73.1851862,16.4818816 C73.164317,16.1267893 73.070406,15.6359264 72.903453,15.0092928 C72.8617147,14.8630783 72.7782382,14.6750883 72.6530234,14.4453226 L72.5278087,14.1633375 L72.4025939,13.8813524 L72.3086828,13.7560257 L71.6200016,12.9414021 C71.2026191,12.4609831 70.7852366,12.1372224 70.367854,11.9701201 L70.2113356,11.8761251 C69.7313456,11.5210327 69.1678792,11.2181599 68.5209363,10.9675064 C67.9366007,10.7377408 67.4566108,10.6646336 67.0809665,10.7481847 L66.9557517,10.716853 C66.7470605,10.6959652 66.4653273,10.7586286 66.1105521,10.9048431 L65.8601226,10.9675064 L65.609693,11.0301698 C65.5679548,11.0510576 65.5053474,11.0615015 65.4218709,11.0615015 L65.2027451,11.0301698 C65.0357921,10.9883942 64.9105773,10.9883942 64.8271008,11.0301698 C64.6601478,11.1137209 64.5244984,11.1450526 64.4201528,11.1241648 C64.3158072,11.103277 64.201027,11.0928331 64.0758122,11.0928331 L63.7627753,11.0928331 C63.4914766,11.0928331 63.2723508,11.0719454 63.1053978,11.0301698 C63.1053978,11.0301698 63.0427904,11.0197259 62.9175757,10.9988381 L62.7297535,10.9988381 L62.5732351,10.9675064 C62.5106277,10.9675064 62.2915018,11.0406137 61.9158576,11.1868282 C61.7906428,11.2494915 61.6758626,11.301711 61.571517,11.3434866 C61.4463022,11.4061499 61.3836948,11.4374816 61.3836948,11.4374816 C61.3628257,11.5419205 61.3419566,11.9074568 61.3210874,12.5340903 C61.2793492,13.2024994 61.2793492,13.6098112 61.3210874,13.7560257 C61.3419566,13.9857914 61.3523911,14.2573326 61.3523911,14.5706493 L61.3210874,15.1659512 C61.3210874,15.4166046 61.331522,15.6150386 61.3523911,15.7612531 L61.3836948,16.5758767 L61.4463022,17.3905003 L61.4463022,17.7978121 L61.571517,18.7690941 L61.571517,19.1137425 L61.665428,19.9283662 L61.7593391,20.7429898 L61.8532502,21.6829401 L61.8845539,22.6228904 L61.9158576,22.9988705 L61.9784649,24.0328159 L62.0097686,25.5054047 L62.0097686,25.7247265 L62.0410723,25.9753799 L62.0410723,26.6646768 L62.072376,26.8213352 L62.072376,26.9466619 L62.1036797,27.8239488 C62.1036797,27.9283878 62.1141143,28.2521484 62.1349834,28.7952308 L62.1349834,29.1085476 L62.1662871,29.3905327 L62.1662871,29.7978445 L62.1662871,29.7978445 C62.1871562,30.4453659 62.2080253,31.009336 62.2288945,31.4897551 C62.2497636,31.7821841 62.312371,32.0015058 62.4167166,32.1477203 C62.5836696,32.377486 62.6775807,32.5968077 62.6984498,32.8056855 C62.6984498,32.8892367 62.7610572,33.0041195 62.886272,33.150334 C63.0114867,33.2756607 63.1053978,33.3278802 63.1680052,33.3069924 C63.2306126,33.2861046 63.3453928,33.2965485 63.5123458,33.3383241 L63.6688642,33.4323191 C63.7314716,33.4532069 63.7732099,33.4636508 63.794079,33.4636508 L63.8879901,33.4949824 L64.0132048,33.5263141 L64.1697233,33.5576458 L64.3262417,33.6203092 C64.4305874,33.6620847 64.5244984,33.7038603 64.6079749,33.7456359 L65.2966561,33.7456359 C65.3592635,33.7456359 65.5992585,33.6516408 66.016641,33.4636508 C66.1627249,33.4009874 66.3088088,33.3383241 66.4548927,33.2756607 C66.5801075,33.2129974 66.663584,33.1712218 66.7053222,33.150334 C66.830537,33.0876706 66.9244481,32.9832317 66.9870554,32.8370172 C67.1122702,32.5445882 67.1435739,32.1372764 67.0809665,31.6150818 L67.0496628,31.2391017 L67.0496628,30.8944532 C67.0705319,30.5393609 67.0600974,30.1111613 67.0183591,29.6098545 L67.0183591,29.0772159 L66.9244481,28.5132458 C66.9035789,28.2834801 66.9035789,28.0954901 66.9244481,27.9492756 L66.8931444,27.8552805 L66.8931444,27.7612855 L66.7992333,26.8213352 C66.9035789,26.7795596 67.0079246,26.737784 67.1122702,26.6960085 L67.1435739,26.7586718 L67.2061813,26.7900035 L67.6757366,27.4793004 L67.8322551,27.7299538 L67.9887735,27.9806072 C68.3018104,28.3983629 68.6983239,29.0249965 69.1783138,29.8605079 L69.3661359,30.2051563 C69.4496124,30.330483 69.5226544,30.434922 69.5852618,30.5184731 C69.7522148,30.7064632 69.8565604,30.8944532 69.8982987,31.0824433 L70.0235134,31.4270917 L70.1800319,31.8030719 C70.3261158,32.0955009 70.4095923,32.3357104 70.4304614,32.5237005 C70.4513305,32.6490272 70.5035033,32.7743539 70.5869799,32.8996806 L70.774802,33.2756607 C70.8165402,33.3592118 70.9104513,33.4323191 71.0565352,33.4949824 L71.2443574,33.5889775 L71.4008758,33.6829725 C71.5469597,33.7665237 71.682609,33.7978553 71.8078238,33.7769675 L71.9956459,33.8082992 L72.1521644,33.8082992 L72.3712902,33.8396309 C72.7260654,33.8605187 72.903453,33.8709626 72.903453,33.8709626 Z M66.7992333,22.1215836 L66.6740185,22.0902519 L66.5801075,22.0589202 C66.4966309,22.0171446 66.4548927,21.9649252 66.4548927,21.9022618 C66.4757618,21.7560473 66.4757618,21.5680573 66.4548927,21.3382916 L66.423589,21.0876382 L66.3922853,20.7743214 C66.3922853,20.6698825 66.3818507,20.5549997 66.3609816,20.429673 L66.2983742,20.2416829 C66.2775051,20.1581318 66.2670705,20.0745807 66.2670705,19.9910295 L66.2670705,19.7090444 L66.2357669,18.8317574 L66.2044632,18.2677873 L66.2357669,18.2677873 L66.1731595,17.5784904 L66.1731595,16.45055 L66.1418558,16.0432382 L66.0792484,15.1659512 L66.0792484,15.0092928 C66.183594,14.7586394 66.1627249,14.4244348 66.016641,14.0066791 C65.9749028,13.9440158 65.9644682,13.8709085 65.9853373,13.7873574 L66.0792484,13.5680357 L66.1105521,13.4113773 L66.1731595,13.2547189 L66.1731595,13.1293922 L66.2044632,13.0040655 C66.2462014,12.9205143 66.3088088,12.857851 66.3922853,12.8160754 C66.7261913,12.6698609 67.0183591,12.659417 67.2687886,12.7847437 L67.6757366,13.0040655 L68.1139883,13.2233872 L68.4583289,13.4113773 C68.5626745,13.4949284 68.6983239,13.5889234 68.8652769,13.6933624 L69.1470101,13.9126841 L69.460047,14.1006742 C69.6896074,14.2468887 69.866995,14.403547 69.9922097,14.5706493 C70.2426393,14.8839661 70.4095923,15.374829 70.4930688,16.0432382 C70.5765453,16.6907595 70.6182835,17.3382808 70.6182835,17.9858022 C70.6391527,18.9466403 70.4721997,19.6672688 70.1174245,20.1476879 C70.0130789,20.2730146 69.8774295,20.4087852 69.7104765,20.5549997 L69.2409212,20.9309798 C68.9904916,21.1189699 68.5313708,21.3696233 67.8635588,21.6829401 C67.2166158,21.9962569 66.8618407,22.1424714 66.7992333,22.1215836 Z M81.6684863,33.7769675 C81.6893555,33.7769675 81.8354393,33.7560798 82.106738,33.7143042 L82.4197749,33.6516408 C82.5032514,33.6307531 82.5658588,33.6203092 82.607597,33.6203092 C82.6702044,33.6203092 82.7536809,33.5994214 82.8580266,33.5576458 L82.9832413,33.5263141 L83.0771524,33.4949824 C83.4110584,33.3905435 83.661488,33.3069924 83.828441,33.244329 L84.5797296,32.8683489 L84.7675517,32.8056855 C84.8301591,32.76391 84.8718973,32.7221344 84.8927665,32.6803588 C85.0179812,32.6176955 85.1327614,32.5132566 85.2371071,32.3670421 C85.3205836,32.3043787 85.3831909,32.2417154 85.4249292,32.179052 L85.6127513,31.8657352 L85.8005735,31.5210868 L85.8631809,31.3957601 L85.9570919,31.301765 C86.0196993,31.1973261 86.0614376,31.113775 86.0823067,31.0511116 L86.1449141,30.8944532 L86.2075215,30.7064632 L86.457951,29.9858346 L86.457951,29.8605079 C86.8753335,28.9414453 87.1570667,28.1372656 87.3031506,27.4479687 C87.532711,26.445355 87.5953184,25.087649 87.4909728,23.3748507 L87.4283654,22.3409053 L87.365758,21.30696 C87.3240198,20.5341119 87.3240198,19.8552589 87.365758,19.2704009 C87.3866271,19.165962 87.3761926,19.0197475 87.3344543,18.8317574 C87.3135852,18.685543 87.2822815,18.4975529 87.2405433,18.2677873 C87.1153285,17.7664804 87.0527211,17.4949392 87.0527211,17.4531636 C87.0944594,17.0354079 87.0735902,16.5549889 86.9901137,16.0119065 C86.864899,15.3226096 86.6457731,14.6646444 86.3327362,14.0380108 L86.2701288,13.630699 L86.2388252,13.4740406 L86.2075215,13.3173822 C86.1866523,13.2129433 86.124045,13.1293922 86.0196993,13.0667288 L85.9883956,13.0040655 L85.9570919,12.9414021 L85.8005735,12.7220804 L85.644055,12.565422 C85.5814477,12.4818708 85.550144,12.4192075 85.550144,12.3774319 C85.4666675,12.1058907 85.2892799,11.8761251 85.0179812,11.688135 L84.8301591,11.4688133 L84.6736406,11.2808232 C84.6319024,11.1972721 84.5797296,11.1450526 84.5171222,11.1241648 C84.2040853,10.9361748 83.8806138,10.8421797 83.5467078,10.8421797 L83.2336709,10.810848 L82.920634,10.7795164 L82.7328118,10.7795164 L82.513686,10.7481847 C82.3676021,10.7690725 82.2423873,10.810848 82.1380417,10.8735114 L82.0754343,10.9048431 L81.9815232,10.9361748 L81.6058789,11.0615015 L81.198931,11.1868282 L80.8858941,11.2808232 L80.5728572,11.4061499 C80.3224276,11.4897011 80.1241709,11.59414 79.978087,11.7194667 L79.9467833,11.7507984 L79.9154797,11.7507984 C79.5398354,11.8761251 79.2476676,12.0641151 79.0389763,12.3147686 C78.8511542,12.5236464 78.6111592,12.6907487 78.3189914,12.8160754 C78.2563841,12.8369632 78.1937767,12.8787388 78.1311693,12.9414021 L77.4737918,13.536704 L77.3172733,13.6620307 L77.1607549,13.8186891 L76.9729327,14.0693425 C76.9103254,14.1528936 76.8685871,14.2364448 76.847718,14.3199959 C76.8268488,14.403547 76.7851106,14.4975421 76.7225032,14.601981 L76.5659848,14.8526344 L76.5659848,14.9779611 L76.5346811,15.0719562 L76.4720737,15.1659512 C76.4303354,15.2077268 76.3990317,15.2599462 76.3781626,15.3226096 L76.3155552,15.5105996 L76.2529479,15.6985897 L76.1903405,15.8552481 L75.9399109,16.4818816 L75.8146962,16.8578618 L75.5642667,17.421832 C75.5225284,17.609822 75.4390519,17.902251 75.3138371,18.2991189 C75.1886224,18.7168746 75.0947113,19.0510792 75.0321039,19.3017326 L74.9694965,19.552386 L74.9068892,19.8343711 C74.8442818,20.0223612 74.8234126,20.1894635 74.8442818,20.335678 L74.8442818,20.3983413 L74.8442818,20.3983413 C74.7816744,20.4818925 74.7503707,20.5758875 74.7503707,20.6803264 L74.7503707,20.9936432 L74.6564596,22.0589202 L74.5938522,23.1555289 L74.5938522,23.4061823 L74.5625486,23.6255041 L74.5625486,24.5654544 L74.5938522,25.1294246 L74.6564596,25.6307314 L74.719067,26.1633699 C74.719067,26.7064524 74.7608053,27.1033203 74.8442818,27.3539737 L74.9068892,27.6359588 L74.9381928,27.8866122 C74.9381928,28.0537145 74.9799311,28.2625923 75.0634076,28.5132458 L75.1886224,28.8265625 L75.2825334,29.1398793 L75.3451408,29.4845277 L75.4390519,29.8291762 C75.5016593,30.1007174 75.5851358,30.330483 75.6894814,30.5184731 C75.7103505,30.7273509 75.7833925,30.9362288 75.9086073,31.1451066 L76.0651257,31.3330967 L76.1903405,31.5210868 L76.3468589,31.6777452 L76.5346811,31.8030719 C76.5972884,31.8448474 76.680765,31.9179547 76.7851106,32.0223936 L77.0355401,32.273047 C77.181624,32.377486 77.3381425,32.471481 77.5050955,32.5550321 L77.7242213,32.6803588 L77.9746508,32.8056855 L78.2250804,32.9623439 L78.5068136,33.150334 L78.6320283,33.2129974 L79.7276575,33.4949824 L79.884176,33.5263141 L80.0406944,33.5576458 L80.2911239,33.6203092 L80.5728572,33.6829725 L80.9171978,33.7456359 L80.9798051,33.7456359 L81.0737162,33.7769675 L81.6684863,33.7769675 Z M81.6371826,30.5184731 L81.5119679,30.4871414 L81.3554494,30.4558097 L81.2615383,30.4558097 L81.0737162,30.3931464 L80.9798051,30.3618147 C80.8545904,30.3409269 80.7293756,30.2678197 80.6041608,30.142493 C80.4998152,30.0171663 80.4267733,29.8918396 80.385035,29.7665128 L80.3224276,29.5785228 L80.2285166,29.4218644 C80.1659092,29.2756499 80.1346055,29.2025427 80.1346055,29.2025427 C80.1554746,29.1189915 80.1450401,29.0145526 80.1033018,28.8892259 L80.0719981,28.7325675 L80.0406944,28.6072408 C80.0406944,28.586353 80.0302599,28.5550213 80.0093907,28.5132458 L79.9467833,28.3565874 C79.884176,28.2103729 79.8528723,28.1059339 79.8528723,28.0432706 L79.8215686,27.8552805 L79.7902649,27.6986221 C79.7276575,27.5732954 79.6963538,27.4688565 79.6963538,27.3853054 C79.6754847,26.9048863 79.6128773,26.549794 79.5085317,26.3200283 C79.4667934,26.1947016 79.4354897,26.0484871 79.4146206,25.8813849 L79.4146206,25.4427414 L79.3833169,25.1294246 L79.3207095,24.7847761 L79.2894058,24.0641476 L79.2894058,23.343519 L79.3207095,22.7795488 L79.3520132,22.2155786 L79.3833169,21.6516084 L79.4146206,21.0876382 L79.477228,20.6176631 C79.4980971,20.429673 79.5398354,20.2730146 79.6024427,20.1476879 L79.6963538,19.7403761 L79.8215686,19.3330643 L79.9154797,19.0197475 L80.0406944,18.7377624 C80.0824327,18.6124357 80.1659092,18.3200067 80.2911239,17.8604755 C80.3328622,17.6933732 80.3746004,17.515827 80.4163387,17.3278369 C80.458077,17.1816224 80.4893806,17.0562957 80.5102498,16.9518568 L80.5102498,16.8891935 L80.5102498,16.8891935 L80.5415535,16.7012034 C80.5624226,16.5341011 80.5832917,16.4087744 80.6041608,16.3252233 L80.6980719,16.0432382 L80.791983,15.6985897 C80.8754595,15.4479363 80.958936,15.2495023 81.0424125,15.1032878 C81.1676273,14.8735222 81.3137112,14.6750883 81.4806642,14.507986 L81.6684863,14.2886642 L81.8876122,14.0380108 C81.9293504,13.9753475 82.0336961,13.8813524 82.2006491,13.7560257 L82.3884712,13.630699 L82.5449897,13.5053723 C82.5658588,13.4635967 82.6493353,13.4218212 82.7954192,13.3800456 L82.9832413,13.3173822 L83.1084561,13.2547189 C83.2128017,13.2129433 83.3171474,13.2129433 83.421493,13.2547189 L83.5467078,13.3487139 C83.588446,13.3696017 83.6301843,13.4009334 83.6719225,13.4427089 L83.828441,13.5993673 C83.9745249,13.7455818 84.0684359,13.8813524 84.1101742,14.0066791 C84.4440802,14.5706493 84.6840752,15.2286146 84.8301591,15.9805748 C84.8927665,16.252116 84.9449393,16.5967645 84.9866775,17.0145202 L85.1118923,18.0484655 C85.6962279,22.8317683 85.4562329,26.5184623 84.3919074,29.1085476 L84.3293,29.2338743 L84.2666926,29.3905327 C84.2249544,29.4949716 84.1727816,29.5680789 84.1101742,29.6098545 L83.9536557,29.7978445 C83.8910484,29.8605079 83.828441,29.9127273 83.7658336,29.9545029 L83.6406188,30.0484979 L83.5154041,30.142493 C83.4319276,30.2051563 83.3380165,30.2573758 83.2336709,30.2991514 C83.1919326,30.2991514 83.1188907,30.3200391 83.014545,30.3618147 L82.8267229,30.3931464 L82.6702044,30.4244781 C82.5658588,30.4662536 82.4093403,30.4975853 82.2006491,30.5184731 L81.9189159,30.5184731 C81.8354393,30.5393609 81.7415283,30.5393609 81.6371826,30.5184731 Z M94.6282142,33.4323191 L94.9412511,33.3069924 L95.2855917,33.2129974 C95.4734139,33.1921096 95.6508015,33.0772268 95.8177545,32.8683489 C96.0055766,32.5968077 96.1203568,32.3357104 96.1620951,32.085057 L96.2247025,31.8970669 L96.2873098,31.6777452 L96.3499172,31.4897551 L96.3812209,31.301765 L96.4125246,29.265206 L96.4438283,28.8578942 L96.475132,28.4819141 L96.475132,27.6359588 L96.5377394,26.7586718 C96.5586085,26.0484871 96.5586085,25.4845169 96.5377394,25.0667612 L96.5377394,24.1894743 C96.5377394,23.729943 96.5794776,23.3539629 96.6629541,23.0615339 L96.7255615,22.9362072 L96.7568652,22.7795488 C96.7986035,22.4035687 96.88208,21.9440374 97.0072947,21.400955 L97.1638132,20.7429898 L97.3516353,20.0536929 L97.6959759,18.5184407 L97.7585833,18.2364556 L98.1655313,16.7951984 L98.2281387,16.4818816 L98.290746,16.1998966 L98.3846571,15.7299214 C98.4055262,15.6045947 98.4576991,15.374829 98.5411756,15.0406245 C98.6246521,14.6646444 98.7081286,14.2782203 98.7916051,13.8813524 C99.0420346,12.857851 99.2194222,12.2625491 99.3237678,12.0954468 L99.4176789,11.8761251 L99.4802863,11.6568033 C99.4802863,11.59414 99.4698517,11.5001449 99.4489826,11.3748182 C99.4281135,11.2494915 99.3968098,11.1554965 99.3550715,11.0928331 C99.3342024,11.0510576 99.271595,11.009282 99.1672494,10.9675064 L99.0420346,10.9048431 L98.9481235,10.8735114 C98.6142175,10.6646336 98.3011806,10.6541897 98.0090128,10.8421797 C97.9046672,10.9048431 97.8107561,11.009282 97.7272796,11.1554965 L97.6333685,11.3121549 L97.5394575,11.5001449 L97.1012058,12.2521052 C97.0385984,12.3774319 96.8925145,12.9309582 96.6629541,13.9126841 L96.5377394,14.4766543 C96.4960011,14.6855321 96.4542629,14.8421905 96.4125246,14.9466295 C96.3499172,15.280834 96.2977444,15.479268 96.2560062,15.5419313 L96.1620951,15.9179115 C96.0368803,16.4609939 95.9429692,16.930969 95.8803619,17.3278369 L95.6925397,18.393114 L95.4734139,19.1764059 C95.4525448,19.2808448 95.4212411,19.3539521 95.3795028,19.3957276 C95.2542881,19.6046055 95.1499424,19.5941616 95.0664659,19.364396 L95.0038585,19.2077376 L94.9725548,19.0197475 L94.8160364,18.393114 L94.6595179,17.7978121 C94.5551723,17.4636075 94.4925649,17.1816224 94.4716958,16.9518568 L94.2838736,15.9805748 C94.2630045,15.9179115 94.1899626,15.7194775 94.0647478,15.3852729 C94.0230096,15.2599462 93.9604022,15.092844 93.8769257,14.8839661 L93.6891035,14.3513276 C93.3343284,13.3904895 93.1465062,12.8474071 93.1256371,12.7220804 C93.0421606,12.1581102 92.8230347,11.7612423 92.4682596,11.5314766 L92.0926153,11.2808232 L91.716971,11.0301698 C91.4874106,10.8839553 91.2474157,10.810848 90.9969861,10.810848 L90.4648234,10.7795164 L89.9326606,10.7481847 L89.6822311,10.7481847 L89.4004979,10.810848 L89.2439795,10.8421797 L89.1187647,10.8735114 C88.9100734,10.8317358 88.7118167,10.8943992 88.5239946,11.0615015 C88.3987798,11.1868282 88.2944342,11.395706 88.2109577,11.688135 C88.106612,11.9596762 88.0857429,12.1894419 88.1483503,12.3774319 C88.1692194,12.4400953 88.2631305,12.6907487 88.4300835,13.1293922 C88.51356,13.3591578 88.5761674,13.5575918 88.6179056,13.724694 L88.8370315,14.3513276 C88.9526143,14.6919592 89.0533789,14.9910623 89.1393251,15.2486372 L89.2571307,15.6038531 C89.3816046,15.9819344 89.4606973,16.232835 89.494409,16.3565549 L89.6822311,17.0771835 C89.7239694,17.3278369 89.7970113,17.6307098 89.901357,17.9858022 L90.1204828,18.8630891 L90.3709123,19.7403761 L90.5900382,20.5863314 L90.7465566,21.2129649 C90.8300331,21.4427306 90.9135096,21.6307206 90.9969861,21.7769351 L91.0595935,21.9022618 L91.1222009,22.0589202 C91.2682848,22.6855538 91.4352378,23.2286362 91.6230599,23.6881674 L91.716971,23.9074892 L91.8108821,24.1581426 C91.8734895,24.3461327 91.9360968,24.502791 91.9987042,24.6281178 C91.9778351,25.4845169 91.9778351,26.1320383 91.9987042,26.5706818 L91.9987042,27.2599787 L91.9674005,27.9806072 L91.9674005,29.6411861 C91.9674005,29.7874006 91.956966,29.9231712 91.9360968,30.0484979 L91.9360968,30.1738246 L91.9360968,30.1738246 L92.0613116,31.2704334 L92.123919,31.5210868 C92.1447881,31.6046379 92.1656572,31.6777452 92.1865264,31.7404085 L92.4682596,32.2103837 L92.6873854,32.7116905 C92.7499928,32.857905 92.8230347,32.9519 92.9065113,32.9936756 L93.4699777,33.1816657 L94.3777847,33.4009874 C94.4821303,33.4218752 94.5656069,33.4323191 94.6282142,33.4323191 Z M101.076775,33.9022943 C101.201989,33.8605187 101.306335,33.7665237 101.389811,33.6203092 C101.619372,33.4740947 101.723717,33.2338851 101.702848,32.8996806 L101.734152,32.8056855 C101.734152,32.5968077 101.723717,32.3461543 101.702848,32.0537253 L101.608937,31.3330967 L101.515026,30.6124681 L101.389811,29.5471911 L101.358508,28.9205576 L101.2959,28.3252557 C101.254162,27.9075 101.254162,27.5941832 101.2959,27.3853054 C101.316769,27.1555397 101.43155,27.0719886 101.640241,27.1346519 L101.702848,27.1659836 L102.328922,27.322642 L102.954996,27.5106321 L103.455855,27.6046271 L103.92541,27.6986221 C104.092363,27.7403977 104.301055,27.7717294 104.551484,27.7926172 L105.177558,27.8552805 L106.241883,27.8866122 L107.337513,27.8866122 L107.99489,27.8552805 C108.24532,27.8552805 108.464445,27.813505 108.652268,27.7299538 C108.798352,27.6881782 108.881828,27.7508416 108.902697,27.9179439 L108.965305,28.7012358 C108.986174,28.8892259 109.048781,29.0354404 109.153127,29.1398793 C109.257472,29.2234304 109.32008,29.3487571 109.340949,29.5158594 C109.403556,29.8291762 109.43486,30.142493 109.43486,30.4558097 C109.455729,30.7064632 109.497467,30.9988922 109.560075,31.3330967 L109.747897,32.2103837 L109.7792,32.3357104 L109.810504,32.3670421 C109.852242,32.5550321 109.893981,32.7012466 109.935719,32.8056855 C109.998326,32.9519 110.081803,33.0667829 110.186148,33.150334 C110.290494,33.2338851 110.478316,33.2965485 110.749615,33.3383241 C111.271343,33.4009874 111.803506,33.4323191 112.346103,33.4323191 C112.596533,33.4532069 112.794789,33.442763 112.940873,33.4009874 C113.170434,33.3592118 113.347821,33.2652168 113.473036,33.1190023 C113.556512,33.0145634 113.629554,32.8683489 113.692162,32.6803588 C113.775638,32.4505932 113.806942,32.1999398 113.786073,31.9283986 C113.786073,31.8030719 113.775638,31.6986329 113.754769,31.6150818 L113.660858,31.0511116 L113.535643,30.4871414 L113.410429,29.5785228 L113.379125,29.1085476 L113.316518,28.6699041 L113.285214,28.4505824 L113.25391,28.2625923 L113.25391,26.8839985 L113.222606,26.5706818 C113.180868,26.3200283 113.159999,26.1320383 113.159999,26.0067116 C113.180868,25.7978337 113.180868,25.5471803 113.159999,25.2547513 L113.066088,24.502791 L113.003481,23.9388209 C112.982611,23.729943 112.972177,23.5419529 112.972177,23.3748507 L112.972177,23.0928656 L112.940873,22.8108805 L112.90957,22.0902519 C112.90957,22.0693641 112.899135,22.0380324 112.878266,21.9962569 L112.846962,21.8709302 C112.805224,21.7664912 112.784355,21.6829401 112.784355,21.6202767 L112.784355,21.1189699 C112.721747,20.8683165 112.680009,20.5758875 112.65914,20.2416829 L112.65914,20.2103513 L112.408711,18.9570842 L112.346103,18.6750991 L112.314799,18.393114 C112.314799,17.7664804 112.252192,17.2756175 112.126977,16.9205251 L112.095674,16.8578618 L112.06437,16.7638667 C112.06437,16.5758767 111.991328,16.3669988 111.845244,16.1372332 C111.824375,16.1163454 111.793071,15.9805748 111.751333,15.7299214 L111.720029,15.4166046 L111.688726,15.2599462 L111.688726,15.1346195 L111.626118,14.9466295 L111.532207,14.7273077 C111.448731,14.3722154 111.302647,14.0693425 111.093955,13.8186891 C110.947872,13.630699 110.822657,13.4009334 110.718311,13.1293922 C110.572227,12.8160754 110.269625,12.4400953 109.810504,12.0014518 L109.747897,11.9701201 L109.685289,11.9387884 L109.466164,11.78213 L109.247038,11.6568033 L109.059216,11.5314766 L108.401838,11.2494915 C108.276623,11.1868282 108.151409,11.1450526 108.026194,11.1241648 L107.40012,11.0301698 L107.14969,10.9988381 L106.930565,10.9675064 C106.742743,10.9675064 106.586224,10.9988381 106.461009,11.0615015 C106.419271,11.0823893 106.367098,11.0823893 106.304491,11.0615015 C106.221014,11.0406137 106.127103,11.0510576 106.022758,11.0928331 L105.772328,11.1554965 L105.427987,11.2808232 L105.083647,11.4374816 L104.833217,11.5001449 L104.614092,11.59414 C104.217578,11.8030178 103.894107,12.0536712 103.643677,12.3461002 C103.497593,12.5340903 103.309771,12.8160754 103.080211,13.1920555 L102.861085,13.5993673 C102.756739,13.7455818 102.662828,13.8709085 102.579352,13.9753475 L102.548048,14.0380108 L102.516744,14.1006742 L102.39153,14.3513276 L102.266315,14.601981 C102.161969,14.8108589 102.068058,14.9675172 101.984582,15.0719562 C101.921974,15.1137317 101.869801,15.1972829 101.828063,15.3226096 L101.796759,15.4479363 L101.734152,15.573263 C101.525461,15.8865798 101.327204,16.2834477 101.139382,16.7638667 L100.888952,17.515827 C100.784607,17.7873682 100.711565,18.0380216 100.669827,18.2677873 L100.544612,18.8944208 L100.388093,19.6463811 L100.262879,20.3983413 L100.137664,21.1189699 L100.043753,21.8395985 L99.7933232,23.5001774 C99.7724541,23.6463919 99.8037578,23.7717186 99.8872343,23.8761575 L99.918538,23.9701525 L99.9498416,24.0641476 L99.8872343,24.6594494 L99.8246269,24.9727662 L99.7933232,25.286083 C99.7933232,25.6411753 99.8037578,25.9127165 99.8246269,26.1007066 C99.8663651,26.3304722 99.8767997,26.643789 99.8559306,27.0406569 L99.8246269,27.4793004 L99.8246269,28.5759091 L99.9811453,30.2678197 L100.075056,31.9283986 L100.137664,32.5550321 C100.179402,32.7847978 100.22114,32.9936756 100.262879,33.1816657 C100.325486,33.4114313 100.419397,33.5785336 100.544612,33.6829725 C100.690696,33.8709626 100.868083,33.9440698 101.076775,33.9022943 Z M108.777482,26.4766867 L108.558357,26.445355 L108.401838,26.4140234 L108.120105,26.3826917 L107.869675,26.35136 L107.055779,26.2886967 L106.241883,26.2260333 L105.866239,26.1633699 L105.521899,26.0693749 L104.332358,25.8187215 L104.019321,25.7247265 L103.737588,25.6307314 C103.069776,25.4009658 102.401964,25.2965269 101.734152,25.3174147 C101.483722,25.3383024 101.368942,25.2234196 101.389811,24.9727662 L101.515026,23.6255041 L101.640241,22.3095736 L101.765456,21.6829401 L101.828063,21.2129649 L101.828063,21.0563065 C101.869801,20.9727554 101.901105,20.8683165 101.921974,20.7429898 L101.953278,20.4610047 L101.984582,20.2416829 L102.047189,20.0536929 L102.203707,19.3330643 L102.360226,18.6124357 L102.454137,18.2677873 L102.579352,17.9544705 L102.829781,17.3278369 C103.121949,16.5967645 103.414117,16.0327943 103.706285,15.6359264 L104.050625,15.1346195 L104.363662,14.6646444 L104.52018,14.3826593 L104.676699,14.1320058 C104.739306,14.0275669 104.843652,13.9126841 104.989736,13.7873574 L105.334076,13.4740406 C105.459291,13.3904895 105.626244,13.33827 105.834935,13.3173822 C105.981019,13.2964944 106.085365,13.33827 106.147972,13.4427089 L106.304491,13.630699 L106.461009,13.8500207 C106.815784,14.3931032 107.045345,14.9048539 107.14969,15.3852729 L107.40012,16.2312282 L107.65055,17.1085152 L107.775764,17.6411537 L107.838372,18.2051239 L108.057498,19.552386 L108.24532,20.7116581 C108.307927,21.1711894 108.3601,21.5680573 108.401838,21.9022618 L108.495749,23.0615339 L108.620964,24.2521376 L108.777482,26.1633699 L108.777482,26.4766867 Z M119.452041,33.4009874 L119.639863,33.3383241 C119.72334,33.3174363 119.785947,33.2861046 119.827685,33.244329 C119.911162,33.1607779 120.005073,33.1398901 120.109418,33.1816657 C120.213764,33.2234412 120.307675,33.1712218 120.391152,33.0250073 L120.610277,32.7430222 C120.652016,32.6803588 120.725058,32.6699149 120.829403,32.7116905 C120.933749,32.7534661 121.079833,32.7952417 121.267655,32.8370172 L121.549388,32.8370172 C121.841556,32.9414561 122.2172,32.9519 122.676321,32.8683489 C123.031096,32.8056855 123.417175,32.7012466 123.834558,32.5550321 C124.272809,32.3879298 124.596281,32.2312715 124.804972,32.085057 L124.992794,31.9597303 C125.055402,31.9179547 125.09714,31.8761791 125.118009,31.8344035 C125.180616,31.7508524 125.264093,31.6673013 125.368438,31.5837501 L125.650172,31.3957601 C125.837994,31.2495456 125.963209,31.1242189 126.025816,31.0197799 C126.067554,30.9571166 126.109292,30.9048971 126.151031,30.8631216 C126.40146,30.6960193 126.557979,30.4140342 126.620586,30.0171663 C126.724932,30.0171663 126.797974,29.9753907 126.839712,29.8918396 L126.933623,29.7665128 L126.99623,29.6411861 L127.215356,29.2965377 C127.298833,29.1503232 127.36144,29.0249965 127.403178,28.9205576 L127.528393,28.5759091 L127.684912,28.2312607 C127.830995,28.001495 127.914472,27.7717294 127.935341,27.5419638 C127.95621,27.4375248 127.997948,27.322642 128.060556,27.1973153 C128.20664,26.8839985 128.300551,26.5915695 128.342289,26.3200283 L128.4362,25.5993998 L128.530111,24.7221128 L128.530111,24.408796 L128.561415,24.0641476 C128.603153,23.6672797 128.561415,23.2912995 128.4362,22.9362072 L128.404896,22.7482171 L128.373593,22.5915587 L128.310985,22.466232 L128.248378,22.3409053 L128.123163,22.1215836 L127.997948,21.9335935 L127.716215,21.5576134 L127.528393,21.2756283 L126.933623,20.429673 L126.714497,20.1476879 L126.526675,19.8970345 L126.338853,19.6777127 L126.119727,19.4897227 L125.900601,19.2704009 C125.775386,19.1032987 125.597999,18.9466403 125.368438,18.8004258 L124.523239,18.2677873 L124.116291,18.0171338 L123.709343,17.7664804 C123.54239,17.6829293 123.500652,17.5680465 123.584128,17.421832 C123.667605,17.2756175 123.740647,17.1189591 123.803254,16.9518568 L123.865861,16.7325351 C123.88673,16.6698717 123.897165,16.5967645 123.897165,16.5132133 L123.897165,16.45055 L123.959772,16.3565549 L124.02238,16.2312282 L124.053683,15.4479363 L124.053683,15.3852729 C124.011945,15.3226096 123.991076,15.2495023 123.991076,15.1659512 L123.991076,14.9152978 L123.959772,14.601981 L123.928469,14.2886642 C123.844992,13.9962352 123.698908,13.5680357 123.490217,13.0040655 L123.396306,12.8474071 L123.271091,12.659417 L123.145876,12.5027586 L123.020662,12.3461002 C122.937185,12.178998 122.759798,12.0223396 122.488499,11.8761251 C121.98764,11.5836961 121.465912,11.3434866 120.923314,11.1554965 L120.704189,11.1554965 L120.453759,11.1868282 L120.172026,11.1554965 L119.890293,11.1554965 C119.681601,11.1763843 119.504214,11.2390476 119.35813,11.3434866 C119.170308,11.4688133 118.99292,11.5105888 118.825967,11.4688133 L118.419019,11.3121549 L118.012071,11.1868282 L117.573819,11.0615015 L117.354694,11.0301698 L117.104264,10.9988381 L116.947746,11.1868282 C116.885138,11.2494915 116.822531,11.301711 116.759923,11.3434866 C116.530363,11.4479255 116.300803,11.6568033 116.071242,11.9701201 C116.029504,12.0118957 116.008635,12.0641151 116.008635,12.1267785 L116.008635,13.1607238 L115.977331,14.1320058 L115.977331,15.1032878 L116.039939,17.4531636 L116.071242,17.7351487 L116.102546,18.0171338 L116.165153,19.8030394 L116.227761,21.2129649 L116.321672,22.6855538 L116.384279,23.5315091 L116.446887,24.408796 L116.47819,25.1607563 L116.509494,25.9440482 L116.572101,27.4793004 L116.603405,29.8605079 L116.603405,31.3644284 L116.634709,31.8030719 L116.666012,32.1477203 C116.686882,32.2521592 116.718185,32.3565982 116.759923,32.4610371 C116.885138,32.7534661 117.146002,32.9727878 117.542516,33.1190023 L117.855553,33.2129974 L117.886856,33.244329 C118.03294,33.3069924 118.304239,33.3592118 118.700752,33.4009874 C119.097266,33.442763 119.347695,33.442763 119.452041,33.4009874 Z M120.172026,17.7351487 C120.109418,17.6724854 120.088549,17.6202659 120.109418,17.5784904 C120.192895,17.4113881 120.224199,17.2025102 120.203329,16.9518568 L120.172026,16.63854 L120.172026,16.3252233 L120.140722,15.3852729 L120.109418,14.4453226 L120.109418,13.0353971 L120.297241,13.0980605 L120.954618,13.5053723 C121.017225,13.5471479 121.069398,13.6098112 121.111136,13.6933624 L121.455477,14.2886642 C121.559823,14.5393177 121.62243,14.7690833 121.643299,14.9779611 C121.726776,15.6045947 121.716341,16.1059015 121.611996,16.4818816 C121.570257,16.6280961 121.50765,16.7743106 121.424173,16.9205251 L121.267655,17.0771835 L121.111136,17.2651736 L120.954618,17.421832 L120.766796,17.5784904 C120.66245,17.6620415 120.505932,17.7351487 120.297241,17.7978121 C120.255502,17.8186999 120.213764,17.7978121 120.172026,17.7351487 Z M120.704189,29.4218644 L120.704189,28.8578942 L120.672885,28.8578942 L120.672885,27.0406569 L120.641581,26.5080184 L120.641581,25.6307314 C120.66245,25.5054047 120.652016,25.4009658 120.610277,25.3174147 C120.568539,25.1503124 120.537235,24.9518784 120.516366,24.7221128 L120.485063,24.0954792 L120.485063,23.4061823 C120.485063,23.3226312 120.453759,23.2599678 120.391152,23.2181923 L120.391152,23.1241972 C120.43289,22.9779828 120.43289,22.8004366 120.391152,22.5915587 L120.359848,22.3409053 L120.328544,22.0589202 L120.297241,21.5889451 C120.276371,21.400955 120.276371,21.2442966 120.297241,21.1189699 C120.31811,20.9518676 120.31811,20.722102 120.297241,20.429673 L120.265937,19.7717078 L120.265937,19.552386 L120.234633,19.364396 C120.255502,19.1972937 120.338979,19.1241864 120.485063,19.1450742 L120.704189,19.1764059 L120.923314,19.2077376 L121.705907,19.2704009 L121.831121,19.3017326 L121.925032,19.3017326 C122.008509,19.259957 122.123289,19.2495131 122.269373,19.2704009 L122.425891,19.3017326 L122.613714,19.3017326 L122.895447,19.3330643 C122.999792,19.3539521 123.083269,19.3852837 123.145876,19.4270593 L123.17718,19.4270593 L123.208484,19.458391 L123.77195,19.8343711 L124.304113,20.2416829 C124.512804,20.3878974 124.679757,20.5758875 124.804972,20.8056531 L125.024098,21.2129649 L125.180616,21.6516084 C125.264093,21.8395985 125.284962,22.1111397 125.243224,22.466232 C125.180616,23.0928656 125.107574,23.6463919 125.024098,24.1268109 C124.96149,24.5445666 124.857145,24.9623223 124.711061,25.380078 L124.491935,25.9127165 L124.241506,26.4140234 C124.074553,26.7691157 123.9076,27.0719886 123.740647,27.322642 C123.365002,27.9283878 122.895447,28.4819141 122.33198,28.9832209 C121.998074,29.2965377 121.580692,29.4740839 121.079833,29.5158594 L120.923314,29.5785228 C120.77723,29.5994106 120.704189,29.5471911 120.704189,29.4218644 Z M139.611618,33.7456359 C140.175084,33.7456359 140.644639,33.7247481 141.020284,33.6829725 L141.333321,33.6829725 C141.458535,33.6829725 141.573316,33.6620847 141.677661,33.6203092 C141.823745,33.5576458 141.959394,33.4740947 142.084609,33.3696557 C142.230693,33.244329 142.324604,33.1190023 142.366342,32.9936756 C142.470688,32.6594711 142.491557,32.3461543 142.42895,32.0537253 L142.397646,31.9283986 L142.397646,31.7717402 C142.376777,31.6673013 142.345473,31.5837501 142.303735,31.5210868 L142.272431,31.4584234 L142.17852,31.3957601 C142.115913,31.3330967 142.032436,31.2913211 141.928091,31.2704334 C141.823745,31.2286578 141.552446,31.20777 141.114195,31.20777 L140.644639,31.20777 L140.425514,31.1764383 C139.736832,31.113775 139.162931,31.1033311 138.703811,31.1451066 L136.794285,31.1451066 C136.063866,31.1451066 135.667353,31.1346628 135.604745,31.113775 L135.448227,31.0824433 L135.260405,31.0197799 C135.114321,30.9362288 135.041279,30.8004582 135.041279,30.6124681 L135.072583,30.2678197 L135.103886,29.8918396 L135.072583,29.4218644 L135.041279,28.9518892 L135.041279,28.7638992 L135.072583,28.4192507 L135.072583,28.0746023 C135.072583,27.7612855 135.083017,27.521076 135.103886,27.3539737 C135.145624,27.1659836 135.156059,26.8839985 135.13519,26.5080184 L135.13519,25.6620631 L135.166494,25.1294246 L135.13519,24.5654544 L135.103886,24.0641476 L135.072583,23.5315091 L135.072583,22.7168854 C135.072583,22.466232 135.030844,22.2469103 134.947368,22.0589202 C134.88476,21.8918179 134.88476,21.7456034 134.947368,21.6202767 C135.051713,21.4531745 135.083017,21.2338527 135.041279,20.9623115 C134.957802,20.4818925 134.957802,20.043249 135.041279,19.6463811 L135.041279,18.5497724 L135.009975,18.4244456 L135.009975,18.2991189 L135.041279,18.0171338 L135.041279,17.7038171 C135.02041,17.4531636 135.030844,17.2547297 135.072583,17.1085152 L135.072583,16.9831885 C135.051713,16.8578618 135.041279,16.7220912 135.041279,16.5758767 L135.041279,16.1685649 C135.062148,16.0432382 135.051713,15.8970237 135.009975,15.7299214 L134.978671,15.4479363 C134.957802,15.3643852 134.978671,15.280834 135.041279,15.1972829 L135.072583,15.1346195 L135.072583,15.0406245 L135.041279,14.4766543 L135.041279,14.1946692 L135.009975,13.9126841 C134.989106,13.7664696 135.009975,13.6202551 135.072583,13.4740406 L135.103886,13.3800456 L135.103886,13.3173822 L135.166494,12.9727338 L135.166494,12.659417 C135.166494,12.4087636 135.13519,12.1894419 135.072583,12.0014518 C134.843022,11.395706 134.436074,11.0197259 133.851739,10.8735114 C133.288272,10.7272969 132.808282,10.6646336 132.411769,10.6855213 L132.130036,10.6855213 C132.004821,10.6855213 131.91091,10.6959652 131.848302,10.716853 C131.597873,10.8004042 131.410051,10.9361748 131.284836,11.1241648 C131.243098,11.1868282 131.201359,11.2286037 131.159621,11.2494915 C131.055276,11.2912671 130.982234,11.3852621 130.940495,11.5314766 C130.898757,11.7194667 130.846584,11.8552373 130.783977,11.9387884 C130.617024,12.2103296 130.533547,12.5340903 130.533547,12.9100704 C130.533547,13.0353971 130.554416,13.1293922 130.596155,13.1920555 C130.658762,13.2964944 130.679631,13.4427089 130.658762,13.630699 L130.564851,14.1006742 C130.543982,14.2677764 130.564851,14.4244348 130.627458,14.5706493 L130.627458,17.7038171 L130.658762,18.7690941 L130.658762,21.4636183 L130.690066,23.0302022 L130.72137,23.8448258 L130.752673,24.8161078 L130.752673,25.2547513 L130.72137,25.7247265 L130.752673,26.4766867 L130.752673,27.6672905 L130.72137,28.0746023 L130.72137,28.6072408 L130.752673,29.1398793 L130.752673,31.8657352 L130.783977,32.179052 C130.783977,32.2626031 130.794411,32.377486 130.815281,32.5237005 C130.794411,32.6490272 130.825715,32.7743539 130.909192,32.8996806 C130.971799,33.0250073 131.076145,33.1294462 131.222229,33.2129974 C131.577004,33.442763 132.02569,33.5994214 132.568287,33.6829725 C132.902193,33.7247481 133.382183,33.7456359 134.008257,33.7456359 L139.611618,33.7456359 Z M146.623644,33.7769675 L147.562755,33.6829725 L148.220133,33.6203092 C148.366216,33.5994214 148.616646,33.5785336 148.971421,33.5576458 L149.47228,33.5263141 L150.035747,33.4949824 C151.016596,33.4532069 151.6218,33.4218752 151.851361,33.4009874 C151.934837,33.3800996 152.007879,33.3278802 152.070487,33.244329 L152.258309,32.9936756 L152.414827,32.7116905 C152.393958,32.3565982 152.310481,32.0746131 152.164398,31.8657352 L151.538324,31.8657352 C151.329632,31.8657352 151.152245,31.8344035 151.006161,31.7717402 C150.964423,31.7508524 150.91225,31.7508524 150.849643,31.7717402 C150.703559,31.8135158 150.275742,31.8239597 149.566191,31.8030719 L148.752295,31.8030719 L148.752295,31.8030719 C148.501866,31.7821841 148.334913,31.7717402 148.251436,31.7717402 C148.126221,31.7508524 148.021876,31.6986329 147.938399,31.6150818 C147.834054,31.5106429 147.80275,31.406204 147.844488,31.301765 C147.844488,31.0719994 147.834054,30.8735654 147.813185,30.7064632 L147.813185,30.5184731 L147.781881,30.330483 C147.761012,30.0589418 147.750577,29.756069 147.750577,29.4218644 L147.781881,28.7952308 L147.844488,28.2312607 C147.865357,27.8343927 147.854923,27.5524076 147.813185,27.3853054 C147.834054,27.1555397 147.844488,26.8317791 147.844488,26.4140234 L147.844488,25.8813849 L147.875792,25.3487463 L147.876662,24.9623223 C147.87956,24.3705017 147.889705,24.0397785 147.907096,23.9701525 C147.948834,23.8657136 148.03231,23.8134941 148.157525,23.8134941 C148.241002,23.8134941 148.355782,23.8030503 148.501866,23.7821625 L149.47228,23.5628407 C149.847924,23.4792896 150.181831,23.4270701 150.473998,23.4061823 L150.724428,23.3748507 L150.974857,23.3121873 C151.162679,23.249524 151.308763,23.145085 151.413109,22.9988705 L151.444413,22.9675389 C151.569627,22.9048755 151.673973,22.8213244 151.75745,22.7168854 L151.851361,22.5602271 L151.976575,22.4035687 C152.060052,22.2991297 152.080921,22.1529152 152.039183,21.9649252 C151.955706,21.5471695 151.767884,21.2965161 151.475716,21.2129649 L151.413109,21.1816332 L151.350502,21.1189699 C151.100072,20.9518676 150.870512,20.8787604 150.66182,20.8996482 C150.599213,20.8996482 150.54704,20.8892043 150.505302,20.8683165 C150.421825,20.8056531 150.296611,20.7847653 150.129658,20.8056531 L148.157525,21.0876382 L147.907096,21.1189699 C147.740143,21.1189699 147.656666,21.0563065 147.656666,20.9309798 L147.68797,20.5549997 L147.68797,20.1476879 C147.68797,20.0850245 147.698404,20.0328051 147.719274,19.9910295 L147.750577,19.8657028 C147.771446,19.7612639 147.771446,19.6463811 147.750577,19.5210544 L147.781881,19.3017326 L147.844488,19.1137425 C147.844488,19.0928548 147.834054,19.0197475 147.813185,18.8944208 L147.813185,18.7064307 L147.781881,18.487109 C147.761012,18.0693533 147.781881,17.7769243 147.844488,17.609822 L147.844488,17.515827 L147.875792,17.0458518 L147.907096,16.5758767 C147.927965,16.1998966 147.969703,15.8865798 148.03231,15.6359264 L148.126221,15.1032878 C148.147091,15.0197367 148.147091,14.8317466 148.126221,14.5393177 L148.126221,14.0066791 L148.126221,14.0066791 C148.147091,13.8604646 148.230567,13.7560257 148.376651,13.6933624 L149.034029,13.5053723 C149.138374,13.4844845 149.336631,13.4844845 149.628799,13.5053723 L149.941836,13.536704 L150.192265,13.536704 L150.192265,13.536704 C150.338349,13.4949284 150.484433,13.4844845 150.630517,13.5053723 L150.849643,13.5053723 C150.91225,13.4844845 150.985292,13.4635967 151.068768,13.4427089 L151.413109,13.3800456 L151.726146,13.3173822 C151.851361,13.2964944 151.945272,13.2651628 152.007879,13.2233872 L152.195701,13.1293922 L152.383523,13.0040655 C152.487869,12.9205143 152.560911,12.8056315 152.602649,12.659417 L152.759168,12.5027586 C152.821775,12.3983197 152.863513,12.3147686 152.884382,12.2521052 C152.926121,12.1058907 152.905252,11.9596762 152.821775,11.8134617 L152.727864,11.6568033 L152.571346,11.5001449 C152.467,11.3539305 152.279178,11.2390476 152.007879,11.1554965 L151.444413,10.9988381 L150.849643,10.8735114 C150.578344,10.810848 150.348784,10.8004042 150.160961,10.8421797 C149.868794,10.9048431 149.597495,10.9361748 149.347065,10.9361748 L148.814903,10.9675064 L148.28274,10.9675064 C147.865357,10.9883942 147.521017,11.0301698 147.249718,11.0928331 C147.103634,11.1346087 146.801032,11.1450526 146.341911,11.1241648 L146.091482,11.0928331 L145.089763,11.0928331 L145.089763,11.0928331 C144.881072,11.1137209 144.755857,11.1346087 144.714119,11.1554965 C144.609774,11.1763843 144.515863,11.2181599 144.432386,11.2808232 L144.181956,11.4688133 C143.994134,11.6150278 143.889789,11.8134617 143.86892,12.0641151 L143.837616,12.4087636 L143.775008,12.7847437 L143.681097,13.1607238 L143.587186,13.5680357 C143.524579,13.9022402 143.482841,14.1737814 143.461972,14.3826593 L143.368061,15.2912779 L143.274149,16.1685649 L143.242846,16.6072084 L143.211542,17.0771835 C143.190673,17.4531636 143.148935,17.7560365 143.086327,17.9858022 L143.055024,18.0484655 C143.034154,18.2155678 143.034154,18.4453334 143.055024,18.7377624 L143.055024,19.458391 C143.013285,19.6881566 143.002851,20.2416829 143.02372,21.1189699 C143.044589,21.9544813 143.075893,22.5497832 143.117631,22.9048755 L143.211542,23.9701525 L143.305453,25.0354296 C143.326322,25.1816441 143.326322,25.4636292 143.305453,25.8813849 L143.305453,26.4766867 L143.274149,27.1659836 C143.232411,28.3356996 143.232411,29.0458843 143.274149,29.2965377 L143.336757,29.8291762 C143.357626,30.0171663 143.357626,30.1947124 143.336757,30.3618147 C143.315888,30.4871414 143.315888,30.6960193 143.336757,30.9884483 C143.336757,31.2599895 143.347191,31.4166479 143.368061,31.4584234 L143.493275,31.7717402 L143.587186,32.0537253 C143.608055,32.1999398 143.670663,32.2939348 143.775008,32.3357104 C143.921092,32.377486 143.994134,32.471481 143.994134,32.6176955 C144.015003,32.8265733 144.129784,32.9832317 144.338475,33.0876706 L144.651512,33.1816657 L144.933245,33.3069924 L145.183675,33.4323191 L145.434104,33.5263141 C145.621926,33.6098653 145.799314,33.6516408 145.966267,33.6516408 L146.028874,33.6516408 L146.091482,33.6829725 C146.216696,33.7665237 146.394084,33.7978553 146.623644,33.7769675 Z M160.209446,33.8082992 C160.605959,33.7665237 160.981604,33.7143042 161.336379,33.6516408 C161.461594,33.6307531 161.565939,33.5994214 161.649416,33.5576458 C161.732892,33.5576458 161.774631,33.5472019 161.774631,33.5263141 L161.931149,33.4949824 L162.056364,33.4949824 C162.202448,33.4740947 162.306793,33.4532069 162.369401,33.4323191 L162.682438,33.1816657 C162.745045,33.1398901 162.828522,33.0981145 162.932867,33.056339 L163.2146,33.0250073 C163.46503,32.9832317 163.642417,32.9205684 163.746763,32.8370172 L163.903282,32.6803588 L164.0598,32.5237005 L164.31023,32.273047 C164.435444,32.1686081 164.529355,32.0746131 164.591963,31.9910619 C165.218037,31.301765 165.572812,30.4662536 165.656288,29.4845277 C165.739765,28.5028019 165.72933,27.6568466 165.624985,26.9466619 L165.531073,26.4766867 C165.489335,26.2886967 165.437162,26.1320383 165.374555,26.0067116 L165.186733,25.6620631 L165.155429,25.5680681 L164.65457,24.3461327 L164.498052,24.0328159 L164.247622,23.7821625 C164.018062,23.5315091 163.746763,23.2181923 163.433726,22.8422121 L162.61983,21.8709302 C161.952018,21.0980821 161.367683,20.5027802 160.866824,20.0850245 L160.459876,19.7403761 L160.084231,19.364396 L160.084231,19.364396 L159.865105,19.1137425 L159.677283,18.8317574 C159.51033,18.6019918 159.385116,18.4348895 159.301639,18.3304506 L158.957298,18.0171338 L158.644262,17.7038171 C158.268617,17.3069492 157.903408,16.6280961 157.548632,15.667258 C157.548632,15.6045947 157.538198,15.5001558 157.517329,15.3539413 L157.454721,14.9152978 C157.433852,14.5184299 157.454721,14.1946692 157.517329,13.9440158 C157.538198,13.8186891 157.61124,13.6620307 157.736455,13.4740406 C157.861669,13.2860506 157.976449,13.1711677 158.080795,13.1293922 C158.519047,13.0040655 158.873822,12.9727338 159.145121,13.0353971 C159.479027,13.0980605 159.677283,13.2756067 159.739891,13.5680357 L159.771194,13.6933624 L159.802498,13.8500207 C159.844236,14.2051131 160.042493,14.507986 160.397268,14.7586394 L160.553787,14.8526344 C160.696889,14.995865 160.86299,15.0239995 161.05209,14.9370381 L161.148557,14.8839661 C161.54507,14.7168638 161.722458,14.4244348 161.68072,14.0066791 C161.701589,13.9649036 161.712023,13.9126841 161.712023,13.8500207 L161.586808,13.1607238 L161.43029,12.4714269 C161.388552,12.2834369 161.305075,12.1894419 161.17986,12.1894419 L161.023342,11.9387884 C160.605959,11.4374816 160.084231,11.0719454 159.458157,10.8421797 L159.458157,10.810848 L159.332943,10.7795164 L159.239032,10.7481847 L159.270335,10.7795164 L159.145121,10.7795164 C159.019906,10.716853 158.873822,10.7064091 158.706869,10.7481847 L158.644262,10.7481847 C157.934711,10.7690725 157.24603,10.8735114 156.578218,11.0615015 C156.014752,11.2286037 155.5765,11.4479255 155.263463,11.7194667 C154.449567,12.4296514 153.980012,13.5053723 153.854797,14.9466295 C153.77132,16.1372332 154.011315,17.2025102 154.574782,18.1424605 C154.679127,18.288675 154.814777,18.4662212 154.98173,18.6750991 L155.388678,19.1764059 L155.670411,19.5837177 L155.92084,19.9910295 C156.129532,20.3252341 156.338223,20.5758875 156.546914,20.7429898 C156.672129,20.8474287 156.807778,20.9309798 156.953862,20.9936432 L157.235595,21.2129649 L157.454721,21.4636183 L157.736455,21.8082668 L158.018188,22.1529152 L158.55035,22.7795488 L159.05121,23.4061823 L160.052928,24.5967861 L160.303357,24.9101029 L160.553787,25.2547513 L160.992038,25.9753799 C161.158991,26.2678089 161.284206,26.5184623 161.367683,26.7273401 C161.618112,27.2704225 161.722458,27.7195099 161.68072,28.0746023 L161.649416,28.1685973 L161.618112,28.2625923 L161.555505,28.5759091 L161.555505,28.8892259 C161.492897,29.5367472 161.075515,30.1529369 160.303357,30.7377948 C159.656414,31.2182139 159.009471,31.4897551 158.362528,31.5524185 L157.861669,31.5524185 L157.892973,31.5837501 C157.746889,31.5628623 157.538198,31.5210868 157.266899,31.4584234 C156.974731,31.3957601 156.776475,31.3330967 156.672129,31.2704334 L156.202574,30.8944532 L155.733018,30.5498048 C155.628673,30.4662536 155.430416,30.142493 155.138248,29.5785228 C154.825211,28.9936648 154.647824,28.5550213 154.606085,28.2625923 L154.574782,27.9492756 L154.543478,27.6672905 C154.522609,27.416637 154.460002,27.2182031 154.355656,27.0719886 L154.355656,27.0406569 C154.334787,26.9571058 154.303483,26.8839985 154.261745,26.8213352 L154.230441,26.7900035 L154.199137,26.7900035 C154.13653,26.7273401 154.053054,26.6751207 153.948708,26.6333451 L153.729582,26.5706818 L153.510456,26.5080184 L153.479153,26.5393501 L153.416545,26.5706818 C153.124377,26.5915695 152.873948,26.6960085 152.665257,26.8839985 L152.446131,27.1033203 C152.362654,27.1450958 152.310481,27.1868714 152.289612,27.228647 C152.247874,27.2913103 152.227005,27.4375248 152.227005,27.6672905 C152.227005,27.8343927 152.279178,28.0954901 152.383523,28.4505824 L152.508738,28.9518892 L152.665257,29.4531961 L152.759168,29.7978445 C152.780037,29.9022834 152.821775,29.9962785 152.884382,30.0798296 L153.009597,30.4244781 L153.103508,30.7377948 C153.207854,31.0928872 153.416545,31.4584234 153.729582,31.8344035 C153.959143,32.1268325 154.25131,32.4192615 154.606085,32.7116905 C155.273898,33.2756607 155.983448,33.6203092 156.734736,33.7456359 C157.819931,33.9336259 158.978168,33.9545137 160.209446,33.8082992 Z" id="INCroYABLES" fill="#FFFFFF" transform="translate(96.409046, 22.048951) rotate(-1.000000) translate(-96.409046, -22.048951) "></path>
                </g>
            </g>
            <g id="Group-10" transform="translate(163.681528, 3.883721)">
                <path d="M9.58411758,4.68967625 C8.29770016,5.42152444 6.87147786,5.66547383 5.48033968,5.49130036 C5.6541655,6.88522082 5.41070303,8.31376292 4.68031562,9.60328582 C3.91537567,10.8928087 2.80225249,11.833452 1.5503876,12.3565051 C2.38496419,13.4367002 2.87188914,14.8306207 2.87188914,16.2943171 C2.87188914,17.7926351 2.38496419,19.1519339 1.5503876,20.2667507 C2.8373366,20.7898038 3.91537567,21.7304471 4.68031562,23.01997 C5.41070303,24.3094929 5.6541655,25.738035 5.48033968,27.0973338 C6.87147786,26.9231603 8.29770016,27.2017314 9.58411758,27.9335796 C10.8710666,28.6654278 11.8103639,29.7802445 12.3318414,31.0697674 C13.4098805,30.2335217 14.8010187,29.7456229 16.2617935,29.7456229 C17.7571209,29.7456229 19.1137065,30.2335217 20.2268297,31.0697674 C20.7483072,29.7802445 21.6870729,28.6654278 22.9740219,27.9335796 C24.260971,27.2017314 25.6866617,26.9231603 27.0432473,27.0973338 C26.8694215,25.738035 27.1474365,24.3094929 27.8778239,23.01997 C28.6082113,21.7304471 29.7213345,20.7898038 31.0077519,20.2667507 C30.1731753,19.1519339 29.6862504,17.7926351 29.6862504,16.2943171 C29.6862504,14.8306207 30.1731753,13.4367002 31.0077519,12.3565051 C29.7213345,11.833452 28.6082113,10.8928087 27.8778239,9.60328582 C27.1474365,8.31376292 26.8694215,6.88522082 27.0432473,5.49130036 C25.6866617,5.66547383 24.260971,5.42152444 22.9740219,4.68967625 C21.6870729,3.92320642 20.7483072,2.80785699 20.2268297,1.55348837 C19.1137065,2.38973412 17.7571209,2.87763291 16.2617935,2.87763291 C14.8010187,2.87763291 13.4449646,2.38973412 12.3318414,1.55348837 C11.8103639,2.80785699 10.8710666,3.92320642 9.58411758,4.68967625" id="Fill-75" fill="#FCCB3A"></path>
                <path d="M26.3565891,15.5169669 C26.3565891,21.5403325 21.4969535,26.4093023 15.4857477,26.4093023 C9.5103033,26.4093023 4.65116279,21.5403325 4.65116279,15.5169669 C4.65116279,9.52943498 9.5103033,4.66046512 15.4857477,4.66046512 C21.4969535,4.66046512 26.3565891,9.52943498 26.3565891,15.5169669 Z" id="Fill-76" fill="#FCF09D"></path>
                <path d="M8.75406464,3.80653022 L8.78030197,3.80653022 L8.75406464,3.80653022 Z M15.4860281,28.5300734 C16.8293497,28.5300734 18.1183359,28.8917514 19.2523856,29.5806104 C19.8742838,28.4044833 20.808207,27.4428836 21.9831427,26.7745071 C23.1688379,26.1012795 24.4944063,25.7617011 25.7478862,25.799971 C25.7188356,24.503105 26.0502278,23.2121682 26.7216196,22.0274169 C27.3897835,20.8491338 28.3489916,19.9139457 29.5217754,19.2913854 C28.8342443,18.1535283 28.4737478,16.8625914 28.4737478,15.5172142 C28.4737478,14.1858514 28.840162,12.8825172 29.5169336,11.7753838 C28.345172,11.1522845 27.3886538,10.2181744 26.7216196,9.04204738 C26.0502278,7.8562181 25.7188356,6.55396196 25.7495002,5.23661344 C24.4422228,5.27488338 23.1435531,4.95470948 21.9831427,4.29495719 C20.808207,3.59531792 19.8791255,2.6342572 19.2583033,1.48508083 C17.0052673,2.85956476 14.0308079,2.87950825 11.7487212,1.48615886 C11.127899,2.6342572 10.2004315,3.5942399 9.03410336,4.28902805 C9.03033754,4.2911841 9.02657172,4.29280114 9.02441983,4.29495719 C7.86400945,4.95470948 6.56264982,5.27650042 5.22524593,5.23553541 C5.26398007,6.57767854 4.94388541,7.8804737 4.28540498,9.04204738 C3.58926634,10.2176354 2.63167224,11.1468943 1.48793906,11.7694547 C2.16578657,12.8782051 2.53322296,14.1836953 2.53322296,15.5172142 C2.53322296,16.8631304 2.17331821,18.1546063 1.48417324,19.2924634 C2.62037478,19.9037045 3.57850686,20.8340415 4.27948726,22.0171757 C4.94280947,23.1868345 5.26398007,24.4799275 5.22524593,25.8010491 C6.56372577,25.7633181 7.84087656,26.1007405 9.02441983,26.7745071 C10.1977416,27.4423446 11.1295129,28.4012493 11.7514111,29.5741422 C12.8558722,28.8971415 14.1572318,28.5300734 15.4860281,28.5300734 Z M19.4982398,31.0693651 C19.369664,31.0693651 19.243778,31.0278611 19.139411,30.9491652 C17.0224825,29.3579979 13.9011561,29.3725512 11.8751452,30.943775 C11.7272023,31.0596629 11.5367594,31.0979328 11.3522343,31.0488826 C11.1714749,30.9992934 11.0251459,30.8688522 10.9546713,30.6947509 C10.4586591,29.4679566 9.58660288,28.472938 8.43264819,27.8169588 C7.25771251,27.1485823 5.95258707,26.8812317 4.64907554,27.0440138 C4.46724026,27.0655743 4.28163916,27.0035878 4.15198737,26.8731465 C4.02125964,26.7416273 3.95831665,26.5572847 3.98252549,26.3734812 C4.14983547,25.0631399 3.8948357,23.7646568 3.24496285,22.6187145 C2.55259003,21.4506727 1.55733774,20.573698 0.373794465,20.0928982 C0.201642716,20.0233654 0.0719909309,19.8767538 0.0219593289,19.6978014 C-0.0275342988,19.518849 0.00743402517,19.3264212 0.118794687,19.1776536 C0.915534499,18.1120243 1.33784426,16.846421 1.33784426,15.5172142 C1.33784426,14.1971706 0.905850963,12.9116239 0.125250378,11.8988179 C0.0111998447,11.7516673 -0.0275342988,11.5587005 0.0198074321,11.3786701 C0.0671491629,11.1986396 0.195187026,11.050411 0.367876749,10.9787222 C1.56540735,10.4790568 2.56227357,9.60046516 3.25088056,8.43996951 C3.89375975,7.30642453 4.14822155,5.99500516 3.98091157,4.65879118 C3.95831665,4.47498764 4.02125964,4.2911841 4.15198737,4.16074288 C4.28163916,4.02976265 4.46724026,3.96669809 4.64907554,3.98987566 C5.98163767,4.1575088 7.28783906,3.90309452 8.42780642,3.25466152 C9.58445098,2.56472448 10.4586591,1.56647184 10.9557473,0.369323291 C11.0272978,0.19791706 11.1730888,0.0701709064 11.3511583,0.0211206956 C11.5319176,-0.0279295152 11.7207466,0.00980141622 11.8676135,0.120299144 C14.0103648,1.7308709 17.033242,1.70284221 19.139411,0.120299144 C19.286278,0.00980141622 19.4756449,-0.0279295152 19.6558662,0.0211206956 C19.8344737,0.0701709064 19.9797267,0.19791706 20.0512773,0.369323291 C20.5499794,1.5686279 21.4252634,2.56795856 22.5845979,3.25843461 C23.7197235,3.90309452 25.0119375,4.1612819 26.3202908,3.98987566 C26.50374,3.96723711 26.6877272,4.02868462 26.8189929,4.16020387 C26.9497206,4.29064509 27.0142775,4.47444863 26.9911447,4.65879118 C26.8286764,5.96212535 27.0955117,7.27300571 27.7620079,8.45021077 C28.4167763,9.60585529 29.4098767,10.4795959 30.6337681,10.9760271 C30.8069958,11.0466379 30.9377235,11.1948665 30.9866253,11.375975 C31.0361728,11.5570835 30.9974386,11.7500502 30.8823121,11.8988179 C30.1011736,12.9116239 29.6697183,14.1971706 29.6697183,15.5172142 C29.6697183,16.846421 30.0914901,18.1120243 30.8882299,19.1776536 C30.9995905,19.3264212 31.0350968,19.518849 30.9850652,19.6978014 C30.9355716,19.8767538 30.8059198,20.0233654 30.6337681,20.0928982 C29.4098767,20.5898684 28.4167763,21.463609 27.7620079,22.6187145 C27.0938977,23.7980756 26.8270625,25.0960197 26.9895307,26.3734812 C27.0142775,26.5578238 26.9507966,26.7421663 26.8200689,26.8736855 C26.6888031,27.0046658 26.50374,27.0650353 26.3202908,27.0440138 C25.0485198,26.8779977 23.7520019,27.1475043 22.5749143,27.8169588 C21.4204217,28.472938 20.5483655,29.4679566 20.0528912,30.6947509 C19.9834925,30.8672351 19.8382395,30.9976763 19.6585561,31.0472656 C19.6063726,31.0618189 19.5520372,31.0693651 19.4982398,31.0693651 L19.4982398,31.0693651 Z" id="Fill-77" fill="#434A53"></path>
                <path d="M15.8736714,27.1860465 C9.68467689,27.1860465 4.65116279,22.1254116 4.65116279,15.90596 C4.65116279,9.70542569 9.68467689,4.66046512 15.8736714,4.66046512 C18.5228609,4.66046512 21.0776485,5.57660055 23.0692607,7.24023765 C23.323337,7.45319184 23.3584005,7.83207735 23.1458612,8.08719 C22.9333219,8.34230264 22.5535562,8.37581319 22.3010983,8.16393998 C20.5241831,6.67974653 18.2423521,5.86306178 15.8736714,5.86306178 C10.3460303,5.86306178 5.84979834,10.36807 5.84979834,15.90596 C5.84979834,21.4627674 10.3460303,25.9839903 15.8736714,25.9839903 C21.419114,25.9839903 25.932608,21.4627674 25.932608,15.90596 C25.932608,13.5564375 25.1169748,11.2820434 23.6356727,9.50165987 C23.4231333,9.24600674 23.4581969,8.86712123 23.7122732,8.65470752 C23.9652705,8.44283431 24.3461151,8.47580438 24.5575755,8.73145751 C26.2185111,10.7280382 27.1317829,13.2764622 27.1317829,15.90596 C27.1317829,22.1254116 22.0820856,27.1860465 15.8736714,27.1860465" id="Fill-80" fill="#434A53"></path>
            </g>
        </g>
    </g>
</svg>