<?xml version="1.0" encoding="UTF-8"?>
<svg width="86px" height="19px" viewBox="0 0 86 19" version="1.1" xmlns="http://www.w3.org/2000/svg" xmlns:xlink="http://www.w3.org/1999/xlink">
    <title>capgemini invent</title>
    <g id="logo-partenaires" stroke="none" stroke-width="1" fill="none" fill-rule="evenodd">
        <g id="partenaire-capgemini" transform="translate(-8.000000, -41.000000)" fill-rule="nonzero">
            <g id="capgemini-invent" transform="translate(8.000000, 41.000000)">
                <path d="M81.717,11.349 C83.581,11.349 85.0205,9.83 85.039,8.029 C84.9095,7.2425 84.634,5.7875 82.5925,5.7875 C80.3605,5.7875 79.62,8.9075 77.8025,10.9185 C77.655,12.0625 76.5735,13.086 75.221,13.2575 C75.553,13.6045 76.289,13.791 77.168,13.791 C78.778,13.791 80.727,13.3065 81.7465,12.3 C80.3865,12.3175 79.5115,11.4435 79.425,10.232 C80.0885,11.036 80.8385,11.349 81.717,11.349" id="Path" fill="#12ABDB"></path>
                <path d="M67.3975,6.385 C67.3975,5.3945 67.3375,4.7325 66.6895,4.7325 C66.394,4.7325 66.2495,4.7905 65.991,4.877 C66.2205,8.227 65.464,11.177 64.54,11.177 C63.3285,11.177 63.9335,3.997 61.366,3.997 C59,3.997 58.66,9.7285 58.391,9.7285 C58.2075,9.7285 58.18,8.2235 58.1895,7.0765 C58.289,6.5255 58.3425,6.0325 58.3425,5.6575 C58.3425,5.1235 58.1255,4.2005 56.9135,4.662 C56.9565,8.7595 56.1355,11.237 55.212,11.237 C53.856,11.237 53.842,7.521 53.842,6.497 C53.842,5.497 53.9135,4.1605 52.428,4.6365 C52.205,8.2115 51.269,10.91 50.678,10.91 C49.797,10.91 49.9745,4.733 48.0695,4.733 C46.358,4.733 45.8285,10.583 45.4715,10.583 C44.833,10.583 45.671,3.997 43.199,3.997 C41.9015,3.997 41.3865,6.1965 40.8785,8.657 C40.7795,9.134 40.676,9.148 40.6595,8.6105 C40.6462249,8.15096084 40.6422241,7.69120059 40.6475,7.2315 C41.272,4.758 40.51,3.8445 39.3645,4.5035 C39.7335,9.068 37.639,11.2995 36.031,11.2995 C35.4495,11.2995 34.993,11.0525 34.651,10.662 C36.579,9.48 37.4355,8.123 37.4355,6.798 C37.4355,5.361 36.6105,4.534 35.2405,4.534 C33.3275,4.534 32.2585,6.503 32.2585,8.1765 C32.2585,9.0775 32.426,9.8425 32.7035,10.4735 C32.0465,10.787 31.427,11.058 30.8505,11.321 C30.8005,9.599 30.6055,7.7905 30.4575,6.1225 C29.44,5.842 29.1425,6.3315 29.064,7.2375 C28.884,9.305 28.118,10.5875 27.441,10.5875 C26.931,10.5875 26.6205,9.9675 26.583,9.309 C26.394,5.995 29.0845,5.073 30.491,5.5535 C30.783,4.823 30.4625,4.2965 29.1935,4.2965 C27.6535,4.2965 26.503,5.2315 25.6595,6.4315 C25.096,7.2315 24.446,7.799 23.5815,8.4855 C23.6035,8.288 23.6155,8.0905 23.6155,7.8965 C23.6155,5.5595 22.349,4.534 21.14,4.534 C20.1395,4.534 19.511,5.134 19.146,6.054 C19.056,5.1315 18.8725,4.733 18.336,4.733 C18.106,4.733 17.7875,4.798 17.4445,4.964 C17.6015,5.479 17.6625,6.6215 17.6625,7.3735 C17.6625,10.1835 16.8575,11.4425 16.0825,11.4425 C15.1975,11.4425 15.0565,8.1095 14.9825,6.8125 C14.8439916,6.75934392 14.6968579,6.73222251 14.5485,6.7325 C13.748,6.7325 13.6435,7.8085 13.446,8.7975 C13.227,9.8935 12.5955,11.272 11.6605,11.272 C11.0955,11.272 10.743,10.727 10.699,9.747 C10.607,7.7605 12.26,5.406 14.8465,6.1385 C15.1855,5.347 14.6535,4.7445 13.58,4.7445 C11.6895,4.7445 10.1265,6.1595 9.445,7.834 C8.753,9.369 7.5415,11.624 5.0775,11.624 C3.3375,11.624 2.0065,10.107 2.0065,6.9225 C2.0065,4.1775 3.7365,1.57 5.583,1.57 C6.8745,1.57 7.174,2.84 7.0605,4.033 C7.7285,4.5705 8.8265,4.071 8.8265,2.729 C8.8265,1.804 8.0755,0.236 5.6515,0.236 C2.651,0.236 0,3.228 0,7.16 C0,10.966 1.932,13.216 4.667,13.216 C6.392,13.216 8.0205,12.231 9.1445,10.415 C9.427,12.005 10.511,12.6745 11.3235,12.6745 C12.638,12.6745 13.4965,11.824 13.9655,10.671 C14.258,11.826 14.8755,12.679 15.9005,12.679 C16.6235,12.679 17.187,12.3135 17.6115,11.726 C17.4435,15.7375 17.2305,18.295 19.601,17.791 C19.235,16.651 19.118,14.5745 19.118,12.7105 C19.118,7.609 19.9595,5.9305 21.014,5.9305 C21.778,5.9305 22.0255,6.9045 22.0255,7.9435 C22.0255,8.5 21.9725,9.1395 21.8305,9.717 C20.535,10.5345 19.5,11.1795 19.5,11.9995 C19.5,12.648 19.981,12.7085 20.3975,12.7085 C21.3925,12.7085 22.59,11.732 23.252,9.8895 C23.831,9.5395 24.411,9.138 24.9665,8.5915 C24.948,8.7785 24.9365,8.9665 24.9365,9.1585 C24.9365,10.988 25.738,12.0925 27.016,12.0925 C28.0175,12.0925 28.769,11.3825 29.299,10.319 C29.3325,10.932 29.353,11.4965 29.3625,12.0165 C27.331,12.955 25.0825,13.91 25.0825,16.56 C25.0825,17.931 26.0725,18.9635 27.3625,18.9635 C30.1925,18.9635 30.8375,15.9765 30.8645,12.5065 C31.7855,12.1065 32.472,11.7985 33.264,11.4075 C33.941,12.2545 34.861,12.6795 35.7055,12.6795 C37.303,12.6795 38.502,11.833 39.4655,10.117 C39.6365,11.423 39.975,12.6795 40.669,12.6795 C41.9355,12.6795 42.1915,6.0595 43.1335,6.0595 C43.8545,6.0595 43.262,13.2225 45.166,13.2225 C46.796,13.2225 47.102,6.919 47.8955,6.919 C48.458,6.919 48.5005,12.6805 50.2755,12.6805 C51.1485,12.6805 52.0955,11.6315 52.5705,9.4335 C52.793,10.8955 53.532,12.6805 54.9745,12.6805 C55.816,12.6805 56.5395,11.829 57.098,10.697 C57.252,11.862 57.582,12.6805 58.2195,12.6805 C59.878,12.6805 59.8225,6.0745 61.1355,6.0745 C62.1595,6.0745 61.8425,12.6805 64.2805,12.6805 C65.4405,12.6805 65.9905,11.6915 66.3175,10.4515 C66.766,12.276 67.491,12.6805 68.087,12.6805 C68.4645,12.6805 68.75,12.5475 69.124,12.1015 C67.239,11.2835 67.3975,8.3075 67.3975,6.385 M27.481,17.728 C26.8955,17.728 26.586,17.1725 26.586,16.543 C26.586,14.8495 27.83,13.95 29.363,13.178 C29.293,16.8815 28.4325,17.728 27.481,17.728 M35.096,5.723 C35.666,5.723 35.9925,6.2465 35.936,6.9995 C35.8695,7.884 35.226,8.8955 34.1075,9.691 C33.5225,8.0285 33.9575,5.723 35.0965,5.723 M53.158,3.219 C53.7015,3.2005 54.081,2.734 54.083008,2.179 C54.085,1.624 53.71,1.1885 53.1665,1.208 C52.623,1.2265 52.18,1.692 52.1774894,2.2475 C52.175,2.8025 52.614,3.2375 53.158,3.219 M66.669,3.5005 C67.1635,3.483 67.567,3.039 67.5690117,2.5105 C67.5715,1.981 67.172,1.567 66.6765,1.5845 C66.181,1.6025 65.7785,2.0465 65.7759925,2.575 C65.774,3.104 66.174,3.5185 66.669,3.5005 M85.036,7.8965 C84.9955,5.803 83.999,4.0365 82.4635,2.6265 C81.2975,1.5615 79.912,0.753 78.4595,0.144 C78.3426356,0.0946200642 78.2251254,0.0467825761 78.107,0.0005 L78.1065,0.0005 C76.318,2.143 70.125,3.742 70.125,8.234 C70.125,9.99 71.234,11.632 72.8625,12.291 C73.8065,12.648 74.751,12.6675 75.696,12.35 C76.536,12.074 77.227,11.553 77.8015,10.918 C79.6205,8.907 80.3605,5.788 82.592,5.788 C84.634,5.788 84.909,7.2415 85.0395,8.0285 C85.0395,8.0265 85.0385,7.9715 85.036,7.8965" id="Shape" fill="#0070AD"></path>
            </g>
        </g>
    </g>
</svg>