<?xml version="1.0" encoding="utf-8"?>
<!-- Generator: Adobe Illustrator 20.0.0, SVG Export Plug-In . SVG Version: 6.00 Build 0)  -->
<svg version="1.1" id="Calque_1" xmlns="http://www.w3.org/2000/svg" xmlns:xlink="http://www.w3.org/1999/xlink" x="0px" y="0px"
	 viewBox="0 0 595.3 170.1" style="enable-background:new 0 0 595.3 170.1;" xml:space="preserve">
<style type="text/css">
	.st0{fill:#003358;}
</style>
<g>
	<g>
		<g>
			<path class="st0" d="M22,109.6v18.5H44v4.8H22v22.2h-5.4v-50.3h31.2v4.8H22z"/>
		</g>
		<g>
			<path class="st0" d="M83.5,150.3c-3.4,3.4-7.8,5.2-12.9,5.2c-5,0-9.5-1.8-12.9-5.2C53,145.6,53,140.7,53,130
				c0-10.7,0-15.6,4.7-20.4c3.4-3.4,7.8-5.2,12.9-5.2c5,0,9.5,1.8,12.9,5.2c4.7,4.7,4.7,9.7,4.7,20.4
				C88.2,140.7,88.2,145.6,83.5,150.3z M79.3,112.8c-2.2-2.3-5.4-3.6-8.7-3.6c-3.3,0-6.5,1.3-8.7,3.6c-3.2,3.2-3.5,6.6-3.5,17.2
				c0,10.5,0.4,13.9,3.5,17.2c2.2,2.3,5.4,3.6,8.7,3.6c3.3,0,6.5-1.3,8.7-3.6c3.2-3.3,3.5-6.6,3.5-17.2
				C82.8,119.4,82.5,116.1,79.3,112.8z"/>
		</g>
		<g>
			<path class="st0" d="M116.4,155.6c-10.2,0-17.5-7-17.5-17v-33.7h5.4v33.3c0,7.6,4.8,12.7,12.2,12.7c7.4,0,12.2-5,12.2-12.7v-33.3
				h5.4v33.7C134,148.6,126.6,155.6,116.4,155.6z"/>
		</g>
		<g>
			<path class="st0" d="M178.7,155.1L152,114.8v40.4h-5.4v-50.3h5.1l26.7,40.2v-40.2h5.4v50.3H178.7z"/>
		</g>
		<g>
			<path class="st0" d="M227,150.5c-3,3-7.5,4.7-12.7,4.7H197v-50.3h17.2c5.2,0,9.7,1.6,12.7,4.7c5.2,5.2,4.9,12.9,4.9,19.9
				C232,136.4,232.2,145.2,227,150.5z M223.3,113.3c-2.6-2.7-6-3.7-9.9-3.7h-11v40.7h11c3.9,0,7.3-1,9.9-3.7
				c3.5-3.6,3.3-11.1,3.3-17.2C226.6,123.3,226.7,116.9,223.3,113.3z"/>
		</g>
		<g>
			<path class="st0" d="M272,155.1l-4-11.4h-22l-4,11.4h-5.7l18.5-50.3h4.5l18.4,50.3H272z M257.1,112.5l-9.5,26.6h18.8L257.1,112.5
				z"/>
		</g>
		<g>
			<path class="st0" d="M295.1,109.6v45.5h-5.4v-45.5h-14.6v-4.8h34.5v4.8H295.1z"/>
		</g>
		<g>
			<path class="st0" d="M317.8,155.1v-50.3h5.4v50.3H317.8z"/>
		</g>
		<g>
			<path class="st0" d="M365,150.3c-3.4,3.4-7.8,5.2-12.9,5.2c-5,0-9.5-1.8-12.9-5.2c-4.7-4.7-4.7-9.7-4.7-20.4
				c0-10.7,0-15.6,4.7-20.4c3.4-3.4,7.8-5.2,12.9-5.2c5,0,9.5,1.8,12.9,5.2c4.7,4.7,4.7,9.7,4.7,20.4
				C369.7,140.7,369.7,145.6,365,150.3z M360.8,112.8c-2.2-2.3-5.4-3.6-8.7-3.6c-3.3,0-6.5,1.3-8.7,3.6c-3.2,3.2-3.5,6.6-3.5,17.2
				c0,10.5,0.4,13.9,3.5,17.2c2.2,2.3,5.4,3.6,8.7,3.6c3.3,0,6.5-1.3,8.7-3.6c3.2-3.3,3.5-6.6,3.5-17.2
				C364.3,119.4,364,116.1,360.8,112.8z"/>
		</g>
		<g>
			<path class="st0" d="M413.2,155.1l-26.7-40.4v40.4h-5.4v-50.3h5.1l26.7,40.2v-40.2h5.4v50.3H413.2z"/>
		</g>
	</g>
	<g>
		<g>
			<g>
				<g>
					<polygon class="st0" points="544,15.1 544,75.2 581.2,75.2 581.2,67 553.2,67 553.2,49 576.9,49 576.9,40.8 553.2,40.8 
						553.2,23.3 581.2,23.3 581.2,15.1 					"/>
				</g>
			</g>
		</g>
		<g>
			<g>
				<g>
					<g>
						<path class="st0" d="M513.6,75.7c-9,0-15.6-2-21.4-7.9l6.6-6.6c4.1,4.2,9.1,5.5,15,5.5c7.4,0,11.7-3.1,11.7-8.6
							c0-2.4-0.7-4.4-2.1-5.8c-1.4-1.3-2.8-1.8-6.1-2.3l-7.1-1.1c-5-0.7-8.8-2.4-11.4-4.9c-2.9-2.8-4.4-6.7-4.4-11.6
							c0-10.6,7.7-17.8,20.4-17.8c8,0,13.7,2,18.8,6.9l-6.4,6.4c-3.7-3.6-8.1-4.5-12.8-4.5c-6.7,0-10.2,3.8-10.2,8.7
							c0,2,0.6,3.8,2.1,5.1c1.4,1.2,3.6,2.3,6.3,2.6l6.9,1c5.5,0.8,8.7,2.2,11.3,4.5c3.2,3,4.8,7.3,4.8,12.5
							C535.4,69.1,526.1,75.7,513.6,75.7"/>
					</g>
				</g>
			</g>
		</g>
		<g>
			<g>
				<g>
					<polygon class="st0" points="457.8,15.1 457.8,75.2 487.2,75.2 487.2,65.4 468.8,65.4 468.8,15.1 					"/>
				</g>
			</g>
		</g>
		<g>
			<g>
				<g>
					<g>
						<path class="st0" d="M423.3,75.7c-12.3,0-22-8.4-22-21.2V15.1h11.9v39c0,6.8,3.9,10.9,10.1,10.9c6.2,0,10.2-4.1,10.2-10.9v-39
							h11.9v39.4C445.5,67.3,435.7,75.7,423.3,75.7"/>
					</g>
				</g>
			</g>
			<g>
				<g>
					<g>
						<path class="st0" d="M373.2,53h-10.5v22.2h-12.9V15.1h23.4c12.8,0,20,8.9,20,19C393.2,44.2,385.9,53,373.2,53 M372.5,26.7
							h-9.9v14.8h9.9c4.8,0,7.8-3.2,7.8-7.4C380.3,29.9,377.3,26.7,372.5,26.7"/>
					</g>
				</g>
			</g>
		</g>
		<g>
			<g>
				<g>
					<polygon class="st0" points="323.9,15.1 309.8,43.4 295.6,15.1 282.1,15.1 282.1,75.2 295.9,75.2 295.9,44.5 305.3,61.8 
						314.3,61.8 323.6,44.5 323.6,75.2 337.4,75.2 337.4,15.1 					"/>
				</g>
			</g>
		</g>
		<g>
			<g>
				<g>
					<rect x="254.5" y="15.1" class="st0" width="15.9" height="60.1"/>
				</g>
			</g>
		</g>
		<g>
			<g>
				<g>
					<g>
						<path class="st0" d="M34.2,75.7c-8.9,0-14.5-2.4-19.9-7.9l3.2-3.2c5.4,5.4,9.7,7.1,17,7.1c9.4,0,15.4-4.5,15.4-12.4
							c0-3.5-1.1-6.5-3.3-8.4c-2.2-1.9-3.8-2.5-8.7-3.2l-7-1.1c-4.5-0.7-8.2-2.2-10.7-4.4c-3.2-2.7-4.7-6.4-4.7-11.1
							c0-10.1,7.1-16.5,18.6-16.5c7.4,0,12.1,2,17.2,6.5l-2.9,3c-3.7-3.3-7.4-5.6-14.5-5.6c-8.7,0-13.9,4.8-13.9,12.4
							c0,3.5,1,6.1,3.1,7.8c2.1,1.8,5.6,3.2,8.9,3.7l6.5,1c5.6,0.8,8.2,1.9,10.7,4c3.3,2.7,5.2,6.8,5.2,11.6
							C54.4,69.2,46.6,75.7,34.2,75.7"/>
					</g>
				</g>
			</g>
			<g>
				<g>
					<g>
						<path class="st0" d="M97.2,69.5c-4,4-9.3,6.2-15.1,6.2c-5.8,0-11.1-2.2-15.1-6.2c-5.5-5.6-5.6-11.2-5.6-24.3
							c0-13.2,0.1-18.8,5.6-24.3c4-4,9.3-6.2,15.1-6.2c5.8,0,11.1,2.2,15.1,6.2c5.5,5.6,5.6,11.2,5.6,24.3
							C102.8,58.4,102.7,63.9,97.2,69.5 M92.9,23.9c-2.9-2.9-6.7-4.5-10.8-4.5c-4.1,0-8,1.6-10.9,4.5c-4,4.1-4.4,8.5-4.4,21.2
							c0,12.7,0.4,17.1,4.4,21.2c2.8,2.9,6.7,4.5,10.9,4.5c4.1,0,8-1.6,10.8-4.5c4-4.1,4.4-8.5,4.4-21.2
							C97.3,32.4,96.9,28,92.9,23.9"/>
					</g>
				</g>
			</g>
		</g>
		<g>
			<g>
				<g>
					<polygon class="st0" points="112.8,15.1 112.8,75.2 140.5,75.2 140.5,69.5 119.2,69.5 119.2,15.1 					"/>
				</g>
			</g>
		</g>
		<g>
			<g>
				<g>
					<path class="st0" d="M171.3,25.8l10.5,30.1h-21.1L171.3,25.8z M168.2,15.1l-22,60.1h7.7l4.6-13.1h25.3l4.5,13.1h7.7l-22-60.1
						H168.2z"/>
				</g>
			</g>
		</g>
		<g>
			<g>
				<g>
					<g>
						<path class="st0" d="M236.1,75.2l-12.9-25.8h-12.3v25.8h-8.2V15.1h23.1c11,0,18.3,7,18.3,17.3c0,8.7-5.2,14.3-12.3,16
							l13.9,26.8H236.1z M225.1,22.5h-14.3v19.9h14.3c6.3,0,10.7-3.5,10.7-10C235.9,26.1,231.5,22.5,225.1,22.5"/>
					</g>
				</g>
			</g>
		</g>
	</g>
</g>
</svg>
