<svg width="70" height="60" fill="none" xmlns="http://www.w3.org/2000/svg">
  <path d="M0 13l70 1-7 31-58-2-5-30z" fill="#FA2863"/>
  <path d="M7.89 39.613L4.465 16.407l61.038.985-5.364 24.196L7.89 39.613z" fill="#FA2863" stroke="#fff" stroke-width=".8"/>
  <path d="M9 15h4l-.63.945a1 1 0 000 1.11L13 18H9l.63-.945a1 1 0 000-1.11L9 15zm43 24.7h4l-.63.945a1 1 0 000 1.11l.63.945h-4l.63-.945a1 1 0 000-1.11L52 39.7z" fill="#FA2863"/>
  <path d="M20.367 30.76c.49 0 .78.3.73.77-.04.47-.37.77-.86.77h-.54l.13-1.54h.54zm.26 3.52c1.91 0 3.26-1.09 3.4-2.75.15-1.67-.99-2.76-2.87-2.76h-3.96l-.64 7.23h2.81l.15-1.72h1.11zm9.53-.89c.15-1.7-.96-2.82-2.8-2.82-1.84 0-3.16 1.12-3.31 2.82-.15 1.69.98 2.81 2.82 2.81 1.84 0 3.14-1.12 3.29-2.81zm-2.58 0c-.03.35-.23.57-.52.57-.29 0-.46-.22-.43-.57.03-.36.24-.58.53-.58.29 0 .45.22.42.58zm6.012.57c-.15 0-.26-.17-.23-.44l.24-2.75h-2.58l-.3 3.47c-.1 1.14.47 1.96 1.3 1.96.84 0 1.48-.72 1.77-1.81l-.14 1.61h2.58l.46-5.23h-2.58l-.24 2.77c-.03.26-.12.42-.28.42zm6.554 1.56l-.3-4.75h-2.74l.78 5.23h4.43l1.7-5.23h-2.75l-1.12 4.75zm9.683-2.13c.15-1.7-.96-2.82-2.8-2.82-1.84 0-3.16 1.12-3.31 2.82-.15 1.69.98 2.81 2.82 2.81 1.84 0 3.14-1.12 3.29-2.81zm-2.58 0c-.03.35-.23.57-.52.57-.29 0-.46-.22-.43-.57.03-.36.24-.58.53-.58.29 0 .45.22.42.58zm3.04 2.61h2.58l.46-5.23h-2.58l-.46 5.23zm.51-6.85c-.07.77.48 1.32 1.27 1.32.81 0 1.43-.55 1.5-1.32.07-.78-.46-1.33-1.27-1.33-.79 0-1.43.55-1.5 1.33zm7.532 1.42c-.6 0-1.16.74-1.43 1.88l.15-1.68h-2.59l-.46 5.23h2.58l.23-2.56c.03-.44.37-.72.82-.72.27 0 .66.1.98.24l.2-2.28c-.16-.07-.33-.11-.48-.11z" fill="#fff"/>
  <mask id="a" style="mask-type:alpha" maskUnits="userSpaceOnUse" x="50" y="27" width="4" height="4">
    <path d="M54 30.5h-4v-3h4v3z" fill="#C4C4C4"/>
  </mask>
  <g mask="url(#a)">
    <path d="M20.367 30.76c.49 0 .78.3.73.77-.04.47-.37.77-.86.77h-.54l.13-1.54h.54zm.26 3.52c1.91 0 3.26-1.09 3.4-2.75.15-1.67-.99-2.76-2.87-2.76h-3.96l-.64 7.23h2.81l.15-1.72h1.11zm9.53-.89c.15-1.7-.96-2.82-2.8-2.82-1.84 0-3.16 1.12-3.31 2.82-.15 1.69.98 2.81 2.82 2.81 1.84 0 3.14-1.12 3.29-2.81zm-2.58 0c-.03.35-.23.57-.52.57-.29 0-.46-.22-.43-.57.03-.36.24-.58.53-.58.29 0 .45.22.42.58zm6.012.57c-.15 0-.26-.17-.23-.44l.24-2.75h-2.58l-.3 3.47c-.1 1.14.47 1.96 1.3 1.96.84 0 1.48-.72 1.77-1.81l-.14 1.61h2.58l.46-5.23h-2.58l-.24 2.77c-.03.26-.12.42-.28.42zm6.554 1.56l-.3-4.75h-2.74l.78 5.23h4.43l1.7-5.23h-2.75l-1.12 4.75zm9.683-2.13c.15-1.7-.96-2.82-2.8-2.82-1.84 0-3.16 1.12-3.31 2.82-.15 1.69.98 2.81 2.82 2.81 1.84 0 3.14-1.12 3.29-2.81zm-2.58 0c-.03.35-.23.57-.52.57-.29 0-.46-.22-.43-.57.03-.36.24-.58.53-.58.29 0 .45.22.42.58zm3.04 2.61h2.58l.46-5.23h-2.58l-.46 5.23zm.51-6.85c-.07.77.48 1.32 1.27 1.32.81 0 1.43-.55 1.5-1.32.07-.78-.46-1.33-1.27-1.33-.79 0-1.43.55-1.5 1.33zm7.532 1.42c-.6 0-1.16.74-1.43 1.88l.15-1.68h-2.59l-.46 5.23h2.58l.23-2.56c.03-.44.37-.72.82-.72.27 0 .66.1.98.24l.2-2.28c-.16-.07-.33-.11-.48-.11z" fill="#2854C3"/>
  </g>
  <mask id="b" style="mask-type:alpha" maskUnits="userSpaceOnUse" x="4" y="18" width="59" height="18">
    <path d="M16.147 28.125L14.99 36 4 29.25 15.569 18l30.656 5.625 6.472 2.821 1.627-2.259L63 30.937l-10.303-4.49-2.422 3.365H40.44c-1.388 0-2.506.375-2.892.563-.386-.188-1.273-.563-1.735-.563-.463 0-1.35.375-1.736.563 0-.188-.347-.563-1.735-.563-1.388 0-2.12.375-2.314.563-.578-.375-1.966-1.125-2.892-1.125-.925 0-1.928.375-2.314.562-.192-.375-.81-1.237-1.735-1.687-.925-.45-5.013-.187-6.94 0z" fill="#C4C4C4"/>
  </mask>
  <g mask="url(#b)">
    <path d="M14.704 29.25c2.03 0 3.63-1.08 3.77-2.71.15-1.77-1.22-2.24-2.73-2.37-.61-.05-1.04-.09-1.01-.37.01-.17.29-.29.62-.29.48 0 .83.24.79.58h2.36c.13-1.49-1.16-2.57-3.08-2.57-1.9 0-3.39 1.03-3.53 2.62-.15 1.74 1.2 2.22 2.78 2.38.57.06.99.11.96.41-.01.19-.3.33-.65.33-.49 0-.87-.28-.84-.67l-2.47.01c-.13 1.54 1.14 2.65 3.03 2.65zm7.333-2.29c-.15 0-.26-.17-.23-.44l.24-2.75h-2.58l-.3 3.47c-.1 1.14.47 1.96 1.3 1.96.84 0 1.48-.72 1.77-1.81l-.14 1.61h2.58l.46-5.23h-2.58l-.24 2.77c-.03.26-.12.42-.28.42zm7.194-.57c-.03.33-.24.58-.52.58s-.45-.25-.42-.58c.03-.34.24-.59.52-.59s.45.25.42.59zm-.95 1.35c.17.91.68 1.46 1.43 1.46 1.13 0 1.96-1.11 2.11-2.81.15-1.7-.49-2.82-1.62-2.82-.77 0-1.35.54-1.67 1.43l.11-1.23h-2.59l-.66 7.53h2.58l.31-3.56zm6.739-1.86c.09-.34.21-.55.45-.55.26 0 .42.3.37.55h-.82zm.84 1.29c-.07.15-.16.27-.41.27-.28 0-.4-.13-.5-.39h3.32c.03-.09.07-.45.09-.62.15-1.73-.87-2.86-2.69-2.86-1.81 0-3.17 1.12-3.32 2.83-.15 1.69.97 2.8 2.76 2.8 1.47 0 2.69-.74 2.96-1.76l-2.21-.27zm7.333-3.6c-.6 0-1.16.74-1.43 1.88l.15-1.68h-2.59l-.46 5.23h2.58l.23-2.56c.03-.44.37-.72.82-.72.27 0 .66.1.98.24l.2-2.28c-.16-.07-.33-.11-.48-.11z" fill="#fff"/>
  </g>
</svg>
