<?xml version="1.0" encoding="UTF-8"?>
<svg width="100px" height="100px" viewBox="0 0 100 100" version="1.1" xmlns="http://www.w3.org/2000/svg" xmlns:xlink="http://www.w3.org/1999/xlink">
    <!-- Generator: Sketch 58 (84663) - https://sketch.com -->
    <title>areco 50px</title>
    <desc>Created with Sketch.</desc>
    <defs>
        <circle id="path-1" cx="47" cy="47" r="46.6666667"></circle>
        <circle id="path-3" cx="46.6666685" cy="46.6666685" r="46.6666685"></circle>
    </defs>
    <g id="areco-50px" stroke="none" stroke-width="1" fill="none" fill-rule="evenodd">
        <g id="avatar/partner" transform="translate(3.000000, 3.000000)">
            <mask id="mask-2" fill="white">
                <use xlink:href="#path-1"></use>
            </mask>
            <circle stroke="#979797" stroke-width="0.5" cx="47" cy="47" r="46.9166667"></circle>
            <g id="partner" mask="url(#mask-2)">
                <g transform="translate(0.333333, 0.333333)">
                    <mask id="mask-4" fill="white">
                        <use xlink:href="#path-3"></use>
                    </mask>
                    <g id="mask" stroke="none" fill="none"></g>
                    <g id="alimentation/areco" stroke="none" fill="none" mask="url(#mask-4)">
                        <rect fill="#FFFFFF" x="0" y="0" width="93" height="93"></rect>
                        <g id="Plan-de-travail-1" stroke-width="1" fill-rule="evenodd" transform="translate(9.300000, 31.310001)">
                            <polygon id="Path" fill="#221F20" fill-rule="nonzero" points="0.0266579799 28.8390874 0.0266579799 23.7716477 0.484690544 23.7716477 0.484690544 28.424677 3.03416281 28.424677 3.03416281 28.8390874"></polygon>
                            <path d="M3.89933543,27.1814457 C3.91387614,27.9327161 4.25800643,28.5652372 5.11106179,28.5652372 C5.60759471,28.5602048 6.03296451,28.2085927 6.13133538,27.7218757 L6.57482723,27.7218757 C6.35671649,28.5652372 5.82840379,28.9529897 4.97777189,28.9529897 C3.92356995,28.9529897 3.43160905,28.0441949 3.43160905,27.0820842 C3.43160905,26.1199734 3.96961556,25.2039083 5.01654713,25.2039083 C6.19676861,25.2039083 6.62571974,26.0690809 6.62571974,27.1741754 L3.89933543,27.1814457 Z M6.17011063,26.7936933 C6.11921812,26.1127031 5.75570021,25.5989311 5.02381749,25.5989311 C4.33555692,25.5989311 3.96961556,26.1757128 3.91387614,26.7936933 L6.17011063,26.7936933 Z" id="Shape" fill="#221F20" fill-rule="nonzero"></path>
                            <path d="M11.9670095,25.3178106 L12.403231,25.3178106 C12.3886903,25.5601558 12.3668792,25.8388529 12.3668792,26.1127031 L12.3668792,28.2283773 C12.3668792,28.9311786 12.403231,29.6679082 11.6228792,30.0338496 C11.3739184,30.1560977 11.0976213,30.2120249 10.8207164,30.1962209 C10.1809249,30.1962209 9.42238418,29.9781102 9.42238418,29.2462274 L9.88041674,29.2462274 C9.93615615,29.6679082 10.4208467,29.8084685 10.8788793,29.8084685 C11.4402784,29.8331736 11.9164462,29.4002938 11.9451985,28.8390874 L11.9451985,28.1799082 L11.9451985,28.1799082 C11.7102007,28.5964787 11.2649503,28.8498429 10.7867881,28.8390874 C9.72531577,28.8390874 9.2672832,28.0320776 9.2672832,27.0602731 C9.2672832,26.0884685 9.69381088,25.2039025 10.7722473,25.2039025 C11.2473843,25.2025172 11.688263,25.4510292 11.9330812,25.8582405 L11.9330812,25.8315825 L11.9670095,25.3178106 Z M10.813446,25.5989311 C10.047635,25.5989311 9.72531577,26.3720125 9.72531577,27.0190744 C9.72531577,27.6661363 10.0549053,28.446488 10.8279868,28.446488 C11.63742,28.446488 11.9451985,27.6927942 11.9451985,27.0045337 C11.9451985,26.3162731 11.5744102,25.5989311 10.813446,25.5989311 L10.813446,25.5989311 Z" id="Shape" fill="#221F20" fill-rule="nonzero"></path>
                            <path d="M16.4576674,27.0820842 C16.4576674,28.0102665 15.9390485,28.9529897 14.8145665,28.9529897 C13.6900844,28.9529897 13.1690421,28.0102665 13.1690421,27.0820842 C13.1690421,26.1539018 13.687661,25.2039083 14.8145665,25.2039083 C15.941472,25.2039083 16.4576674,26.1539018 16.4576674,27.0820842 Z M14.8145665,25.5989311 C13.9639346,25.5989311 13.6246512,26.4277519 13.6246512,27.0820842 C13.6246512,27.7364164 13.9639346,28.5652372 14.8145665,28.5652372 C15.6651984,28.5652372 16.0020583,27.7364164 16.0020583,27.0820842 C16.0020583,26.4277519 15.6651984,25.5989311 14.8145665,25.5989311 L14.8145665,25.5989311 Z" id="Shape" fill="#221F20" fill-rule="nonzero"></path>
                            <path d="M19.6905534,25.3178106 L20.1146576,25.3178106 L20.1146576,28.0514652 C20.1146576,28.3253154 20.1364687,28.6064359 20.1510094,28.8463577 L19.7147879,28.8463577 L19.6929768,28.3253154 L19.6784361,28.3253154 C19.4618347,28.7303207 19.0348706,28.9780537 18.5757651,28.9651069 C17.4222016,28.9651069 17.3325339,27.9448333 17.3325339,27.5376933 L17.3325339,25.3299278 L17.7542146,25.3299278 L17.7542146,27.6079734 C17.7542146,28.2186835 18.1056153,28.5773545 18.682397,28.5773545 C19.377928,28.5773545 19.6929768,27.9933024 19.6929768,27.3656281 L19.6905534,25.3178106 Z M18.478827,23.8637389 L18.9901755,23.8637389 L19.6857064,24.8840125 L19.3464231,24.8840125 L18.7211723,24.1375891 L18.0886511,24.8840125 L17.7663319,24.8840125 L18.478827,23.8637389 Z" id="Shape" fill="#221F20" fill-rule="nonzero"></path>
                            <path d="M21.5396478,25.705563 L20.8416934,25.705563 L20.8416934,25.3178106 L21.5444947,25.3178106 L21.5444947,24.5665402 L21.9661755,24.3823578 L21.9661755,25.3178106 L22.7659149,25.3178106 L22.7659149,25.705563 L21.9661755,25.705563 L21.9661755,28.066006 C21.9443381,28.2013067 21.9877232,28.3389695 22.0831908,28.4373012 C22.1786584,28.5356328 22.314979,28.5830668 22.450866,28.5652372 C22.5741867,28.5690185 22.6974145,28.5551452 22.8168074,28.5240385 L22.8168074,28.8875564 C22.6772141,28.9276393 22.5330514,28.9496302 22.3878562,28.9529897 C21.4936022,28.9529897 21.5444947,28.3834783 21.5444947,27.9036346 L21.5396478,25.705563 Z" id="Path" fill="#221F20" fill-rule="nonzero"></path>
                            <path d="M27.9642209,28.3253154 L27.9496802,28.2986574 C27.6836904,28.7090325 27.2269847,28.9556535 26.7379539,28.953011 C25.6910223,28.953011 25.2838822,27.9545271 25.2838822,27.0675434 C25.2838822,26.1805597 25.6861754,25.2111787 26.7379539,25.2111787 C27.2250599,25.2016659 27.6828148,25.4433605 27.9496802,25.8509702 L27.9642209,25.8509702 L27.9642209,23.7716477 L28.3859017,23.7716477 L28.3859017,28.0514652 C28.3859017,28.3253154 28.4052893,28.6064359 28.4198301,28.8463577 L27.9836086,28.8463577 L27.9642209,28.3253154 Z M26.8106574,25.5989311 C26.0084946,25.5989311 25.7491852,26.3429311 25.7491852,27.0190744 C25.7491852,27.6952177 25.9382145,28.5652372 26.7476477,28.5652372 C27.6685597,28.5652372 27.959374,27.7994262 27.959374,26.9972633 C27.9496802,26.2799213 27.627361,25.5989311 26.8106574,25.5989311 Z" id="Shape" fill="#221F20" fill-rule="nonzero"></path>
                            <path d="M29.6848724,27.1814457 C29.6994131,27.9327161 30.0435434,28.5652372 30.8965987,28.5652372 C31.3931317,28.5602048 31.8185015,28.2085927 31.9168723,27.7218757 L32.3603642,27.7218757 C32.1422534,28.5652372 31.6139407,28.9529897 30.7633088,28.9529897 C29.7091069,28.9529897 29.217146,28.0441949 29.217146,27.0820842 C29.217146,26.1199734 29.7454587,25.2111787 30.7923903,25.2111787 C31.9726117,25.2111787 32.4015629,26.0763513 32.4015629,27.1814457 L29.6848724,27.1814457 Z M31.9556476,26.7936933 C31.9047551,26.1127031 31.5412372,25.5989311 30.8093544,25.5989311 C30.1210939,25.5989311 29.7551525,26.1757128 29.6994131,26.7936933 L31.9556476,26.7936933 Z" id="Shape" fill="#221F20" fill-rule="nonzero"></path>
                            <polygon id="Path" fill="#221F20" fill-rule="nonzero" points="35.7289635 28.8390874 35.3072827 28.8390874 35.3072827 23.7716477 35.7289635 23.7716477"></polygon>
                            <path d="M38.8552175,26.3574718 C38.8140188,25.78069 38.5183575,25.5989311 38.0191263,25.5989311 C37.5780579,25.5989311 37.2121165,25.732221 37.1539537,26.2096412 L36.7056149,26.2096412 C36.8098234,25.4826054 37.3526768,25.2111787 38.0263966,25.2111787 C38.8067484,25.2111787 39.291439,25.5698497 39.2768982,26.3792829 L39.2768982,28.0514652 C39.2768982,28.3253154 39.2987093,28.6064359 39.31325,28.8463577 L38.8770285,28.8463577 L38.8624878,28.3253154 L38.8503706,28.3253154 L38.8285595,28.3762079 C38.5795018,28.7408081 38.1649916,28.9571533 37.723465,28.9529897 C37.0715563,28.9529897 36.5505139,28.5506965 36.5505139,27.8624359 C36.5519444,27.4077548 36.8347167,27.0014505 37.2605856,26.8421623 C37.7307354,26.6385923 38.3438689,26.7088724 38.8552175,26.6822145 L38.8552175,26.3574718 Z M37.8058624,28.5652372 C38.7267745,28.5652372 38.9036865,27.8066965 38.8600644,27.0675434 C38.263895,27.0893545 37.0133934,26.9778757 37.0133934,27.8624359 C37.0085465,28.3398561 37.3720644,28.5652372 37.8058624,28.5652372 Z" id="Shape" fill="#221F20" fill-rule="nonzero"></path>
                            <path d="M42.6309568,28.8390874 L42.6309568,25.6885988 L41.9257321,25.6885988 L41.9257321,25.3008464 L42.6358037,25.3008464 L42.6358037,24.5495761 C42.6358037,23.9437129 42.878149,23.6698627 43.4864356,23.6698627 C43.6221693,23.6809477 43.7562683,23.7069548 43.8863053,23.7474132 L43.8863053,24.0842731 C43.8007412,24.0683253 43.714015,24.0594095 43.6269959,24.0576152 C43.0502141,24.0576152 43.0356734,24.3435826 43.0574845,24.8500842 L43.0574845,25.3008464 L43.8644942,25.3008464 L43.8644942,25.6885988 L43.0647548,25.6885988 L43.0647548,28.8390874 L42.6309568,28.8390874 Z" id="Path" fill="#221F20" fill-rule="nonzero"></path>
                            <path d="M45.0907613,28.8390874 L44.6690805,28.8390874 L44.6690805,26.1127031 C44.6690805,25.8388529 44.6472695,25.5577324 44.6327288,25.3178106 L45.0762206,25.3178106 L45.0980317,25.8388529 L45.1101489,25.8388529 C45.2242851,25.4884694 45.5377416,25.2409534 45.9050414,25.2111787 C46.0456017,25.2111787 46.1861619,25.2111787 46.3267222,25.2111787 L46.3267222,25.6207422 C46.2419014,25.6207422 46.1522336,25.5916607 46.0674128,25.5916607 C45.442162,25.5916607 45.1101489,26.0424229 45.0980317,26.7161428 L45.0907613,28.8390874 Z" id="Path" fill="#221F20" fill-rule="nonzero"></path>
                            <path d="M49.0046375,26.3574718 C48.9634388,25.78069 48.6677775,25.5989311 48.1685463,25.5989311 C47.7250544,25.5989311 47.3591131,25.732221 47.3033737,26.2096412 L46.8526114,26.2096412 C46.9592434,25.4826054 47.4996733,25.2111787 48.1758166,25.2111787 C48.9561684,25.2111787 49.440859,25.5698497 49.4263182,26.3792829 L49.4263182,28.0514652 C49.4263182,28.3253154 49.4481293,28.6064359 49.46267,28.8463577 L49.0264485,28.8463577 L49.0119078,28.3253154 L48.9973671,28.3253154 L48.975556,28.3762079 C48.7272731,28.7404234 48.3136605,28.9567746 47.872885,28.9529897 C47.2185528,28.9529897 46.6999339,28.5506965 46.6999339,27.8624359 C46.7013644,27.4077548 46.9841367,27.0014505 47.4100056,26.8421623 C47.8801554,26.6385923 48.4908655,26.7088724 49.0046375,26.6822145 L49.0046375,26.3574718 Z M47.9504355,28.5652372 C48.8713476,28.5652372 49.0458362,27.8066965 49.0046375,27.0675434 C48.4060446,27.0893545 47.155543,26.9778757 47.155543,27.8624359 C47.155543,28.3398561 47.5214844,28.5652372 47.9504355,28.5652372 Z" id="Shape" fill="#221F20" fill-rule="nonzero"></path>
                            <path d="M50.4877905,23.8758562 L50.9991391,23.8758562 L51.6970934,24.8961298 L51.3771977,24.8961298 L50.7519469,24.1497064 L50.1194257,24.8961298 L49.7971065,24.8961298 L50.4877905,23.8758562 Z M50.5289892,28.8390874 L50.5289892,25.3178106 L50.95067,25.3178106 L50.95067,28.8390874 L50.5289892,28.8390874 Z" id="Shape" fill="#221F20" fill-rule="nonzero"></path>
                            <path d="M54.3095755,26.4010939 C54.2756471,25.8582405 53.9315168,25.5989311 53.3401944,25.5989311 C52.6931325,25.5989311 52.2932628,26.2726509 52.2932628,27.0748138 C52.2932628,27.8769766 52.6931325,28.5652372 53.3401944,28.5652372 C53.5782274,28.5873535 53.8151421,28.5127158 53.9975148,28.358155 C54.1798874,28.2035942 54.2923619,27.9821244 54.3095755,27.7436867 L54.7700315,27.7436867 C54.6585527,28.5506965 54.1932497,28.9554131 53.3935103,28.9554131 C52.336885,28.9554131 51.8449241,28.0466183 51.8449241,27.0845076 C51.8449241,26.1223969 52.3732367,25.2136021 53.4201683,25.2136021 C54.1472041,25.2136021 54.7361031,25.6498236 54.7700315,26.4035174 L54.3095755,26.4010939 Z" id="Path" fill="#221F20" fill-rule="nonzero"></path>
                            <path d="M55.666709,25.8509702 L55.6812497,25.8509702 C55.8978511,25.4459649 56.3248152,25.1982319 56.7839207,25.2111787 C57.9374842,25.2111787 58.0295754,26.2314522 58.0295754,26.6385923 L58.0295754,28.8390874 L57.6078946,28.8390874 L57.6078946,26.5610418 C57.6078946,25.9503317 57.256494,25.5916607 56.6797122,25.5916607 C55.9841813,25.5916607 55.666709,26.1757128 55.666709,26.8033871 L55.666709,28.8390874 L55.254722,28.8390874 L55.254722,23.7716477 L55.6764028,23.7716477 L55.666709,25.8509702 Z" id="Path" fill="#221F20" fill-rule="nonzero"></path>
                            <path d="M59.3988262,27.1814457 C59.4133669,27.9327161 59.7574972,28.5652372 60.6226698,28.5652372 C61.1186276,28.5599911 61.5431833,28.2082163 61.6405199,27.7218757 L62.0840118,27.7218757 C61.8659011,28.5652372 61.3375884,28.9529897 60.4893799,28.9529897 C59.4327545,28.9529897 58.9407936,28.0441949 58.9407936,27.0820842 C58.9407936,26.1199734 59.4691063,25.2111787 60.5160379,25.2111787 C61.6962594,25.2111787 62.1252105,26.0763513 62.1252105,27.1814457 L59.3988262,27.1814457 Z M61.6696014,26.7936933 C61.6211323,26.1127031 61.255191,25.5989311 60.5233082,25.5989311 C59.8350477,25.5989311 59.4691063,26.1757128 59.4133669,26.7936933 L61.6696014,26.7936933 Z" id="Shape" fill="#221F20" fill-rule="nonzero"></path>
                            <path d="M65.4332235,25.3178106 L65.8549042,25.3178106 L65.8549042,28.0514652 C65.8549042,28.3253154 65.8767153,28.6064359 65.891256,28.8463577 L65.4332235,28.8463577 L65.4114124,28.3253154 L65.3992951,28.3253154 C65.1823011,28.7311184 64.754168,28.978985 64.2942007,28.9651069 C63.1406372,28.9651069 63.0509694,27.9448333 63.0509694,27.5376933 L63.0509694,25.3299278 L63.4944613,25.3299278 L63.4944613,27.6079734 C63.4944613,28.2186835 63.8458619,28.5773545 64.4226437,28.5773545 C65.1181746,28.5773545 65.4332235,27.9933024 65.4332235,27.3656281 L65.4332235,25.3178106 Z" id="Path" fill="#221F20" fill-rule="nonzero"></path>
                            <path d="M67.3889498,28.8390874 L66.967269,28.8390874 L66.967269,26.1127031 C66.967269,25.8388529 66.945458,25.5577324 66.9333407,25.3178106 L67.3719856,25.3178106 L67.3937967,25.8388529 L67.4083374,25.8388529 C67.5219134,25.4880794 67.8356806,25.240318 68.2032299,25.2111787 C68.3437902,25.2111787 68.4843504,25.2111787 68.6249107,25.2111787 L68.6249107,25.6207422 C68.5400898,25.6207422 68.4479986,25.5916607 68.3631778,25.5916607 C67.737927,25.5916607 67.4083374,26.0424229 67.3937967,26.7161428 L67.3889498,28.8390874 Z" id="Path" fill="#221F20" fill-rule="nonzero"></path>
                            <path d="M8.84802588,15.941472 C8.09675554,13.789446 7.27035816,11.6737718 6.37852756,9.52174574 C4.58934161,13.4874958 3.1169369,17.5886737 1.97511397,21.78684 L0,21.78684 C1.50600106,16.9635147 3.30015887,12.2349337 5.37279468,7.62660571 L7.48604545,7.62660571 C9.53902418,12.2413308 11.3279951,16.9690364 12.8442994,21.78684 L10.7455894,21.78684 C10.3287555,20.4054719 9.89495746,19.0022928 9.42238418,17.5991137 L3.24742665,17.5991137 L3.76119862,15.941472 L8.84802588,15.941472 Z" id="Path" fill="#007CB1" fill-rule="nonzero"></path>
                            <path d="M16.5327945,21.78684 L14.635231,21.78684 L14.635231,7.62660571 L20.2091722,7.62660571 C23.3111917,7.62660571 25.8994392,7.96104219 25.8994392,11.5162473 C25.8994392,14.4001561 24.576234,15.3283385 22.4217846,15.5852244 L26.7428008,21.78684 L24.3920516,21.78684 L20.1849377,15.7039736 L17.9141625,15.7039736 L17.9141625,14.0560258 L20.8974328,14.0560258 C23.0228008,14.0560258 23.938866,13.709472 23.938866,11.5356349 C23.938866,9.52174574 22.8313481,9.28424737 20.9362081,9.28424737 L16.5327945,9.28424737 L16.5327945,21.78684 Z" id="Path" fill="#007CB1" fill-rule="nonzero"></path>
                            <path d="M30.8117779,20.1291983 L39.4029178,20.1291983 L39.4029178,21.78684 L28.9166379,21.78684 L28.9166379,7.62660571 L39.2066181,7.62660571 L39.2066181,9.28424737 L30.8117779,9.28424737 L30.8117779,20.1291983 Z M32.1955694,13.6706968 L38.5934846,13.6706968 L38.5934846,15.3283385 L32.1955694,15.3283385 L32.1955694,13.6706968 Z" id="Shape" fill="#007CB1" fill-rule="nonzero"></path>
                            <path d="M51.5710739,11.7731333 C51.1154648,9.42238418 49.5765723,9.00797376 47.6402336,9.00797376 C44.2231652,9.00797376 42.9193477,10.3917653 42.9193477,14.8242603 C42.9193477,18.5975762 43.8669177,20.3982015 47.540872,20.3982015 C49.4965984,20.3982015 51.0766895,19.913511 51.5710739,16.8236088 L53.4662139,16.8236088 C52.8748915,21.7020191 49.3972368,22.0970419 47.4827092,22.0970419 C43.3337581,22.0970419 40.9636213,20.2406771 40.9636213,14.7491333 C40.9636213,9.69381088 42.979934,7.30186305 47.4827092,7.30186305 C51.1566635,7.30186305 53.1099664,8.88195422 53.4662139,11.765863 L51.5710739,11.7731333 Z" id="Path" fill="#007CB1" fill-rule="nonzero"></path>
                            <path d="M68.9641941,4.11986962 C68.6202807,4.22535802 68.2559192,4.03233562 68.1500103,3.68855154 C68.0441013,3.34476746 68.2366779,2.98017013 68.5803322,2.87384082 C68.9239865,2.7675115 69.2888191,2.95964207 69.3955687,3.30316606 C69.4469989,3.46867066 69.4304092,3.64784242 69.3494652,3.80109032 C69.2685212,3.95433822 69.1298863,4.06904693 68.9641941,4.11986962 Z" id="Path" fill="#007CB1" fill-rule="nonzero"></path>
                            <path d="M73.8038292,2.36771331 C73.5903553,2.43395753 73.3635985,2.31460667 73.2973505,2.10113399 C73.2311024,1.8876613 73.3504492,1.6609024 73.5639207,1.59465053 C73.7773922,1.52839866 74.0041533,1.64774138 74.070409,1.86121169 C74.1352409,2.07455936 74.0163959,2.30036493 73.8038292,2.36771331 L73.8038292,2.36771331 Z" id="Path" fill="#C0CB50" fill-rule="nonzero"></path>
                            <path d="M72.170422,6.32763505 C72.025629,6.37461791 71.8667961,6.32956985 71.7682294,6.21356555 C71.6696626,6.09756125 71.6508521,5.93353869 71.7205979,5.79823191 C71.7903437,5.66292513 71.9348546,5.58308887 72.0865247,5.59607262 C72.2381948,5.60905638 72.3670337,5.71229281 72.4127673,5.85748523 C72.4747153,6.0541543 72.3665501,6.26399485 72.170422,6.32763505 Z" id="Path" fill="#B23634" fill-rule="nonzero"></path>
                            <path d="M68.3122853,0.981498352 C68.1115199,1.04306641 67.8988566,0.930224666 67.8372886,0.729459269 C67.7757205,0.528693872 67.8885622,0.316030591 68.0893276,0.254462536 C68.1857185,0.221567833 68.2912737,0.228691817 68.3823704,0.274240174 C68.4734671,0.31978853 68.5424994,0.39995828 68.5740182,0.496807808 C68.6061914,0.595789263 68.5964126,0.703629617 68.5469596,0.795209327 C68.4975066,0.886789038 68.4126968,0.95411267 68.3122853,0.981498352 L68.3122853,0.981498352 Z" id="Path" fill="#C0CB50" fill-rule="nonzero"></path>
                            <path d="M70.4546175,2.03570029 C70.3089483,2.08368163 70.1487253,2.03890418 70.049038,1.92235315 C69.9493506,1.80580213 69.9299539,1.6405744 69.9999382,1.50410496 C70.0699225,1.36763552 70.2154191,1.28696847 70.3682401,1.29990892 C70.5210611,1.31284936 70.650922,1.4168329 70.6969628,1.563127 C70.7590545,1.76042314 70.6510708,1.97099136 70.4546175,2.03570029 L70.4546175,2.03570029 Z" id="Path" fill="#B23634" fill-rule="nonzero"></path>
                            <path d="M74.0413275,6.69115296 C73.8965345,6.73813581 73.7377016,6.69308776 73.6391349,6.57708346 C73.5405681,6.46107916 73.5217576,6.2970566 73.5915034,6.16174982 C73.6612492,6.02644304 73.8057601,5.94660678 73.9574302,5.95959053 C74.1091003,5.97257428 74.2379392,6.07581072 74.2836728,6.22100313 C74.3141047,6.31548304 74.3056462,6.41819368 74.2601676,6.50642211 C74.2146891,6.59465053 74.1359374,6.66112763 74.0413275,6.69115296 Z" id="Path" fill="#007CB1" fill-rule="nonzero"></path>
                            <path d="M67.9293798,7.3963777 C67.2699044,7.74373676 66.4609479,7.61993978 65.9355362,7.09125402 C65.4101246,6.56256826 65.2913553,5.75285827 65.6428044,5.0955535 C65.9942535,4.43824872 66.7335807,4.08734756 67.4650319,4.2306838 C68.196483,4.37402004 68.748688,4.97801177 68.8260573,5.71934842 C68.894635,6.4084174 68.5405061,7.07073431 67.9293798,7.3963777 L67.9293798,7.3963777 Z" id="Path" fill="#007CB1" fill-rule="nonzero"></path>
                            <path d="M65.6561811,2.66579799 C65.3122678,2.77128639 64.9479062,2.57826399 64.8419973,2.23447991 C64.7360884,1.89069583 64.928665,1.5260985 65.2723193,1.41976918 C65.6159736,1.31343987 65.9808061,1.50557043 66.0875557,1.84909443 C66.1396668,2.01459613 66.1233888,2.19406831 66.0423512,2.34749349 C65.9613135,2.50091867 65.8222547,2.61553928 65.6561811,2.66579799 L65.6561811,2.66579799 Z" id="Path" fill="#F3D854" fill-rule="nonzero"></path>
                            <path d="M72.8077901,8.35606498 C72.5557387,8.43367918 72.2817536,8.3517827 72.1136414,8.14857798 C71.9455292,7.94537326 71.9164119,7.6608965 72.039872,7.42784825 C72.1633321,7.19479999 72.4150449,7.05909634 72.6775934,7.08403928 C72.940142,7.10898223 73.1617978,7.28965741 73.2391647,7.54178487 C73.2905279,7.70696792 73.2738736,7.88581625 73.1928945,8.03867568 C73.1119154,8.19153511 72.9733029,8.30577458 72.8077901,8.35606498 Z" id="Path" fill="#F3D854" fill-rule="nonzero"></path>
                            <path d="M62.0718945,6.58452104 C61.6314965,6.72015548 61.1527616,6.57707074 60.8590212,6.22201629 C60.5652807,5.86696184 60.5144134,5.36989764 60.7301488,4.96270563 C60.9458843,4.55551363 61.385714,4.31842697 61.8444562,4.3620473 C62.3031984,4.40566763 62.6904624,4.7214 62.8255883,5.16195429 C63.0099015,5.76287493 62.672602,6.39951426 62.0718945,6.58452104 L62.0718945,6.58452104 Z" id="Path" fill="#007CB1" fill-rule="nonzero"></path>
                            <path d="M69.9602331,8.25670342 C69.7065603,8.47115344 69.3412261,8.49075634 69.0660622,8.30468237 C68.7908983,8.11860839 68.6730356,7.77225351 68.7775882,7.45696402 C68.7976185,7.38545122 68.8332029,7.31924774 68.8817967,7.2630878 C69.0884482,6.9932533 69.4520805,6.89843888 69.7641786,7.03301329 C70.0762766,7.1675877 70.2569426,7.49709952 70.2025784,7.83259919 C70.1798131,8.00003263 70.0929257,8.1520856 69.9602331,8.25670342 L69.9602331,8.25670342 Z" id="Path" fill="#C0CB50" fill-rule="nonzero"></path>
                            <path d="M70.0983699,11.4871659 C69.4003145,11.5169964 68.809771,10.9762949 68.7780933,10.2783209 C68.7464157,9.58034684 69.2855525,8.98837456 69.9834403,8.95484994 C70.6813281,8.92132531 71.274725,9.45889375 71.3100963,10.1566904 C71.3278652,10.4943213 71.2097425,10.8250159 70.9820865,11.0749822 C70.7544305,11.3249485 70.4361871,11.4733838 70.0983699,11.4871659 Z" id="Path" fill="#007CB1" fill-rule="nonzero"></path>
                            <path d="M64.7061876,5.44549826 C64.3547625,5.55397191 63.9726031,5.43993914 63.7380837,5.15662514 C63.5035644,4.87331115 63.4629254,4.47657732 63.6351354,4.15160053 C63.8073453,3.82662375 64.1584492,3.63748012 64.5245681,3.67245309 C64.890687,3.70742605 65.1996328,3.95961994 65.3072039,4.31132239 C65.4537389,4.7904165 65.184904,5.29773391 64.7061876,5.44549826 L64.7061876,5.44549826 Z" id="Path" fill="#B23634" fill-rule="nonzero"></path>
                            <path d="M61.9798033,7.28974578 C56.6482073,7.28974578 55.1456667,10.6074526 55.1456667,14.6764297 C55.1456667,18.6460452 56.5682334,22.1236999 61.999191,22.1236999 C67.3307869,22.1236999 68.8527152,18.784182 68.8527152,14.6958173 C68.8527152,10.7262017 67.4107609,7.28974578 61.9798033,7.28974578 Z M66.7540052,16.5546055 C66.6802446,17.4914023 66.3207338,18.382989 65.7240378,19.1089247 C64.7958554,20.1655501 63.3417838,20.4248595 61.999191,20.4248595 C58.4245982,20.4248595 57.101393,18.60727 57.101393,14.6958173 C57.101393,13.1666186 57.2540705,11.3611464 58.3737057,10.1954656 C58.8677597,9.70285025 59.4884184,9.35645559 60.1670607,9.19457962 C60.9304483,8.99343305 61.5968978,9.23577832 62.3118164,9.11945259 C63.0994385,8.98858614 63.6035167,8.21308127 64.4929238,8.44330928 C65.2975101,8.65414967 65.5398554,9.55809753 65.8961029,10.2075829 C66.2523505,10.8570682 66.7418879,11.3247946 67.1659922,11.8797652 C67.684611,12.5607555 67.9875426,13.4113874 67.5949433,14.2038564 C67.2023439,14.9963254 66.8412495,15.6433873 66.7540052,16.5546055 Z" id="Shape" fill="#007CB1" fill-rule="nonzero"></path>
                            <path d="M62.9419141,18.6242342 C62.1332712,19.0614884 61.1337358,18.9180103 60.4807413,18.2709456 C59.8277468,17.6238808 59.6751567,16.6256959 60.1050162,15.813098 C60.5348757,15.0005 61.445898,14.5649597 62.3482416,14.7406597 C63.2505853,14.9163597 63.9316332,15.6619001 64.0251974,16.5764166 C64.1103436,17.4150652 63.6831032,18.2227121 62.9419141,18.6242342 Z" id="Path" fill="#007CB1" fill-rule="nonzero"></path>
                            <path d="M60.8892496,14.3371463 C60.2330302,14.5436634 59.5170617,14.3334194 59.0766891,13.8048882 C58.6363165,13.276357 58.5587443,12.5342006 58.8803058,11.92603 C59.2018672,11.3178594 59.8588853,10.9641071 60.5436262,11.0304635 C61.2283671,11.0968199 61.8052355,11.5701448 62.0040379,12.2287424 C62.2725395,13.1182415 61.7755366,14.0582252 60.8892496,14.3371463 L60.8892496,14.3371463 Z" id="Path" fill="#F3D854" fill-rule="nonzero"></path>
                            <path d="M66.1045199,15.0472179 C65.2097131,15.3201743 64.2628315,14.8172231 63.9879949,13.922992 C63.7131582,13.0287609 64.2141179,12.0808243 65.1077693,11.8041085 C66.0014207,11.5273928 66.9504083,12.0263587 67.2290019,12.9194265 C67.3635385,13.3507007 67.320493,13.8178242 67.1094073,14.2172492 C66.8983216,14.6166743 66.5366339,14.9154037 66.1045199,15.0472179 L66.1045199,15.0472179 Z" id="Path" fill="#B23634" fill-rule="nonzero"></path>
                            <path d="M64.5195818,11.6931594 C64.0109306,11.8511461 63.4572043,11.6869388 63.1169124,11.2771983 C62.7766206,10.8674577 62.716877,10.2929948 62.9655733,9.82200017 C63.2142696,9.35100549 63.7223568,9.07637063 64.2526321,9.12631011 C64.7829074,9.17624959 65.2307876,9.54091412 65.3871779,10.0500584 C65.4907905,10.3829954 65.4575115,10.7434916 65.2946995,11.0518338 C65.1318876,11.3601759 64.8529558,11.5909617 64.5195818,11.6931594 L64.5195818,11.6931594 Z" id="Path" fill="#C0CB50" fill-rule="nonzero"></path>
                        </g>
                    </g>
                </g>
            </g>
        </g>
    </g>
</svg>