<?xml version="1.0" encoding="UTF-8"?>
<svg width="300px" height="300px" viewBox="0 0 300 300" version="1.1" xmlns="http://www.w3.org/2000/svg" xmlns:xlink="http://www.w3.org/1999/xlink">
    <!-- Generator: Sketch 60 (88103) - https://sketch.com -->
    <title>environnement/expert/ABC</title>
    <desc>Created with Sketch.</desc>
    <g id="environnement/expert/ABC" stroke="none" stroke-width="1" fill="none" fill-rule="evenodd">
        <g id="logo-abc_" transform="translate(45.000000, 116.000000)">
            <path d="M105.288004,28.4628011 L97.8228039,11.1900004 L90.4224036,28.4628011 L105.288004,28.4628011 Z M94.4328038,2.12280008 L101.463604,2.12280008 L120.462005,45.6120018 L112.441204,45.6120018 L108.064804,35.1864014 L87.6444035,35.1864014 L83.2056033,45.6120018 L75.434403,45.6120018 L94.4328038,2.12280008 L94.4328038,2.12280008 Z" id="Fill-1" fill="#2C5595"></path>
            <path d="M147.900006,38.8848015 C153.084006,38.8848015 156.226806,36.8484015 156.226806,32.9640013 L156.226806,32.8404013 C156.226806,29.1996012 153.331206,27.0444011 147.346806,27.0444011 L135.318005,27.0444011 L135.318005,38.8848015 L147.900006,38.8848015 Z M145.682406,20.6292008 C150.553206,20.6292008 153.825606,18.7152007 153.825606,14.7696006 L153.825606,14.6436006 C153.825606,11.2524004 151.107606,9.15360036 146.235606,9.15360036 L135.318005,9.15360036 L135.318005,20.6292008 L145.682406,20.6292008 Z M127.854005,2.4300001 L147.223206,2.4300001 C152.156406,2.4300001 156.043206,3.78720015 158.510406,6.25440025 C160.423206,8.16960032 161.409606,10.5108004 161.409606,13.4076005 L161.409606,13.5348005 C161.409606,18.7152007 158.450406,21.4908009 155.242806,23.1552009 C160.298406,24.880801 163.815607,27.7848011 163.815607,33.6444013 L163.815607,33.7656013 C163.815607,41.4768016 157.461606,45.6120018 147.840006,45.6120018 L127.854005,45.6120018 L127.854005,2.4300001 L127.854005,2.4300001 Z" id="Fill-2" fill="#2C5595"></path>
            <path d="M170.468407,24.144001 L170.468407,24.020401 C170.468407,11.7456005 179.658007,1.68840007 192.734408,1.68840007 C200.691608,1.68840007 205.504808,4.46400018 209.635208,8.41560033 L204.763208,14.0292006 C201.309608,10.8192004 197.608808,8.66280034 192.674408,8.66280034 C184.407607,8.66280034 178.423207,15.4440006 178.423207,23.8968009 L178.423207,24.020401 C178.423207,32.4708013 184.407607,39.3780016 192.674408,39.3780016 C197.979608,39.3780016 201.370808,37.2228015 205.070408,33.7656013 L209.946008,38.7036015 C205.440008,43.3884017 200.506808,46.3524018 192.427208,46.3524018 C179.841607,46.3524018 170.468407,36.5412015 170.468407,24.144001" id="Fill-3" fill="#2C5595"></path>
            <path d="M37.9668015,2.38920009 C36.6672015,7.82880031 35.2884014,13.2480005 33.8988013,18.6648007 L29.6436012,34.8888014 L25.224001,51.070802 L22.9572009,59.1444024 L20.6148008,67.2000027 L22.6104009,59.0508023 L24.680401,50.923202 L28.9380011,34.6992014 L33.3588013,18.5196007 C34.8612014,13.1340005 36.3756014,7.75080031 37.9668015,2.38920009" id="Fill-4" fill="#2C5595"></path>
            <path d="M31.2180012,1.20240005 C25.677601,1.20240005 20.4696008,2.6232001 15.9312006,5.1132002 C19.7544008,3.36840013 23.997601,2.38800009 28.4748011,2.38800009 C45.1836018,2.38800009 58.7292023,15.9336006 58.7292023,32.6436013 C58.7292023,49.353602 45.1836018,62.8992025 28.4748011,62.8992025 C21.1536008,62.8992025 14.4396006,60.2976024 9.20640037,55.9704022 C14.9220006,61.4532024 22.6740009,64.8276026 31.2180012,64.8276026 C48.7884019,64.8276026 63.0312025,50.583602 63.0312025,33.0156013 C63.0312025,15.4440006 48.7884019,1.20240005 31.2180012,1.20240005" id="Fill-5" fill="#2C5595"></path>
            <g id="Group-10" transform="translate(0.000000, 4.800000)" fill="#2C5595">
                <path d="M58.7892023,19.5144008 C59.2908024,17.7672007 58.6704023,15.8112006 57.1632023,13.8276005 C58.1604023,15.4200006 58.5312023,16.9752007 58.1244023,18.3852007 C56.6088022,23.6544009 44.9460018,24.925201 32.0772013,21.2256008 C19.2048008,17.5260007 9.9984004,10.2540004 11.5128005,4.9860002 C12.1764005,2.67720011 14.7876006,1.13640005 18.5964007,0.445200018 C13.8564006,1.03320004 10.5528004,2.73000011 9.77880039,5.42400022 C8.18520033,10.9644004 17.8668007,18.6096007 31.4004012,22.5000009 C44.9340018,26.391601 57.1956023,25.054801 58.7892023,19.5144008" id="Fill-6"></path>
                <path d="M50.038802,50.364002 C50.540402,48.6168019 49.920002,46.6596019 48.4128019,44.6760018 C49.410002,46.2696018 49.780802,47.8236019 49.374002,49.234802 C47.8584019,54.5040022 36.1968014,55.7748022 23.3268009,52.0752021 C10.4544004,48.3744019 1.24800005,41.1036016 2.76240011,35.8344014 C3.42720014,33.5256013 6.03840024,31.9848013 9.84600039,31.2948012 C5.1060002,31.8816013 1.80360007,33.5772013 1.02960004,36.2724014 C-0.564000022,41.8140017 9.11760036,49.458002 22.6500009,53.3496021 C36.1848014,57.2400023 48.4464019,55.9032022 50.038802,50.364002" id="Fill-8"></path>
                <path d="M60.5220024,35.5776014 C61.1400024,33.4272013 60.3744024,31.0200012 58.5216023,28.5804011 C59.7480024,30.5388012 60.2028024,32.4528013 59.7036024,34.1904014 C57.8376023,40.6740016 43.4880017,42.2364017 27.6492011,37.6836015 C11.8092005,33.1308013 0.481200019,24.182401 2.34360009,17.7000007 C3.16080013,14.8584006 6.37560025,12.9636005 11.0616004,12.1116005 C5.22840021,12.8352005 1.16400005,14.9232006 0.211200008,18.2388007 C-1.74960007,25.057201 10.1628004,34.4652014 26.8176011,39.2532016 C43.4736017,44.0412018 58.5624023,42.3948017 60.5220024,35.5776014" id="Fill-9"></path>
            </g>
            <path d="M48.9492019,9.29760037 C49.190402,8.45760034 48.8916019,7.5168003 48.1668019,6.56400026 C48.6468019,7.32840029 48.8256019,8.07600032 48.6300019,8.75520035 C47.9016019,11.2872004 42.2940017,11.8992005 36.1056014,10.1208004 C29.9184012,8.34120033 25.490401,4.84560019 26.220001,2.31360009 C26.5392011,1.20240005 27.7944011,0.462000018 29.6256012,0.128400005 C27.3456011,0.412800016 25.758001,1.22640005 25.384801,2.5248001 C24.620401,5.18640021 29.2740012,8.86200035 35.7828014,10.7328004 C42.2868017,12.6048005 48.1836019,11.9616005 48.9492019,9.29760037" id="Fill-11" fill="#2C5595"></path>
            <path d="M78.6348031,62.6076025 L77.6376031,60.3000024 L76.647603,62.6076025 L78.6348031,62.6076025 Z M77.1840031,59.0880023 L78.1236031,59.0880023 L80.6616032,64.8984026 L79.5888032,64.8984026 L79.0056031,63.5064025 L76.278003,63.5064025 L75.684003,64.8984026 L74.644803,64.8984026 L77.1840031,59.0880023 L77.1840031,59.0880023 Z" id="Fill-12" fill="#7BABD0"></path>
            <path d="M81.1632032,64.0572025 L81.7728032,63.3324025 C82.3248033,63.8112025 82.8780033,64.0824025 83.5944033,64.0824025 C84.2208033,64.0824025 84.6168034,63.7944025 84.6168034,63.3576025 L84.6168034,63.3420025 C84.6168034,62.9292025 84.3852034,62.7072025 83.3136033,62.4588025 C82.0848033,62.1636025 81.3936032,61.8000025 81.3936032,60.7356024 L81.3936032,60.7200024 C81.3936032,59.7300024 82.2180033,59.0484023 83.3640033,59.0484023 C84.2040033,59.0484023 84.8724034,59.3016024 85.4568034,59.7732024 L84.9132034,60.5388024 C84.3936034,60.1524024 83.8752033,59.9448024 83.3460033,59.9448024 C82.7532033,59.9448024 82.4076033,60.2496024 82.4076033,60.6288024 L82.4076033,60.6468024 C82.4076033,61.0908024 82.6716033,61.2888024 83.7756033,61.5516024 C84.9948034,61.8492025 85.6296034,62.2860025 85.6296034,63.2412025 L85.6296034,63.2592025 C85.6296034,64.3380026 84.7812034,64.9800026 83.5692033,64.9800026 C82.6884033,64.9800026 81.8556033,64.6752026 81.1632032,64.0572025" id="Fill-13" fill="#7BABD0"></path>
            <path d="M86.3544034,64.0572025 L86.9652035,63.3324025 C87.5160035,63.8112025 88.0692035,64.0824025 88.7856035,64.0824025 C89.4120036,64.0824025 89.8080036,63.7944025 89.8080036,63.3576025 L89.8080036,63.3420025 C89.8080036,62.9292025 89.5764036,62.7072025 88.5048035,62.4588025 C87.2772035,62.1636025 86.5860034,61.8000025 86.5860034,60.7356024 L86.5860034,60.7200024 C86.5860034,59.7300024 87.4104035,59.0484023 88.5552035,59.0484023 C89.3952036,59.0484023 90.0636036,59.3016024 90.6480036,59.7732024 L90.1044036,60.5388024 C89.5860036,60.1524024 89.0664035,59.9448024 88.5384035,59.9448024 C87.9444035,59.9448024 87.5988035,60.2496024 87.5988035,60.6288024 L87.5988035,60.6468024 C87.5988035,61.0908024 87.8628035,61.2888024 88.9668035,61.5516024 C90.1884036,61.8492025 90.8208036,62.2860025 90.8208036,63.2412025 L90.8208036,63.2592025 C90.8208036,64.3380026 89.9724036,64.9800026 88.7616035,64.9800026 C87.8796035,64.9800026 87.0468035,64.6752026 86.3544034,64.0572025" id="Fill-14" fill="#7BABD0"></path>
            <path d="M96.7308038,62.0304025 L96.7308038,62.0148025 C96.7308038,60.8928024 95.9136038,59.9628024 94.7688038,59.9628024 C93.6240037,59.9628024 92.8236037,60.8760024 92.8236037,61.9968025 L92.8236037,62.0148025 C92.8236037,63.1356025 93.6384037,64.0668025 94.7856038,64.0668025 C95.9304038,64.0668025 96.7308038,63.1524025 96.7308038,62.0304025 Z M91.7604036,62.0304025 L91.7604036,62.0148025 C91.7604036,60.3900024 93.0120037,59.0292023 94.7856038,59.0292023 C96.5568038,59.0292023 97.7928039,60.3744024 97.7928039,61.9968025 L97.7928039,62.0148025 C97.7928039,63.6372025 96.5412038,64.9980026 94.7688038,64.9980026 C92.9952037,64.9980026 91.7604036,63.6540025 91.7604036,62.0304025 L91.7604036,62.0304025 Z" id="Fill-15" fill="#7BABD0"></path>
            <path d="M98.7648039,62.0304025 L98.7648039,62.0148025 C98.7648039,60.3744024 99.993604,59.0292023 101.738404,59.0292023 C102.802804,59.0292023 103.446004,59.4012024 103.998004,59.9280024 L103.346404,60.6792024 C102.885604,60.2496024 102.391204,59.9628024 101.732404,59.9628024 C100.627204,59.9628024 99.829204,60.8676024 99.829204,61.9968025 L99.829204,62.0148025 C99.829204,63.1428025 100.627204,64.0668025 101.732404,64.0668025 C102.440404,64.0668025 102.892804,63.7776025 103.388404,63.3168025 L104.038804,63.9756025 C103.437604,64.6032026 102.778804,64.9980026 101.697604,64.9980026 C100.017604,64.9980026 98.7648039,63.6876025 98.7648039,62.0304025" id="Fill-16" fill="#7BABD0"></path>
            <polygon id="Fill-17" fill="#7BABD0" points="105.159604 64.8984026 106.172404 64.8984026 106.172404 59.1300023 105.159604 59.1300023"></polygon>
            <path d="M111.207604,62.6076025 L110.210404,60.3000024 L109.222804,62.6076025 L111.207604,62.6076025 Z M109.756804,59.0880023 L110.696404,59.0880023 L113.236804,64.8984026 L112.164004,64.8984026 L111.579604,63.5064025 L108.850804,63.5064025 L108.256804,64.8984026 L107.218804,64.8984026 L109.756804,59.0880023 L109.756804,59.0880023 Z" id="Fill-18" fill="#7BABD0"></path>
            <polyline id="Fill-19" fill="#7BABD0" points="114.898805 60.0696024 113.070004 60.0696024 113.070004 59.1300023 117.751205 59.1300023 117.751205 60.0696024 115.921205 60.0696024 115.921205 64.8984026 114.898805 64.8984026 114.898805 60.0696024"></polyline>
            <polygon id="Fill-20" fill="#7BABD0" points="118.880405 64.8984026 119.893205 64.8984026 119.893205 59.1300023 118.880405 59.1300023"></polygon>
            <path d="M126.148805,62.0304025 L126.148805,62.0148025 C126.148805,60.8928024 125.332805,59.9628024 124.185605,59.9628024 C123.040805,59.9628024 122.240405,60.8760024 122.240405,61.9968025 L122.240405,62.0148025 C122.240405,63.1356025 123.056405,64.0668025 124.202405,64.0668025 C125.349605,64.0668025 126.148805,63.1524025 126.148805,62.0304025 Z M121.178405,62.0304025 L121.178405,62.0148025 C121.178405,60.3900024 122.430005,59.0292023 124.202405,59.0292023 C125.973605,59.0292023 127.210805,60.3744024 127.210805,61.9968025 L127.210805,62.0148025 C127.210805,63.6372025 125.958005,64.9980026 124.185605,64.9980026 C122.414405,64.9980026 121.178405,63.6540025 121.178405,62.0304025 L121.178405,62.0304025 Z" id="Fill-21" fill="#7BABD0"></path>
            <polyline id="Fill-22" fill="#7BABD0" points="128.437205 59.1300023 129.378005 59.1300023 132.468005 63.1188025 132.468005 59.1300023 133.465205 59.1300023 133.465205 64.8984026 132.615605 64.8984026 129.435605 60.7944024 129.435605 64.8984026 128.437205 64.8984026 128.437205 59.1300023"></polyline>
            <path d="M140.857206,64.0008025 C141.549606,64.0008025 141.968406,63.7284025 141.968406,63.2088025 L141.968406,63.1920025 C141.968406,62.7072025 141.582006,62.4180025 140.781606,62.4180025 L139.174806,62.4180025 L139.174806,64.0008025 L140.857206,64.0008025 Z M140.559606,61.5612024 C141.211206,61.5612024 141.648006,61.3056024 141.648006,60.7776024 L141.648006,60.7608024 C141.648006,60.3084024 141.284406,60.0264024 140.634006,60.0264024 L139.174806,60.0264024 L139.174806,61.5612024 L140.559606,61.5612024 Z M138.178805,59.1300023 L140.766006,59.1300023 C141.424806,59.1300023 141.943206,59.3112024 142.274406,59.6412024 C142.530006,59.8956024 142.662006,60.2088024 142.662006,60.5964024 L142.662006,60.6144024 C142.662006,61.3056024 142.266006,61.6752025 141.837606,61.8984025 C142.514406,62.1276025 142.983606,62.5176025 142.983606,63.3000025 L142.983606,63.3168025 C142.983606,64.3476026 142.134006,64.8984026 140.847606,64.8984026 L138.178805,64.8984026 L138.178805,59.1300023 L138.178805,59.1300023 Z" id="Fill-23" fill="#7BABD0"></path>
            <polygon id="Fill-24" fill="#7BABD0" points="144.186006 64.8984026 145.198806 64.8984026 145.198806 59.1300023 144.186006 59.1300023"></polygon>
            <polyline id="Fill-25" fill="#7BABD0" points="146.738406 59.1300023 147.753606 59.1300023 147.753606 63.9756025 150.786006 63.9756025 150.786006 64.8984026 146.738406 64.8984026 146.738406 59.1300023"></polyline>
            <path d="M155.335206,62.6076025 L154.336806,60.3000024 L153.349206,62.6076025 L155.335206,62.6076025 Z M153.884406,59.0880023 L154.824006,59.0880023 L157.362006,64.8984026 L156.290406,64.8984026 L155.706006,63.5064025 L152.978406,63.5064025 L152.385606,64.8984026 L151.344006,64.8984026 L153.884406,59.0880023 L153.884406,59.0880023 Z" id="Fill-26" fill="#7BABD0"></path>
            <polyline id="Fill-27" fill="#7BABD0" points="158.349606 59.1300023 159.288006 59.1300023 162.380406 63.1188025 162.380406 59.1300023 163.378806 59.1300023 163.378806 64.8984026 162.528006 64.8984026 159.346806 60.7944024 159.346806 64.8984026 158.349606 64.8984026 158.349606 59.1300023"></polyline>
            <path d="M167.077207,62.0304025 L167.077207,62.0148025 C167.077207,60.3744024 168.304807,59.0292023 170.050807,59.0292023 C171.115207,59.0292023 171.757207,59.4012024 172.309207,59.9280024 L171.658807,60.6792024 C171.196807,60.2496024 170.702407,59.9628024 170.043607,59.9628024 C168.938407,59.9628024 168.139207,60.8676024 168.139207,61.9968025 L168.139207,62.0148025 C168.139207,63.1428025 168.938407,64.0668025 170.043607,64.0668025 C170.752807,64.0668025 171.205207,63.7776025 171.700807,63.3168025 L172.351207,63.9756025 C171.750007,64.6032026 171.088807,64.9980026 170.011207,64.9980026 C168.328807,64.9980026 167.077207,63.6876025 167.077207,62.0304025" id="Fill-28" fill="#7BABD0"></path>
            <path d="M176.907607,62.6076025 L175.910407,60.3000024 L174.921607,62.6076025 L176.907607,62.6076025 Z M175.456807,59.0880023 L176.396407,59.0880023 L178.935607,64.8984026 L177.864007,64.8984026 L177.278407,63.5064025 L174.550807,63.5064025 L173.956807,64.8984026 L172.917607,64.8984026 L175.456807,59.0880023 L175.456807,59.0880023 Z" id="Fill-29" fill="#7BABD0"></path>
            <path d="M182.420407,61.9896025 C183.144007,61.9896025 183.606007,61.6104024 183.606007,61.0248024 L183.606007,61.0092024 C183.606007,60.3900024 183.162007,60.0516024 182.410807,60.0516024 L180.936007,60.0516024 L180.936007,61.9896025 L182.420407,61.9896025 Z M179.923207,59.1300023 L182.494807,59.1300023 C183.219607,59.1300023 183.787207,59.3436024 184.159207,59.7060024 C184.464007,60.0192024 184.636807,60.4476024 184.636807,60.9504024 L184.636807,60.9684024 C184.636807,61.9152025 184.068007,62.4840025 183.260407,62.7144025 L184.819207,64.8984026 L183.622807,64.8984026 L182.205607,62.8872025 L180.936007,62.8872025 L180.936007,64.8984026 L179.923207,64.8984026 L179.923207,59.1300023 L179.923207,59.1300023 Z" id="Fill-30" fill="#7BABD0"></path>
            <path d="M188.560807,64.0008025 C189.250808,64.0008025 189.672008,63.7284025 189.672008,63.2088025 L189.672008,63.1920025 C189.672008,62.7072025 189.284408,62.4180025 188.485207,62.4180025 L186.878407,62.4180025 L186.878407,64.0008025 L188.560807,64.0008025 Z M188.262007,61.5612024 C188.912408,61.5612024 189.349208,61.3056024 189.349208,60.7776024 L189.349208,60.7608024 C189.349208,60.3084024 188.986808,60.0264024 188.335207,60.0264024 L186.878407,60.0264024 L186.878407,61.5612024 L188.262007,61.5612024 Z M185.880007,59.1300023 L188.469607,59.1300023 C189.128408,59.1300023 189.646808,59.3112024 189.978008,59.6412024 C190.232408,59.8956024 190.363208,60.2088024 190.363208,60.5964024 L190.363208,60.6144024 C190.363208,61.3056024 189.969608,61.6752025 189.540008,61.8984025 C190.214408,62.1276025 190.684808,62.5176025 190.684808,63.3000025 L190.684808,63.3168025 C190.684808,64.3476026 189.836408,64.8984026 188.551207,64.8984026 L185.880007,64.8984026 L185.880007,59.1300023 L185.880007,59.1300023 Z" id="Fill-31" fill="#7BABD0"></path>
            <path d="M196.544408,62.0304025 L196.544408,62.0148025 C196.544408,60.8928024 195.728408,59.9628024 194.581208,59.9628024 C193.436408,59.9628024 192.637208,60.8760024 192.637208,61.9968025 L192.637208,62.0148025 C192.637208,63.1356025 193.453208,64.0668025 194.598008,64.0668025 C195.744008,64.0668025 196.544408,63.1524025 196.544408,62.0304025 Z M191.575208,62.0304025 L191.575208,62.0148025 C191.575208,60.3900024 192.828008,59.0292023 194.598008,59.0292023 C196.370408,59.0292023 197.606408,60.3744024 197.606408,61.9968025 L197.606408,62.0148025 C197.606408,63.6372025 196.353608,64.9980026 194.581208,64.9980026 C192.810008,64.9980026 191.575208,63.6540025 191.575208,62.0304025 L191.575208,62.0304025 Z" id="Fill-32" fill="#7BABD0"></path>
            <polyline id="Fill-33" fill="#7BABD0" points="198.835208 59.1300023 199.774808 59.1300023 202.863608 63.1188025 202.863608 59.1300023 203.860808 59.1300023 203.860808 64.8984026 203.013608 64.8984026 199.831208 60.7944024 199.831208 64.8984026 198.835208 64.8984026 198.835208 59.1300023"></polyline>
            <polyline id="Fill-34" fill="#7BABD0" points="205.344008 59.1300023 209.622008 59.1300023 209.622008 60.0348024 206.356808 60.0348024 206.356808 61.5348024 209.250008 61.5348024 209.250008 62.4420025 206.356808 62.4420025 206.356808 63.9924025 209.662808 63.9924025 209.662808 64.8984026 205.344008 64.8984026 205.344008 59.1300023"></polyline>
        </g>
    </g>
</svg>