<svg width="20" height="20" viewBox="0 0 20 20" fill="none" xmlns="http://www.w3.org/2000/svg">
<path fill-rule="evenodd" clip-rule="evenodd" d="M18.75 7.87109C18.75 8.35938 18.5586 8.80078 18.2539 9.13281C19.2266 9.19922 20 10.0039 20 10.9957C20 12.0312 19.1609 12.8699 18.125 12.8699H12.4004C13.2895 14.3504 13.7488 16.0289 13.7488 16.6207C13.7488 17.5422 13.0258 18.5 11.8164 18.5C10.5695 18.5 10.3213 17.7393 9.9663 16.6517C9.61957 15.5893 9.17104 14.2151 7.59052 12.9332L6.9538 12.4242C6.49337 12.0563 6.25694 11.5113 6.2542 10.9648L6.25 4.71484C6.25 4.16016 6.52734 3.60273 7 3.24883L8.33359 2.24922C9.41523 1.43828 10.7305 1 12.0824 1H14.375C15.4102 1 16.25 1.83867 16.25 2.87422C16.25 3.01602 16.2305 3.15313 16.2012 3.25273C16.9531 3.49688 17.5 4.19453 17.5 5.02734C17.5 5.41797 17.3945 5.75 17.2211 6.03164C18.091 6.19453 18.75 6.9543 18.75 7.87109ZM1.25 1.00156H3.75C4.44141 1.00156 5 1.56094 5 2.25117V10.9312C5 11.5863 4.44023 12.1461 3.75 12.1461H1.25C0.559766 12.1461 0 11.6215 0 10.9312V2.21641C0 1.56094 0.559766 1.00156 1.25 1.00156Z" fill="#BE182C"/>
</svg>
