<?xml version="1.0" encoding="UTF-8"?>
<svg width="148px" height="67px" viewBox="0 0 148 67" version="1.1" xmlns="http://www.w3.org/2000/svg" xmlns:xlink="http://www.w3.org/1999/xlink">
    <title>cnews</title>
    <defs>
        <polygon id="path-1" points="0 0.0835441034 100.537641 0.0835441034 100.537641 25.153549 0 25.153549"></polygon>
    </defs>
    <g id="cnews" stroke="none" stroke-width="1" fill="none" fill-rule="evenodd">
        <g id="CNEWS_logo" transform="translate(24.000000, 21.000000)">
            <g id="Group-4">
                <mask id="mask-2" fill="white">
                    <use xlink:href="#path-1"></use>
                </mask>
                <g id="Clip-2"></g>
                <polygon id="Fill-1" fill="#DB3D33" mask="url(#mask-2)" points="25.0763486 23.8963016 99.2738345 23.8963016 99.2738345 1.34735027 25.0763486 1.34735027"></polygon>
                <path d="M25.0763486,23.8963016 L99.2738345,23.8963016 L99.2738345,1.34735027 L25.0763486,1.34735027 L25.0763486,23.8963016 Z M0,0.0835441034 L0,25.1600003 L100.537641,25.1600003 L100.537641,0.0835441034 L0,0.0835441034 L0,0.0835441034 Z" id="Fill-3" fill="#020301" mask="url(#mask-2)"></path>
            </g>
            <polyline id="Fill-5" fill="#FFFFFE" points="29.7258952 4.18408654 33.8879398 4.18408654 41.561955 13.9997123 41.561955 4.18408654 45.7239996 4.18408654 45.7239996 20.2307906 41.561955 20.2307906 33.8879398 10.4150574 33.8879398 20.2307906 29.7258952 20.2307906 29.7258952 4.18408654"></polyline>
            <polyline id="Fill-6" fill="#FFFFFE" points="53.0501831 7.72078692 53.0501831 10.3907575 57.7415555 10.3907575 57.7415555 13.9277805 53.0501831 13.9277805 53.0501831 16.6944128 58.0061656 16.6944128 58.0061656 20.2305756 48.888246 20.2305756 48.888246 4.18430158 58.0061656 4.18430158 58.0061656 7.72078692 53.0501831 7.72078692"></polyline>
            <polyline id="Fill-7" fill="#FFFFFE" points="66.5159443 14.5531248 69.9079209 4.18419406 73.2279657 4.18419406 76.379202 14.5531248 79.4104444 4.18419406 83.7649523 4.18419406 78.6405914 20.2307906 74.3828527 20.2307906 71.4717117 10.9443851 68.3924072 20.2307906 64.1582157 20.2307906 59.3707193 4.18419406 63.7251196 4.18419406 66.5159443 14.5531248"></polyline>
            <path d="M93.278443,8.33408881 C92.340104,7.58821307 91.4979967,7.25145614 90.536218,7.25145614 C89.5254097,7.25145614 88.7558792,7.85293068 88.7558792,8.64676095 C88.7558792,8.93545582 88.8998503,9.24823548 89.1404832,9.44069873 C89.5978791,9.82562523 89.765935,9.89777207 91.642828,10.4507545 C94.433115,11.2690996 95.5878945,12.5682803 95.5878945,14.9495561 C95.5878945,16.7779569 95.0345895,18.1737993 93.9520644,19.1116007 C92.7976075,20.0978942 91.1616698,20.627652 89.3092917,20.627652 C87.4086365,20.627652 85.4594891,20.0017701 83.7518347,18.8229058 L85.532066,15.4552291 C86.8312467,16.5859238 87.9855961,17.0907366 89.2125225,17.0907366 C90.4395563,17.0907366 91.2333866,16.4651773 91.2333866,15.5273759 C91.2333866,14.6612913 90.6800816,14.25228 88.7314719,13.6748902 C86.9515631,13.1456701 86.2534269,12.8565451 85.6764672,12.3758171 C84.8344674,11.6776808 84.4013713,10.619563 84.4013713,9.20006591 C84.4013713,5.97636023 86.6146987,3.78711765 89.8624892,3.78711765 C91.5462738,3.78711765 93.3265051,4.24462107 94.9383579,5.08619082 L93.278443,8.33408881" id="Fill-8" fill="#FFFFFE"></path>
            <path d="M17.3301867,19.6002853 C17.3078222,19.7709217 17.2233104,19.8993023 17.2233104,19.8993023 C17.2233104,19.8993023 17.1378309,19.9852118 16.9890214,20.0288655 C14.9361159,20.8616185 12.6479536,20.5842134 12.6479536,20.5842134 C8.94749821,20.1775676 6.5970811,17.9117698 5.84959254,14.9811673 C4.73663885,10.599564 6.94114947,7.47800367 7.47477803,6.8159946 C8.77739941,5.25467681 10.8079405,4.14333594 12.7966557,3.88539218 C15.3424391,3.52250756 17.2233104,4.12161662 17.9931634,4.37654979 C17.9931634,4.37654979 18.8476358,4.65524518 19.4891082,5.08382535 C19.8098445,5.29800792 19.852638,5.38359493 19.852638,5.38359493 C19.852638,5.38359493 19.8740347,5.42509818 19.7885553,5.7678763 L19.1917041,8.91137103 C19.1703074,9.03975155 19.0838602,9.10383428 19.0838602,9.10383428 C19.0838602,9.10383428 19.040099,9.12566112 18.7416197,8.93309035 C16.8169872,7.56412828 14.5725861,7.73465718 14.5725861,7.73465718 C12.8598783,7.84088829 10.8720232,8.7406271 10.2742044,11.0064249 C9.73960814,13.0140639 10.2946334,14.7040848 11.4931741,15.7085494 C12.3038853,16.4142121 13.5665087,16.7790321 14.8924622,16.7132291 C16.3456135,16.6082882 17.5002855,16.0308985 17.4157737,16.0717566 C17.4157737,16.0717566 17.4789963,16.0513275 17.5441542,16.0308985 C17.8444614,15.8809061 17.9076839,15.9026255 17.9076839,15.9026255 C17.9076839,15.9026255 17.9717667,15.9650954 17.9289732,16.1575586 L17.3301867,19.6002853" id="Fill-9" fill="#FFFFFE"></path>
        </g>
    </g>
</svg>