<svg width="296" height="205" viewBox="0 0 296 205" fill="none" xmlns="http://www.w3.org/2000/svg">
<path d="M140.025 181.51C137.425 184.68 132.575 184.68 129.975 181.51L29.9729 59.6229C26.4922 55.3803 29.5104 49 34.9981 49L235.002 49C240.49 49 243.508 55.3804 240.027 59.6229L140.025 181.51Z" fill="#ED1250" stroke="white" stroke-width="3"/>
<path d="M158.53 196.488C155.929 199.665 151.071 199.665 148.47 196.488L41.9496 66.3674C38.4755 62.1237 41.4948 55.75 46.9792 55.75L260.021 55.75C265.505 55.75 268.524 62.1237 265.05 66.3674L158.53 196.488Z" fill="#042F4B" stroke="white" stroke-width="3"/>
<path d="M165.985 142.462C166.069 141.552 165.795 140.646 165.223 139.935C164.65 139.223 163.823 138.762 162.917 138.649L162.323 134.919C162.204 134.232 161.883 133.597 161.403 133.092C160.922 132.588 160.302 132.238 159.623 132.085C158.943 131.933 158.233 131.986 157.583 132.237C156.933 132.488 156.372 132.926 155.971 133.496C155.563 132.913 154.988 132.468 154.322 132.22C153.655 131.972 152.929 131.933 152.239 132.108C151.55 132.283 150.93 132.663 150.462 133.198C149.994 133.734 149.7 134.399 149.619 135.106C149.121 134.792 148.551 134.609 147.963 134.575C147.375 134.541 146.788 134.657 146.257 134.911C145.725 135.165 145.267 135.55 144.925 136.03C144.583 136.509 144.367 137.067 144.299 137.652C143.722 137.31 143.059 137.141 142.389 137.164C141.719 137.187 141.069 137.401 140.517 137.782C139.965 138.163 139.534 138.694 139.274 139.312C139.014 139.93 138.937 140.61 139.052 141.271L140.261 148.868C140.336 149.295 140.49 149.705 140.715 150.076C140.528 151.012 140.556 151.978 140.798 152.902L141.794 156.622C142.047 157.979 143.07 159.078 144.038 159.973L145.019 160.882L145.023 166.19C145.025 166.856 145.29 167.495 145.761 167.966C146.232 168.437 146.871 168.702 147.538 168.703H158.682C159.022 168.703 159.358 168.634 159.671 168.501C159.983 168.367 160.265 168.172 160.5 167.926C160.735 167.681 160.917 167.39 161.037 167.072C161.156 166.754 161.21 166.415 161.194 166.075L160.56 158.363L162.942 156.295C164.365 155.053 165.239 153.298 165.373 151.414C165.373 151.414 165.985 142.466 165.985 142.462ZM158.488 133.441C159.038 133.352 159.601 133.481 160.058 133.8C160.514 134.119 160.828 134.604 160.933 135.151L161.507 138.757C161.07 138.88 160.661 139.087 160.303 139.368L157.646 141.398L156.768 135.888C156.673 135.335 156.8 134.768 157.122 134.309C157.445 133.85 157.936 133.538 158.488 133.441ZM152.74 133.441C153.29 133.351 153.854 133.479 154.311 133.798C154.768 134.118 155.081 134.603 155.185 135.151L156.339 142.398L154.191 144.04C153.858 144.305 153.576 144.629 153.359 144.995C153.066 144.849 152.811 144.636 152.615 144.374C152.42 144.112 152.288 143.807 152.231 143.485L151.02 135.888C150.924 135.335 151.052 134.768 151.374 134.309C151.697 133.85 152.188 133.538 152.74 133.441ZM146.051 136.879C146.21 136.652 146.413 136.458 146.647 136.309C146.882 136.16 147.144 136.06 147.417 136.013C147.97 135.918 148.537 136.045 148.997 136.365C149.223 136.523 149.416 136.725 149.564 136.957C149.713 137.19 149.814 137.45 149.862 137.722L151.072 145.319C151.164 145.84 151.056 146.377 150.771 146.822C150.486 147.268 150.044 147.591 149.532 147.726C149.021 147.861 148.477 147.8 148.009 147.554C147.54 147.307 147.182 146.894 147.003 146.396L145.698 138.458C145.649 138.185 145.656 137.904 145.716 137.633C145.777 137.362 145.891 137.106 146.051 136.879ZM140.795 139.46C140.954 139.233 141.157 139.039 141.391 138.89C141.626 138.741 141.887 138.641 142.161 138.594C142.646 138.513 143.145 138.602 143.572 138.847C143.999 139.091 144.329 139.475 144.506 139.934L145.816 147.9C145.911 148.451 145.785 149.018 145.463 149.477C145.142 149.935 144.652 150.247 144.101 150.344C143.55 150.442 142.982 150.317 142.523 149.997C142.064 149.677 141.751 149.188 141.652 148.637L140.442 141.039C140.393 140.766 140.399 140.486 140.46 140.214C140.521 139.943 140.635 139.687 140.795 139.46ZM163.966 151.319C163.859 152.829 163.159 154.236 162.018 155.232L159.412 157.495C158.049 158.477 156.438 159.057 154.763 159.171C154.581 159.184 154.41 159.267 154.288 159.402C154.166 159.538 154.101 159.716 154.107 159.898C154.113 160.081 154.19 160.254 154.321 160.381C154.452 160.508 154.628 160.579 154.81 160.579C154.826 160.579 154.843 160.578 154.859 160.577C156.38 160.472 157.859 160.035 159.191 159.295L159.786 166.139C159.793 166.289 159.769 166.437 159.717 166.577C159.664 166.717 159.584 166.845 159.481 166.952C159.378 167.06 159.254 167.146 159.117 167.205C158.979 167.263 158.832 167.294 158.682 167.294H147.538C147.245 167.293 146.964 167.177 146.757 166.97C146.55 166.763 146.434 166.482 146.433 166.189L146.429 160.574C146.429 160.477 146.409 160.381 146.37 160.293C146.331 160.204 146.274 160.124 146.203 160.058L144.996 158.939C144.133 158.27 143.495 157.353 143.167 156.311L142.16 152.539C142.054 152.142 141.999 151.735 141.996 151.325C142.496 151.614 143.06 151.775 143.637 151.792C144.215 151.81 144.787 151.684 145.304 151.426C145.821 151.168 146.266 150.786 146.599 150.314C146.932 149.842 147.143 149.295 147.212 148.722C147.715 149.017 148.283 149.183 148.866 149.204C149.448 149.225 150.027 149.1 150.549 148.841C151.071 148.582 151.521 148.196 151.856 147.72C152.192 147.243 152.404 146.69 152.472 146.111C152.605 146.192 152.744 146.264 152.886 146.326C152.883 146.349 152.875 146.37 152.872 146.392C152.766 147.286 153.009 148.185 153.55 148.904C151.249 149.864 149.31 151.527 148.011 153.655C147.963 153.734 147.931 153.822 147.917 153.913C147.903 154.005 147.907 154.098 147.929 154.188C147.951 154.278 147.99 154.362 148.045 154.437C148.1 154.512 148.169 154.575 148.248 154.623C148.327 154.671 148.415 154.703 148.506 154.717C148.598 154.731 148.691 154.727 148.781 154.705C148.871 154.683 148.955 154.643 149.03 154.589C149.105 154.534 149.168 154.465 149.216 154.386C150.389 152.461 152.156 150.969 154.251 150.134L154.756 149.934C155.257 150.194 155.813 150.33 156.378 150.331C156.841 150.328 157.299 150.232 157.725 150.051L157.672 150.796C157.665 150.888 157.677 150.981 157.706 151.069C157.735 151.157 157.782 151.238 157.842 151.308C157.903 151.378 157.977 151.435 158.059 151.477C158.142 151.518 158.232 151.543 158.325 151.549C158.342 151.55 158.359 151.551 158.376 151.551C158.554 151.551 158.725 151.483 158.855 151.362C158.985 151.24 159.065 151.074 159.078 150.896L159.207 149.076L160.034 148.444L161.458 148.426C161.645 148.425 161.824 148.35 161.955 148.217C162.086 148.084 162.16 147.904 162.158 147.717C162.157 147.53 162.082 147.351 161.949 147.22C161.816 147.089 161.636 147.016 161.449 147.017H161.44L159.782 147.037C159.631 147.039 159.484 147.09 159.363 147.182L157.68 148.469C157.352 148.728 156.954 148.883 156.537 148.916C156.12 148.949 155.703 148.857 155.338 148.653C154.973 148.448 154.677 148.14 154.488 147.767C154.298 147.395 154.223 146.974 154.272 146.559C154.304 146.285 154.389 146.019 154.523 145.778C154.658 145.537 154.839 145.325 155.055 145.154L161.168 140.482C161.492 140.226 161.885 140.071 162.296 140.036C162.708 140.001 163.121 140.087 163.484 140.284C163.848 140.481 164.145 140.78 164.34 141.145C164.535 141.509 164.619 141.923 164.581 142.334L163.966 151.319ZM152.742 160.143C152.742 160.329 152.668 160.509 152.536 160.641C152.404 160.773 152.225 160.847 152.038 160.847H150.657C150.47 160.847 150.291 160.773 150.159 160.641C150.027 160.509 149.953 160.329 149.953 160.143C149.953 159.956 150.027 159.776 150.159 159.644C150.291 159.512 150.47 159.438 150.657 159.438H152.037C152.13 159.438 152.222 159.456 152.307 159.491C152.393 159.527 152.47 159.579 152.536 159.644C152.601 159.71 152.653 159.788 152.689 159.873C152.724 159.959 152.743 160.05 152.742 160.143Z" fill="white"/>
<path d="M94.93 77.49H92.9V84H90.1V77.49H88.07V75.25H94.93V77.49ZM95.7275 83.3C95.1488 82.684 94.8595 81.7507 94.8595 80.5C94.8595 79.2493 95.1488 78.3207 95.7275 77.714C96.3155 77.098 97.2628 76.79 98.5695 76.79C99.8761 76.79 100.819 77.098 101.397 77.714C101.985 78.3207 102.279 79.2493 102.279 80.5C102.279 81.7507 101.985 82.684 101.397 83.3C100.819 83.9067 99.8761 84.21 98.5695 84.21C97.2628 84.21 96.3155 83.9067 95.7275 83.3ZM97.8695 79.422V82.166H98.3035C98.6395 82.166 98.8821 82.1333 99.0315 82.068C99.1901 81.9933 99.2695 81.83 99.2695 81.578V78.834H98.8355C98.4995 78.834 98.2521 78.8713 98.0935 78.946C97.9441 79.0113 97.8695 79.17 97.8695 79.422ZM106.057 77V82.166H106.491C106.827 82.166 107.07 82.1333 107.219 82.068C107.378 81.9933 107.457 81.83 107.457 81.578V77H110.257V84H108.857L108.045 83.202C107.485 83.874 106.687 84.21 105.651 84.21C104.821 84.21 104.214 84.0327 103.831 83.678C103.449 83.3233 103.257 82.7307 103.257 81.9V77H106.057ZM112.313 77.28C112.92 76.9533 113.746 76.79 114.791 76.79C115.836 76.79 116.798 76.9347 117.675 77.224L117.353 79.128C116.625 78.9227 115.897 78.82 115.169 78.82C114.945 78.82 114.628 78.8387 114.217 78.876V79.324C115.729 79.324 116.756 79.548 117.297 79.996C117.568 80.22 117.759 80.4673 117.871 80.738C117.983 80.9993 118.039 81.3213 118.039 81.704C118.039 82.0773 117.992 82.4133 117.899 82.712C117.815 83.0107 117.68 83.2487 117.493 83.426C117.316 83.6033 117.129 83.748 116.933 83.86C116.737 83.972 116.48 84.0513 116.163 84.098C115.668 84.1727 115.094 84.21 114.441 84.21C113.284 84.21 112.238 84.0747 111.305 83.804L111.655 81.816C112.439 82.0587 113.288 82.18 114.203 82.18C114.623 82.18 115.006 82.1613 115.351 82.124V81.676C113.858 81.676 112.826 81.48 112.257 81.088C111.697 80.696 111.417 80.0473 111.417 79.142C111.417 78.2273 111.716 77.6067 112.313 77.28ZM123.86 81.62V82.11C124.14 82.138 124.42 82.152 124.7 82.152C125.568 82.152 126.445 82.012 127.332 81.732L127.668 83.79C126.622 84.07 125.586 84.21 124.56 84.21C123.253 84.21 122.306 83.9067 121.718 83.3C121.139 82.684 120.85 81.7507 120.85 80.5C120.85 79.2493 121.139 78.3207 121.718 77.714C122.306 77.098 123.248 76.79 124.546 76.79C125.852 76.79 126.753 76.9673 127.248 77.322C127.742 77.6767 127.99 78.3393 127.99 79.31C127.99 80.1313 127.691 80.724 127.094 81.088C126.506 81.4427 125.428 81.62 123.86 81.62ZM123.86 79.422V79.996H124.434C124.77 79.996 125.012 79.9633 125.162 79.898C125.32 79.8233 125.4 79.66 125.4 79.408V78.834H124.826C124.49 78.834 124.242 78.8713 124.084 78.946C123.934 79.0113 123.86 79.17 123.86 79.422ZM130.446 77L131.146 77.7C132.014 77.0933 132.947 76.79 133.946 76.79C134.599 76.79 135.112 76.9347 135.486 77.224C135.859 77.504 136.046 77.896 136.046 78.4V84H133.246V79.1H132.812C132.494 79.1 132.252 79.1373 132.084 79.212C131.925 79.2773 131.846 79.4173 131.846 79.632V84H129.046V77H130.446ZM136.994 85.89L137.358 83.804C138.151 84.0747 139.08 84.21 140.144 84.21C140.461 84.21 140.685 84.2007 140.816 84.182V83.692C139.985 83.692 139.439 83.6593 139.178 83.594C138.926 83.5193 138.758 83.4493 138.674 83.384C138.599 83.3093 138.553 83.2487 138.534 83.202C138.525 83.1553 138.52 83.09 138.52 83.006L138.94 81.802C138.268 81.6807 137.755 81.4287 137.4 81.046C137.055 80.6633 136.882 80.066 136.882 79.254C136.882 78.4327 137.157 77.8167 137.708 77.406C138.259 76.9953 139.155 76.79 140.396 76.79C140.844 76.79 141.241 76.818 141.586 76.874L142.804 75.936L144.274 77.35L143.476 78.288C143.597 78.6147 143.658 79.0347 143.658 79.548C143.658 80.2853 143.471 80.836 143.098 81.2C142.734 81.5547 142.081 81.7693 141.138 81.844L141.082 82.18C142.09 82.236 142.799 82.39 143.21 82.642C143.63 82.8847 143.84 83.3373 143.84 84C143.84 85.1293 143.294 85.8293 142.202 86.1C141.661 86.24 140.928 86.31 140.004 86.31C139.089 86.31 138.086 86.17 136.994 85.89ZM139.514 79.24V80.15H139.948C140.284 80.15 140.527 80.1173 140.676 80.052C140.835 79.9773 140.914 79.814 140.914 79.562V78.652H140.48C140.144 78.652 139.897 78.6893 139.738 78.764C139.589 78.8293 139.514 78.988 139.514 79.24ZM148.196 76.79C150.436 76.79 151.556 77.56 151.556 79.1V84H150.156L149.358 83.202C149.087 83.5193 148.718 83.7667 148.252 83.944C147.785 84.1213 147.342 84.21 146.922 84.21C146.511 84.21 146.18 84.1773 145.928 84.112C145.676 84.0467 145.428 83.9347 145.186 83.776C144.654 83.44 144.388 82.8147 144.388 81.9C144.388 80.22 145.657 79.38 148.196 79.38H148.756V78.876C148.457 78.8573 148.21 78.848 148.014 78.848C146.959 78.848 146.054 78.974 145.298 79.226L144.962 77.224C145.895 76.9347 146.973 76.79 148.196 76.79ZM147.216 81.592V82.166H147.79C148.2 82.166 148.462 82.1193 148.574 82.026C148.695 81.9327 148.756 81.8113 148.756 81.662V81.004H148.182C147.846 81.004 147.598 81.0413 147.44 81.116C147.29 81.1813 147.216 81.34 147.216 81.592ZM152.443 85.89L152.807 83.804C153.6 84.0747 154.529 84.21 155.593 84.21C155.91 84.21 156.134 84.2007 156.265 84.182V83.692C155.434 83.692 154.888 83.6593 154.627 83.594C154.375 83.5193 154.207 83.4493 154.123 83.384C154.048 83.3093 154.002 83.2487 153.983 83.202C153.974 83.1553 153.969 83.09 153.969 83.006L154.389 81.802C153.717 81.6807 153.204 81.4287 152.849 81.046C152.504 80.6633 152.331 80.066 152.331 79.254C152.331 78.4327 152.606 77.8167 153.157 77.406C153.708 76.9953 154.604 76.79 155.845 76.79C156.293 76.79 156.69 76.818 157.035 76.874L158.253 75.936L159.723 77.35L158.925 78.288C159.046 78.6147 159.107 79.0347 159.107 79.548C159.107 80.2853 158.92 80.836 158.547 81.2C158.183 81.5547 157.53 81.7693 156.587 81.844L156.531 82.18C157.539 82.236 158.248 82.39 158.659 82.642C159.079 82.8847 159.289 83.3373 159.289 84C159.289 85.1293 158.743 85.8293 157.651 86.1C157.11 86.24 156.377 86.31 155.453 86.31C154.538 86.31 153.535 86.17 152.443 85.89ZM154.963 79.24V80.15H155.397C155.733 80.15 155.976 80.1173 156.125 80.052C156.284 79.9773 156.363 79.814 156.363 79.562V78.652H155.929C155.593 78.652 155.346 78.6893 155.187 78.764C155.038 78.8293 154.963 78.988 154.963 79.24ZM163.057 81.62V82.11C163.337 82.138 163.617 82.152 163.897 82.152C164.765 82.152 165.642 82.012 166.529 81.732L166.865 83.79C165.82 84.07 164.784 84.21 163.757 84.21C162.45 84.21 161.503 83.9067 160.915 83.3C160.336 82.684 160.047 81.7507 160.047 80.5C160.047 79.2493 160.336 78.3207 160.915 77.714C161.503 77.098 162.446 76.79 163.743 76.79C165.05 76.79 165.95 76.9673 166.445 77.322C166.94 77.6767 167.187 78.3393 167.187 79.31C167.187 80.1313 166.888 80.724 166.291 81.088C165.703 81.4427 164.625 81.62 163.057 81.62ZM163.057 79.422V79.996H163.631C163.967 79.996 164.21 79.9633 164.359 79.898C164.518 79.8233 164.597 79.66 164.597 79.408V78.834H164.023C163.687 78.834 163.44 78.8713 163.281 78.946C163.132 79.0113 163.057 79.17 163.057 79.422ZM165.087 75.964L162.651 76.454L162.077 75.656L164.723 73.71C164.779 73.6727 164.84 73.654 164.905 73.654C164.97 73.654 165.045 73.7053 165.129 73.808L166.011 74.844C166.095 74.9373 166.137 75.0167 166.137 75.082C166.137 75.138 166.123 75.1847 166.095 75.222C166.076 75.25 165.862 75.4413 165.451 75.796C165.358 75.88 165.236 75.936 165.087 75.964ZM168.901 77.28C169.508 76.9533 170.334 76.79 171.379 76.79C172.424 76.79 173.386 76.9347 174.263 77.224L173.941 79.128C173.213 78.9227 172.485 78.82 171.757 78.82C171.533 78.82 171.216 78.8387 170.805 78.876V79.324C172.317 79.324 173.344 79.548 173.885 79.996C174.156 80.22 174.347 80.4673 174.459 80.738C174.571 80.9993 174.627 81.3213 174.627 81.704C174.627 82.0773 174.58 82.4133 174.487 82.712C174.403 83.0107 174.268 83.2487 174.081 83.426C173.904 83.6033 173.717 83.748 173.521 83.86C173.325 83.972 173.068 84.0513 172.751 84.098C172.256 84.1727 171.682 84.21 171.029 84.21C169.872 84.21 168.826 84.0747 167.893 83.804L168.243 81.816C169.027 82.0587 169.876 82.18 170.791 82.18C171.211 82.18 171.594 82.1613 171.939 82.124V81.676C170.446 81.676 169.414 81.48 168.845 81.088C168.285 80.696 168.005 80.0473 168.005 79.142C168.005 78.2273 168.304 77.6067 168.901 77.28ZM182.856 81.9L183.024 83.916C182.538 84.112 181.913 84.21 181.148 84.21C179.841 84.21 178.894 83.9067 178.306 83.3C177.727 82.684 177.438 81.7507 177.438 80.5C177.438 79.2493 177.727 78.3207 178.306 77.714C178.894 77.098 179.841 76.79 181.148 76.79C181.96 76.79 182.585 76.888 183.024 77.084L182.688 78.988C182.193 78.8853 181.801 78.834 181.512 78.834C180.802 78.834 180.448 79.0813 180.448 79.576V82.082C180.718 82.138 181.064 82.166 181.484 82.166C181.913 82.166 182.37 82.0773 182.856 81.9ZM184.731 83.3C184.153 82.684 183.863 81.7507 183.863 80.5C183.863 79.2493 184.153 78.3207 184.731 77.714C185.319 77.098 186.267 76.79 187.573 76.79C188.88 76.79 189.823 77.098 190.401 77.714C190.989 78.3207 191.283 79.2493 191.283 80.5C191.283 81.7507 190.989 82.684 190.401 83.3C189.823 83.9067 188.88 84.21 187.573 84.21C186.267 84.21 185.319 83.9067 184.731 83.3ZM186.873 79.422V82.166H187.307C187.643 82.166 187.886 82.1333 188.035 82.068C188.194 81.9933 188.273 81.83 188.273 81.578V78.834H187.839C187.503 78.834 187.256 78.8713 187.097 78.946C186.948 79.0113 186.873 79.17 186.873 79.422ZM193.801 77L194.501 77.7C195.369 77.0933 196.303 76.79 197.301 76.79C197.955 76.79 198.468 76.9347 198.841 77.224C199.215 77.504 199.401 77.896 199.401 78.4V84H196.601V79.1H196.167C195.85 79.1 195.607 79.1373 195.439 79.212C195.281 79.2773 195.201 79.4173 195.201 79.632V84H192.401V77H193.801ZM200.307 78.806V77H201.007V75.88L203.807 75.18V77H204.773V78.806H203.807V81.998C204.05 82.0447 204.325 82.0773 204.633 82.096L204.507 84.154C203.229 84.154 202.398 84.084 202.015 83.944C201.539 83.776 201.241 83.552 201.119 83.272C201.045 83.104 201.007 82.908 201.007 82.684V78.806H200.307ZM205.827 77H207.227L207.997 77.784C208.548 77.28 209.238 76.9487 210.069 76.79L210.237 79.436C210.013 79.4453 209.719 79.5013 209.355 79.604C209 79.7067 208.758 79.8373 208.627 79.996V84H205.827V77ZM213.807 81.62V82.11C214.087 82.138 214.367 82.152 214.647 82.152C215.515 82.152 216.392 82.012 217.279 81.732L217.615 83.79C216.57 84.07 215.534 84.21 214.507 84.21C213.2 84.21 212.253 83.9067 211.665 83.3C211.086 82.684 210.797 81.7507 210.797 80.5C210.797 79.2493 211.086 78.3207 211.665 77.714C212.253 77.098 213.196 76.79 214.493 76.79C215.8 76.79 216.7 76.9673 217.195 77.322C217.69 77.6767 217.937 78.3393 217.937 79.31C217.937 80.1313 217.638 80.724 217.041 81.088C216.453 81.4427 215.375 81.62 213.807 81.62ZM213.807 79.422V79.996H214.381C214.717 79.996 214.96 79.9633 215.109 79.898C215.268 79.8233 215.347 79.66 215.347 79.408V78.834H214.773C214.437 78.834 214.19 78.8713 214.031 78.946C213.882 79.0113 213.807 79.17 213.807 79.422Z" fill="white"/>
<path d="M96 95.04V107.568C96.512 107.664 96.904 107.72 97.176 107.736L96.96 111.264C94.912 111.264 93.56 111.144 92.904 110.904C92.088 110.6 91.584 110.216 91.392 109.752C91.264 109.464 91.2 109.128 91.2 108.744V95.4L96 95.04ZM103.598 97.776V98.064C103.55 98.768 103.35 99.464 102.998 100.152C102.886 100.36 102.822 100.48 102.806 100.512L101.174 103.776L99.0383 103.08L99.8303 99.624C99.2703 99.528 98.8863 99.344 98.6783 99.072C98.4863 98.784 98.3903 98.264 98.3903 97.512C98.3903 96.744 98.5663 96.168 98.9183 95.784C99.2703 95.4 99.9583 95.208 100.982 95.208C102.022 95.208 102.718 95.4 103.07 95.784C103.422 96.168 103.598 96.832 103.598 97.776ZM105.216 111V99.6L110.016 99V111H105.216ZM105.48 98.232C105.128 97.96 104.952 97.464 104.952 96.744C104.952 96.024 105.128 95.52 105.48 95.232C105.848 94.944 106.56 94.8 107.616 94.8C108.688 94.8 109.4 94.944 109.752 95.232C110.12 95.52 110.304 96.024 110.304 96.744C110.304 97.464 110.12 97.96 109.752 98.232C109.4 98.504 108.688 98.64 107.616 98.64C106.56 98.64 105.848 98.504 105.48 98.232ZM113.539 99.48C114.579 98.92 115.995 98.64 117.787 98.64C119.579 98.64 121.227 98.888 122.731 99.384L122.179 102.648C120.931 102.296 119.683 102.12 118.435 102.12C118.051 102.12 117.507 102.152 116.803 102.216V102.984C119.395 102.984 121.155 103.368 122.083 104.136C122.547 104.52 122.875 104.944 123.067 105.408C123.259 105.856 123.355 106.408 123.355 107.064C123.355 107.704 123.275 108.28 123.115 108.792C122.971 109.304 122.739 109.712 122.419 110.016C122.115 110.32 121.795 110.568 121.459 110.76C121.123 110.952 120.683 111.088 120.139 111.168C119.291 111.296 118.307 111.36 117.187 111.36C115.203 111.36 113.411 111.128 111.811 110.664L112.411 107.256C113.755 107.672 115.211 107.88 116.779 107.88C117.499 107.88 118.155 107.848 118.747 107.784V107.016C116.187 107.016 114.419 106.68 113.443 106.008C112.483 105.336 112.003 104.224 112.003 102.672C112.003 101.104 112.515 100.04 113.539 99.48ZM126.052 109.8C125.06 108.744 124.564 107.144 124.564 105C124.564 102.856 125.06 101.264 126.052 100.224C127.06 99.168 128.684 98.64 130.924 98.64C133.164 98.64 134.78 99.168 135.772 100.224C136.78 101.264 137.284 102.856 137.284 105C137.284 107.144 136.78 108.744 135.772 109.8C134.78 110.84 133.164 111.36 130.924 111.36C128.684 111.36 127.06 110.84 126.052 109.8ZM129.724 103.152V107.856H130.468C131.044 107.856 131.46 107.8 131.716 107.688C131.988 107.56 132.124 107.28 132.124 106.848V102.144H131.38C130.804 102.144 130.38 102.208 130.108 102.336C129.852 102.448 129.724 102.72 129.724 103.152ZM144 95.04V107.568C144.512 107.664 144.904 107.72 145.176 107.736L144.96 111.264C142.912 111.264 141.56 111.144 140.904 110.904C140.088 110.6 139.584 110.216 139.392 109.752C139.264 109.464 139.2 109.128 139.2 108.744V95.4L144 95.04ZM151.286 106.92V107.76C151.766 107.808 152.246 107.832 152.726 107.832C154.214 107.832 155.718 107.592 157.238 107.112L157.814 110.64C156.022 111.12 154.246 111.36 152.486 111.36C150.246 111.36 148.622 110.84 147.614 109.8C146.622 108.744 146.126 107.144 146.126 105C146.126 102.856 146.622 101.264 147.614 100.224C148.622 99.168 150.238 98.64 152.462 98.64C154.702 98.64 156.246 98.944 157.094 99.552C157.942 100.16 158.366 101.296 158.366 102.96C158.366 104.368 157.854 105.384 156.83 106.008C155.822 106.616 153.974 106.92 151.286 106.92ZM151.286 103.152V104.136H152.27C152.846 104.136 153.262 104.08 153.518 103.968C153.79 103.84 153.926 103.56 153.926 103.128V102.144H152.942C152.366 102.144 151.942 102.208 151.67 102.336C151.414 102.448 151.286 102.72 151.286 103.152ZM166.897 102.6H166.561C166.193 102.6 165.913 102.616 165.721 102.648C165.545 102.68 165.377 102.784 165.217 102.96C165.057 103.12 164.977 103.368 164.977 103.704V111H160.177V99H162.577L163.657 100.104C164.633 99.128 165.913 98.64 167.497 98.64C169.081 98.64 170.225 98.968 170.929 99.624C171.905 98.968 173.033 98.64 174.313 98.64C175.609 98.64 176.617 98.888 177.337 99.384C178.057 99.864 178.417 100.536 178.417 101.4V111H173.617V102.6H173.281C172.945 102.6 172.681 102.616 172.489 102.648C172.297 102.68 172.121 102.768 171.961 102.912C171.801 103.056 171.713 103.272 171.697 103.56V111H166.897V102.6ZM185.341 106.92V107.76C185.821 107.808 186.301 107.832 186.781 107.832C188.269 107.832 189.773 107.592 191.293 107.112L191.869 110.64C190.077 111.12 188.301 111.36 186.541 111.36C184.301 111.36 182.677 110.84 181.669 109.8C180.677 108.744 180.181 107.144 180.181 105C180.181 102.856 180.677 101.264 181.669 100.224C182.677 99.168 184.293 98.64 186.517 98.64C188.757 98.64 190.301 98.944 191.149 99.552C191.997 100.16 192.421 101.296 192.421 102.96C192.421 104.368 191.909 105.384 190.885 106.008C189.877 106.616 188.029 106.92 185.341 106.92ZM185.341 103.152V104.136H186.325C186.901 104.136 187.317 104.08 187.573 103.968C187.845 103.84 187.981 103.56 187.981 103.128V102.144H186.997C186.421 102.144 185.997 102.208 185.725 102.336C185.469 102.448 185.341 102.72 185.341 103.152ZM196.631 99L197.831 100.2C199.319 99.16 200.919 98.64 202.631 98.64C203.751 98.64 204.631 98.888 205.271 99.384C205.911 99.864 206.231 100.536 206.231 101.4V111H201.431V102.6H200.687C200.143 102.6 199.727 102.664 199.439 102.792C199.167 102.904 199.031 103.144 199.031 103.512V111H194.231V99H196.631ZM207.785 102.096V99H208.985V97.08L213.785 95.88V99H215.441V102.096H213.785V107.568C214.201 107.648 214.673 107.704 215.201 107.736L214.985 111.264C212.793 111.264 211.369 111.144 210.713 110.904C209.897 110.616 209.385 110.232 209.177 109.752C209.049 109.464 208.985 109.128 208.985 108.744V102.096H207.785Z" fill="white"/>
</svg>
