<?xml version="1.0" encoding="UTF-8"?>
<svg width="146px" height="65px" viewBox="0 0 146 65" version="1.1" xmlns="http://www.w3.org/2000/svg" xmlns:xlink="http://www.w3.org/1999/xlink">
    <!-- Generator: Sketch 60 (88103) - https://sketch.com -->
    <title>La croix</title>
    <desc>Created with Sketch.</desc>
    <defs>
        <rect id="path-1" x="0" y="0" width="146" height="65" rx="8"></rect>
    </defs>
    <g id="Produit-(modifier-la-couleur)" stroke="none" stroke-width="1" fill="none" fill-rule="evenodd">
        <g id="page-consultation---GC---consultation" transform="translate(-1124.000000, -1197.000000)">
            <g id="La-croix" transform="translate(1124.000000, 1197.000000)">
                <mask id="mask-2" fill="white">
                    <use xlink:href="#path-1"></use>
                </mask>
                <use id="Rectangle" fill="#FFFFFF" xlink:href="#path-1"></use>
                <g id="environnement/media/LaCroix" mask="url(#mask-2)">
                    <g transform="translate(27.000000, -13.000000)" id="Group">
                        <g transform="translate(10.540000, 39.560000)">
                            <path d="M30.8361637,8.87465664 L31.1720651,8.91767298 L30.9739245,12.3348343 C29.7100696,13.0771705 28.1835727,13.5062179 26.0548232,13.4640132 C21.5127351,13.3740239 19.0116089,10.772144 19.0116089,7.02231619 C19.0116089,2.73366817 21.9733116,0.0604663659 26.1584786,0.0604663659 C28.2094351,0.0604663659 29.857825,0.502905664 31.0267826,1.2214003 L31.0289464,4.68614336 L30.6775893,4.69466546 C30.0429829,2.76826386 28.546779,0.897864662 27.0618062,0.897864662 C24.5660379,0.897864662 23.9740889,4.45604652 23.9740889,6.76888501 C23.9740889,9.80529083 24.9576825,12.4983775 27.340728,12.4983775 C28.7423437,12.4982761 30.2153642,11.2109309 30.8361637,8.87465664" id="Path" fill="#EF7D00" fill-rule="nonzero"></path>
                            <path d="M59.2102523,13.1364194 L59.1538909,8.22829554 L59.1638855,4.75087078 C59.1638855,3.79588772 59.2905183,3.64025784 59.9321312,3.23748692 L59.9321312,2.9939982 L55.5154395,2.9939982 L55.549854,8.11588491 L55.5171912,11.3884748 C55.5171912,12.3436608 55.2993704,12.5391619 54.7231861,12.9022645 L54.7231861,13.1365209 L59.2102523,13.1365209 L59.2102523,13.1364194 Z" id="Path" fill="#EF7D00" fill-rule="nonzero"></path>
                            <path d="M43.1340715,11.9598617 C42.7851874,11.4658839 42.3439819,10.7674771 42.0674299,10.2410342 C41.4760991,9.11510175 40.7242363,8.43526095 39.1227284,8.36333033 C41.0009944,8.29748692 42.502041,7.37496902 42.502041,5.73994226 C42.502041,3.86680381 40.9153704,2.97046095 38.6523633,2.97046095 L32.7480198,2.97046095 L32.7690394,8.04679499 L32.7321521,11.3884748 C32.7321521,12.3436608 32.5143313,12.5391619 31.938147,12.9022645 L31.938147,13.1365209 L36.3793616,13.1365209 L36.3517476,8.63147228 L36.6836306,8.63147228 C37.6531081,8.63147228 37.95171,8.87232321 38.1527357,9.56383118 L38.759316,11.5821498 C38.950347,12.1887411 39.1801201,12.7018935 39.5443568,13.1365209 L44.0955121,13.1365209 L44.0955121,12.8822781 C43.757756,12.6514711 43.4089749,12.3496465 43.1340715,11.9598617 M36.9185555,7.9480806 L36.3517476,7.9480806 L36.3384558,3.61398135 L36.9185555,3.61398135 C38.1823074,3.61398135 38.8477219,4.38969584 38.8477219,5.72076752 C38.8476189,7.0518392 38.1822044,7.9480806 36.9185555,7.9480806" id="Shape" fill="#EF7D00" fill-rule="nonzero"></path>
                            <path d="M54.1264974,7.86590316 C54.1264974,11.2938185 51.7781755,13.454781 48.6931372,13.454781 C45.3624581,13.454781 43.5205642,11.0553011 43.5205642,8.2830805 C43.5205642,4.85496221 45.8689892,2.6939998 48.938778,2.6939998 C52.269354,2.6939998 54.1264974,5.09358115 54.1264974,7.86590316 M50.5314248,8.2633985 C50.5314248,5.46297383 49.9792481,3.42608922 48.7483652,3.42608922 C47.6660619,3.42608922 47.2203228,5.38312982 47.2203228,7.84956912 C47.2203228,10.6501967 47.7719842,12.6868784 49.0028672,12.6868784 C50.0854795,12.6869798 50.5314248,10.7297363 50.5314248,8.2633985" id="Shape" fill="#EF7D00" fill-rule="nonzero"></path>
                            <path d="M17.033912,11.5515108 C16.2192995,10.1422183 12.5580769,2.81371509 12.5580769,2.81371509 L12.301205,2.81330927 C12.301205,2.81330927 8.48996023,10.6755601 8.22824562,11.2091048 C8.13705765,11.3951707 7.95900928,11.6700086 7.75571679,11.8440016 C7.37427289,12.1705809 6.76439542,12.4264469 5.80841582,12.4264469 L4.56362281,12.4264469 L4.56362281,8.12268231 L4.60051014,4.70491228 C4.60051014,3.74962486 4.81833089,3.55442807 5.39441215,3.19112261 L5.39441215,2.99389674 L0.860876218,2.99389674 C0.860876218,2.99389674 0.884883897,10.9749498 0.884883897,11.4835368 C0.884883897,12.4406504 0.50756149,12.6346298 0.0830480229,12.902163 L0.0830480229,13.1364194 L8.24215564,13.1364194 L9.5592808,10.3740399 L12.5595194,10.3740399 L13.9601048,13.1364194 L18.2792202,13.1364194 L18.2792202,12.8991194 C17.8259593,12.5849175 17.4511098,12.2732519 17.033912,11.5515108 L17.033912,11.5515108 Z M12.2505107,9.74096922 L9.75783358,9.74096922 L11.0060268,7.12610326 L12.2505107,9.74096922 Z" id="Shape" fill="#EF7D00" fill-rule="nonzero"></path>
                            <path d="M70.199381,11.3120802 C69.0277444,9.55713524 68.1375026,8.12978406 67.5268008,7.13381373 C68.1380178,6.31173494 69.0395937,5.17514987 69.5500402,4.62374937 C70.285211,3.82997614 71.2264563,3.40985664 71.6730197,3.25321223 L71.6730197,2.99389674 L69.2630815,2.99389674 C69.1512861,3.33112862 68.9669524,3.80369965 68.4657793,4.55506526 C68.2856701,4.82503338 67.5662641,5.81522085 67.0954869,6.43398657 L65.0138253,2.99389674 L60.5460272,2.99389674 L60.5460272,3.23748692 C61.0441092,3.46423579 61.6064865,3.9587208 62.0360488,4.6188796 C62.5913166,5.47271338 63.3626534,6.71146226 64.5568551,8.65237173 C64.1741748,9.16674165 63.1463782,10.5202346 62.4225415,11.3906053 C61.6157599,12.3611108 60.526141,12.7247206 59.9964265,12.865031 L59.9964265,13.1364194 L62.9241269,13.1364194 C62.9698754,12.7551567 63.2159284,12.0660836 63.5217429,11.5588154 C63.6654799,11.3206023 64.4052873,10.2250045 64.9971333,9.36214135 C65.3193308,9.86626446 65.4425633,10.067447 65.6314306,10.3667352 C66.4128651,11.6041652 67.281263,13.1364194 67.281263,13.1364194 L71.9056778,13.1364194 L71.9056778,12.8986121 C71.3592713,12.6253975 70.7670132,12.1622617 70.199381,11.3120802" id="Path" fill="#EF7D00" fill-rule="nonzero"></path>
                        </g>
                    </g>
                </g>
            </g>
        </g>
    </g>
</svg>