<?xml version="1.0" encoding="UTF-8"?>
<svg width="200px" height="200px" viewBox="0 0 200 200" version="1.1" xmlns="http://www.w3.org/2000/svg" xmlns:xlink="http://www.w3.org/1999/xlink">
    <title>Grandes Causes/Environnement/Actions/Circuit colis réutilisables</title>
    <g id="Grandes-Causes/Environnement/Actions/Circuit-colis-réutilisables" stroke="none" stroke-width="1" fill="none" fill-rule="evenodd">
        <g id="circuit-colis-reutilisables" transform="translate(0.000000, 11.000000)">
            <rect id="Rectangle" fill="#2B9297" x="0" y="0" width="200" height="178" rx="7.65027322"></rect>
            <rect id="Rectangle" stroke="#FFFFFF" stroke-width="3.82513661" x="13.2008413" y="11.9591312" width="174.715636" height="155.076151" rx="6.8852459"></rect>
            <path d="M35.7667575,145.483842 L36.3191072,145.019076 L36.3481783,144.931932 L36.3481783,144.583358 C36.3094169,143.88621 36.1931327,143.363348 35.9993258,143.014774 L35.8248996,142.695248 L35.6795444,142.375721 L35.4469761,141.85286 L35.1853367,141.359047 L34.8364843,140.778089 L34.4585608,140.197132 L34.0224952,139.529032 L33.6155007,138.860931 L33.092222,138.163783 L32.5689433,137.466634 C32.4332785,137.272982 32.3266846,137.07933 32.2491619,136.885677 L32.1910198,136.566151 L32.1619488,136.246624 C32.1231874,136.111068 32.1619488,136.004559 32.2782329,135.927098 L32.5689433,135.723763 L32.8596537,135.49138 L33.6155007,134.910423 L33.7317848,134.794232 L33.87714,134.67804 C34.0321856,134.561849 34.2259925,134.387562 34.4585608,134.155179 L34.7202001,133.864701 L35.0109105,133.60327 L35.0690526,133.516126 C35.359763,133.090091 35.5535699,132.635008 35.6504734,132.150877 L35.7086154,131.831351 L35.7958285,131.482777 C35.8539706,131.231029 35.8830417,131.008328 35.8830417,130.814676 L35.9411837,130.408006 L35.9993258,129.972288 L36.0283969,129.68181 L36.0283969,129.362283 C36.0090162,129.033074 35.921803,128.577991 35.7667575,127.997034 C35.7279961,127.861478 35.6504734,127.687191 35.5341892,127.474173 L35.417905,127.212742 L35.3016209,126.951312 L35.2144078,126.83512 L34.5748449,126.079876 C34.1872311,125.634476 33.7996173,125.334314 33.4120034,125.179393 L33.2666482,125.092249 C32.8208923,124.76304 32.2976136,124.482244 31.6968122,124.249861 C31.1541528,124.036844 30.7083969,123.969065 30.3595444,124.046526 L30.2432602,124.017478 C30.0494533,123.998113 29.787814,124.056209 29.4583422,124.191766 L29.2257739,124.249861 L28.9932056,124.307957 C28.9544442,124.327322 28.8963021,124.337005 28.8187794,124.337005 L28.6152821,124.307957 C28.4602366,124.269226 28.3439524,124.269226 28.2664296,124.307957 C28.1113841,124.385418 27.9854096,124.414466 27.8885061,124.395101 C27.7916027,124.375735 27.6850089,124.366053 27.5687247,124.366053 L27.2780143,124.366053 C27.0260653,124.366053 26.8225681,124.346687 26.6675225,124.307957 C26.6675225,124.307957 26.6093805,124.298274 26.4930963,124.278909 L26.3186701,124.278909 L26.1733149,124.249861 C26.1151728,124.249861 25.9116755,124.31764 25.5628231,124.453196 C25.4465389,124.511292 25.3399451,124.559705 25.2430417,124.598435 C25.1267575,124.656531 25.0686154,124.685579 25.0686154,124.685579 C25.0492347,124.782405 25.029854,125.121297 25.0104734,125.702254 C24.971712,126.321941 24.971712,126.699564 25.0104734,126.83512 C25.029854,127.048138 25.0395444,127.299886 25.0395444,127.590364 L25.0104734,128.142274 C25.0104734,128.374656 25.0201637,128.558626 25.0395444,128.694183 L25.0686154,129.449427 L25.1267575,130.204671 L25.1267575,130.582293 L25.2430417,131.482777 L25.2430417,131.802303 L25.3302548,132.557547 L25.4174679,133.312791 L25.504681,134.184227 L25.533752,135.055662 L25.5628231,135.404237 L25.6209652,136.362816 L25.6500362,137.728065 L25.6500362,137.9314 L25.6791072,138.163783 L25.6791072,138.802835 L25.7081783,138.948075 L25.7081783,139.064266 L25.7372493,139.877606 C25.7372493,139.974432 25.7469397,140.274593 25.7663203,140.778089 L25.7663203,141.068568 L25.7953914,141.329999 L25.7953914,141.707621 L25.7953914,141.707621 C25.8147721,142.307943 25.8341528,142.830804 25.8535335,143.276205 C25.8729142,143.547318 25.9310562,143.750653 26.0279597,143.88621 C26.1830052,144.099227 26.2702183,144.302562 26.289599,144.496215 C26.289599,144.573676 26.3477411,144.680184 26.4640253,144.815741 C26.5803094,144.931932 26.6675225,144.980346 26.7256646,144.96098 C26.7838067,144.941615 26.8904005,144.951298 27.045446,144.990028 L27.1908012,145.077172 C27.2489433,145.096537 27.2877047,145.10622 27.3070854,145.10622 L27.3942985,145.135267 L27.5105826,145.164315 L27.6559378,145.193363 L27.801293,145.251459 C27.8981965,145.290189 27.9854096,145.32892 28.0629324,145.36765 L28.7024952,145.36765 C28.7606373,145.36765 28.9835152,145.280507 29.3711291,145.10622 C29.5067939,145.048124 29.6424588,144.990028 29.7781236,144.931932 L29.858069,144.891992 L29.858069,144.891992 L30.0106919,144.815741 L30.0106919,144.815741 C30.1269761,144.757645 30.2141892,144.660819 30.2723313,144.525262 C30.3886154,144.254149 30.4176865,143.876527 30.3595444,143.392396 L30.3304734,143.043822 L30.3304734,142.724296 C30.349854,142.395087 30.3401637,141.998099 30.3014023,141.533334 L30.3014023,141.03952 L30.2141892,140.516659 C30.1948085,140.303641 30.1948085,140.129354 30.2141892,139.993797 L30.1851182,139.906654 L30.1851182,139.81951 L30.097905,138.948075 L30.3886154,138.831883 L30.3886154,138.831883 L30.4176865,138.889979 L30.4758285,138.919027 L30.9118941,139.55808 L31.2026045,140.022845 C31.4933149,140.41015 31.861548,140.991107 32.307304,141.765716 L32.4817302,142.085243 C32.559253,142.201434 32.6270854,142.29826 32.6852275,142.375721 C32.840273,142.550008 32.9371764,142.724296 32.9759378,142.898583 L33.092222,143.218109 L33.2375772,143.566683 C33.373242,143.837797 33.4507648,144.060497 33.4701455,144.234784 C33.4895262,144.350975 33.5379779,144.467167 33.6155007,144.583358 L33.7899269,144.931932 C33.8286883,145.009393 33.9159014,145.077172 34.0515662,145.135267 L34.2259925,145.222411 L34.3713477,145.309555 C34.5070125,145.387015 34.632987,145.416063 34.7492712,145.396698 L34.9236974,145.425746 L35.0690526,145.425746 L35.2725499,145.454794 C35.6020216,145.474159 35.7667575,145.483842 35.7667575,145.483842 Z M30.097905,134.590897 L29.9816209,134.561849 L29.8944078,134.532801 C29.816885,134.494071 29.7781236,134.445658 29.7781236,134.387562 C29.7975043,134.252005 29.7975043,134.077718 29.7781236,133.864701 L29.7490526,133.632318 L29.7199815,133.341839 C29.7199815,133.245013 29.7102912,133.138504 29.6909105,133.022313 L29.6327684,132.848026 C29.6133877,132.770565 29.6036974,132.693104 29.6036974,132.615643 L29.6036974,132.354212 L29.5746264,131.540872 L29.5455553,131.018011 L29.5746264,131.018011 L29.5164843,130.378958 L29.5164843,129.333235 L29.4874132,128.955613 L29.4292712,128.142274 L29.4292712,127.997034 C29.5261746,127.764651 29.5067939,127.454808 29.3711291,127.067503 C29.3323677,127.009407 29.3226774,126.941629 29.3420581,126.864168 L29.4292712,126.660833 L29.4583422,126.515594 L29.5164843,126.370355 L29.5164843,126.254163 L29.5455553,126.137972 C29.5843167,126.060511 29.6424588,126.002415 29.7199815,125.963685 C30.0300726,125.828128 30.3014023,125.818445 30.5339706,125.934637 L30.9118941,126.137972 L31.3188887,126.341307 L31.6386701,126.515594 C31.7355735,126.593055 31.861548,126.680198 32.0165936,126.777024 L32.2782329,126.980359 L32.5689433,127.154647 C32.7821309,127.290203 32.9468668,127.435442 33.0631509,127.590364 C33.2957193,127.880843 33.4507648,128.335926 33.5282876,128.955613 C33.6058103,129.555936 33.6445717,130.156258 33.6445717,130.75658 C33.6639524,131.647381 33.5089069,132.315482 33.1794351,132.760882 C33.0825316,132.877074 32.9565571,133.002948 32.8015116,133.138504 L32.365446,133.487078 C32.1328777,133.661366 31.7065025,133.893748 31.0863203,134.184227 C30.4855189,134.474705 30.1560471,134.610262 30.097905,134.590897 Z M41.1448996,145.396698 L42.0170307,145.309555 L42.6275225,145.251459 C42.7631874,145.232094 42.9957557,145.212728 43.3252275,145.193363 L43.7903641,145.164315 L44.3136428,145.135267 C45.2245353,145.096537 45.7865754,145.067489 45.999763,145.048124 C46.0772857,145.028759 46.1451182,144.980346 46.2032602,144.902885 L46.3776865,144.670502 L46.5230417,144.409071 C46.503661,144.079862 46.4261382,143.818431 46.2904734,143.624779 L45.7090526,143.624779 C45.5152457,143.624779 45.3505098,143.595731 45.2148449,143.537635 C45.1760836,143.51827 45.1276318,143.51827 45.0694897,143.537635 C44.9338249,143.576366 44.5365207,143.586049 43.8775772,143.566683 L43.1217302,143.566683 L43.1217302,143.566683 C42.8891619,143.547318 42.7341163,143.537635 42.6565936,143.537635 C42.5403094,143.51827 42.443406,143.469857 42.3658832,143.392396 C42.2689797,143.29557 42.2399087,143.198744 42.2786701,143.101918 C42.2786701,142.8889 42.2689797,142.70493 42.249599,142.550008 L42.249599,142.375721 L42.220528,142.201434 C42.2011473,141.949686 42.191457,141.66889 42.191457,141.359047 L42.220528,140.778089 L42.2786701,140.255228 C42.2980508,139.887289 42.2883604,139.625858 42.249599,139.470936 C42.2689797,139.257919 42.2786701,138.957757 42.2786701,138.570453 L42.2786701,138.076639 L42.3077411,137.582826 C42.3077411,136.808216 42.3174315,136.382181 42.3368122,136.30472 C42.3755735,136.207894 42.4530963,136.159481 42.5693805,136.159481 C42.6469032,136.159481 42.753497,136.149798 42.8891619,136.130433 L43.7903641,135.927098 C44.1392165,135.849637 44.4493076,135.801224 44.7206373,135.781859 L44.9532056,135.752811 L45.1857739,135.694715 C45.3602001,135.63662 45.495865,135.539793 45.5927684,135.404237 L45.6218395,135.375189 C45.7381236,135.317093 45.8350271,135.239632 45.9125499,135.142806 L45.999763,134.997567 L46.1160471,134.852328 C46.1935699,134.755501 46.2129506,134.619945 46.1741892,134.445658 C46.0966664,134.058353 45.9222402,133.82597 45.6509105,133.748509 L45.5927684,133.719461 L45.5346264,133.661366 C45.3020581,133.506444 45.0888704,133.438665 44.8950635,133.458031 C44.8369214,133.458031 44.7884697,133.448348 44.7497083,133.428983 C44.6721856,133.370887 44.5559014,133.351522 44.4008559,133.370887 L42.5693805,133.632318 L42.3368122,133.661366 C42.1817666,133.661366 42.1042438,133.60327 42.1042438,133.487078 L42.1333149,133.138504 L42.1333149,132.760882 C42.1333149,132.702786 42.1430052,132.654373 42.1623859,132.615643 L42.191457,132.499451 C42.2108377,132.402625 42.2108377,132.296116 42.191457,132.179925 L42.220528,131.97659 L42.2786701,131.802303 C42.2786701,131.782938 42.2689797,131.715159 42.249599,131.598968 L42.249599,131.424681 L42.220528,131.221346 C42.2011473,130.834041 42.220528,130.562928 42.2786701,130.408006 L42.2786701,130.320862 L42.3077411,129.885145 L42.3368122,129.449427 C42.3561928,129.100853 42.3949542,128.810374 42.4530963,128.577991 L42.5403094,128.084178 C42.5596901,128.006717 42.5596901,127.83243 42.5403094,127.561316 L42.5403094,127.067503 L42.5403094,127.067503 C42.5596901,126.931946 42.6372129,126.83512 42.7728777,126.777024 L43.3833695,126.602737 C43.480273,126.583372 43.6643896,126.583372 43.9357193,126.602737 L44.2264296,126.631785 L44.4589979,126.631785 L44.4589979,126.631785 C44.5946628,126.593055 44.7303276,126.583372 44.8659925,126.602737 L45.0694897,126.602737 C45.1276318,126.583372 45.1954642,126.564007 45.272987,126.544642 L45.5927684,126.486546 L45.8834788,126.42845 C45.999763,126.409085 46.0869761,126.380037 46.1451182,126.341307 L46.3195444,126.254163 L46.4939706,126.137972 C46.5908741,126.060511 46.6587065,125.954002 46.6974679,125.818445 L46.75561,125.76035 L46.8428231,125.673206 C46.9009652,125.57638 46.9397265,125.498919 46.9591072,125.440823 C46.9978686,125.305267 46.9784879,125.16971 46.9009652,125.034153 L46.813752,124.888914 L46.6683969,124.743675 C46.5714934,124.608118 46.3970672,124.501609 46.1451182,124.424148 L45.6218395,124.278909 L45.0694897,124.162718 C44.8175407,124.104622 44.6043531,124.094939 44.4299269,124.13367 C44.1585972,124.191766 43.9066482,124.220813 43.6740799,124.220813 L43.1798723,124.249861 L42.6856646,124.249861 C42.2980508,124.269226 41.9782693,124.307957 41.7263203,124.366053 C41.5906555,124.404783 41.3096355,124.414466 40.8832602,124.395101 L40.6506919,124.366053 L39.7204187,124.366053 L39.7204187,124.366053 C39.5266118,124.385418 39.4103276,124.404783 39.3715662,124.424148 C39.2746628,124.443514 39.1874497,124.482244 39.1099269,124.54034 L38.8773586,124.714627 C38.7029324,124.850184 38.6060289,125.034153 38.5866482,125.266536 L38.5575772,125.586062 L38.4994351,125.934637 L38.412222,126.283211 L38.3250089,126.660833 C38.2668668,126.970677 38.2281054,127.222425 38.2087247,127.416077 L38.1215116,128.258465 L38.0342985,129.071805 L38.0052275,129.478475 L37.9761564,129.914193 C37.9567757,130.262767 37.9180143,130.543563 37.8598723,130.75658 L37.8308012,130.814676 C37.8114205,130.969598 37.8114205,131.182615 37.8308012,131.453729 L37.8308012,132.121829 C37.7920398,132.334847 37.7823495,132.848026 37.8017302,133.661366 C37.8211109,134.435975 37.8501819,134.987884 37.8889433,135.317093 L37.9761564,136.30472 L38.0633695,137.292347 C38.0827502,137.427904 38.0827502,137.689334 38.0633695,138.076639 L38.0633695,138.628548 L38.0342985,139.267601 C37.9955371,140.352054 37.9955371,141.010472 38.0342985,141.242855 L38.0924406,141.736669 C38.1118213,141.910956 38.1118213,142.07556 38.0924406,142.230482 C38.0730599,142.346674 38.0730599,142.540326 38.0924406,142.811439 C38.0924406,143.063187 38.1021309,143.208426 38.1215116,143.247157 L38.2377958,143.537635 L38.3250089,143.799066 C38.3443896,143.934623 38.4025316,144.021766 38.4994351,144.060497 C38.6350999,144.099227 38.7029324,144.186371 38.7029324,144.321928 C38.7223131,144.51558 38.8289069,144.660819 39.0227138,144.757645 L39.3134242,144.844789 L39.5750635,144.96098 L39.8076318,145.077172 L40.0402001,145.164315 C40.2146264,145.241776 40.3793622,145.280507 40.5344078,145.280507 L40.5925499,145.280507 L40.6506919,145.309555 C40.7669761,145.387015 40.931712,145.416063 41.1448996,145.396698 Z M53.7617302,145.048124 L54.0524406,144.990028 L54.3140799,144.931932 L54.4885061,144.931932 L54.6338613,144.873837 C54.6338613,144.873837 54.7016938,144.844789 54.8373586,144.786693 L55.0408559,144.728597 L55.2734242,144.641454 C55.661038,144.486532 55.8645353,144.409071 55.883916,144.409071 C56.0971036,144.370341 56.2812202,144.254149 56.4362657,144.060497 C56.4944078,143.983036 56.5719305,143.915258 56.668834,143.857162 C56.8044989,143.779701 56.891712,143.682875 56.9304734,143.566683 L56.9886154,143.363348 C57.0855189,143.150331 57.1824224,142.879217 57.2793258,142.550008 L57.39561,142.114291 L57.4828231,141.707621 L57.7444624,140.894281 L57.8026045,140.63285 L57.9188887,140.139037 L58.0642438,139.674271 L58.180528,139.354745 L58.2677411,139.035218 L58.3258832,138.686644 L58.5875225,137.495682 L58.6747356,137.11806 L58.7328777,136.740438 L58.8782329,136.159481 C58.9169943,135.946463 58.936375,135.752811 58.936375,135.578524 L58.965446,134.997567 L58.9945171,134.445658 L59.0235881,134.126131 L59.0526591,133.632318 L59.0526591,133.399935 L59.0817302,131.279442 L59.0817302,130.611341 L59.1108012,129.94324 L59.1689433,128.4618 L59.2270854,127.880843 L59.3142985,127.328934 L59.4015116,126.689881 C59.440273,126.438133 59.4596537,126.225115 59.4596537,126.050828 C59.4208923,125.469871 59.2852275,125.053519 59.0526591,124.80177 C58.7813295,124.550022 58.5487611,124.424148 58.3549542,124.424148 C58.2968122,124.424148 58.2483604,124.414466 58.209599,124.395101 C58.151457,124.31764 58.0448632,124.307957 57.8898176,124.366053 L57.7153914,124.453196 L57.5409652,124.54034 C57.4053003,124.617801 57.2793258,124.646849 57.1630417,124.627483 C57.0661382,124.627483 57.0176865,124.675896 57.0176865,124.772723 L56.9886154,125.266536 C56.9886154,125.440823 56.9983058,125.595745 57.0176865,125.731302 L57.1048996,126.341307 C57.1242803,126.593055 57.1242803,126.806072 57.1048996,126.980359 L57.0758285,127.357982 L57.0176865,127.764651 L56.9304734,129.158948 L56.8723313,131.018011 L56.8723313,131.395633 L56.8432602,131.773255 C56.8238795,131.966907 56.8141892,132.208973 56.8141892,132.499451 L56.8432602,133.1966 L56.8141892,133.748509 L56.697905,134.619945 C56.7366664,134.987884 56.7172857,135.365506 56.639763,135.752811 L56.4944078,136.479007 L56.3781236,137.234251 L56.2036974,138.105687 L56.0002001,139.122362 L55.7676318,139.935702 L55.6222766,140.429515 L55.5059925,140.894281 C55.4284697,141.300951 55.3412566,141.620477 55.2443531,141.85286 C55.128069,142.143339 55.0214752,142.385404 54.9245717,142.579056 C54.8664296,142.656517 54.7792165,142.70493 54.6629324,142.724296 C54.5466482,142.743661 54.4497448,142.714613 54.372222,142.637152 C54.0621309,142.385404 53.7811109,141.998099 53.5291619,141.475238 C53.2578322,140.894281 53.0640253,140.235863 52.9477411,139.499984 L52.9186701,139.383793 C52.8023859,138.919027 52.7151728,138.434896 52.6570307,137.9314 L52.5988887,137.466634 L52.5407466,136.972821 L52.5116755,136.856629 L52.5116755,136.769486 C52.5310562,136.67266 52.5310562,136.566151 52.5116755,136.449959 L52.4535335,136.130433 C52.4147721,135.917415 52.3953914,135.71408 52.3953914,135.520428 L52.4244624,135.08471 L52.4244624,134.474705 L52.3953914,134.27137 L52.3663203,133.893748 L52.3372493,133.487078 C52.35663,133.119139 52.3469397,132.664056 52.3081783,132.121829 L52.3081783,131.860399 C52.327559,131.763573 52.327559,131.686112 52.3081783,131.628016 C52.2500362,131.434364 52.2403458,131.211663 52.2791072,130.959915 L52.2791072,130.727532 L52.2500362,130.204671 L52.1918941,129.68181 L52.1918941,128.723231 L52.2209652,127.764651 L52.1918941,127.503221 L52.1918941,127.24179 L52.104681,126.806072 L52.0465389,126.399402 L52.0465389,126.312259 L52.07561,126.225115 C52.1143713,126.089559 52.1143713,125.954002 52.07561,125.818445 L52.0174679,125.61511 C51.9980872,125.479554 51.9399451,125.382728 51.8430417,125.324632 C51.7848996,125.285901 51.7364479,125.237488 51.6976865,125.179393 C51.6201637,125.043836 51.4941892,124.927644 51.319763,124.830818 L51.0871947,124.714627 L50.8546264,124.598435 L50.6220581,124.511292 L49.7789979,124.307957 C49.7596173,124.307957 49.6530234,124.327322 49.4592165,124.366053 L49.1975772,124.395101 L48.9940799,124.395101 L48.9940799,124.395101 C48.9165571,124.395101 48.8390344,124.424148 48.7615116,124.482244 L48.5870854,124.598435 L48.4417302,124.714627 C48.3060653,124.830818 48.1897812,124.888914 48.0928777,124.888914 L48.0638067,124.917962 L48.0347356,124.94701 C47.9765936,124.966375 47.9475225,125.014788 47.9475225,125.092249 L47.9184515,125.179393 L47.9184515,125.266536 C47.8796901,125.421458 47.8506191,125.595745 47.8312384,125.789397 L47.8603094,126.312259 L47.8603094,128.113226 L47.8312384,128.287513 L47.8312384,128.4618 L47.8893805,129.391331 L47.9184515,130.320862 L47.9475225,130.669437 L48.0056646,131.018011 C48.0250453,131.289124 48.0056646,131.521507 47.9475225,131.715159 L47.9475225,131.744207 C47.9862839,131.97659 48.0056646,132.247703 48.0056646,132.557547 L48.0347356,133.341839 C48.073497,134.561849 48.1219488,135.539793 48.1800908,136.275672 L48.325446,137.9314 C48.3642074,138.260609 48.4029688,138.502674 48.4417302,138.657596 L48.5289433,139.15141 L48.6452275,139.616175 L48.6742985,139.703319 L48.6742985,139.761415 L48.7324406,140.080941 L48.8777958,140.661898 L49.0231509,141.271903 C49.0619123,141.40746 49.1200544,141.552699 49.1975772,141.707621 L49.4010744,142.143339 L49.6917848,142.637152 L49.9824952,143.101918 C50.1956828,143.527953 50.5445353,143.92494 51.0290526,144.29288 C51.125956,144.370341 51.2519305,144.438119 51.4069761,144.496215 L51.8721127,144.670502 L52.3372493,144.844789 C52.5891983,144.941615 52.8411473,144.999711 53.0930963,145.019076 L53.2093805,145.019076 C53.364426,145.077172 53.5485426,145.086854 53.7617302,145.048124 Z M67.8902548,145.019076 C67.9096355,144.999711 67.9871582,144.980346 68.1228231,144.96098 L68.2972493,144.931932 L68.5007466,144.873837 C68.8883604,144.777011 69.1306191,144.660819 69.2275225,144.525262 C69.324426,144.428436 69.3631874,144.312245 69.3438067,144.176688 C69.3438067,144.099227 69.3341163,144.002401 69.3147356,143.88621 L69.2856646,143.537635 C69.2662839,143.227792 69.2469032,143.014774 69.2275225,142.898583 C69.2081418,142.821122 69.1790708,142.579056 69.1403094,142.172386 L69.0821673,141.736669 C69.0821673,141.601112 69.072477,141.504286 69.0530963,141.44619 C68.9755735,141.020155 68.9465025,140.652215 68.9658832,140.342372 C68.9852639,140.18745 68.9755735,139.858241 68.9368122,139.354745 L68.9368122,139.064266 L68.9077411,138.802835 L68.9077411,138.425213 L68.9077411,138.425213 C68.9077411,138.309022 68.9174315,137.979813 68.9368122,137.437586 C68.9368122,137.282665 68.9465025,137.07933 68.9658832,136.827582 L68.9658832,136.537103 L68.9949542,136.362816 L68.9658832,136.217577 L68.9658832,136.101385 L68.9368122,135.781859 C68.9368122,135.646302 68.9465025,135.530111 68.9658832,135.433285 C69.0046446,135.278363 69.0046446,134.755501 68.9658832,133.864701 C68.9376931,133.259097 68.9146285,132.822499 68.8966893,132.554906 L68.884196,132.385901 C68.8822739,132.363015 68.880432,132.342769 68.8786701,132.325164 L68.849599,132.034686 L68.820528,131.715159 L68.849599,131.453729 L68.9077411,130.988963 C68.9271218,130.814676 68.9174315,130.659754 68.8786701,130.524197 L68.8786701,130.320862 L68.849599,129.129901 L68.849599,128.926566 C68.849599,128.887835 68.8399087,128.820057 68.820528,128.723231 L68.791457,128.4618 C68.7720763,128.229417 68.7623859,128.084178 68.7623859,128.026082 C68.7817666,127.948621 68.7720763,127.87116 68.7333149,127.793699 L68.6751728,127.706556 C68.6557921,127.667825 68.6461018,127.619412 68.6461018,127.561316 C68.6267211,127.309568 68.539508,127.05782 68.3844624,126.806072 C68.3650817,126.728611 68.3553914,126.670516 68.3553914,126.631785 L70.6810744,126.573689 C70.9717848,126.554324 71.2043531,126.525276 71.3787794,126.486546 C71.6307284,126.409085 71.8245353,126.292894 71.9602001,126.137972 C72.095865,125.963685 72.1733877,125.673206 72.1927684,125.266536 C72.2121491,125.092249 72.2024588,124.956692 72.1636974,124.859866 C72.0861746,124.685579 71.8923677,124.57907 71.5822766,124.54034 L71.5822766,124.511292 L71.3787794,124.424148 L71.1752821,124.395101 L70.7682876,124.366053 L70.361293,124.366053 L70.0415116,124.395101 L69.4019488,124.424148 L68.7623859,124.453196 C68.5879597,124.453196 68.4522948,124.424148 68.3553914,124.366053 C68.2584879,124.327322 68.1422038,124.307957 68.0065389,124.307957 L66.8727684,124.366053 L65.9424952,124.424148 L65.012222,124.424148 L64.285446,124.395101 L63.7912384,124.395101 L63.3551728,124.453196 L62.9191072,124.511292 C62.7834424,124.511292 62.6187065,124.550022 62.4248996,124.627483 C62.211712,124.704944 61.9985244,124.753357 61.7853367,124.772723 L61.0004187,124.772723 L60.9422766,124.830818 L60.8841346,124.917962 L60.8259925,125.034153 C60.7872311,125.111614 60.7775407,125.189075 60.7969214,125.266536 C60.8356828,125.460188 60.8066118,125.634476 60.7097083,125.789397 C60.6128049,125.944319 60.6321856,126.089559 60.7678504,126.225115 L60.8550635,126.312259 L60.9132056,126.399402 L61.0876318,126.573689 C61.1070125,126.593055 61.1845353,126.641468 61.3202001,126.718929 L61.4655553,126.806072 C61.5236974,126.844803 61.5624588,126.864168 61.5818395,126.864168 C61.6787429,126.941629 61.7756464,126.970677 61.8725499,126.951312 L62.2795444,126.893216 L62.6865389,126.83512 C62.8415845,126.79639 63.0160107,126.777024 63.2098176,126.777024 L63.471457,126.806072 C63.5683604,126.786707 63.6652639,126.777024 63.7621673,126.777024 C64.0141163,126.738294 64.2079233,126.738294 64.3435881,126.777024 C64.479253,126.79639 64.537395,126.893216 64.5180143,127.067503 C64.4986336,127.164329 64.5277047,127.328934 64.6052275,127.561316 L64.7215116,127.851795 C64.7408923,127.948621 64.7505826,128.026082 64.7505826,128.084178 L64.7505826,131.047059 L64.7796537,132.267069 L64.7796537,135.462332 L64.8087247,135.839955 L64.8087247,136.217577 C64.7505826,136.93409 64.731202,137.56346 64.7505826,138.105687 L64.7796537,138.977123 L64.8087247,139.877606 L64.8959378,141.184759 L64.9540799,141.765716 L65.012222,142.317626 C65.012222,142.453182 65.041293,142.617787 65.0994351,142.811439 L65.2447903,143.305253 C65.2447903,143.324618 65.2544806,143.382714 65.2738613,143.47954 L65.3029324,143.682875 C65.3416938,143.895892 65.3804551,144.031449 65.4192165,144.089545 L65.5936428,144.496215 C65.6711655,144.651137 65.79714,144.747963 65.9715662,144.786693 L66.1750635,144.815741 C66.1944442,144.815741 66.2332056,144.825424 66.2913477,144.844789 L66.4948449,144.902885 C66.6886519,144.941615 66.8630781,144.980346 67.0181236,145.019076 C67.4832602,145.096537 67.7739706,145.096537 67.8902548,145.019076 Z M76.9022766,144.786693 C76.941038,144.747963 77.0185608,144.689867 77.1348449,144.612406 C77.2317484,144.534945 77.2995808,144.486532 77.3383422,144.467167 C77.4546264,144.447802 77.5321491,144.350975 77.5709105,144.176688 L77.6290526,143.944305 L77.7162657,143.74097 C77.7550271,143.66351 77.7744078,143.595731 77.7744078,143.537635 L77.7453367,143.189061 C77.7453367,143.053505 77.7550271,142.937313 77.7744078,142.840487 C77.7937885,142.646835 77.8034788,142.395087 77.8034788,142.085243 L77.7744078,141.707621 L77.7744078,140.981424 L77.7453367,140.661898 L77.7453367,138.74474 L77.7162657,138.047591 L77.6871947,137.350443 L77.6871947,136.653294 L77.7162657,135.839955 L77.7744078,135.055662 C77.7937885,134.745819 77.7840981,134.484388 77.7453367,134.27137 L77.7744078,134.184227 L77.7744078,134.126131 L77.8325499,133.661366 L77.8616209,133.225648 L77.8325499,132.179925 L77.8325499,131.16325 L77.8616209,130.466102 L77.8616209,129.739905 L77.8906919,129.449427 L77.919763,129.129901 L77.919763,128.781326 L77.948834,128.432752 L78.0360471,128.026082 L78.1232602,127.619412 C78.200783,127.290203 78.2395444,127.009407 78.2395444,126.777024 L78.2395444,126.747977 L78.2686154,126.718929 L78.2976865,126.312259 L78.2976865,126.02178 C78.2976865,125.905589 78.3073768,125.818445 78.3267575,125.76035 C78.3848996,125.566697 78.3655189,125.373045 78.2686154,125.179393 L78.0651182,124.830818 L77.8325499,124.511292 C77.8131692,124.472561 77.6581236,124.35637 77.3674132,124.162718 C77.0960836,123.969065 76.9216573,123.852874 76.8441346,123.814143 L76.6697083,123.756048 L76.5243531,123.697952 C76.2142621,123.581761 75.9720034,123.523665 75.7975772,123.523665 L75.6231509,123.523665 L75.4777958,123.552713 L75.1870854,123.639856 L74.925446,123.727 C74.6928777,123.785096 74.5184515,123.862557 74.4021673,123.959383 L74.3149542,123.988431 C74.1211473,124.046526 74.0242438,124.162718 74.0242438,124.337005 L73.9951728,124.482244 C73.8982693,124.908279 73.8498176,125.305267 73.8498176,125.673206 C73.8498176,125.808763 73.8304369,125.915271 73.7916755,125.992732 C73.7335335,126.147654 73.6850817,126.341307 73.6463203,126.573689 L73.5881783,127.125599 L73.5300362,127.619412 L73.5009652,128.084178 L73.413752,128.665135 L73.35561,129.246092 L73.3265389,130.146575 C73.3071582,130.49515 73.3071582,130.785628 73.3265389,131.018011 L73.3265389,131.657064 L73.2974679,132.325164 L73.2974679,133.254696 L73.2683969,133.777557 L73.2102548,134.126131 C73.2102548,134.261688 73.2199451,134.377879 73.2393258,134.474705 L73.2393258,134.67804 L73.2102548,134.939471 L73.1811837,135.22995 L73.2102548,135.694715 L73.1811837,136.188529 C73.1811837,136.575833 73.1908741,136.885677 73.2102548,137.11806 L73.2102548,137.176156 L73.1811837,138.047591 L73.2102548,138.889979 L73.2102548,139.703319 L73.2393258,140.313324 L73.2393258,140.981424 L73.2974679,141.678573 L73.3265389,142.375721 C73.3459196,142.937313 73.3943713,143.392396 73.4718941,143.74097 C73.4912748,143.818431 73.5978686,143.953988 73.7916755,144.14764 L74.0242438,144.380023 C74.1017666,144.457484 74.1502183,144.51558 74.169599,144.55431 C74.3246446,144.786693 74.5087611,144.912567 74.7219488,144.931932 C74.7994715,144.931932 74.8576136,144.941615 74.896375,144.96098 C74.9932785,144.999711 75.1095626,145.028759 75.2452275,145.048124 L75.5940799,145.019076 L75.8266482,145.019076 C76.3111655,145.135267 76.6697083,145.057806 76.9022766,144.786693 Z M89.1702548,145.36765 C89.6935335,145.36765 90.129599,145.348285 90.4784515,145.309555 L90.7691619,145.309555 C90.885446,145.309555 90.9920398,145.290189 91.0889433,145.251459 C91.2246081,145.193363 91.3505826,145.115902 91.4668668,145.019076 C91.6025316,144.902885 91.6897448,144.786693 91.7285061,144.670502 C91.8254096,144.360658 91.8447903,144.070179 91.7866482,143.799066 L91.7575772,143.682875 L91.7575772,143.537635 C91.7381965,143.440809 91.7091254,143.363348 91.6703641,143.305253 L91.641293,143.247157 L91.5540799,143.189061 C91.4959378,143.130966 91.4184151,143.092235 91.3215116,143.07287 C91.2246081,143.034139 90.9726591,143.014774 90.5656646,143.014774 L90.129599,143.014774 L89.9261018,142.985726 C89.2865389,142.927631 88.7535699,142.917948 88.3271947,142.956678 L86.5538613,142.956678 C85.8755371,142.956678 85.507304,142.946996 85.4491619,142.927631 L85.3038067,142.898583 L85.1293805,142.840487 C84.9937156,142.763026 84.9258832,142.637152 84.9258832,142.462865 L84.9549542,142.143339 L84.9840253,141.794764 L84.9549542,141.359047 L84.9258832,140.923329 L84.9258832,140.749042 L84.9549542,140.429515 L84.9549542,140.109989 C84.9549542,139.81951 84.9646446,139.59681 84.9840253,139.441888 C85.0227867,139.267601 85.032477,139.00617 85.0130963,138.657596 L85.0130963,137.873304 L85.0421673,137.379491 L85.0130963,136.856629 L84.9840253,136.391864 L84.9549542,135.89805 L84.9549542,135.142806 C84.9549542,134.910423 84.9161928,134.707088 84.8386701,134.532801 C84.780528,134.377879 84.780528,134.242323 84.8386701,134.126131 C84.9355735,133.971209 84.9646446,133.767874 84.9258832,133.516126 C84.8483604,133.070726 84.8483604,132.664056 84.9258832,132.296116 L84.9258832,131.279442 L84.8968122,131.16325 L84.8968122,131.047059 L84.9258832,130.785628 L84.9258832,130.49515 C84.9065025,130.262767 84.9161928,130.078797 84.9549542,129.94324 L84.9549542,129.827049 C84.9355735,129.710858 84.9258832,129.584984 84.9258832,129.449427 L84.9258832,129.071805 C84.9452639,128.955613 84.9355735,128.820057 84.8968122,128.665135 L84.8677411,128.403704 C84.8483604,128.326243 84.8677411,128.248782 84.9258832,128.171321 L84.9549542,128.113226 L84.9549542,128.026082 L84.9258832,127.503221 L84.9258832,127.24179 L84.8968122,126.980359 C84.8774315,126.844803 84.8968122,126.709246 84.9549542,126.573689 L84.9840253,126.486546 L84.9840253,126.42845 L85.0421673,126.108924 L85.0421673,125.818445 C85.0421673,125.586062 85.0130963,125.382728 84.9549542,125.20844 C84.7417666,124.646849 84.3638431,124.298274 83.8211837,124.162718 C83.297905,124.027161 82.8521491,123.969065 82.483916,123.988431 L82.2222766,123.988431 C82.1059925,123.988431 82.0187794,123.998113 81.9606373,124.017478 C81.728069,124.094939 81.5536428,124.220813 81.4373586,124.395101 C81.3985972,124.453196 81.3598358,124.491927 81.3210744,124.511292 C81.224171,124.550022 81.1563386,124.637166 81.1175772,124.772723 C81.0788158,124.94701 81.0303641,125.072884 80.972222,125.150345 C80.8171764,125.402093 80.7396537,125.702254 80.7396537,126.050828 C80.7396537,126.16702 80.7590344,126.254163 80.7977958,126.312259 C80.8559378,126.409085 80.8753185,126.544642 80.8559378,126.718929 L80.7687247,127.154647 C80.749344,127.309568 80.7687247,127.454808 80.8268668,127.590364 L80.8268668,130.49515 L80.8559378,131.482777 L80.8559378,133.980892 L80.8850089,135.433285 L80.9140799,136.188529 L80.9431509,137.089012 L80.9431509,137.495682 L80.9140799,137.9314 L80.9431509,138.628548 L80.9431509,139.732367 L80.9140799,140.109989 L80.9140799,140.603802 L80.9431509,141.097616 L80.9431509,143.624779 L80.972222,143.915258 C80.972222,143.992719 80.9819123,144.099227 81.001293,144.234784 C80.9819123,144.350975 81.0109834,144.467167 81.0885061,144.583358 C81.1466482,144.69955 81.2435517,144.796376 81.3792165,144.873837 C81.7086883,145.086854 82.1253732,145.232094 82.6292712,145.309555 C82.9393622,145.348285 83.3851182,145.36765 83.9665389,145.36765 L89.1702548,145.36765 Z M96.7868668,144.786693 C96.8256282,144.747963 96.9031509,144.689867 97.0194351,144.612406 C97.1163386,144.534945 97.184171,144.486532 97.2229324,144.467167 C97.3392165,144.447802 97.4167393,144.350975 97.4555007,144.176688 L97.5136428,143.944305 L97.6008559,143.74097 C97.6396173,143.66351 97.6589979,143.595731 97.6589979,143.537635 L97.6299269,143.189061 C97.6299269,143.053505 97.6396173,142.937313 97.6589979,142.840487 C97.6783786,142.646835 97.688069,142.395087 97.688069,142.085243 L97.6589979,141.707621 L97.6589979,140.981424 L97.6299269,140.661898 L97.6299269,138.74474 L97.6008559,138.047591 L97.5717848,137.350443 L97.5717848,136.653294 L97.6008559,135.839955 L97.6589979,135.055662 C97.6783786,134.745819 97.6686883,134.484388 97.6299269,134.27137 L97.6589979,134.184227 L97.6589979,134.126131 L97.71714,133.661366 L97.7462111,133.225648 L97.71714,132.179925 L97.71714,131.16325 L97.7462111,130.466102 L97.7462111,129.739905 L97.7752821,129.449427 L97.8043531,129.129901 L97.8043531,128.781326 L97.8334242,128.432752 L97.9206373,128.026082 L98.0078504,127.619412 C98.0853732,127.290203 98.1241346,127.009407 98.1241346,126.777024 L98.1241346,126.747977 L98.1532056,126.718929 L98.1822766,126.312259 L98.1822766,126.02178 C98.1822766,125.905589 98.191967,125.818445 98.2113477,125.76035 C98.2694897,125.566697 98.2501091,125.373045 98.1532056,125.179393 L97.9497083,124.830818 L97.71714,124.511292 C97.6977593,124.472561 97.5427138,124.35637 97.2520034,124.162718 C96.9806737,123.969065 96.8062475,123.852874 96.7287247,123.814143 L96.5542985,123.756048 L96.4089433,123.697952 C96.0988522,123.581761 95.8565936,123.523665 95.6821673,123.523665 L95.5077411,123.523665 L95.3623859,123.552713 L95.0716755,123.639856 L94.8100362,123.727 C94.5774679,123.785096 94.4030417,123.862557 94.2867575,123.959383 L94.1995444,123.988431 C94.0057375,124.046526 93.908834,124.162718 93.908834,124.337005 L93.879763,124.482244 C93.7828595,124.908279 93.7344078,125.305267 93.7344078,125.673206 C93.7344078,125.808763 93.7150271,125.915271 93.6762657,125.992732 C93.6181236,126.147654 93.5696719,126.341307 93.5309105,126.573689 L93.4727684,127.125599 L93.4146264,127.619412 L93.3855553,128.084178 L93.2983422,128.665135 L93.2402001,129.246092 L93.2111291,130.146575 C93.1917484,130.49515 93.1917484,130.785628 93.2111291,131.018011 L93.2111291,131.657064 L93.1820581,132.325164 L93.1820581,133.254696 L93.152987,133.777557 L93.0948449,134.126131 C93.0948449,134.261688 93.1045353,134.377879 93.123916,134.474705 L93.123916,134.67804 L93.0948449,134.939471 L93.0657739,135.22995 L93.0948449,135.694715 L93.0657739,136.188529 C93.0657739,136.575833 93.0754642,136.885677 93.0948449,137.11806 L93.0948449,137.176156 L93.0657739,138.047591 L93.0948449,138.889979 L93.0948449,139.703319 L93.123916,140.313324 L93.123916,140.981424 L93.1820581,141.678573 L93.2111291,142.375721 C93.2305098,142.937313 93.2789615,143.392396 93.3564843,143.74097 C93.375865,143.818431 93.4824588,143.953988 93.6762657,144.14764 L93.908834,144.380023 C93.9863568,144.457484 94.0348085,144.51558 94.0541892,144.55431 C94.2092347,144.786693 94.3933513,144.912567 94.6065389,144.931932 C94.6840617,144.931932 94.7422038,144.941615 94.7809652,144.96098 C94.8778686,144.999711 94.9941528,145.028759 95.1298176,145.048124 L95.4786701,145.019076 L95.7112384,145.019076 C96.1957557,145.135267 96.5542985,145.057806 96.7868668,144.786693 Z M106.293096,145.425746 C106.661329,145.387015 107.010182,145.338602 107.339654,145.280507 C107.455938,145.261141 107.552841,145.232094 107.630364,145.193363 C107.707887,145.193363 107.746648,145.18368 107.746648,145.164315 L107.892003,145.135267 L108.008288,145.135267 C108.143952,145.115902 108.240856,145.096537 108.298998,145.077172 L108.589708,144.844789 C108.64785,144.806058 108.725373,144.767328 108.822277,144.728597 L109.083916,144.69955 C109.316484,144.660819 109.48122,144.602723 109.578124,144.525262 L110.101402,144.002401 C110.217686,143.905575 110.3049,143.818431 110.363042,143.74097 C110.944462,143.101918 111.273934,142.327308 111.351457,141.417142 C111.42898,140.506976 111.419289,139.722684 111.322386,139.064266 L111.235173,138.628548 C111.196411,138.454261 111.14796,138.309022 111.089818,138.192831 L110.915391,137.873304 L110.88632,137.786161 L110.421184,136.653294 L110.275829,136.362816 L110.159544,136.246624 L110.04326,136.130433 C109.830073,135.89805 109.578124,135.607572 109.287413,135.258997 L108.531566,134.358514 C107.911384,133.642 107.368725,133.090091 106.903588,132.702786 L106.525665,132.38326 C106.39,132.247703 106.273716,132.131512 106.176812,132.034686 L105.973315,131.802303 L105.798889,131.540872 C105.643843,131.327855 105.527559,131.172933 105.450036,131.076107 L105.130255,130.785628 L104.839544,130.49515 C104.490692,130.12721 104.15153,129.49784 103.822058,128.607039 C103.822058,128.548943 103.812368,128.452117 103.792987,128.316561 L103.763916,128.113226 L103.734845,127.909891 C103.715464,127.541951 103.734845,127.24179 103.792987,127.009407 C103.812368,126.893216 103.8802,126.747977 103.996484,126.573689 C104.112768,126.399402 104.219362,126.292894 104.316266,126.254163 C104.72326,126.137972 105.052732,126.108924 105.304681,126.16702 C105.614772,126.225115 105.798889,126.38972 105.857031,126.660833 L105.886102,126.777024 L105.915173,126.922264 C105.953934,127.251473 106.138051,127.532269 106.467523,127.764651 L106.612878,127.851795 C106.745774,127.984585 106.900028,128.010669 107.075641,127.930046 L107.165227,127.880843 C107.533461,127.725921 107.698196,127.454808 107.659435,127.067503 C107.678816,127.028773 107.688506,126.980359 107.688506,126.922264 L107.572222,126.283211 L107.426867,125.644158 C107.388105,125.469871 107.310583,125.382728 107.194298,125.382728 L107.048943,125.150345 C106.661329,124.685579 106.176812,124.346687 105.595391,124.13367 L105.595391,124.104622 L105.479107,124.075574 L105.391894,124.046526 L105.420965,124.075574 L105.304681,124.075574 C105.188397,124.017478 105.052732,124.007796 104.897686,124.046526 L104.839544,124.046526 C104.180601,124.065892 103.541038,124.162718 102.920856,124.337005 C102.397577,124.491927 101.990583,124.695262 101.699872,124.94701 C100.944025,125.605428 100.50796,126.602737 100.391676,127.938939 C100.314153,129.042757 100.537031,130.030384 101.060309,130.90182 C101.157213,131.037376 101.283187,131.201981 101.438233,131.395633 L101.816156,131.860399 L102.077796,132.238021 L102.310364,132.615643 C102.504171,132.925487 102.697978,133.157869 102.891785,133.312791 C103.008069,133.409617 103.134043,133.487078 103.269708,133.545174 L103.531348,133.748509 L103.734845,133.980892 L103.996484,134.300418 L104.258124,134.619945 L104.752331,135.200902 L105.217468,135.781859 L106.147741,136.885677 L106.380309,137.176156 L106.612878,137.495682 L107.019872,138.163783 C107.174918,138.434896 107.291202,138.667279 107.368725,138.860931 C107.601293,139.364427 107.698196,139.78078 107.659435,140.109989 L107.630364,140.197132 L107.601293,140.284276 L107.543151,140.574755 L107.543151,140.865233 C107.485009,141.465555 107.097395,142.03683 106.380309,142.579056 C105.779508,143.024457 105.178707,143.276205 104.577905,143.334301 L104.112768,143.334301 L104.141839,143.363348 C104.006175,143.343983 103.812368,143.305253 103.560419,143.247157 C103.289089,143.189061 103.104972,143.130966 103.008069,143.07287 L102.572003,142.724296 L102.135938,142.404769 C102.039034,142.327308 101.854918,142.027147 101.583588,141.504286 C101.292878,140.962059 101.128142,140.555389 101.08938,140.284276 L101.060309,139.993797 L101.031238,139.732367 C101.011858,139.499984 100.953716,139.316014 100.856812,139.180458 L100.856812,139.15141 C100.837431,139.073949 100.80836,139.00617 100.769599,138.948075 L100.740528,138.919027 L100.711457,138.919027 C100.653315,138.860931 100.575792,138.812518 100.478889,138.773788 L100.071894,138.657596 L100.042823,138.686644 L99.984681,138.715692 C99.7133513,138.735057 99.480783,138.831883 99.2869761,139.00617 L99.0834788,139.209505 C99.005956,139.248236 98.9575043,139.286966 98.9381236,139.325697 C98.8993622,139.383793 98.8799815,139.519349 98.8799815,139.732367 C98.8799815,139.887289 98.9284333,140.129354 99.0253367,140.458563 L99.1416209,140.923329 L99.2869761,141.388094 L99.3741892,141.707621 C99.3935699,141.804447 99.4323313,141.891591 99.4904734,141.969051 L99.6067575,142.288578 L99.6939706,142.579056 C99.7908741,142.908265 99.984681,143.247157 100.275391,143.595731 C100.488579,143.866844 100.759909,144.137958 101.08938,144.409071 C101.709563,144.931932 102.368506,145.251459 103.066211,145.36765 C104.074007,145.541937 105.149635,145.561303 106.293096,145.425746 Z M114.171348,145.512889 C114.287632,145.474159 114.384535,145.387015 114.462058,145.251459 C114.675246,145.115902 114.772149,144.893202 114.752768,144.583358 L114.781839,144.496215 C114.781839,144.302562 114.772149,144.070179 114.752768,143.799066 L114.578342,142.462865 L114.462058,141.475238 L114.432987,140.894281 L114.374845,140.342372 C114.336084,139.955067 114.336084,139.664588 114.374845,139.470936 C114.394226,139.257919 114.500819,139.180458 114.694626,139.238553 L114.752768,139.267601 L115.334189,139.41284 L115.91561,139.587128 L116.380747,139.674271 L116.816812,139.761415 C116.971858,139.800145 117.165665,139.829193 117.398233,139.848558 L117.979654,139.906654 L118.968069,139.935702 L119.985555,139.935702 L120.596047,139.906654 C120.828615,139.906654 121.032113,139.867923 121.206539,139.790462 C121.342204,139.751732 121.419727,139.809828 121.439107,139.96475 L121.497249,140.690946 C121.51663,140.865233 121.574772,141.00079 121.671676,141.097616 C121.768579,141.175077 121.826721,141.291268 121.846102,141.44619 C121.904244,141.736669 121.933315,142.027147 121.933315,142.317626 C121.952696,142.550008 121.991457,142.821122 122.049599,143.130966 L122.224025,143.944305 L122.253096,144.060497 L122.282167,144.089545 C122.320929,144.263832 122.35969,144.399388 122.398451,144.496215 C122.456594,144.631771 122.534116,144.73828 122.63102,144.815741 C122.727923,144.893202 122.902349,144.951298 123.154298,144.990028 C123.638816,145.048124 124.133023,145.077172 124.636921,145.077172 C124.86949,145.096537 125.053606,145.086854 125.189271,145.048124 C125.402459,145.009393 125.567195,144.92225 125.683479,144.786693 C125.761002,144.689867 125.828834,144.55431 125.886976,144.380023 C125.964499,144.167006 125.99357,143.934623 125.974189,143.682875 C125.974189,143.566683 125.964499,143.469857 125.945118,143.392396 L125.857905,142.869535 L125.741621,142.346674 L125.625337,141.504286 L125.596266,141.068568 L125.538124,140.661898 L125.509053,140.458563 L125.479982,140.284276 L125.479982,139.00617 L125.450911,138.715692 C125.412149,138.483309 125.392768,138.309022 125.392768,138.192831 C125.412149,137.999178 125.412149,137.766795 125.392768,137.495682 L125.305555,136.798534 L125.247413,136.275672 C125.228033,136.08202 125.218342,135.907733 125.218342,135.752811 L125.218342,135.49138 L125.189271,135.22995 L125.1602,134.561849 C125.1602,134.542484 125.15051,134.513436 125.131129,134.474705 L125.102058,134.358514 C125.063297,134.261688 125.043916,134.184227 125.043916,134.126131 L125.043916,133.661366 C124.985774,133.428983 124.947013,133.157869 124.927632,132.848026 L124.927632,132.818978 L124.695064,131.657064 L124.636921,131.395633 L124.60785,131.134202 C124.60785,130.553245 124.549708,130.098162 124.433424,129.768953 L124.404353,129.710858 L124.375282,129.623714 C124.375282,129.449427 124.30745,129.255775 124.171785,129.042757 C124.152404,129.023392 124.123333,128.897518 124.084572,128.665135 L124.055501,128.374656 L124.02643,128.229417 L124.02643,128.113226 L123.968288,127.938939 L123.881074,127.735604 C123.803552,127.406395 123.667887,127.125599 123.47408,126.893216 C123.338415,126.718929 123.222131,126.505911 123.125227,126.254163 C122.989563,125.963685 122.708543,125.61511 122.282167,125.20844 L122.224025,125.179393 L122.165883,125.150345 L121.962386,125.005105 L121.758889,124.888914 L121.584462,124.772723 L120.973971,124.511292 C120.857686,124.453196 120.741402,124.414466 120.625118,124.395101 L120.043697,124.307957 L119.811129,124.278909 L119.607632,124.249861 C119.433206,124.249861 119.28785,124.278909 119.171566,124.337005 C119.132805,124.35637 119.084353,124.35637 119.026211,124.337005 C118.948688,124.31764 118.861475,124.327322 118.764572,124.366053 L118.532003,124.424148 L118.212222,124.54034 L117.892441,124.685579 L117.659872,124.743675 L117.456375,124.830818 C117.088142,125.024471 116.787741,125.256853 116.555173,125.527967 C116.419508,125.702254 116.245082,125.963685 116.031894,126.312259 L115.828397,126.689881 C115.731493,126.825438 115.64428,126.941629 115.566758,127.038455 L115.537686,127.096551 L115.508615,127.154647 L115.392331,127.387029 L115.276047,127.619412 C115.179144,127.813065 115.091931,127.958304 115.014408,128.05513 C114.956266,128.09386 114.907814,128.171321 114.869053,128.287513 L114.839982,128.403704 L114.781839,128.519896 C114.588033,128.810374 114.403916,129.178314 114.22949,129.623714 L113.996921,130.320862 C113.900018,130.572611 113.832186,130.804993 113.793424,131.018011 L113.67714,131.598968 L113.531785,132.296116 L113.415501,132.993265 L113.299217,133.661366 L113.212003,134.329466 L112.979435,135.869002 C112.960054,136.004559 112.989125,136.12075 113.066648,136.217577 L113.095719,136.30472 L113.12479,136.391864 L113.066648,136.943773 L113.008506,137.234251 L112.979435,137.52473 C112.979435,137.853939 112.989125,138.105687 113.008506,138.279974 C113.047268,138.492992 113.056958,138.78347 113.037577,139.15141 L113.008506,139.55808 L113.008506,140.574755 L113.153861,142.143339 L113.241074,143.682875 L113.299217,144.263832 C113.337978,144.476849 113.376739,144.670502 113.415501,144.844789 C113.473643,145.057806 113.560856,145.212728 113.67714,145.309555 C113.812805,145.483842 113.977541,145.55162 114.171348,145.512889 Z M121.322823,138.628548 L121.119326,138.599501 L120.973971,138.570453 L120.712331,138.541405 L120.479763,138.512357 L119.723916,138.454261 L118.968069,138.396166 L118.619217,138.33807 L118.299435,138.250926 L117.194736,138.018543 L116.904025,137.9314 L116.642386,137.844256 C116.022204,137.631239 115.402022,137.534413 114.781839,137.553778 C114.549271,137.573143 114.442677,137.466634 114.462058,137.234251 L114.578342,135.985194 L114.694626,134.765184 L114.752768,134.474705 L114.810911,134.184227 L114.869053,133.748509 L114.869053,133.60327 C114.907814,133.525809 114.936885,133.428983 114.956266,133.312791 L114.985337,133.051361 L115.014408,132.848026 L115.07255,132.673739 L115.217905,132.005638 L115.36326,131.337537 L115.450473,131.018011 L115.566758,130.727532 L115.799326,130.146575 C116.070656,129.468792 116.341985,128.945931 116.613315,128.577991 L116.933096,128.113226 L117.223807,127.677508 L117.369162,127.416077 L117.514517,127.183694 C117.572659,127.086868 117.669563,126.980359 117.805227,126.864168 L118.125009,126.573689 C118.241293,126.496229 118.396339,126.447815 118.590145,126.42845 C118.72581,126.409085 118.822714,126.447815 118.880856,126.544642 L119.026211,126.718929 L119.171566,126.922264 C119.501038,127.42576 119.714226,127.900208 119.811129,128.345608 L120.043697,129.129901 L120.276266,129.94324 L120.39255,130.437054 L120.450692,130.959915 L120.654189,132.208973 L120.828615,133.283743 C120.886758,133.709779 120.935209,134.077718 120.973971,134.387562 L121.061184,135.462332 L121.177468,136.566151 L121.322823,138.33807 L121.322823,138.628548 Z M131.236047,145.048124 L131.32326,145.019076 L131.410473,144.990028 C131.487996,144.970663 131.546138,144.941615 131.5849,144.902885 C131.662422,144.825424 131.749635,144.806058 131.846539,144.844789 C131.943442,144.883519 132.030656,144.835106 132.108178,144.69955 L132.311676,144.438119 C132.350437,144.380023 132.418269,144.370341 132.515173,144.409071 C132.612076,144.447802 132.747741,144.486532 132.922167,144.525262 L133.183807,144.525262 C133.455136,144.622089 133.803989,144.631771 134.230364,144.55431 C134.559836,144.496215 134.918379,144.399388 135.305992,144.263832 C135.712987,144.10891 136.013388,143.963671 136.207195,143.828114 L136.381621,143.711923 C136.439763,143.673192 136.478524,143.634462 136.497905,143.595731 C136.556047,143.51827 136.63357,143.440809 136.730473,143.363348 L136.992113,143.189061 C137.166539,143.053505 137.282823,142.937313 137.340965,142.840487 C137.379727,142.782391 137.418488,142.733978 137.457249,142.695248 C137.689818,142.540326 137.835173,142.278895 137.893315,141.910956 C137.990218,141.910956 138.058051,141.872225 138.096812,141.794764 L138.184025,141.678573 L138.242167,141.562382 L138.445665,141.242855 C138.523187,141.107298 138.581329,140.991107 138.620091,140.894281 L138.736375,140.574755 L138.88173,140.255228 C139.017395,140.042211 139.094918,139.829193 139.114298,139.616175 C139.133679,139.519349 139.172441,139.41284 139.230583,139.296649 C139.366247,139.00617 139.453461,138.735057 139.492222,138.483309 L139.579435,137.815208 L139.666648,137.001869 L139.666648,136.71139 L139.695719,136.391864 C139.734481,136.023924 139.695719,135.67535 139.579435,135.346141 L139.550364,135.171854 L139.521293,135.026615 L139.463151,134.910423 L139.405009,134.794232 L139.288725,134.590897 L139.172441,134.41661 L138.910801,134.068035 L138.736375,133.806605 L138.184025,133.022313 L137.980528,132.760882 L137.806102,132.528499 L137.631676,132.325164 L137.428178,132.150877 L137.224681,131.947542 C137.108397,131.79262 136.943661,131.647381 136.730473,131.511824 L135.945555,131.018011 L135.189708,130.553245 C135.034663,130.475784 134.995901,130.369276 135.073424,130.233719 C135.150947,130.098162 135.218779,129.952923 135.276921,129.798001 L135.335064,129.594666 C135.354444,129.53657 135.364135,129.468792 135.364135,129.391331 L135.364135,129.333235 L135.422277,129.246092 L135.451348,129.187996 L135.480419,129.129901 L135.50949,128.403704 L135.50949,128.345608 C135.470728,128.287513 135.451348,128.219734 135.451348,128.142274 L135.451348,127.909891 L135.422277,127.619412 L135.393206,127.328934 C135.315683,127.05782 135.180018,126.660833 134.986211,126.137972 L134.898998,125.992732 L134.782714,125.818445 L134.66643,125.673206 L134.550145,125.527967 C134.472623,125.373045 134.307887,125.227806 134.055938,125.092249 C133.590801,124.821136 133.106284,124.598435 132.602386,124.424148 L132.398889,124.424148 L132.16632,124.453196 L131.904681,124.424148 L131.643042,124.424148 C131.449235,124.443514 131.284499,124.501609 131.148834,124.598435 C130.974408,124.714627 130.809672,124.753357 130.654626,124.714627 L130.276703,124.569388 L129.898779,124.453196 L129.491785,124.337005 L129.288288,124.307957 L129.055719,124.278909 L128.910364,124.453196 C128.852222,124.511292 128.79408,124.559705 128.735938,124.598435 C128.52275,124.695262 128.309563,124.888914 128.096375,125.179393 C128.057614,125.218123 128.038233,125.266536 128.038233,125.324632 L128.038233,126.283211 L128.009162,127.183694 L128.009162,128.084178 L128.067304,130.262767 L128.096375,130.524197 L128.125446,130.785628 L128.183588,132.441356 L128.24173,133.748509 L128.328943,135.113758 L128.387085,135.89805 L128.445227,136.71139 L128.474298,137.408539 L128.50337,138.134735 L128.561512,139.55808 L128.590583,141.765716 L128.590583,143.160013 L128.619654,143.566683 L128.648725,143.88621 C128.668105,143.983036 128.697176,144.079862 128.735938,144.176688 C128.852222,144.447802 129.094481,144.651137 129.462714,144.786693 L129.753424,144.873837 L129.782495,144.902885 C129.91816,144.96098 130.170109,145.009393 130.538342,145.048124 C130.906575,145.086854 131.139144,145.086854 131.236047,145.048124 Z M131.904681,130.524197 C131.846539,130.466102 131.827158,130.417689 131.846539,130.378958 C131.924062,130.224036 131.953133,130.030384 131.933752,129.798001 L131.904681,129.507523 L131.904681,129.217044 L131.846539,127.474173 L131.846539,126.16702 L131.933752,126.196067 L132.020965,126.225115 L132.631457,126.602737 C132.689599,126.641468 132.738051,126.699564 132.776812,126.777024 L133.096594,127.328934 C133.193497,127.561316 133.251639,127.774334 133.27102,127.967986 C133.348543,128.548943 133.338852,129.013709 133.241949,129.362283 C133.203187,129.49784 133.145045,129.633397 133.067523,129.768953 L132.922167,129.914193 L132.776812,130.08848 L132.631457,130.233719 L132.457031,130.378958 C132.360127,130.456419 132.214772,130.524197 132.020965,130.582293 C131.982204,130.601658 131.943442,130.582293 131.904681,130.524197 Z M132.398889,141.359047 L132.398889,140.836185 L132.369818,140.836185 L132.369818,139.15141 L132.340747,138.657596 L132.340747,137.844256 C132.360127,137.728065 132.350437,137.631239 132.311676,137.553778 C132.272914,137.398856 132.243843,137.214886 132.224462,137.001869 L132.195391,136.420912 L132.195391,135.781859 C132.195391,135.704398 132.16632,135.646302 132.108178,135.607572 L132.108178,135.520428 C132.14694,135.384871 132.14694,135.220267 132.108178,135.026615 L132.079107,134.794232 L132.050036,134.532801 L132.020965,134.097083 C132.001584,133.922796 132.001584,133.777557 132.020965,133.661366 C132.040346,133.506444 132.040346,133.293426 132.020965,133.022313 L131.991894,132.412308 L131.991894,132.208973 L131.962823,132.034686 C131.982204,131.879764 132.059727,131.811986 132.195391,131.831351 L132.398889,131.860399 L132.602386,131.889447 L133.329162,131.947542 L133.445446,131.97659 L133.532659,131.97659 C133.610182,131.93786 133.716776,131.928177 133.852441,131.947542 L133.997796,131.97659 L134.172222,131.97659 L134.433861,132.005638 C134.530765,132.025003 134.608288,132.054051 134.66643,132.092782 L134.695501,132.092782 L134.724572,132.121829 L135.24785,132.470404 L135.742058,132.848026 C135.935865,132.983582 136.090911,133.157869 136.207195,133.370887 L136.410692,133.748509 L136.556047,134.155179 C136.63357,134.329466 136.652951,134.581214 136.614189,134.910423 C136.556047,135.49138 136.488215,136.004559 136.410692,136.449959 C136.35255,136.837264 136.255646,137.224569 136.119982,137.611874 L135.916484,138.105687 L135.683916,138.570453 C135.52887,138.899662 135.373825,139.180458 135.218779,139.41284 C134.869927,139.974432 134.433861,140.487611 133.910583,140.952377 C133.600492,141.242855 133.212878,141.40746 132.747741,141.44619 L132.602386,141.504286 C132.466721,141.523651 132.398889,141.475238 132.398889,141.359047 Z M149.957796,145.36765 C150.481074,145.36765 150.91714,145.348285 151.265992,145.309555 L151.556703,145.309555 C151.672987,145.309555 151.779581,145.290189 151.876484,145.251459 C152.012149,145.193363 152.138124,145.115902 152.254408,145.019076 C152.390073,144.902885 152.477286,144.786693 152.516047,144.670502 C152.612951,144.360658 152.632331,144.070179 152.574189,143.799066 L152.545118,143.682875 L152.545118,143.537635 C152.525737,143.440809 152.496666,143.363348 152.457905,143.305253 L152.428834,143.247157 L152.341621,143.189061 C152.283479,143.130966 152.205956,143.092235 152.109053,143.07287 C152.012149,143.034139 151.7602,143.014774 151.353206,143.014774 L150.91714,143.014774 L150.713643,142.985726 C150.07408,142.927631 149.541111,142.917948 149.114736,142.956678 L147.341402,142.956678 C146.663078,142.956678 146.294845,142.946996 146.236703,142.927631 L146.091348,142.898583 L145.916921,142.840487 C145.781257,142.763026 145.713424,142.637152 145.713424,142.462865 L145.742495,142.143339 L145.771566,141.794764 L145.742495,141.359047 L145.713424,140.923329 L145.713424,140.749042 L145.742495,140.429515 L145.742495,140.109989 C145.742495,139.81951 145.752186,139.59681 145.771566,139.441888 C145.810328,139.267601 145.820018,139.00617 145.800637,138.657596 L145.800637,137.873304 L145.829708,137.379491 L145.800637,136.856629 L145.771566,136.391864 L145.742495,135.89805 L145.742495,135.142806 C145.742495,134.910423 145.703734,134.707088 145.626211,134.532801 C145.568069,134.377879 145.568069,134.242323 145.626211,134.126131 C145.723115,133.971209 145.752186,133.767874 145.713424,133.516126 C145.635901,133.070726 145.635901,132.664056 145.713424,132.296116 L145.713424,131.279442 L145.684353,131.16325 L145.684353,131.047059 L145.713424,130.785628 L145.713424,130.49515 C145.694043,130.262767 145.703734,130.078797 145.742495,129.94324 L145.742495,129.827049 C145.723115,129.710858 145.713424,129.584984 145.713424,129.449427 L145.713424,129.071805 C145.732805,128.955613 145.723115,128.820057 145.684353,128.665135 L145.655282,128.403704 C145.635901,128.326243 145.655282,128.248782 145.713424,128.171321 L145.742495,128.113226 L145.742495,128.026082 L145.713424,127.503221 L145.713424,127.24179 L145.684353,126.980359 C145.664972,126.844803 145.684353,126.709246 145.742495,126.573689 L145.771566,126.486546 L145.771566,126.42845 L145.829708,126.108924 L145.829708,125.818445 C145.829708,125.586062 145.800637,125.382728 145.742495,125.20844 C145.529308,124.646849 145.151384,124.298274 144.608725,124.162718 C144.085446,124.027161 143.63969,123.969065 143.271457,123.988431 L143.009818,123.988431 C142.893533,123.988431 142.80632,123.998113 142.748178,124.017478 C142.51561,124.094939 142.341184,124.220813 142.2249,124.395101 C142.186138,124.453196 142.147377,124.491927 142.108615,124.511292 C142.011712,124.550022 141.94388,124.637166 141.905118,124.772723 C141.866357,124.94701 141.817905,125.072884 141.759763,125.150345 C141.604717,125.402093 141.527195,125.702254 141.527195,126.050828 C141.527195,126.16702 141.546575,126.254163 141.585337,126.312259 C141.643479,126.409085 141.66286,126.544642 141.643479,126.718929 L141.556266,127.154647 C141.536885,127.309568 141.556266,127.454808 141.614408,127.590364 L141.614408,130.49515 L141.643479,131.482777 L141.643479,133.980892 L141.67255,135.433285 L141.701621,136.188529 L141.730692,137.089012 L141.730692,137.495682 L141.701621,137.9314 L141.730692,138.628548 L141.730692,139.732367 L141.701621,140.109989 L141.701621,140.603802 L141.730692,141.097616 L141.730692,143.624779 L141.759763,143.915258 C141.759763,143.992719 141.769453,144.099227 141.788834,144.234784 C141.769453,144.350975 141.798524,144.467167 141.876047,144.583358 C141.934189,144.69955 142.031093,144.796376 142.166758,144.873837 C142.496229,145.086854 142.912914,145.232094 143.416812,145.309555 C143.726903,145.348285 144.172659,145.36765 144.75408,145.36765 L149.957796,145.36765 Z M156.469708,145.396698 L157.341839,145.309555 L157.952331,145.251459 C158.087996,145.232094 158.320564,145.212728 158.650036,145.193363 L159.115173,145.164315 L159.638451,145.135267 C160.549344,145.096537 161.111384,145.067489 161.324572,145.048124 C161.402094,145.028759 161.469927,144.980346 161.528069,144.902885 L161.702495,144.670502 L161.84785,144.409071 C161.82847,144.079862 161.750947,143.818431 161.615282,143.624779 L161.033861,143.624779 C160.840054,143.624779 160.675319,143.595731 160.539654,143.537635 C160.500892,143.51827 160.452441,143.51827 160.394298,143.537635 C160.258634,143.576366 159.861329,143.586049 159.202386,143.566683 L158.446539,143.566683 L158.446539,143.566683 C158.213971,143.547318 158.058925,143.537635 157.981402,143.537635 C157.865118,143.51827 157.768215,143.469857 157.690692,143.392396 C157.593788,143.29557 157.564717,143.198744 157.603479,143.101918 C157.603479,142.8889 157.593788,142.70493 157.574408,142.550008 L157.574408,142.375721 L157.545337,142.201434 C157.525956,141.949686 157.516266,141.66889 157.516266,141.359047 L157.545337,140.778089 L157.603479,140.255228 C157.62286,139.887289 157.613169,139.625858 157.574408,139.470936 C157.593788,139.257919 157.603479,138.957757 157.603479,138.570453 L157.603479,138.076639 L157.63255,137.582826 L157.633511,137.194881 C157.636394,136.664818 157.645764,136.368097 157.661621,136.30472 C157.700382,136.207894 157.777905,136.159481 157.894189,136.159481 C157.971712,136.159481 158.078306,136.149798 158.213971,136.130433 L159.115173,135.927098 C159.464025,135.849637 159.774116,135.801224 160.045446,135.781859 L160.278014,135.752811 L160.510583,135.694715 C160.685009,135.63662 160.820674,135.539793 160.917577,135.404237 L160.946648,135.375189 C161.062932,135.317093 161.159836,135.239632 161.237359,135.142806 L161.324572,134.997567 L161.440856,134.852328 C161.518379,134.755501 161.537759,134.619945 161.498998,134.445658 C161.421475,134.058353 161.247049,133.82597 160.975719,133.748509 L160.917577,133.719461 L160.859435,133.661366 C160.626867,133.506444 160.413679,133.438665 160.219872,133.458031 C160.16173,133.458031 160.113278,133.448348 160.074517,133.428983 C159.996994,133.370887 159.88071,133.351522 159.725665,133.370887 L157.894189,133.632318 L157.661621,133.661366 C157.506575,133.661366 157.429053,133.60327 157.429053,133.487078 L157.458124,133.138504 L157.458124,132.760882 C157.458124,132.702786 157.467814,132.654373 157.487195,132.615643 L157.516266,132.499451 C157.535646,132.402625 157.535646,132.296116 157.516266,132.179925 L157.545337,131.97659 L157.603479,131.802303 C157.603479,131.782938 157.593788,131.715159 157.574408,131.598968 L157.574408,131.424681 L157.545337,131.221346 C157.525956,130.834041 157.545337,130.562928 157.603479,130.408006 L157.603479,130.320862 L157.63255,129.885145 L157.661621,129.449427 C157.681002,129.100853 157.719763,128.810374 157.777905,128.577991 L157.865118,128.084178 C157.884499,128.006717 157.884499,127.83243 157.865118,127.561316 L157.865118,127.067503 L157.865118,127.067503 C157.884499,126.931946 157.962022,126.83512 158.097686,126.777024 L158.708178,126.602737 C158.805082,126.583372 158.989198,126.583372 159.260528,126.602737 L159.551238,126.631785 L159.783807,126.631785 L159.783807,126.631785 C159.919472,126.593055 160.055136,126.583372 160.190801,126.602737 L160.394298,126.602737 C160.452441,126.583372 160.520273,126.564007 160.597796,126.544642 L160.917577,126.486546 L161.208288,126.42845 C161.324572,126.409085 161.411785,126.380037 161.469927,126.341307 L161.644353,126.254163 L161.818779,126.137972 C161.915683,126.060511 161.983515,125.954002 162.022277,125.818445 L162.080419,125.76035 L162.167632,125.673206 C162.225774,125.57638 162.264535,125.498919 162.283916,125.440823 C162.322677,125.305267 162.303297,125.16971 162.225774,125.034153 L162.138561,124.888914 L161.993206,124.743675 C161.896302,124.608118 161.721876,124.501609 161.469927,124.424148 L160.946648,124.278909 L160.394298,124.162718 C160.142349,124.104622 159.929162,124.094939 159.754736,124.13367 C159.483406,124.191766 159.231457,124.220813 158.998889,124.220813 L158.504681,124.249861 L158.010473,124.249861 C157.62286,124.269226 157.303078,124.307957 157.051129,124.366053 C156.915464,124.404783 156.634444,124.414466 156.208069,124.395101 L155.975501,124.366053 L155.045227,124.366053 L155.045227,124.366053 C154.851421,124.385418 154.735136,124.404783 154.696375,124.424148 C154.599472,124.443514 154.512258,124.482244 154.434736,124.54034 L154.202167,124.714627 C154.027741,124.850184 153.930838,125.034153 153.911457,125.266536 L153.882386,125.586062 L153.824244,125.934637 L153.737031,126.283211 L153.649818,126.660833 C153.591676,126.970677 153.552914,127.222425 153.533533,127.416077 L153.44632,128.258465 L153.359107,129.071805 L153.330036,129.478475 L153.300965,129.914193 C153.281584,130.262767 153.242823,130.543563 153.184681,130.75658 L153.15561,130.814676 C153.136229,130.969598 153.136229,131.182615 153.15561,131.453729 L153.15561,132.121829 C153.116849,132.334847 153.107158,132.848026 153.126539,133.661366 C153.14592,134.435975 153.174991,134.987884 153.213752,135.317093 L153.300965,136.30472 L153.388178,137.292347 C153.407559,137.427904 153.407559,137.689334 153.388178,138.076639 L153.388178,138.628548 L153.359107,139.267601 C153.320346,140.352054 153.320346,141.010472 153.359107,141.242855 L153.417249,141.736669 C153.43663,141.910956 153.43663,142.07556 153.417249,142.230482 C153.397869,142.346674 153.397869,142.540326 153.417249,142.811439 C153.417249,143.063187 153.42694,143.208426 153.44632,143.247157 L153.562605,143.537635 L153.649818,143.799066 C153.669198,143.934623 153.72734,144.021766 153.824244,144.060497 C153.959909,144.099227 154.027741,144.186371 154.027741,144.321928 C154.047122,144.51558 154.153716,144.660819 154.347523,144.757645 L154.638233,144.844789 L154.899872,144.96098 L155.132441,145.077172 L155.365009,145.164315 C155.539435,145.241776 155.704171,145.280507 155.859217,145.280507 L155.917359,145.280507 L155.975501,145.309555 C156.091785,145.387015 156.256521,145.416063 156.469708,145.396698 Z M169.086539,145.425746 C169.454772,145.387015 169.803625,145.338602 170.133096,145.280507 C170.24938,145.261141 170.346284,145.232094 170.423807,145.193363 C170.501329,145.193363 170.540091,145.18368 170.540091,145.164315 L170.685446,145.135267 L170.80173,145.135267 C170.937395,145.115902 171.034298,145.096537 171.092441,145.077172 L171.383151,144.844789 C171.441293,144.806058 171.518816,144.767328 171.615719,144.728597 L171.877359,144.69955 C172.109927,144.660819 172.274663,144.602723 172.371566,144.525262 L172.894845,144.002401 C173.011129,143.905575 173.098342,143.818431 173.156484,143.74097 C173.737905,143.101918 174.067377,142.327308 174.1449,141.417142 C174.222422,140.506976 174.212732,139.722684 174.115829,139.064266 L174.028615,138.628548 C173.989854,138.454261 173.941402,138.309022 173.88326,138.192831 L173.708834,137.873304 L173.679763,137.786161 L173.214626,136.653294 L173.069271,136.362816 L172.952987,136.246624 L172.836703,136.130433 C172.623515,135.89805 172.371566,135.607572 172.080856,135.258997 L171.325009,134.358514 C170.704827,133.642 170.162167,133.090091 169.697031,132.702786 L169.319107,132.38326 C169.183442,132.247703 169.067158,132.131512 168.970255,132.034686 L168.766758,131.802303 L168.592331,131.540872 C168.437286,131.327855 168.321002,131.172933 168.243479,131.076107 L167.923697,130.785628 L167.632987,130.49515 C167.284135,130.12721 166.944972,129.49784 166.615501,128.607039 C166.615501,128.548943 166.60581,128.452117 166.58643,128.316561 L166.557359,128.113226 L166.528288,127.909891 C166.508907,127.541951 166.528288,127.24179 166.58643,127.009407 C166.60581,126.893216 166.673643,126.747977 166.789927,126.573689 C166.906211,126.399402 167.012805,126.292894 167.109708,126.254163 C167.516703,126.137972 167.846175,126.108924 168.098124,126.16702 C168.408215,126.225115 168.592331,126.38972 168.650473,126.660833 L168.679544,126.777024 L168.708615,126.922264 C168.747377,127.251473 168.931493,127.532269 169.260965,127.764651 L169.40632,127.851795 C169.539217,127.984585 169.693471,128.010669 169.869084,127.930046 L169.95867,127.880843 C170.326903,127.725921 170.491639,127.454808 170.452878,127.067503 C170.472258,127.028773 170.481949,126.980359 170.481949,126.922264 L170.365665,126.283211 L170.220309,125.644158 C170.181548,125.469871 170.104025,125.382728 169.987741,125.382728 L169.842386,125.150345 C169.454772,124.685579 168.970255,124.346687 168.388834,124.13367 L168.388834,124.104622 L168.27255,124.075574 L168.185337,124.046526 L168.214408,124.075574 L168.098124,124.075574 C167.981839,124.017478 167.846175,124.007796 167.691129,124.046526 L167.632987,124.046526 C166.974043,124.065892 166.334481,124.162718 165.714298,124.337005 C165.19102,124.491927 164.784025,124.695262 164.493315,124.94701 C163.737468,125.605428 163.301402,126.602737 163.185118,127.938939 C163.107595,129.042757 163.330473,130.030384 163.853752,130.90182 C163.950656,131.037376 164.07663,131.201981 164.231676,131.395633 L164.609599,131.860399 L164.871238,132.238021 L165.103807,132.615643 C165.297614,132.925487 165.491421,133.157869 165.685227,133.312791 C165.801512,133.409617 165.927486,133.487078 166.063151,133.545174 L166.32479,133.748509 L166.528288,133.980892 L166.789927,134.300418 L167.051566,134.619945 L167.545774,135.200902 L168.010911,135.781859 L168.941184,136.885677 L169.173752,137.176156 L169.40632,137.495682 L169.813315,138.163783 C169.96836,138.434896 170.084645,138.667279 170.162167,138.860931 C170.394736,139.364427 170.491639,139.78078 170.452878,140.109989 L170.423807,140.197132 L170.394736,140.284276 L170.336594,140.574755 L170.336594,140.865233 C170.278451,141.465555 169.890838,142.03683 169.173752,142.579056 C168.572951,143.024457 167.972149,143.276205 167.371348,143.334301 L166.906211,143.334301 L166.935282,143.363348 C166.799617,143.343983 166.60581,143.305253 166.353861,143.247157 C166.082532,143.189061 165.898415,143.130966 165.801512,143.07287 L165.365446,142.724296 L164.92938,142.404769 C164.832477,142.327308 164.64836,142.027147 164.377031,141.504286 C164.08632,140.962059 163.921584,140.555389 163.882823,140.284276 L163.853752,139.993797 L163.824681,139.732367 C163.8053,139.499984 163.747158,139.316014 163.650255,139.180458 L163.650255,139.15141 C163.630874,139.073949 163.601803,139.00617 163.563042,138.948075 L163.533971,138.919027 L163.5049,138.919027 C163.446758,138.860931 163.369235,138.812518 163.272331,138.773788 L162.865337,138.657596 L162.836266,138.686644 L162.778124,138.715692 C162.506794,138.735057 162.274226,138.831883 162.080419,139.00617 L161.876921,139.209505 C161.799399,139.248236 161.750947,139.286966 161.731566,139.325697 C161.692805,139.383793 161.673424,139.519349 161.673424,139.732367 C161.673424,139.887289 161.721876,140.129354 161.818779,140.458563 L161.935064,140.923329 L162.080419,141.388094 L162.167632,141.707621 C162.187013,141.804447 162.225774,141.891591 162.283916,141.969051 L162.4002,142.288578 L162.487413,142.579056 C162.584317,142.908265 162.778124,143.247157 163.068834,143.595731 C163.282022,143.866844 163.553351,144.137958 163.882823,144.409071 C164.503005,144.931932 165.161949,145.251459 165.859654,145.36765 C166.86745,145.541937 167.943078,145.561303 169.086539,145.425746 Z" id="REUTILISABLES" fill="#FFFFFF" fill-rule="nonzero"></path>
            <rect id="Rectangle" fill="#A4D693" x="110.473255" y="88.5027933" width="57.8522657" height="24.8603352" rx="1.53005464"></rect>
            <path d="M40.7839635,109.215255 C43.7427067,109.215255 45.3588269,107.22777 45.3588269,104.693727 L45.3588269,102.557181 L42.2757668,102.557181 L42.2757668,104.793102 C42.2757668,105.737157 42.0022696,106.532151 40.7839635,106.532151 C39.6153843,106.532151 39.1429799,105.935905 39.1429799,104.619197 L39.1429799,95.3525495 C39.1429799,94.0358409 39.6153843,93.4644391 40.7839635,93.4644391 C41.7287723,93.4644391 42.2757668,94.3091201 42.2757668,95.6506722 L42.2757668,97.0170679 L45.3588269,97.0170679 L45.3588269,95.6506722 C45.3588269,92.793663 43.6432532,90.7813348 40.7839635,90.7813348 C37.7257668,90.7813348 36.0599198,92.6942888 36.0599198,95.3028624 L36.0599198,104.693727 C36.0599198,107.252614 37.6760401,109.215255 40.7839635,109.215255 Z M51.9973515,108.966819 L51.9973515,91.0297704 L48.9142914,91.0297704 L48.9142914,108.966819 L51.9973515,108.966819 Z M58.4866958,108.966819 L58.4866958,101.613126 C59.1828707,101.613126 59.6801384,101.588283 60.0779526,101.538596 L62.2659308,108.966819 L65.3987176,108.966819 L62.7880619,100.842976 C64.2550018,100.147356 64.9511767,98.6567428 64.9511767,96.3214483 C64.9511767,92.5452274 63.2107395,91.0297704 59.8541821,91.0297704 L55.4036357,91.0297704 L55.4036357,108.966819 L58.4866958,108.966819 Z M59.655275,99.0790833 L58.4866958,99.0790833 L58.4866958,93.5638133 L59.5309581,93.5638133 C61.3459854,93.5638133 61.8681166,94.2345894 61.8681166,96.3214483 C61.8681166,98.4083072 61.2962586,99.0790833 59.655275,99.0790833 Z M72.5593734,109.215255 C75.5181166,109.215255 77.1342368,107.22777 77.1342368,104.693727 L77.1342368,102.557181 L74.0511767,102.557181 L74.0511767,104.793102 C74.0511767,105.737157 73.7776794,106.532151 72.5593734,106.532151 C71.3907941,106.532151 70.9183898,105.935905 70.9183898,104.619197 L70.9183898,95.3525495 C70.9183898,94.0358409 71.3907941,93.4644391 72.5593734,93.4644391 C73.5041821,93.4644391 74.0511767,94.3091201 74.0511767,95.6506722 L74.0511767,97.0170679 L77.1342368,97.0170679 L77.1342368,95.6506722 C77.1342368,92.793663 75.418663,90.7813348 72.5593734,90.7813348 C69.5011767,90.7813348 67.8353297,92.6942888 67.8353297,95.3028624 L67.8353297,104.693727 C67.8353297,107.252614 69.4514499,109.215255 72.5593734,109.215255 Z M84.9910674,109.215255 C88.0741275,109.215255 89.7151111,107.302301 89.7151111,104.544666 L89.7151111,91.0297704 L86.632051,91.0297704 L86.632051,104.64404 C86.632051,105.836531 86.1099198,106.532151 84.9910674,106.532151 C83.8722149,106.532151 83.3500838,105.836531 83.3500838,104.64404 L83.3500838,91.0297704 L80.2670237,91.0297704 L80.2670237,104.544666 C80.2670237,107.401675 81.9825974,109.215255 84.9910674,109.215255 Z M96.2044554,108.966819 L96.2044554,91.0297704 L93.1213952,91.0297704 L93.1213952,108.966819 L96.2044554,108.966819 Z M104.483964,108.966819 L104.483964,93.7128747 L107.46757,93.7128747 L107.46757,91.0297704 L98.4172969,91.0297704 L98.4172969,93.7128747 L101.400903,93.7128747 L101.400903,108.966819 L104.483964,108.966819 Z M119.526313,109.215255 C122.485056,109.215255 124.101177,107.22777 124.101177,104.693727 L124.101177,102.557181 L121.018117,102.557181 L121.018117,104.793102 C121.018117,105.737157 120.744619,106.532151 119.526313,106.532151 C118.357734,106.532151 117.88533,105.935905 117.88533,104.619197 L117.88533,95.3525495 C117.88533,94.0358409 118.357734,93.4644391 119.526313,93.4644391 C120.471122,93.4644391 121.018117,94.3091201 121.018117,95.6506722 L121.018117,97.0170679 L124.101177,97.0170679 L124.101177,95.6506722 C124.101177,92.793663 122.385603,90.7813348 119.526313,90.7813348 C116.468117,90.7813348 114.80227,92.6942888 114.80227,95.3028624 L114.80227,104.693727 C114.80227,107.252614 116.41839,109.215255 119.526313,109.215255 Z M131.958007,109.215255 C135.090794,109.215255 136.682051,107.22777 136.682051,104.693727 L136.682051,95.3028624 C136.682051,92.6942888 135.016204,90.7813348 131.958007,90.7813348 C128.874947,90.7813348 127.233964,92.7191324 127.233964,95.327706 L127.233964,104.693727 C127.233964,107.252614 128.850084,109.215255 131.958007,109.215255 Z M131.958007,106.532151 C130.789428,106.532151 130.317024,105.935905 130.317024,104.619197 L130.317024,95.3525495 C130.317024,93.9613103 130.864018,93.4644391 131.958007,93.4644391 C133.350357,93.4644391 133.598991,94.3339636 133.598991,95.3773931 L133.598991,104.619197 C133.598991,105.786844 133.250903,106.532151 131.958007,106.532151 Z M147.447898,108.966819 L147.447898,106.283715 L142.599537,106.283715 L142.599537,91.0297704 L139.516477,91.0297704 L139.516477,108.966819 L147.447898,108.966819 Z M152.843253,108.966819 L152.843253,91.0297704 L149.760193,91.0297704 L149.760193,108.966819 L152.843253,108.966819 Z M160.078499,109.215255 C163.062106,109.215255 164.951723,107.50105 164.951723,104.619197 C164.951723,103.029209 164.479319,101.339847 160.874127,98.4331508 C159.407188,97.24066 158.686149,96.2966047 158.686149,95.2034882 C158.686149,94.1103716 159.233144,93.4644391 160.227679,93.4644391 C161.097898,93.4644391 161.769209,94.1352152 161.868663,95.4519238 L164.802543,95.1289575 C164.479319,92.3961661 162.912925,90.7813348 160.501177,90.7813348 C157.492707,90.7813348 155.75227,92.3961661 155.75227,95.2531753 C155.75227,97.7623747 157.094893,99.2529882 159.829865,101.464065 C161.247078,102.606869 162.017843,103.675142 162.017843,104.892476 C162.017843,105.960749 161.296805,106.532151 160.252543,106.532151 C159.233144,106.532151 158.512106,105.662626 158.387789,103.824203 L155.453909,104.246543 C155.603089,107.252614 157.492707,109.215255 160.078499,109.215255 Z" id="CIRCUITCOLIS" fill="#FFFFFF" fill-rule="nonzero"></path>
            <g id="Group-3" transform="translate(84.149918, 29.524697)">
                <polyline id="Fill-205" fill="#24B172" points="31.4048896 15.1003517 35.3418481 2.6497707 28.87409 0.503345058 24.2344101 15.1003517 31.4048896 15.1003517"></polyline>
                <path d="M6.05860254,14.5970067 L34.8369646,14.5970067 L34.8369646,37.2521561 C34.8369646,38.6009985 33.7242201,39.7642596 32.3345291,39.7642596 L8.561038,39.7642596 C7.17063868,39.7642596 6.05860254,38.6009985 6.05860254,37.2521561 L6.05860254,14.5970067" id="Fill-206" fill="#FFFFFF"></path>
                <path d="M27.8922798,29.1062371 C28.4005447,30.004756 28.4005447,30.9979699 27.8922798,31.8495026 C27.383308,32.7003124 26.5505736,33.2207738 25.5792857,33.2207738 L15.821165,33.2207738 C14.8498771,33.2207738 13.9704869,32.7003124 13.5081708,31.8495026 C12.9999059,30.9979699 12.9999059,30.004756 13.5081708,29.1062371 L18.4105591,20.4513974 C18.873582,19.5998647 19.7056096,19.1271122 20.6768975,19.1271122 C21.6948411,19.1271122 22.5268686,19.5998647 22.9891847,20.4513974 L27.8922798,29.1062371" id="Fill-207" fill="#FFFFFF"></path>
                <polyline id="Fill-208" fill="#24B172" points="13.1269722 25.6709558 16.661157 23.6572177 16.661157 27.6839782 13.1269722 25.6709558"></polyline>
                <polyline id="Fill-209" fill="#24B172" points="26.7588279 26.6772881 23.2246431 24.6872534 26.7588279 22.6505276 26.7588279 26.6772881"></polyline>
                <polyline id="Fill-210" fill="#24B172" points="22.1680608 31.2073936 22.214876 35.2341541 18.6806912 33.2441194 22.1680608 31.2073936"></polyline>
                <polygon id="Fill-211" fill="#A4D693" points="8.07813671 14.5970067 22.214876 14.5970067 22.214876 3.52341541 8.07813671 3.52341541"></polygon>
                <polygon id="Fill-212" fill="#EDDB5E" points="12.1172051 15.1003517 29.2832456 15.1003517 29.2832456 9.56355611 12.1172051 9.56355611"></polygon>
                <path d="M32.5643406,40.7709497 L8.83611007,40.7709497 C7.02559886,40.7709497 5.55371899,39.321712 5.55371899,37.5392122 C5.55371899,37.1120245 5.90436857,36.7655433 6.33914576,36.7655433 C6.77392296,36.7655433 7.12457253,37.1120245 7.12457253,37.5392122 C7.12457253,38.4520302 7.90858539,39.2236119 8.83611007,39.2236119 L32.5643406,39.2236119 C33.4918653,39.2236119 34.2758781,38.4520302 34.2758781,37.5392122 L34.2758781,16.1450403 L7.12457253,16.1450403 L7.12457253,34.3526981 C7.12457253,34.7798858 6.77392296,35.1263671 6.33914576,35.1263671 C5.90436857,35.1263671 5.55371899,34.7798858 5.55371899,34.3526981 L5.55371899,15.3713714 C5.55371899,14.9441837 5.90436857,14.5970067 6.33914576,14.5970067 L35.0613049,14.5970067 C35.4960821,14.5970067 35.8467317,14.9441837 35.8467317,15.3713714 L35.8467317,37.5392122 C35.8467317,39.321712 34.3741448,40.7709497 32.5643406,40.7709497" id="Fill-213" fill="#434A53"></path>
                <path d="M0.817393617,21.6438375 C0.613808831,21.6438375 0.408019156,21.569657 0.24926712,21.4205827 C-0.0755865815,21.1160147 -0.0836711758,20.6138698 0.229423116,20.2986027 L5.66300551,14.8392034 C5.97756973,14.5246496 6.4942488,14.5146637 6.8191025,14.819945 C7.14395621,15.124513 7.1520408,15.6266579 6.83894651,15.941925 L1.40536412,21.4013243 C1.24440719,21.5625243 1.03126789,21.6438375 0.817393617,21.6438375" id="Fill-214" fill="#434A53"></path>
                <path d="M40.0781735,21.6438375 C39.8642992,21.6438375 39.650425,21.5625304 39.490203,21.4013427 L34.0566206,15.9423576 C33.7435263,15.6271144 33.7516109,15.1250076 34.0764646,14.8204627 C34.4005833,14.5144914 34.9194673,14.5244764 35.2325616,14.8397196 L40.666144,20.2987048 C40.9792383,20.613948 40.9711537,21.1160548 40.6463,21.4205997 C40.487548,21.5696626 40.2817583,21.6438375 40.0781735,21.6438375" id="Fill-215" fill="#434A53"></path>
                <path d="M8.85293153,15.6036968 C8.42403971,15.6036968 8.07813671,15.2603942 8.07813671,14.8371255 L8.07813671,3.78733102 C8.07813671,3.36337297 8.42403971,3.02007035 8.85293153,3.02007035 L22.4498482,3.02007035 C22.8787401,3.02007035 23.2246431,3.36337297 23.2246431,3.78733102 L23.2246431,7.5305704 C23.2246431,7.95383909 22.8787401,8.29714171 22.4498482,8.29714171 C22.0209564,8.29714171 21.6750534,7.95383909 21.6750534,7.5305704 L21.6750534,4.55390232 L9.62772634,4.55390232 L9.62772634,14.8371255 C9.62772634,15.2603942 9.28182334,15.6036968 8.85293153,15.6036968" id="Fill-216" fill="#434A53"></path>
                <path d="M32.1997757,15.6036968 C32.120148,15.6036968 32.039111,15.5917722 31.9601881,15.5658188 C31.5472517,15.4339472 31.3217575,14.9948429 31.4535307,14.5844979 L35.0875113,3.34595308 L30.2111983,1.76349415 L28.2874506,7.63037647 C28.1542681,8.04142298 27.7110309,8.26448235 27.3002086,8.13050644 C26.8886816,7.99653053 26.6631874,7.55602335 26.7977793,7.14708117 L28.964638,0.538070502 C29.0992299,0.127725434 29.542467,-0.0946324926 29.9525846,0.0386419742 L36.3150456,2.10439621 C36.7251632,2.23696923 36.9506575,2.67537208 36.8188843,3.08431426 L32.9460207,15.0621816 C32.8382063,15.3932634 32.531675,15.6036968 32.1997757,15.6036968" id="Fill-217" fill="#434A53"></path>
                <path d="M29.0106555,15.6036968 C28.579581,15.6036968 28.2331819,15.2625477 28.2331819,14.8419342 L28.2331819,10.5837362 L13.1679686,10.5837362 L13.1679686,12.6004889 C13.1679686,13.0211024 12.8208696,13.3629366 12.3904949,13.3629366 C11.9594205,13.3629366 11.6123215,13.0211024 11.6123215,12.6004889 L11.6123215,9.82197363 C11.6123215,9.40136012 11.9594205,9.06021105 12.3904949,9.06021105 L29.0106555,9.06021105 C29.4410302,9.06021105 29.7881291,9.40136012 29.7881291,9.82197363 L29.7881291,14.8419342 C29.7881291,15.2625477 29.4410302,15.6036968 29.0106555,15.6036968" id="Fill-218" fill="#434A53"></path>
                <path d="M25.9574102,28.1873233 C25.8196328,28.1873233 25.6825767,28.1510737 25.5592262,28.0800246 L22.0195715,26.0399003 C21.6343717,25.8187781 21.5009223,25.3257843 21.7223762,24.9393641 C21.9431087,24.551494 22.4357893,24.4188207 22.8166611,24.6413929 L25.1559926,25.9884259 L25.1559926,24.3709713 C24.8566332,24.3854711 24.5478963,24.3542965 24.2377166,24.2687475 C23.5120405,24.0874998 22.9493891,23.6568552 22.5331713,22.9565141 L21.7757559,21.6732802 C21.3465539,20.8982649 20.6324193,20.7394919 20.1058353,20.7394919 C19.3924221,20.7394919 18.8218359,21.0642879 18.4943439,21.6529804 L18.156753,22.2365981 C17.9338565,22.6230182 17.4426185,22.7535166 17.0588614,22.5265945 C16.6772683,22.3025723 16.5467043,21.8088535 16.7710435,21.4246083 L17.1014209,20.8554905 C17.7044678,19.7622042 18.8016381,19.1271122 20.1058353,19.1271122 C21.4388864,19.1271122 22.5548118,19.7622042 23.1657935,20.8707153 L23.9102246,22.1300244 C24.1042672,22.4548204 24.323557,22.6288182 24.6423928,22.7085672 C24.9886399,22.803541 25.2779004,22.7701914 25.5447992,22.6099684 C25.7915002,22.4598953 26.1038439,22.4569953 26.3527089,22.5990935 C26.6044594,22.7426417 26.7588279,23.0101634 26.7588279,23.3008847 L26.7588279,27.3804084 C26.7588279,27.6682298 26.6080661,27.9335765 26.3592011,28.0785746 C26.2358506,28.1510737 26.0959091,28.1873233 25.9574102,28.1873233" id="Fill-219" fill="#434A53"></path>
                <path d="M16.3352509,34.227464 L15.7133965,34.227464 C14.4200562,34.227464 13.2340076,33.5558943 12.6172623,32.4728551 C11.9508855,31.4125568 11.947966,30.1347979 12.6238312,28.9963275 L13.3398396,27.7882129 C13.5354464,27.4378596 13.5799688,27.1763383 13.4923837,26.8401982 C13.4135571,26.5559359 13.2230594,26.3199982 12.9624937,26.1935015 C12.8851268,26.1551261 12.8150587,26.1053802 12.7522894,26.0456851 C12.5727399,25.8715745 12.4639884,25.6029466 12.4975627,25.3591917 C12.5318668,25.1147262 12.6552159,24.8773672 12.8756384,24.7544238 L16.4571402,22.7553493 C16.7067578,22.6160608 17.0162252,22.6146395 17.2665727,22.7567706 C17.51838,22.8989018 17.6709241,23.1590018 17.6709241,23.4411321 L17.6709241,27.4392809 C17.6709241,27.8756235 17.3089055,28.22953 16.8600318,28.22953 C16.411158,28.22953 16.0491395,27.8756235 16.0491395,27.4392809 L16.0491395,24.8048803 L14.6521567,25.5844696 C14.8368154,25.8367524 14.974762,26.1245679 15.0638068,26.440099 C15.2528447,27.1798916 15.1543115,27.8486186 14.7543394,28.5614062 L14.0288426,29.7865766 C13.6536863,30.4183495 13.6507668,31.0899191 14.0186243,31.6776314 C14.3675051,32.2859526 15.0090661,32.6462551 15.7133965,32.6462551 L16.3352509,32.6462551 C16.7841247,32.6462551 17.1461432,33.0008723 17.1461432,33.4372148 C17.1461432,33.8735574 16.7841247,34.227464 16.3352509,34.227464" id="Fill-220" fill="#434A53"></path>
                <path d="M21.8910788,36.2408442 C21.7666875,36.2408442 21.6444166,36.2119597 21.5341607,36.1478503 L18.0660479,34.1667979 C17.8229195,34.0280116 17.6730846,33.7715738 17.6709241,33.4932965 C17.6681372,33.2143147 17.8144383,32.9557635 18.0554463,32.8134546 L21.4769125,30.7859053 C21.8479659,30.563988 22.3328091,30.6858664 22.5540276,31.0585466 C22.7752461,31.4305222 22.6529752,31.9116953 22.2798015,32.1322037 L20.0160221,33.474275 L21.3956341,34.2633144 C21.5186118,34.0005361 21.6839956,33.7525523 21.8910788,33.519363 C22.4359973,32.9740804 23.1081341,32.7028482 23.8664967,32.7028482 L25.3005299,32.7028482 C25.9790276,32.7028482 26.560698,32.3618705 26.9409395,31.741911 C27.2978575,31.1599945 27.2950305,30.4942425 26.9317515,29.8686471 L26.6257207,29.3909965 C26.3917804,29.0253613 26.4999159,28.5413702 26.866022,28.3088854 C27.2307145,28.0785141 27.7169712,28.1848935 27.9509116,28.5491197 L28.2746116,29.0556548 C28.9467484,30.2131473 28.9432145,31.4798372 28.282386,32.5584258 C27.6166101,33.6461729 26.5281867,34.2703594 25.3005299,34.2703594 L23.8664967,34.2703594 C23.5208869,34.2703594 23.2565555,34.3732163 23.0346302,34.5937246 C22.8233064,34.8332544 22.7102234,35.1066002 22.7102234,35.4222159 C22.7102234,35.7019022 22.5618021,35.9829974 22.3179669,36.1238973 C22.1872148,36.1999832 22.0380866,36.2408442 21.8910788,36.2408442" id="Fill-221" fill="#434A53"></path>
            </g>
        </g>
    </g>
</svg>