<?xml version="1.0" encoding="UTF-8"?>
<svg width="146px" height="65px" viewBox="0 0 146 65" version="1.1" xmlns="http://www.w3.org/2000/svg" xmlns:xlink="http://www.w3.org/1999/xlink">
    <!-- Generator: Sketch 60 (88103) - https://sketch.com -->
    <title>Fondation GoodPlanet</title>
    <desc>Created with Sketch.</desc>
    <defs>
        <rect id="path-1" x="0" y="0" width="146" height="65" rx="8"></rect>
    </defs>
    <g id="Produit-(modifier-la-couleur)" stroke="none" stroke-width="1" fill="none" fill-rule="evenodd">
        <g id="page-consultation---GC---consultation" transform="translate(-1124.000000, -1630.000000)">
            <g id="Fondation-GoodPlanet" transform="translate(1124.000000, 1630.000000)">
                <mask id="mask-2" fill="white">
                    <use xlink:href="#path-1"></use>
                </mask>
                <use id="Rectangle" fill="#FFFFFF" xlink:href="#path-1"></use>
                <g id="environnement/expert/GoodPlanet" mask="url(#mask-2)">
                    <g transform="translate(18.000000, -23.000000)" id="Plan-de-travail-1">
                        <g transform="translate(14.060000, 45.510000)">
                            <polygon id="Path" fill="#194B49" fill-rule="nonzero" points="23.7557732 0.154511982 23.7557732 0.42268795 21.3990214 0.42268795 21.3990214 2.30524773 23.4396452 2.30524773 23.4396452 2.57519969 21.3990214 2.57519969 21.3990214 4.63003145 21.0740135 4.63003145 21.0740135 0.154511982"></polygon>
                            <path d="M28.9807645,2.39049572 C28.9852469,2.10459012 28.9414146,1.81998043 28.8511166,1.54867182 C28.7732264,1.31532454 28.6487591,1.10022576 28.4852606,0.916415891 C28.3284609,0.743631503 28.1348453,0.608282661 27.9187167,0.520367938 C27.6846912,0.42564548 27.4341237,0.378550854 27.1816768,0.381839954 C26.9315488,0.378733316 26.6833394,0.425838743 26.4517408,0.520367938 C26.2353193,0.608686757 26.0412081,0.743958022 25.8834209,0.916415891 C25.7182144,1.09990142 25.5919408,1.31498948 25.512237,1.54867182 C25.3369713,2.09681046 25.3369713,2.68595697 25.512237,3.23409561 C25.5919774,3.46723042 25.7182604,3.68173029 25.8834209,3.86457554 C26.0407307,4.03757773 26.2349739,4.17294099 26.4517408,4.26062349 C26.6838271,4.35311699 26.9318615,4.39898223 27.1816768,4.39559948 C27.4336927,4.39969448 27.6840754,4.35444459 27.9187167,4.26239949 C28.1351992,4.17513662 28.3289515,4.03969221 28.4852606,3.86635154 C28.6487536,3.68321071 28.7732353,3.46869134 28.8511166,3.23587161 C28.941546,2.9639828 28.9853791,2.67876729 28.9807645,2.39227171 M29.3164285,2.39227171 C29.3207922,2.71268512 29.2684835,3.03134757 29.1619165,3.3335516 C29.0668594,3.60112511 28.9181938,3.84648368 28.7250206,4.05460752 C28.5356504,4.25499491 28.3055189,4.4124533 28.0501407,4.51636746 C27.4934845,4.73415526 26.875197,4.73415526 26.3185409,4.51636746 C26.0631627,4.4124533 25.8330312,4.25499491 25.6436609,4.05460752 C25.44988,3.84694287 25.3011338,3.60145117 25.206765,3.3335516 C24.9960626,2.724936 24.9960626,2.06315943 25.206765,1.45454383 C25.3015491,1.18684083 25.4502465,0.941429634 25.6436609,0.733487913 C25.833355,0.533041865 26.0633654,0.375061043 26.3185409,0.269951968 C26.5923325,0.15798101 26.885903,0.102407995 27.1816768,0.106559987 C27.4790116,0.10238004 27.7742141,0.157315473 28.0501407,0.268175968 C28.3059738,0.372066839 28.5362275,0.530214764 28.7250206,0.731711913 C28.9174162,0.941096687 29.0659648,1.18686617 29.1619165,1.45454383 C29.268071,1.75562528 29.3203737,2.07304884 29.3164285,2.39227171" id="Shape" fill="#194B49" fill-rule="nonzero"></path>
                            <path d="M31.2291803,0.16516798 C31.2513403,0.17696722 31.2702501,0.194047054 31.2842363,0.214895974 L34.1808919,4.08479951 C34.1808919,4.02263952 34.1720119,3.96047953 34.1720119,3.90719953 L34.1720119,0.154511982 L34.4543959,0.154511982 L34.4543959,4.63004111 L34.2998839,4.63004111 C34.2527851,4.63058673 34.2086312,4.6071718 34.1826679,4.56787146 L31.2735803,0.681983919 C31.2803343,0.740948265 31.2838915,0.800234995 31.2842363,0.859583898 L31.2842363,4.63004111 L31.0018523,4.63004111 L31.0018523,0.154511982 L31.1599163,0.154511982 C31.1834829,0.153428387 31.2070292,0.157050896 31.2291803,0.16516798" id="Path" fill="#194B49" fill-rule="nonzero"></path>
                            <path d="M39.8498832,2.39049572 C39.8545941,2.10689762 39.8107455,1.82458426 39.7202353,1.55577581 C39.6427061,1.32597729 39.518101,1.1148746 39.3543793,0.935951888 C39.1962441,0.766486536 39.0020081,0.634770271 38.7860594,0.550559934 C38.5512696,0.459039804 38.3009908,0.41380871 38.0490195,0.41735995 L36.7436596,0.41735995 L36.7436596,4.36718348 L38.0490195,4.36718348 C38.3007928,4.37029267 38.5508779,4.32569918 38.7860594,4.2357595 C39.0021204,4.15092497 39.1963481,4.01860737 39.3543793,3.84859154 C39.518101,3.66966883 39.6427061,3.45856614 39.7202353,3.22876762 C39.8109759,2.95879062 39.8548253,2.67527109 39.8498832,2.39049572 M40.1855472,2.39049572 C40.1905667,2.70879132 40.1376076,3.02534248 40.0292592,3.3246716 C39.9349376,3.58902854 39.7867726,3.83093049 39.5941393,4.03507152 C39.4036674,4.23024156 39.1735245,4.382257 38.9192594,4.48084747 C38.6415653,4.58693763 38.3462618,4.63936907 38.0490195,4.63535945 L36.4168757,4.63535945 L36.4168757,0.154511982 L38.0490195,0.154511982 C38.3462618,0.150502364 38.6415653,0.202933803 38.9192594,0.309023963 C39.1735245,0.407614428 39.4036674,0.559629872 39.5941393,0.75479991 C39.7865676,0.9590977 39.9347048,1.20095431 40.0292592,1.46519983 C40.1374695,1.76271885 40.1904344,2.07749889 40.1855472,2.39404771" id="Shape" fill="#194B49" fill-rule="nonzero"></path>
                            <path d="M42.137371,3.00499164 L44.1424747,3.00499164 L43.2278348,0.742367912 C43.2136268,0.706847916 43.1976429,0.665999921 43.1834349,0.621599926 C43.1692269,0.577199931 43.1532429,0.527471937 43.1390349,0.477743943 C43.1248269,0.527471937 43.1106189,0.575423931 43.0946349,0.621599926 C43.0786509,0.66777592 43.0662189,0.708623916 43.0502349,0.745919911 L42.137371,3.00499164 Z M45.1317066,4.63003145 L44.8830666,4.63003145 C44.8567542,4.63177207 44.8307528,4.62352774 44.8102507,4.60694345 C44.7906443,4.59011647 44.7754093,4.56878741 44.7658507,4.54478346 L44.2330507,3.24475161 L42.037915,3.24475161 L41.5139951,4.54478346 C41.5051923,4.56869937 41.4897988,4.58963459 41.4695951,4.60516745 C41.4480129,4.62247241 41.4208606,4.6313127 41.3932271,4.63003145 L41.1463631,4.63003145 L42.9791949,0.154511982 L43.3024268,0.154511982 L45.1317066,4.63003145 Z" id="Shape" fill="#194B49" fill-rule="nonzero"></path>
                            <polygon id="Path" fill="#194B49" fill-rule="nonzero" points="49.0318022 0.154511982 49.0318022 0.429791949 47.4600423 0.429791949 47.4600423 4.63003145 47.1385864 4.63003145 47.1385864 0.429791949 45.5561706 0.429791949 45.5561706 0.154511982"></polygon>
                            <rect id="Rectangle" fill="#194B49" fill-rule="nonzero" x="50.557386" y="0.154511982" width="1" height="4.47551947"></rect>
                            <path d="M56.6206493,2.39049572 C56.6251316,2.10459012 56.5812993,1.81998043 56.4910013,1.54867182 C56.4120525,1.31503252 56.2863641,1.09991202 56.1215933,0.916415891 C55.9647936,0.743631503 55.771178,0.608282661 55.5550494,0.520367938 C55.3210239,0.42564548 55.0704564,0.378550854 54.8180095,0.381839954 C54.5678815,0.378733316 54.3196721,0.425838743 54.0880736,0.520367938 C53.8713235,0.609027526 53.6767026,0.74423148 53.5179776,0.916415891 C53.3533273,1.09999988 53.2276542,1.31509434 53.1485697,1.54867182 C52.973304,2.09681046 52.973304,2.68595697 53.1485697,3.23409561 C53.2276907,3.46712542 53.3533733,3.68163172 53.5179776,3.86457554 C53.6771148,4.038325 53.8731213,4.17425523 54.0916256,4.26239949 C54.3237118,4.35489298 54.5717463,4.40075823 54.8215615,4.39737548 C55.073695,4.40090531 55.3240818,4.35505135 55.5586014,4.26239949 C55.7739793,4.17415318 55.9664896,4.03812064 56.1215933,3.86457554 C56.2850863,3.68143471 56.409568,3.46691534 56.4874493,3.23409561 C56.5778787,2.9622068 56.6217118,2.67699129 56.6170973,2.39049572 M56.9527612,2.39049572 C56.9571249,2.71090913 56.9048162,3.02957157 56.7982492,3.3317756 C56.7025222,3.59903069 56.5539342,3.84426127 56.3613533,4.05283152 C56.1719831,4.25321891 55.9418516,4.4106773 55.6864734,4.51459146 C55.1292256,4.73249297 54.5103453,4.73249297 53.9530976,4.51459146 C53.698486,4.41021405 53.4690271,4.2528016 53.2799936,4.05283152 C53.0862631,3.84480689 52.936997,3.59945452 52.8413217,3.3317756 C52.632937,2.72277231 52.632937,2.06177112 52.8413217,1.45276783 C52.9374447,1.18530259 53.0866587,0.940035856 53.2799936,0.731711913 C53.469415,0.531756406 53.698737,0.373832797 53.9530976,0.268175968 C54.2275516,0.156344526 54.521673,0.100781553 54.8180095,0.104783988 C55.1153443,0.10060404 55.4105468,0.155539474 55.6864734,0.266399968 C55.9423065,0.370290839 56.1725602,0.528438765 56.3613533,0.729935913 C56.5531782,0.939748036 56.7016539,1.18539677 56.7982492,1.45276783 C56.9044037,1.75384928 56.9567064,2.07127284 56.9527612,2.39049572" id="Shape" fill="#194B49" fill-rule="nonzero"></path>
                            <path d="M58.869065,0.16516798 C58.891225,0.17696722 58.9101348,0.194047054 58.924121,0.214895974 L61.8207766,4.08479951 C61.8175214,4.02564427 61.8175214,3.96635478 61.8207766,3.90719953 L61.8207766,0.154511982 L62.1049366,0.154511982 L62.1049366,4.63005593 L61.9504246,4.63005593 C61.9032449,4.63092266 61.8589392,4.60742717 61.8332086,4.56787146 L58.913465,0.681983919 C58.920219,0.740948265 58.9237762,0.800234995 58.924121,0.859583898 L58.924121,4.63005593 L58.641737,4.63005593 L58.641737,0.154511982 L58.799801,0.154511982 C58.8233676,0.153428387 58.8469139,0.157050896 58.869065,0.16516798" id="Path" fill="#194B49" fill-rule="nonzero"></path>
                            <path d="M6.17515126,18.7510058 C6.47650413,18.7520722 6.77768983,18.7366572 7.07735916,18.7048298 C7.33892002,18.6755416 7.59821094,18.6286675 7.85347106,18.5645258 C8.08761602,18.5056741 8.31729542,18.4303012 8.54078298,18.3389738 C8.75567896,18.2519498 8.96879893,18.1613738 9.18547091,18.0388298 L9.18547091,15.3588462 L7.30291113,15.3588462 C7.20757975,15.3641634 7.11412186,15.330877 7.04361516,15.2664942 C6.98035977,15.2072089 6.94491682,15.124079 6.94593517,15.0373902 L6.94593517,14.1049903 L10.6755347,14.1049903 L10.6755347,18.7669898 C10.0666817,19.211079 9.38518574,19.5458173 8.66155097,19.7562216 C8.2662504,19.8703165 7.86237593,19.9522792 7.45387111,20.0013096 C6.98945267,20.0565916 6.52207589,20.0832819 6.05438328,20.0812296 C5.22438189,20.0911864 4.40057119,19.9372877 3.63014357,19.6283497 C2.91567237,19.3402828 2.26863372,18.9073112 1.72982379,18.3567338 C1.18693687,17.7934064 0.764003666,17.1257761 0.486623942,16.394254 C0.182310477,15.5899352 0.0311190158,14.7357938 0.0408479951,13.8758863 C0.0298386716,13.0114589 0.177934927,12.1523802 0.477743943,11.3415346 C1.02306232,9.84809279 2.19423949,8.6678317 3.68342356,8.11099103 C4.50543141,7.8010415 5.3784423,7.64861103 6.25684725,7.66166309 C6.7054308,7.65910593 7.15341733,7.69475472 7.59595109,7.76822307 C7.98789051,7.83207803 8.37271502,7.9337859 8.74502296,8.07191904 C9.08654482,8.19982195 9.41437745,8.36165585 9.72359884,8.55499098 C10.0218131,8.74374295 10.3029052,8.95827625 10.5636467,9.1961269 L10.0965588,9.94204681 C10.0236416,10.0810143 9.88051903,10.1689324 9.72359884,10.1711508 C9.61822406,10.1661424 9.51598527,10.1336953 9.42700688,10.0770228 C9.28492689,9.99887881 9.12686291,9.90297482 8.95281493,9.78931083 C8.74924327,9.66153848 8.53468127,9.55217724 8.31167901,9.46252687 C8.02452197,9.34654891 7.72725681,9.25736936 7.42367912,9.1961269 C7.02304693,9.11752965 6.61535286,9.08062888 6.20711926,9.08601492 C5.57384231,9.07513713 4.9443767,9.18607743 4.35297548,9.41279888 C3.81479915,9.62446177 3.3297469,9.95187204 2.93217565,10.3718388 C2.53125689,10.8066557 2.22521652,11.3201503 2.03351976,11.8796626 C1.81747673,12.5202271 1.71178223,13.1928285 1.72094379,13.8687823 C1.70963122,14.567948 1.81959489,15.2637836 2.04595176,15.9253901 C2.24431975,16.4928816 2.55748631,17.0134152 2.96591965,17.4545259 C3.36019677,17.8726448 3.84078337,18.1999043 4.37428748,18.4135658 C4.94625679,18.639343 5.55672869,18.7515443 6.17159926,18.7439018" id="Path" fill="#194B49" fill-rule="nonzero"></path>
                            <path d="M16.0745741,18.8859817 C16.922318,18.8859817 17.5551659,18.6018218 17.9731179,18.0335019 C18.3910698,17.4651819 18.6006378,16.672494 18.6018218,15.6554381 C18.6018218,14.6324623 18.3922538,13.8356304 17.9731179,13.2649424 C17.5539819,12.6942545 16.921134,12.4089105 16.0745741,12.4089105 C15.6899824,12.3994403 15.30801,12.4746222 14.9556942,12.6291345 C14.6434818,12.7728496 14.3714468,12.9912096 14.1635983,13.2649424 C13.9377879,13.5698142 13.7758938,13.9171616 13.6876304,14.2861423 C13.5780887,14.7341732 13.5255771,15.1942464 13.5313424,15.6554381 C13.5252269,16.1154759 13.5777457,16.5744186 13.6876304,17.021182 C13.7754736,17.3875909 13.9374607,17.7321156 14.1635983,18.0335019 C14.372133,18.3056819 14.6440629,18.522738 14.9556942,18.6657578 C15.30801,18.8202701 15.6899824,18.895452 16.0745741,18.8859817 M16.0745741,11.2225427 C16.6561223,11.2144098 17.2336027,11.3206131 17.7742059,11.5351186 C18.2642145,11.73243 18.7045207,12.0356712 19.0635817,12.4231185 C19.4280011,12.8267418 19.7049449,13.3014161 19.8769896,13.8172784 C20.2553215,15.0074557 20.2553215,16.2856605 19.8769896,17.4758379 C19.703668,17.9900598 19.4268415,18.4633244 19.0635817,18.8664458 C18.7048309,19.2542514 18.2644387,19.5575519 17.7742059,19.7544456 C16.6785681,20.1664371 15.4705801,20.1664371 14.3749423,19.7544456 C13.8839095,19.5571249 13.442446,19.2539219 13.0820144,18.8664458 C12.7159777,18.4638186 12.4361487,17.9905871 12.2597265,17.4758379 C11.8760646,16.2864932 11.8760646,15.0066231 12.2597265,13.8172784 C12.4348784,13.3008854 12.714825,12.826246 13.0820144,12.4231185 C13.4427133,12.0359524 13.8841029,11.7328001 14.3749423,11.5351186 C14.9155455,11.3206131 15.4930259,11.2144098 16.0745741,11.2225427" id="Shape" fill="#194B49" fill-rule="nonzero"></path>
                            <path d="M25.371933,18.8859817 C26.2184929,18.8859817 26.8513408,18.6018218 27.2704767,18.0335019 C27.6896127,17.4651819 27.8991807,16.672494 27.8991807,15.6554381 C27.8991807,14.6324623 27.6896127,13.8356304 27.2704767,13.2649424 C26.8513408,12.6942545 26.2184929,12.4089105 25.371933,12.4089105 C24.9873413,12.3994403 24.6053689,12.4746222 24.2530531,12.6291345 C23.9408407,12.7728496 23.6688057,12.9912096 23.4609572,13.2649424 C23.2351468,13.5698142 23.0732527,13.9171616 22.9849893,14.2861423 C22.8754476,14.7341732 22.822936,15.1942464 22.8287013,15.6554381 C22.8225858,16.1154759 22.8751046,16.5744186 22.9849893,17.021182 C23.0728325,17.3875909 23.2348195,17.7321156 23.4609572,18.0335019 C23.6694919,18.3056819 23.9414218,18.522738 24.2530531,18.6657578 C24.6053689,18.8202701 24.9873413,18.895452 25.371933,18.8859817 M25.371933,11.2225427 C25.9534812,11.2144098 26.5309616,11.3206131 27.0715648,11.5351186 C27.5615734,11.73243 28.0018796,12.0356712 28.3609406,12.4231185 C28.72536,12.8267418 29.0023037,13.3014161 29.1743485,13.8172784 C29.5526803,15.0074557 29.5526803,16.2856605 29.1743485,17.4758379 C29.0010269,17.9900598 28.7242004,18.4633244 28.3609406,18.8664458 C28.0021898,19.2542514 27.5617976,19.5575519 27.0715648,19.7544456 C25.975927,20.1664371 24.767939,20.1664371 23.6723012,19.7544456 C23.1812684,19.5571249 22.7398049,19.2539219 22.3793733,18.8664458 C22.0127254,18.4642701 21.7328173,17.9909051 21.5570854,17.4758379 C21.1734235,16.2864932 21.1734235,15.0066231 21.5570854,13.8172784 C21.7321124,13.3038667 22.0114718,12.832221 22.3775973,12.4319985 C22.7382962,12.0448324 23.1796858,11.7416801 23.6705252,11.5439986 C24.2111284,11.3294931 24.7886088,11.2232898 25.370157,11.2314227" id="Shape" fill="#194B49" fill-rule="nonzero"></path>
                            <path d="M34.4437399,18.8433578 C34.8980001,18.8537802 35.346034,18.7362328 35.7366677,18.5041418 C36.1363442,18.2528976 36.4846878,17.9280581 36.7631956,17.5468779 L36.7631956,13.3928144 C36.5309464,13.0581548 36.2174317,12.7880311 35.8521077,12.6078225 C35.5065124,12.455448 35.1322037,12.3791326 34.7545399,12.3840465 C33.951788,12.3840465 33.335516,12.6693905 32.9057241,13.2400784 C32.4759321,13.8107664 32.2610362,14.6247663 32.2610362,15.6820781 C32.2527062,16.1650752 32.3015904,16.6473599 32.4066681,17.118862 C32.4814894,17.4714355 32.6251274,17.8057861 32.8293561,18.1027658 C33.0031383,18.3493119 33.2407286,18.5439272 33.516668,18.6657578 C33.8118136,18.7888943 34.1293221,18.8493721 34.4490679,18.8433578 M37.3741395,20.0528136 C37.1780331,20.0677792 37.0023764,19.9320097 36.9674356,19.7384616 L36.8306836,18.5893898 C36.4806645,19.0195982 36.0536738,19.3809443 35.5714998,19.6549897 C35.0753087,19.9298579 34.5153708,20.0689234 33.948236,20.0581416 C33.4863141,20.0639434 33.0288901,19.9668773 32.6091321,19.7739816 C32.2051663,19.5817749 31.8531566,19.2955386 31.5826042,18.9392617 C31.279127,18.5271345 31.0578355,18.0604326 30.9308123,17.5646379 C30.7693783,16.9480018 30.6923081,16.3123223 30.7017083,15.6749741 C30.6963262,15.0735548 30.7819508,14.4747813 30.9556763,13.8989743 C31.1095763,13.3838362 31.3583375,12.9019742 31.6891642,12.4781745 C32.3433418,11.6420667 33.353998,11.1640625 34.4153239,11.1887987 C34.8790962,11.1757478 35.3398446,11.2674118 35.7633077,11.4569746 C36.1423236,11.6391467 36.4820081,11.8937593 36.7631956,12.2064465 L36.7631956,7.79663907 L38.2727954,7.79663907 L38.2727954,20.0510376 L37.3741395,20.0528136 Z" id="Shape" fill="#194B49" fill-rule="nonzero"></path>
                            <path d="M41.661403,14.0961103 L43.6150028,14.0961103 C44.0368986,14.1036562 44.4570883,14.0406277 44.8582027,13.9096303 C45.191977,13.800217 45.4992576,13.6223814 45.7604105,13.3874864 C46.003194,13.1661076 46.1921239,12.8921288 46.3127465,12.5865105 C46.4400182,12.2600377 46.5033275,11.912138 46.4992265,11.5617586 C46.4992265,10.7874227 46.2624265,10.1823988 45.7888265,9.74668684 C45.3152266,9.31097489 44.5935787,9.09371092 43.6238828,9.0948901 L41.670283,9.0948901 L41.661403,14.0961103 Z M41.661403,15.4014702 L41.672059,20.0652456 L40.0363632,20.0652456 L40.0239312,7.79663907 L43.6114508,7.79663907 C44.2894065,7.78420579 44.9653648,7.87401425 45.6165546,8.06303904 C46.1345148,8.21518972 46.6148721,8.47412285 47.0266984,8.82316695 C47.3971204,9.14538088 47.684112,9.5524092 47.8631943,10.0095348 C48.0522241,10.5048968 48.1456332,11.0316035 48.1384743,11.5617586 C48.1446027,12.0932364 48.0437373,12.6205147 47.8418823,13.1122064 C47.6470186,13.5770115 47.3495107,13.991701 46.9716424,14.3252143 C46.5572444,14.6837025 46.073662,14.9532997 45.5508426,15.1173102 C44.9234174,15.3164088 44.2678417,15.412376 43.6096748,15.4014702 L41.661403,15.4014702 Z" id="Shape" fill="#194B49" fill-rule="nonzero"></path>
                            <rect id="Rectangle" fill="#194B49" fill-rule="nonzero" x="49.5415141" y="7.79663907" width="1.50959982" height="12.2686065"></rect>
                            <path d="M55.3987614,19.0209577 C55.6443733,19.0231882 55.889387,18.9963618 56.1286973,18.9410377 C56.3447301,18.8892985 56.5539507,18.8124054 56.7520732,18.7119338 C56.9500413,18.6126795 57.1374733,18.4936751 57.3115132,18.3567338 C57.4969655,18.2091354 57.6709231,18.0476457 57.8318811,17.8736619 L57.8318811,16.0976621 C57.237163,16.0889806 56.6428437,16.1329602 56.0558813,16.2290861 C55.6470249,16.296966 55.2484022,16.4163141 54.8695135,16.584286 C54.6077977,16.6914319 54.3783323,16.8646018 54.2035135,17.086894 C54.0665122,17.2750928 53.9936624,17.5023595 53.9957216,17.7351339 C53.9911003,17.9366148 54.0286048,18.1368404 54.1058336,18.3229898 C54.17281,18.4786545 54.2742172,18.6171027 54.4024255,18.7279178 C54.5317432,18.8354416 54.6825039,18.914152 54.8446495,18.9587977 C55.0240105,19.0077777 55.2092901,19.0316848 55.3952094,19.0298377 M59.3183929,20.0687976 L58.648841,20.0687976 C58.526882,20.0731729 58.4054968,20.0501097 58.2936411,20.0013096 C58.1920169,19.9383047 58.126163,19.8309629 58.1160411,19.7118217 L57.9473211,18.7971818 C57.7217691,18.9996457 57.5015451,19.1825737 57.2866492,19.3424137 C57.0755974,19.5021979 56.848179,19.6391251 56.6082173,19.7508936 C56.3656508,19.8626084 56.1112593,19.9466112 55.8498653,20.0013096 C55.5573985,20.0587383 55.2599111,20.0867021 54.9618654,20.0847816 C54.6444457,20.0875063 54.328582,20.0401567 54.0259136,19.9444776 C53.7463217,19.8578607 53.487569,19.7145794 53.2657857,19.5235657 C53.0445637,19.3277658 52.8698215,19.0850684 52.7542977,18.8131658 C52.6195336,18.4918283 52.5541707,18.145647 52.5624897,17.7972939 C52.5645507,17.4504309 52.6615993,17.1107611 52.8430977,16.815166 C53.0672791,16.4632527 53.3778925,16.1746513 53.7453056,15.9768941 C54.256331,15.6964309 54.8064818,15.4940903 55.3774494,15.3766062 C56.1883967,15.2065466 57.0158492,15.1279118 57.8443131,15.1421742 L57.8443131,14.4690703 C57.8443131,13.7977424 57.7016411,13.2898064 57.4162972,12.9452625 C57.1303612,12.6007185 56.7058972,12.4302225 56.1482333,12.4302225 C55.8334933,12.4219463 55.5197341,12.4688299 55.2211614,12.5687505 C54.9931508,12.6509612 54.7741536,12.7562941 54.5675935,12.8831025 C54.3840735,13.0015025 54.2260095,13.1062864 54.0934016,13.1974544 C53.9794296,13.2832251 53.8417029,13.3316156 53.6991296,13.3359824 C53.6035748,13.3380778 53.509773,13.3101236 53.4309536,13.2560624 C53.3577104,13.2037771 53.2970398,13.1358261 53.2533537,13.0571504 L52.9816257,12.5740785 C53.4235868,12.137934 53.9442816,11.7895989 54.5160895,11.5475506 C55.0953197,11.3159419 55.7144932,11.2006767 56.3382653,11.2083347 C56.7767744,11.2005487 57.2123314,11.2814982 57.6187611,11.4463186 C57.9775264,11.5942084 58.2990111,11.8198542 58.560041,12.1069906 C58.8229753,12.404423 59.0197185,12.7543233 59.137241,13.1335184 C59.2711371,13.5610222 59.3370603,14.0069027 59.3326009,14.4548623 L59.3183929,20.0687976 Z" id="Shape" fill="#194B49" fill-rule="nonzero"></path>
                            <path d="M60.8137848,20.0528136 L60.8137848,11.3663986 L61.7124406,11.3663986 C61.9082956,11.3522697 62.0834574,11.4876568 62.1191446,11.6807506 L62.2381366,12.6131505 C62.5943454,12.2133505 63.0144566,11.875461 63.4813364,11.6132626 C63.9723713,11.350479 64.5229463,11.2189528 65.0797362,11.2314227 C65.5057613,11.2222292 65.9290667,11.3014478 66.3229361,11.4640786 C66.6697995,11.6114043 66.977507,11.8376241 67.221592,12.1247506 C67.4710653,12.4280172 67.6570805,12.7783055 67.7685999,13.1548304 C67.8973157,13.5869425 67.9601815,14.0359838 67.9550799,14.4868303 L67.9550799,20.0670216 L66.4454801,20.0670216 L66.4454801,14.4779503 C66.4454801,13.8279344 66.2974801,13.3235504 66.0014801,12.9647985 C65.7048882,12.6095985 65.2502322,12.4319985 64.6410643,12.4319985 C64.20592,12.4304904 63.7777375,12.5412062 63.3978644,12.7534545 C62.9959376,12.9825526 62.6356562,13.2779834 62.3322646,13.6272464 L62.3322646,20.0581416 L60.8137848,20.0528136 Z" id="Path" fill="#194B49" fill-rule="nonzero"></path>
                            <path d="M81.0477503,20.0812296 C80.3693184,20.0812296 79.8477665,19.8917896 79.4830945,19.5129097 C79.1184226,19.1340297 78.9360866,18.5887978 78.9360866,17.8772139 L78.9360866,12.6202545 L77.9024547,12.6202545 C77.818845,12.6227732 77.7372529,12.5943108 77.6733507,12.5403345 C77.6060349,12.4751851 77.5714884,12.3832783 77.5792228,12.2899185 L77.5792228,11.6878546 L78.9875906,11.5102546 L79.3339105,8.85691094 C79.3432227,8.77627839 79.3825306,8.70210072 79.4440225,8.64911897 C79.5107247,8.59376087 79.5953675,8.56470439 79.6820065,8.56742298 L80.4527904,8.56742298 L80.4527904,11.5280146 L82.9036701,11.5280146 L82.9036701,12.6202545 L80.4527904,12.6202545 L80.4527904,17.7706539 C80.4283097,18.0633049 80.523098,18.3534339 80.7156384,18.5751818 C80.8957052,18.7528436 81.1413088,18.8479989 81.3940703,18.8380298 C81.5333547,18.8406773 81.6720777,18.8196587 81.8043262,18.7758698 C81.9088289,18.7379078 82.0098465,18.6909643 82.1062462,18.6355658 C82.1897182,18.5840618 82.2625342,18.5378858 82.3211422,18.4952618 C82.366102,18.4583711 82.4212421,18.4360672 82.4792062,18.4313258 C82.5699195,18.4391437 82.650007,18.4936571 82.6905501,18.5751818 L83.1309981,19.2962377 C82.8582097,19.5473211 82.5382565,19.7417078 82.1897182,19.8681096 C81.8271631,20.0056277 81.4426138,20.0760381 81.0548543,20.0759016" id="Path" fill="#194B49" fill-rule="nonzero"></path>
                            <path d="M70.8393036,14.3287663 L70.8393036,14.3287663 C70.9455423,13.8295056 71.1884156,13.3695834 71.5408235,13.0003185 C71.9599594,12.5788145 72.5336074,12.3680625 73.2617673,12.3680625 C73.5773386,12.3637629 73.8904408,12.4242074 74.1817352,12.5456625 C74.4433087,12.6560201 74.6764749,12.8242155 74.8637191,13.0376144 C75.0553707,13.2575151 75.1998405,13.5144175 75.288183,13.7924144 C75.3782083,14.0732885 75.4260889,14.365959 75.430263,14.6608783 L70.7345196,16.1917901 C70.6700247,15.5699147 70.7041899,14.9417543 70.8357516,14.3305423 M76.7871268,15.1670382 C76.7871268,15.1457262 76.7871268,15.1244142 76.7871268,15.1013262 C76.7963402,14.545747 76.70612,13.9929977 76.5207269,13.4691824 C76.359686,13.0205553 76.1068466,12.6104474 75.778359,12.2650545 C75.4599229,11.9388494 75.0754032,11.6845214 74.6505991,11.5191346 C74.1975932,11.3440489 73.7154378,11.2566582 73.2297993,11.2616147 C72.6538952,11.2526295 72.0823971,11.3633006 71.5514795,11.5866226 C71.0714898,11.7930388 70.6410131,12.0993978 70.2887436,12.4852785 C69.9364024,12.8788425 69.6664682,13.3389989 69.4948717,13.8385904 C69.3084379,14.3783305 69.2153454,14.9458944 69.2195917,15.5169102 C69.2077055,16.1849371 69.3110419,16.8500154 69.5250637,17.4829419 C69.7056572,18.0167268 69.9960519,18.5067677 70.3775436,18.9215017 C70.7387683,19.3096765 71.1815493,19.6129511 71.6740235,19.8095016 C72.1965798,20.0145463 72.7537302,20.1170524 73.3150473,20.1114216 C73.6305309,20.1103629 73.9453786,20.0830365 74.2563271,20.0297256 C74.5697283,19.9775354 74.8776765,19.8966841 75.176295,19.7881896 C75.4690623,19.6832267 75.7490689,19.5456064 76.0110149,19.3779337 C76.2633091,19.2171456 76.4891714,19.0182429 76.6805669,18.7883018 L76.2561029,18.2377418 C76.1917823,18.1427711 76.0830088,18.0877129 75.9683909,18.0921098 C75.8436495,18.1023913 75.7245751,18.1486637 75.625623,18.2253098 C75.4649765,18.3281708 75.298983,18.4224314 75.128343,18.5076938 C74.9001281,18.6226063 74.6624522,18.7176767 74.4179431,18.7918538 C74.0999566,18.8862577 73.7692145,18.9305963 73.4375912,18.9232777 C73.0611118,18.9291692 72.687095,18.8616048 72.3364714,18.7243658 C72.010367,18.5927166 71.7196274,18.3865227 71.4875435,18.1223018 C71.2762096,17.8771555 71.109142,17.5971071 70.9938155,17.2946859 L76.3679909,15.5346701 C76.5970949,15.4600782 76.7445029,15.4121262 76.7782468,15.2522862 L76.7782468,15.2522862 L76.7782468,15.2167662 C76.7800557,15.1996458 76.7800557,15.1823825 76.7782468,15.1652622" id="Shape" fill="#194B49" fill-rule="nonzero"></path>
                        </g>
                    </g>
                </g>
            </g>
        </g>
    </g>
</svg>