<?xml version="1.0" encoding="UTF-8"?>
<svg width="66px" height="15px" viewBox="0 0 66 15" version="1.1" xmlns="http://www.w3.org/2000/svg" xmlns:xlink="http://www.w3.org/1999/xlink">
    <!-- Generator: Sketch 47.1 (45422) - http://www.bohemiancoding.com/sketch -->
    <title>lacimade-couleur</title>
    <desc>Created with Sketch.</desc>
    <defs></defs>
    <g id="Symbols" stroke="none" stroke-width="1" fill="none" fill-rule="evenodd">
        <g id="logos" transform="translate(-596.000000, -50.000000)" fill-rule="nonzero">
            <g id="lacimade-couleur" transform="translate(596.000000, 50.000000)">
                <g id="Group" transform="translate(22.155148, 11.055484)" fill="#000000">
                    <path d="M1.31720733,2.34348387 C1.31720733,2.38408258 1.30277856,2.42235871 1.27429337,2.45794065 C1.24543583,2.49370839 1.20252186,2.51163871 1.14517913,2.51163871 L0.183291961,2.51163871 C0.135071932,2.51163871 0.094112835,2.49435871 0.0603215797,2.45979871 C0.0267165021,2.42523871 0.0098674189,2.38529032 0.0098674189,2.34004645 L0.0098674189,0.191009032 C0.0098674189,0.134059355 0.0279266573,0.0912309677 0.064045134,0.0623380645 C0.1002567,0.0338167742 0.140005642,0.0195096774 0.183291961,0.0195096774 C0.226764457,0.0195096774 0.265861777,0.0338167742 0.300863188,0.0623380645 C0.335864598,0.0910451613 0.353272214,0.133966452 0.353272214,0.191009032 L0.353272214,2.1716129 L1.14517913,2.1716129 C1.20252186,2.1716129 1.24552891,2.18945032 1.27429337,2.22540387 C1.30277856,2.26126452 1.31720733,2.30065548 1.31720733,2.34348387 Z" id="Shape"></path>
                    <path d="M1.91018336,0.480030968 C1.89463752,0.546828387 1.87425106,0.604335484 1.84930324,0.653202581 C1.82407616,0.701976774 1.79493935,0.740531613 1.76152045,0.769052903 C1.72791537,0.79776 1.69216925,0.81188129 1.65400282,0.81188129 C1.60838928,0.81188129 1.56854725,0.798317419 1.53382511,0.770910968 C1.49910296,0.743504516 1.48188152,0.706157419 1.48188152,0.658498065 C1.48188152,0.62756129 1.49240056,0.593187097 1.51409027,0.555096774 C1.52833286,0.531220645 1.54034133,0.510967742 1.54983639,0.494430968 C1.55951763,0.477708387 1.56780254,0.46052129 1.57506347,0.442498065 C1.58223131,0.424753548 1.58697884,0.403292903 1.58930606,0.378487742 C1.59181946,0.353310968 1.59302962,0.321909677 1.59302962,0.283726452 L1.59302962,0.183948387 C1.59302962,0.12932129 1.61220592,0.0881651613 1.65037236,0.0607587097 C1.68853879,0.0333522581 1.72791537,0.0197883871 1.76878138,0.0197883871 C1.80927504,0.0197883871 1.84688293,0.0340954839 1.88169817,0.0626167742 C1.91623413,0.0911380645 1.93364175,0.132851613 1.93364175,0.18747871 L1.93364175,0.265981935 C1.93354866,0.341976774 1.92582228,0.413326452 1.91018336,0.480030968 Z" id="Shape"></path>
                    <path d="M3.44503244,2.48748387 C3.40928632,2.51489032 3.36990973,2.5285471 3.32690268,2.5285471 C3.28398872,2.5285471 3.24461213,2.51489032 3.20886601,2.48748387 C3.17311989,2.46007742 3.15515374,2.41789935 3.15515374,2.36076387 L3.15515374,1.3535071 C3.15515374,1.27008 3.12890268,1.20811355 3.07649365,1.16770065 C3.02408463,1.12700903 2.96562482,1.10694194 2.90120733,1.10694194 L2.89050212,1.10694194 C2.8070945,1.10694194 2.74202539,1.13249032 2.69557405,1.18386581 C2.64912271,1.23496258 2.62585049,1.29869419 2.62585049,1.37496774 L2.62585049,2.36076387 C2.62585049,2.41789935 2.60788434,2.46007742 2.57213822,2.48748387 C2.53648519,2.51489032 2.49701551,2.5285471 2.45410155,2.5285471 C2.41118759,2.5285471 2.371811,2.51489032 2.33606488,2.48748387 C2.30031876,2.46007742 2.28235261,2.41771355 2.28235261,2.36076387 L2.28235261,0.191101935 C2.28235261,0.134152258 2.30031876,0.0911380645 2.33606488,0.0624309677 C2.371811,0.0339096774 2.41118759,0.0196025806 2.45410155,0.0196025806 C2.49701551,0.0196025806 2.53648519,0.0339096774 2.57213822,0.0624309677 C2.60788434,0.091323871 2.62585049,0.134059355 2.62585049,0.191287742 L2.62585049,0.860005161 C2.66383075,0.826652903 2.7085134,0.802776774 2.75989845,0.788376774 C2.81109732,0.774162581 2.85000846,0.767009032 2.87607334,0.767009032 L2.91898731,0.767009032 C3.00481523,0.767009032 3.08300987,0.782523871 3.15338505,0.813367742 C3.22376023,0.844397419 3.28464034,0.88676129 3.33583921,0.940366452 C3.38703808,0.99387871 3.4269732,1.05584516 3.45564457,1.12608 C3.48412976,1.19640774 3.49855853,1.27203097 3.49855853,1.35294968 L3.49855853,2.36076387 C3.49865162,2.41771355 3.48068547,2.46007742 3.44503244,2.48748387 Z" id="Shape"></path>
                    <path d="M5.04578843,2.48748387 C5.01004231,2.51489032 4.97066573,2.5285471 4.92765867,2.5285471 C4.89423977,2.5285471 4.86258956,2.52306581 4.83280113,2.51238194 C4.80310578,2.50188387 4.77741326,2.47717161 4.75590973,2.43908129 C4.70554866,2.48683355 4.66086601,2.51368258 4.62130324,2.51953548 C4.58192666,2.52548129 4.54301551,2.5285471 4.50466291,2.5285471 L4.47245416,2.5285471 C4.38392666,2.5285471 4.30368406,2.51368258 4.23200564,2.48395355 C4.16023413,2.45422452 4.09814386,2.41297548 4.04545557,2.36076387 C3.99286037,2.30827355 3.95227362,2.2463071 3.92350917,2.17495742 C3.8948378,2.10332903 3.88040903,2.02594065 3.88040903,1.94260645 L3.88040903,0.938508387 C3.88040903,0.88128 3.89837518,0.83835871 3.9341213,0.809837419 C3.96986742,0.781316129 4.00924401,0.766916129 4.05215797,0.766916129 C4.09265162,0.766916129 4.13156276,0.781316129 4.16851904,0.809837419 C4.20547532,0.83835871 4.22390691,0.88128 4.22390691,0.938322581 L4.22390691,1.94158452 C4.22390691,2.01051871 4.24783075,2.06951226 4.29567842,2.11810065 C4.34371227,2.16687484 4.40245134,2.19140129 4.47198872,2.19140129 L4.50438364,2.19140129 C4.57392102,2.19140129 4.63312553,2.16687484 4.68227645,2.11810065 C4.73133427,2.06951226 4.75600282,2.01051871 4.75600282,1.94158452 L4.75600282,0.938322581 C4.75600282,0.88128 4.77396897,0.83835871 4.80971509,0.809837419 C4.84546121,0.781316129 4.8848378,0.766916129 4.92775176,0.766916129 C4.97066573,0.766916129 5.0101354,0.781316129 5.04588152,0.809837419 C5.08153456,0.83835871 5.09950071,0.88128 5.09950071,0.938508387 L5.09950071,2.36076387 C5.09940762,2.41771355 5.08144147,2.46007742 5.04578843,2.48748387 Z" id="Shape"></path>
                    <path d="M7.59195487,2.48748387 C7.55499859,2.51489032 7.51506347,2.5285471 7.47214951,2.5285471 C7.43146968,2.5285471 7.39330324,2.51489032 7.35765021,2.48748387 C7.32171791,2.46007742 7.30393794,2.41789935 7.30393794,2.36076387 L7.30393794,1.35694452 C7.30393794,1.28801032 7.27871086,1.22901677 7.22881523,1.18024258 C7.17864034,1.13137548 7.11897038,1.10694194 7.04971227,1.10694194 L7.0176897,1.10694194 C6.9483385,1.10694194 6.88866855,1.13137548 6.83858674,1.18024258 C6.78841185,1.22901677 6.76346403,1.28801032 6.76346403,1.35694452 L6.76346403,2.35351742 C6.76346403,2.41306839 6.74503244,2.45710452 6.70807616,2.48581161 C6.67111989,2.51424 6.63239492,2.52864 6.59171509,2.52864 C6.54880113,2.52864 6.50942454,2.51424 6.47367842,2.48581161 C6.43774612,2.45710452 6.41996615,2.41306839 6.41996615,2.35351742 L6.41996615,1.35694452 C6.41996615,1.28801032 6.39483216,1.22901677 6.34484344,1.18024258 C6.29466855,1.13137548 6.23509168,1.10694194 6.16574048,1.10694194 L6.13371791,1.10694194 C6.06436671,1.10694194 6.00478984,1.13137548 5.95461495,1.18024258 C5.90444006,1.22901677 5.87949224,1.28801032 5.87949224,1.35694452 L5.87949224,2.36076387 C5.87949224,2.41789935 5.86152609,2.46007742 5.82577997,2.48748387 C5.78984767,2.51489032 5.75065726,2.5285471 5.70765021,2.5285471 C5.66697038,2.5285471 5.6283385,2.51489032 5.59138223,2.48748387 C5.55442595,2.46007742 5.53590127,2.41771355 5.53590127,2.36076387 L5.53590127,0.938508387 C5.53590127,0.88128 5.55368124,0.83835871 5.58961354,0.809837419 C5.62535966,0.781316129 5.66473625,0.766916129 5.70765021,0.766916129 C5.74833004,0.766916129 5.78156276,0.772861935 5.80781382,0.784753548 C5.83406488,0.796738065 5.85798872,0.821636129 5.87949224,0.860005161 C5.90565021,0.831390968 5.94260649,0.808722581 5.99045416,0.792092903 C6.03792948,0.775370323 6.08577715,0.766916129 6.13353173,0.766916129 L6.16574048,0.766916129 C6.25882934,0.766916129 6.33916502,0.782430968 6.40730606,0.813460645 C6.47535402,0.844304516 6.53679267,0.88731871 6.59171509,0.942131613 C6.64645134,0.88731871 6.7103103,0.844304516 6.78319887,0.813460645 C6.85590127,0.782430968 6.93400282,0.766916129 7.01759661,0.766916129 L7.04980536,0.766916129 C7.25273907,0.766916129 7.4028914,0.818756129 7.50082087,0.922343226 C7.59865726,1.02593032 7.64752891,1.16714323 7.64752891,1.34570323 L7.64752891,2.36076387 C7.64734274,2.41771355 7.62891114,2.46007742 7.59195487,2.48748387 Z" id="Shape"></path>
                    <path d="M9.41109732,2.36420129 C9.41109732,2.4048929 9.39741326,2.44224 9.36995205,2.4768 C9.34249083,2.51136 9.30236953,2.52864 9.24996051,2.52864 C9.19010437,2.52864 9.13685755,2.51498323 9.09040621,2.48757677 C9.04358251,2.46017032 9.00718477,2.43109161 8.98093371,2.39996903 C8.8757433,2.48590452 8.75482087,2.5287329 8.6184457,2.5287329 L8.58623695,2.5287329 C8.51195205,2.5287329 8.439622,2.51860645 8.36906065,2.49835355 C8.29849929,2.47810065 8.23566432,2.44604903 8.18083498,2.40192 C8.12572638,2.35779097 8.08160226,2.30260645 8.04799718,2.23590194 C8.01457828,2.16910452 7.99782228,2.08948645 7.99782228,1.99658323 L7.99782228,1.97883871 C7.99782228,1.85258323 8.02891396,1.75494194 8.0912835,1.68600774 C8.15355994,1.61679484 8.2283103,1.5637471 8.31581382,1.52686452 C8.40313117,1.49007484 8.49352045,1.46434065 8.58679549,1.45012645 C8.6802567,1.43600516 8.75928914,1.42141935 8.8239859,1.40729806 C8.84539633,1.40256 8.85870804,1.39308387 8.86336248,1.37859097 C8.86811001,1.36446968 8.87062341,1.35118452 8.87062341,1.3392929 C8.87062341,1.26794323 8.84790973,1.21145806 8.80257546,1.16965161 C8.7571481,1.12803097 8.70231876,1.10712774 8.63771509,1.10712774 L8.61248801,1.10712774 C8.56007898,1.10712774 8.514,1.11725419 8.47453032,1.1375071 C8.43515374,1.15794581 8.40350353,1.19417806 8.3794866,1.24657548 C8.36524401,1.28243613 8.34374048,1.30872774 8.31506911,1.32526452 C8.28639774,1.3421729 8.25772638,1.35034839 8.22905501,1.35034839 C8.18372073,1.35034839 8.14248237,1.33436903 8.10533992,1.30203871 C8.06838364,1.26989419 8.04976587,1.22994581 8.04976587,1.18228645 C8.04976587,1.15367226 8.05469958,1.12858839 8.06419464,1.10712774 C8.09286601,1.04274581 8.12861213,0.988490323 8.17171227,0.94436129 C8.21481241,0.900232258 8.26070522,0.865021935 8.30957687,0.838730323 C8.3586347,0.81243871 8.40936812,0.794043871 8.46196333,0.783267097 C8.51455853,0.772583226 8.56473343,0.767101935 8.61239492,0.767101935 L8.637622,0.767101935 C8.70920733,0.767101935 8.77976869,0.779550968 8.84893371,0.804727742 C8.91828491,0.829625806 8.97963047,0.865393548 9.03334274,0.911752258 C9.08696192,0.958203871 9.13043441,1.01478194 9.16385331,1.08157935 C9.19727221,1.14828387 9.21402821,1.22325677 9.21402821,1.30659097 L9.21402821,2.09626839 C9.21402821,2.1224671 9.21700705,2.14346323 9.22305783,2.15888516 C9.22901551,2.1743071 9.2450268,2.18573419 9.27146403,2.19279484 C9.31912553,2.20468645 9.35449929,2.22670452 9.37721298,2.25894194 C9.39983357,2.29099355 9.41109732,2.32611097 9.41109732,2.36420129 Z M8.87062341,1.71750194 C8.80816079,1.73422452 8.74448801,1.74713806 8.67969817,1.7567071 C8.61481523,1.76618323 8.55654161,1.77928258 8.5047842,1.79581935 C8.45321298,1.81254194 8.4112299,1.83493161 8.37883498,1.86354581 C8.34625388,1.8922529 8.33005642,1.93359484 8.33005642,1.98822194 C8.33005642,2.0477729 8.35221157,2.09636129 8.39680113,2.13426581 C8.44111142,2.17235613 8.50431876,2.19140129 8.58595769,2.19140129 L8.61853879,2.19140129 C8.68807616,2.19140129 8.74746685,2.16706065 8.79680395,2.11828645 C8.84604795,2.06969806 8.8707165,2.01089032 8.8707165,1.94195613 L8.8707165,1.71750194 L8.87062341,1.71750194 Z" id="Shape"></path>
                    <path d="M10.9096417,2.48748387 C10.8737094,2.51489032 10.834519,2.5285471 10.7916051,2.5285471 C10.7509252,2.5285471 10.7122003,2.51489032 10.675244,2.48748387 C10.6382877,2.46007742 10.619763,2.41789935 10.619763,2.36076387 L10.619763,1.35694452 C10.619763,1.28801032 10.5958392,1.22901677 10.5478054,1.18024258 C10.4999577,1.13137548 10.4411255,1.10694194 10.3716812,1.10694194 L10.3392863,1.10694194 C10.2697489,1.10694194 10.2105444,1.13137548 10.1613935,1.18024258 C10.1121495,1.22901677 10.0876671,1.28801032 10.0876671,1.35694452 L10.0876671,2.36076387 C10.0876671,2.41789935 10.069701,2.46007742 10.0339549,2.48748387 C9.99802257,2.51489032 9.95883216,2.5285471 9.91591819,2.5285471 C9.87300423,2.5285471 9.83353456,2.51489032 9.79778843,2.48748387 C9.76185614,2.46007742 9.74407616,2.41771355 9.74407616,2.36076387 L9.74407616,0.938508387 C9.74407616,0.88128 9.76185614,0.83835871 9.79778843,0.809837419 C9.83353456,0.781316129 9.87291114,0.766916129 9.91591819,0.766916129 C9.94933709,0.766916129 9.98080113,0.772861935 10.0107757,0.784753548 C10.0404711,0.796738065 10.0661636,0.821636129 10.0876671,0.860005161 C10.137842,0.81216 10.1827109,0.784753548 10.2222736,0.7776 C10.2616502,0.770446452 10.3005614,0.766916129 10.3387278,0.766916129 L10.3711227,0.766916129 C10.4596502,0.766916129 10.5403583,0.782430968 10.613433,0.813274839 C10.6863216,0.844304516 10.748598,0.886018065 10.79989,0.938508387 C10.851275,0.990812903 10.8913963,1.05277935 10.9200677,1.12431484 C10.9487391,1.19585032 10.9631678,1.27323871 10.9631678,1.3565729 L10.9631678,2.36076387 C10.963354,2.41771355 10.9453879,2.46007742 10.9096417,2.48748387 Z" id="Shape"></path>
                    <path d="M11.7079718,2.48748387 C11.6710155,2.51489032 11.6321044,2.5285471 11.5916107,2.5285471 C11.5486968,2.5285471 11.5092271,2.51489032 11.473481,2.48748387 C11.4378279,2.46007742 11.4198618,2.41771355 11.4198618,2.36076387 L11.4198618,0.938508387 C11.4198618,0.88128 11.4378279,0.83835871 11.473481,0.809837419 C11.5092271,0.781316129 11.5486037,0.766916129 11.5916107,0.766916129 C11.6321044,0.766916129 11.6710155,0.781316129 11.7079718,0.809837419 C11.744835,0.83835871 11.7633597,0.88128 11.7633597,0.938508387 L11.7633597,2.36076387 C11.7633597,2.41771355 11.744835,2.46007742 11.7079718,2.48748387 Z M11.7095543,0.391494194 C11.6737151,0.420108387 11.6342454,0.434508387 11.5913315,0.434508387 C11.5482313,0.434508387 11.5093202,0.420108387 11.4748773,0.391494194 C11.4400621,0.36288 11.4228406,0.321166452 11.4228406,0.266446452 L11.4228406,0.191194839 C11.4228406,0.134059355 11.4400621,0.0912309677 11.4748773,0.0623380645 C11.5094133,0.0338167742 11.5483244,0.0195096774 11.5913315,0.0195096774 C11.6342454,0.0195096774 11.6737151,0.0338167742 11.7095543,0.0623380645 C11.7454866,0.0912309677 11.7634528,0.133966452 11.7634528,0.191194839 L11.7634528,0.266446452 C11.7633597,0.321259355 11.7453935,0.362972903 11.7095543,0.391494194 Z" id="Shape"></path>
                    <path d="M13.0317884,2.35156645 C13.0317884,2.39458065 13.0175458,2.43341419 12.9888745,2.46816 C12.96011,2.50299871 12.9171961,2.52018581 12.8598533,2.52018581 C12.7930155,2.52018581 12.7298082,2.50773677 12.6701382,2.48256 C12.6104683,2.45766194 12.5587109,2.42300903 12.5144937,2.37906581 C12.4702764,2.33475097 12.4355543,2.28300387 12.4105134,2.2234529 C12.3854725,2.16371613 12.3730917,2.10054194 12.3730917,2.03383742 L12.3730917,1.11827613 L12.3156559,1.11827613 C12.2583131,1.11827613 12.2153061,1.10034581 12.1866347,1.06457806 C12.1579633,1.02890323 12.1437207,0.989419355 12.1437207,0.946498065 C12.1437207,0.905899355 12.1579633,0.867809032 12.1866347,0.83204129 C12.2153061,0.796180645 12.2583131,0.778343226 12.3156559,0.778343226 L12.3730917,0.778343226 L12.3730917,0.191473548 C12.3730917,0.134338065 12.3907786,0.0915096774 12.4267109,0.0626167742 C12.4623639,0.0340954839 12.5005303,0.0197883871 12.5412102,0.0197883871 C12.5841241,0.0197883871 12.6241523,0.0340954839 12.6610155,0.0626167742 C12.6978787,0.0915096774 12.7164965,0.134245161 12.7164965,0.191473548 L12.7164965,0.778343226 L12.8423526,0.778343226 C12.8997884,0.778343226 12.9428886,0.796180645 12.9718392,0.83204129 C13.0006037,0.867901935 13.0149394,0.905992258 13.0149394,0.946498065 C13.0149394,0.989419355 13.0006037,1.02890323 12.9718392,1.06457806 C12.9428886,1.10034581 12.8998815,1.11827613 12.8423526,1.11827613 L12.7164965,1.11827613 L12.7164965,2.03300129 C12.7164965,2.06170839 12.729622,2.09376 12.7558731,2.12952774 C12.7821241,2.16529548 12.8166601,2.1831329 12.8598533,2.1831329 C12.9170099,2.1831329 12.96011,2.20097032 12.9886883,2.23683097 C13.0175458,2.27269161 13.0317884,2.31087484 13.0317884,2.35156645 Z" id="Shape"></path>
                    <path d="M14.5198138,1.77157161 C14.4862087,1.80622452 14.445622,1.82341161 14.3976812,1.82341161 L13.6943949,1.82341161 L13.6943949,1.95198968 C13.6943949,2.02110968 13.7188773,2.07843097 13.7677489,2.12367484 C13.8168068,2.16882581 13.8759182,2.19149419 13.9452694,2.19149419 L13.9739408,2.19149419 C14.0361241,2.19149419 14.0814584,2.17820903 14.1101298,2.15210323 C14.1388942,2.12581161 14.1632835,2.09766194 14.1835769,2.06784 C14.2039633,2.03801806 14.2248152,2.00986839 14.2463188,1.98357677 C14.2677292,1.95747097 14.3025444,1.94418581 14.3501128,1.94418581 C14.3955402,1.94418581 14.4366855,1.95793548 14.4738279,1.98552774 C14.5109704,2.01293419 14.529402,2.0506529 14.529402,2.09840516 C14.529402,2.11512774 14.5235374,2.14141935 14.511622,2.17728 C14.4541862,2.29192258 14.3830663,2.37934452 14.2983554,2.43898839 C14.2134584,2.49881806 14.1052891,2.52864 13.9740339,2.52864 L13.9453625,2.52864 C13.8640028,2.52864 13.7870183,2.51424 13.714409,2.48581161 C13.6415205,2.45710452 13.57822,2.41659871 13.5246008,2.36420129 C13.4708886,2.31189677 13.4286262,2.25039484 13.3975346,2.1802529 C13.366536,2.11001806 13.3510832,2.03439484 13.3510832,1.95347613 L13.3510832,1.34579613 C13.3510832,1.26506323 13.3670945,1.1893471 13.3994894,1.11901935 C13.4319774,1.04878452 13.4748914,0.987468387 13.5286968,0.935070968 C13.5823159,0.882673548 13.6451509,0.841610323 13.7168293,0.811695484 C13.7886008,0.782152258 13.8651199,0.767194839 13.9463865,0.767194839 L13.9749647,0.767194839 C14.0587447,0.767194839 14.1364739,0.782152258 14.2080592,0.811695484 C14.2797377,0.841610323 14.3425726,0.882023226 14.396378,0.93312 C14.4499972,0.984309677 14.4925388,1.04618323 14.5235374,1.11874065 C14.554536,1.19129806 14.5701749,1.27045161 14.5701749,1.35610839 L14.5701749,1.65228387 C14.5699887,1.69734194 14.5532327,1.73710452 14.5198138,1.77157161 Z M14.4166714,0.197419355 C14.4166714,0.226126452 14.408945,0.253532903 14.3933992,0.27963871 C14.3777602,0.305930323 14.3533709,0.327390968 14.319952,0.344020645 L13.7429873,0.615855484 C13.7190635,0.62784 13.6929055,0.633785806 13.664141,0.633785806 C13.6162934,0.633785806 13.5768237,0.615855484 13.5458251,0.580087742 C13.5148265,0.544227097 13.4992807,0.503907097 13.4992807,0.458477419 C13.4992807,0.429677419 13.5071001,0.401806452 13.5225529,0.374492903 C13.5380056,0.347086452 13.5636982,0.324975484 13.5996305,0.308252903 L14.1730578,0.0364180645 C14.1968886,0.0251767742 14.2231396,0.0195096774 14.251811,0.0195096774 C14.2995656,0.0195096774 14.3391283,0.0377187097 14.3701269,0.0745083871 C14.4012186,0.111298065 14.4166714,0.152175484 14.4166714,0.197419355 Z M14.2264908,1.35620129 C14.2264908,1.28271484 14.2012638,1.22279226 14.1509958,1.17634065 C14.1006347,1.13007484 14.0443159,1.10684903 13.9821326,1.10684903 L13.9497377,1.10684903 C13.8802003,1.10684903 13.820158,1.12933161 13.76989,1.17466839 C13.7195289,1.21944774 13.6943018,1.27667613 13.6943018,1.34542452 L13.6943018,1.50586839 L14.2263977,1.50586839 L14.2263977,1.35620129 L14.2264908,1.35620129 Z" id="Shape"></path>
                    <path d="M17.2233004,2.17495742 C17.1921157,2.2463071 17.1497602,2.30827355 17.0959549,2.36076387 C17.0421495,2.41306839 16.9792214,2.45422452 16.907543,2.48395355 C16.8358646,2.51368258 16.7580423,2.5285471 16.6743554,2.5285471 L16.6492214,2.5285471 C16.620457,2.5285471 16.5804288,2.52185806 16.5290437,2.50885161 C16.4773794,2.49565935 16.4327898,2.47224774 16.3944372,2.43880258 L16.3944372,3.10937806 C16.3944372,3.16669935 16.3765642,3.20989935 16.340725,3.23851355 C16.3050719,3.26712774 16.2656023,3.28162065 16.2226883,3.28162065 C16.1797743,3.28162065 16.1403047,3.26712774 16.1046516,3.23869935 C16.0688124,3.20989935 16.0509394,3.16707097 16.0509394,3.10974968 L16.0509394,0.938694194 C16.0509394,0.88388129 16.0688124,0.841424516 16.1046516,0.811695484 C16.1403047,0.781966452 16.1797743,0.767009032 16.2226883,0.767009032 C16.272677,0.767009032 16.3110296,0.775463226 16.3370945,0.792185806 C16.3634386,0.808908387 16.3825219,0.831576774 16.3944372,0.860098065 C16.4327898,0.819499355 16.4774725,0.793858065 16.5290437,0.783174194 C16.5804288,0.772490323 16.620457,0.767009032 16.6492214,0.767009032 L16.6743554,0.767009032 C16.7579492,0.767009032 16.8357715,0.782523871 16.907543,0.813367742 C16.9793145,0.844397419 17.0421495,0.88676129 17.0959549,0.940366452 C17.1497602,0.99387871 17.1921157,1.05630968 17.2233004,1.12784516 C17.2544852,1.19938065 17.2699379,1.27556129 17.2699379,1.35666581 L17.2699379,1.94269935 C17.2699379,2.02594065 17.2543921,2.10323613 17.2233004,2.17495742 Z M16.9264401,1.3565729 C16.9264401,1.28782452 16.9017715,1.22883097 16.8527137,1.18005677 C16.8036559,1.13137548 16.7442652,1.10694194 16.6748209,1.10694194 L16.6458702,1.10694194 C16.576426,1.10694194 16.5171283,1.13249032 16.4680705,1.18368 C16.4190127,1.23477677 16.3943441,1.29237677 16.3943441,1.3565729 L16.3943441,1.94177032 C16.3943441,2.01070452 16.4190127,2.06951226 16.4680705,2.11828645 C16.5171283,2.16687484 16.576426,2.19140129 16.6458702,2.19140129 L16.6748209,2.19140129 C16.7442652,2.19140129 16.8036559,2.16687484 16.8527137,2.11828645 C16.9017715,2.06951226 16.9264401,2.01070452 16.9264401,1.94177032 L16.9264401,1.3565729 Z" id="Shape"></path>
                    <path d="M19.0286657,2.36420129 C19.0286657,2.4048929 19.0149817,2.44224 18.9875205,2.4768 C18.9600592,2.51136 18.9199379,2.52864 18.8675289,2.52864 C18.8076728,2.52864 18.7546121,2.51498323 18.7077884,2.48757677 C18.6613371,2.46017032 18.6247532,2.43109161 18.5985021,2.39996903 C18.4931255,2.48590452 18.3723893,2.5287329 18.2360141,2.5287329 L18.2038054,2.5287329 C18.1295205,2.5287329 18.0572835,2.51860645 17.9866291,2.49835355 C17.9160677,2.47810065 17.8532327,2.44604903 17.7984034,2.40192 C17.7432948,2.35779097 17.6991707,2.30260645 17.6657518,2.23590194 C17.6321467,2.16910452 17.6154838,2.08948645 17.6154838,1.99658323 L17.6154838,1.97883871 C17.6154838,1.85258323 17.6465755,1.75494194 17.7088519,1.68600774 C17.7709422,1.61679484 17.8459718,1.5637471 17.9331961,1.52686452 C18.0205134,1.49007484 18.1110889,1.46434065 18.2045501,1.45012645 C18.297732,1.43600516 18.3767645,1.42141935 18.4414612,1.40729806 C18.4628717,1.40256 18.4761834,1.39308387 18.4809309,1.37859097 C18.4856784,1.36446968 18.4881918,1.35118452 18.4881918,1.3392929 C18.4881918,1.26794323 18.4654781,1.21145806 18.4200508,1.16965161 C18.3747165,1.12803097 18.3196079,1.10712774 18.2551904,1.10712774 L18.2302426,1.10712774 C18.1775543,1.10712774 18.1314753,1.11725419 18.0920987,1.1375071 C18.0527221,1.15794581 18.0209788,1.19417806 17.9973343,1.24657548 C17.9828124,1.28243613 17.9613089,1.30872774 17.9327306,1.32526452 C17.9040592,1.3421729 17.8753879,1.35034839 17.8466234,1.35034839 C17.8012891,1.35034839 17.7600508,1.33436903 17.7230014,1.30203871 C17.6861382,1.26989419 17.6675205,1.22994581 17.6675205,1.18228645 C17.6675205,1.15367226 17.6720818,1.12858839 17.681763,1.10712774 C17.7104344,1.04274581 17.7463667,0.988490323 17.7892807,0.94436129 C17.8321946,0.900232258 17.8782736,0.865021935 17.9271453,0.838730323 C17.9760169,0.81243871 18.0268434,0.794043871 18.0795317,0.783267097 C18.1319408,0.772583226 18.1823018,0.767101935 18.2301495,0.767101935 L18.2550973,0.767101935 C18.3267757,0.767101935 18.397244,0.779550968 18.4665021,0.804727742 C18.5357602,0.829625806 18.5971989,0.865393548 18.6508181,0.911752258 C18.7044372,0.958203871 18.7480959,1.01478194 18.7813286,1.08157935 C18.8147475,1.14828387 18.8315035,1.22325677 18.8315035,1.30659097 L18.8315035,2.09626839 C18.8315035,2.1224671 18.8343893,2.14346323 18.8404401,2.15888516 C18.8464908,2.1743071 18.862409,2.18573419 18.8888463,2.19279484 C18.9366008,2.20468645 18.9719746,2.22670452 18.9946883,2.25894194 C19.0174951,2.29099355 19.0286657,2.32611097 19.0286657,2.36420129 Z M18.4881918,1.71750194 C18.4256361,1.73422452 18.3620564,1.74713806 18.2970804,1.7567071 C18.2322906,1.76618323 18.1740169,1.77928258 18.1223526,1.79581935 C18.0706883,1.81254194 18.0287052,1.83493161 17.9962172,1.86354581 C17.9638223,1.8922529 17.9477179,1.93359484 17.9477179,1.98822194 C17.9477179,2.0477729 17.9698731,2.09636129 18.0143695,2.13426581 C18.0587729,2.17235613 18.1218872,2.19140129 18.2035261,2.19140129 L18.235921,2.19140129 C18.3055515,2.19140129 18.3650353,2.16706065 18.4142793,2.11828645 C18.4635233,2.06969806 18.4882849,2.01089032 18.4882849,1.94195613 L18.4882849,1.71750194 L18.4881918,1.71750194 Z" id="Shape"></path>
                    <path d="M20.5500169,1.99639742 C20.5500169,2.09877677 20.5295374,2.18387613 20.4891368,2.25188129 C20.4482708,2.31960774 20.3977236,2.37367742 20.3367504,2.41427613 C20.2756841,2.45487484 20.2087532,2.48395355 20.1358646,2.50188387 C20.062976,2.51953548 19.9931594,2.5285471 19.9260423,2.5285471 L19.8651622,2.5285471 C19.7504767,2.5285471 19.6399803,2.49696 19.5334866,2.43378581 C19.4271791,2.37079742 19.346378,2.2808671 19.2915487,2.16436645 C19.2795402,2.13584516 19.2736756,2.10973935 19.2736756,2.08577032 C19.2736756,2.03820387 19.2915487,1.9988129 19.327481,1.96796903 C19.3633202,1.93703226 19.404,1.92151742 19.4494274,1.92151742 C19.4925275,1.92151742 19.5271566,1.93582452 19.5534076,1.96416 C19.5797518,1.99249548 19.606189,2.02352516 19.6324401,2.05650581 C19.6587842,2.08957935 19.6892243,2.12042323 19.7238533,2.14885161 C19.7585755,2.17709419 19.8058646,2.19130839 19.8656276,2.19130839 L19.9266939,2.19130839 C20.0269506,2.19130839 20.0988152,2.17282065 20.1419154,2.13593806 C20.1850155,2.09905548 20.206519,2.05204645 20.206519,1.99491097 C20.206519,1.94734452 20.1958138,1.90925419 20.174031,1.88064 C20.1526206,1.85211871 20.1255317,1.82945032 20.093323,1.81282065 C20.060835,1.79619097 20.0245303,1.78429935 19.9836643,1.77723871 C19.9429845,1.76999226 19.9046319,1.76283871 19.8687927,1.75587097 C19.8065162,1.74388645 19.7425642,1.72772129 19.6765642,1.70756129 C19.6107504,1.68730839 19.5502426,1.65990194 19.4953202,1.62552774 C19.4400254,1.59087484 19.3952496,1.54748903 19.3606206,1.49527742 C19.3257123,1.44288 19.3083977,1.37859097 19.3083977,1.30241032 L19.3083977,1.24165161 C19.3083977,1.15357935 19.3298082,1.07925677 19.3728152,1.01868387 C19.4158223,0.958018065 19.4681382,0.909058065 19.5301354,0.872268387 C19.5921326,0.83547871 19.6590635,0.808722581 19.7306488,0.791907097 C19.8024203,0.775370323 19.8668378,0.766916129 19.9241805,0.766916129 L19.9386093,0.766916129 C20.0173625,0.766916129 20.0908096,0.777135484 20.1587645,0.797295484 C20.2269055,0.817455484 20.2860169,0.842910968 20.3361918,0.873847742 C20.3863667,0.904691613 20.4251848,0.938043871 20.452646,0.97371871 C20.4801072,1.00939355 20.4937913,1.04256 20.4937913,1.07340387 C20.4937913,1.11409548 20.4783385,1.15014194 20.4473399,1.18228645 C20.4161551,1.21443097 20.3767786,1.23041032 20.329024,1.23041032 C20.2956051,1.23041032 20.2667475,1.224 20.2430099,1.21117935 C20.2189929,1.19808 20.193952,1.18395871 20.167701,1.16872258 C20.1414499,1.15339355 20.1108237,1.13917935 20.0763808,1.12635871 C20.0415656,1.11335226 19.9955797,1.10684903 19.9385162,1.10684903 L19.9240874,1.10684903 C19.8452412,1.10684903 19.7801721,1.12124903 19.7286939,1.14967742 C19.677402,1.17838452 19.6516164,1.21294452 19.6516164,1.25326452 L19.6516164,1.28912516 C19.6516164,1.33204645 19.6737715,1.36344774 19.7181749,1.38360774 C19.7625783,1.40404645 19.8181523,1.42244129 19.8851763,1.43916387 C19.9522003,1.45588645 20.0239718,1.47307355 20.100677,1.49100387 C20.1773822,1.50865548 20.2492468,1.53680516 20.3161777,1.57489548 C20.3831086,1.61298581 20.4387757,1.66482581 20.4831791,1.73032258 C20.5275825,1.79581935 20.5500169,1.88444903 20.5500169,1.99639742 Z" id="Shape"></path>
                    <path d="M22.0985501,1.99639742 C22.0985501,2.09877677 22.0782567,2.18387613 22.0374838,2.25188129 C21.9969901,2.31960774 21.9462567,2.37367742 21.8850973,2.41427613 C21.8242172,2.45487484 21.7572863,2.48395355 21.6845839,2.50188387 C21.6115092,2.51953548 21.5416925,2.5285471 21.4747616,2.5285471 L21.4136953,2.5285471 C21.299103,2.5285471 21.1886065,2.49696 21.0820197,2.43378581 C20.9758054,2.37079742 20.8951904,2.2808671 20.8400818,2.16436645 C20.8281664,2.13584516 20.8222087,2.10973935 20.8222087,2.08577032 C20.8222087,2.03820387 20.8400818,1.9988129 20.8760141,1.96796903 C20.9118533,1.93703226 20.9525331,1.92151742 20.9979605,1.92151742 C21.0411537,1.92151742 21.0756897,1.93582452 21.1021269,1.96416 C21.128378,1.99249548 21.1547221,2.02352516 21.1809732,2.05650581 C21.2073173,2.08957935 21.2378505,2.12042323 21.2723865,2.14885161 C21.3071086,2.17709419 21.3543977,2.19130839 21.4141608,2.19130839 L21.4750409,2.19130839 C21.575763,2.19130839 21.6473484,2.17282065 21.6904485,2.13593806 C21.7333625,2.09914839 21.7549591,2.05204645 21.7549591,1.99491097 C21.7549591,1.94734452 21.7442539,1.90925419 21.7225642,1.88064 C21.7011537,1.85211871 21.6740649,1.82945032 21.641763,1.81282065 C21.6093681,1.79619097 21.5727842,1.78429935 21.5321975,1.77723871 C21.4914245,1.76999226 21.4530719,1.76283871 21.4173258,1.75587097 C21.3549563,1.74388645 21.2910042,1.72772129 21.2251904,1.70756129 C21.1591904,1.68730839 21.0988688,1.65990194 21.043574,1.62552774 C20.9886516,1.59087484 20.9436897,1.54748903 20.9090606,1.49527742 C20.8743385,1.44288 20.8569309,1.37859097 20.8569309,1.30241032 L20.8569309,1.24165161 C20.8569309,1.15357935 20.8783413,1.07925677 20.9213484,1.01868387 C20.9642623,0.958018065 21.0165783,0.909058065 21.0787616,0.872268387 C21.1406657,0.83547871 21.2075035,0.808722581 21.2790889,0.791907097 C21.3507673,0.775370323 21.4152779,0.766916129 21.4726206,0.766916129 L21.4868632,0.766916129 C21.5657094,0.766916129 21.6392496,0.777135484 21.7072976,0.797295484 C21.7753456,0.817455484 21.834457,0.842910968 21.8846319,0.873847742 C21.9348068,0.904691613 21.9737179,0.938043871 22.0011791,0.97371871 C22.0285472,1.00939355 22.0424175,1.04256 22.0424175,1.07340387 C22.0424175,1.11409548 22.0267786,1.15014194 21.99578,1.18228645 C21.9645952,1.21443097 21.9252186,1.23041032 21.8773709,1.23041032 C21.8440451,1.23041032 21.8155599,1.224 21.791543,1.21117935 C21.7676192,1.19808 21.7424852,1.18395871 21.7162341,1.16872258 C21.68989,1.15339355 21.659543,1.13917935 21.6248209,1.12635871 C21.5902849,1.11335226 21.5442059,1.10684903 21.4868632,1.10684903 L21.4726206,1.10684903 C21.3937743,1.10684903 21.3287052,1.12124903 21.2772271,1.14967742 C21.2259351,1.17838452 21.2002426,1.21294452 21.2002426,1.25326452 L21.2002426,1.28912516 C21.2002426,1.33204645 21.2223977,1.36344774 21.266708,1.38360774 C21.3109252,1.40404645 21.3666855,1.42244129 21.4338025,1.43916387 C21.5007334,1.45588645 21.5726911,1.47307355 21.6492102,1.49100387 C21.7257292,1.50865548 21.79778,1.53680516 21.8648039,1.57489548 C21.9317348,1.61298581 21.9873089,1.66482581 22.0317123,1.73032258 C22.0761157,1.79581935 22.0985501,1.88444903 22.0985501,1.99639742 Z" id="Shape"></path>
                    <path d="M23.5996079,1.77157161 C23.566189,1.80622452 23.5254161,1.82341161 23.4775684,1.82341161 L22.7742821,1.82341161 L22.7742821,1.95198968 C22.7742821,2.02110968 22.7987645,2.07843097 22.8478223,2.12367484 C22.8966939,2.16882581 22.9558984,2.19149419 23.0251566,2.19149419 L23.053921,2.19149419 C23.1159182,2.19149419 23.1613456,2.17820903 23.19011,2.15210323 C23.2187814,2.12581161 23.2431707,2.09766194 23.2633709,2.06784 C23.2838505,2.03801806 23.3046093,2.00986839 23.326299,1.98357677 C23.3477094,1.95747097 23.3824316,1.94418581 23.4302793,1.94418581 C23.4755205,1.94418581 23.5168519,1.95793548 23.5537151,1.98552774 C23.5905783,2.01293419 23.6093822,2.0506529 23.6093822,2.09840516 C23.6093822,2.11512774 23.6034245,2.14141935 23.5914161,2.17728 C23.5341664,2.29192258 23.4630465,2.37934452 23.3781495,2.43898839 C23.2934386,2.49881806 23.1853625,2.52864 23.0540141,2.52864 L23.0252496,2.52864 C22.9439831,2.52864 22.8669055,2.51424 22.7940169,2.48581161 C22.7213145,2.45710452 22.6580141,2.41659871 22.6043949,2.36420129 C22.5507757,2.31189677 22.5084203,2.25039484 22.4773286,2.1802529 C22.4464231,2.11001806 22.4309704,2.03439484 22.4309704,1.95347613 L22.4309704,1.34579613 C22.4309704,1.26506323 22.4471678,1.1893471 22.4793766,1.11901935 C22.5115853,1.04878452 22.5546855,0.987468387 22.6083977,0.935070968 C22.6622031,0.882673548 22.7250381,0.841610323 22.7966234,0.811695484 C22.8683949,0.782152258 22.9448209,0.767194839 23.0260874,0.767194839 L23.054945,0.767194839 C23.1384457,0.767194839 23.2160818,0.782152258 23.2879464,0.811695484 C23.3597179,0.841610323 23.4222736,0.882023226 23.476079,0.93312 C23.5297913,0.984309677 23.5722398,1.04618323 23.6033315,1.11874065 C23.6344231,1.19129806 23.649969,1.27045161 23.649969,1.35610839 L23.649969,1.65228387 C23.6498759,1.69734194 23.6331199,1.73710452 23.5996079,1.77157161 Z M23.306378,1.35620129 C23.306378,1.28271484 23.2811509,1.22279226 23.2307898,1.17634065 C23.1805219,1.13007484 23.12411,1.10684903 23.0617405,1.10684903 L23.0295317,1.10684903 C22.9600874,1.10684903 22.9000451,1.12933161 22.8496841,1.17466839 C22.799323,1.21944774 22.774189,1.27667613 22.774189,1.34542452 L22.774189,1.50586839 L23.3062849,1.50586839 L23.3062849,1.35620129 L23.306378,1.35620129 Z" id="Shape"></path>
                    <path d="M26.3031876,2.17495742 C26.2720959,2.2463071 26.2296474,2.30827355 26.1757489,2.36076387 C26.1219436,2.41306839 26.0592017,2.45422452 25.9874302,2.48395355 C25.9156587,2.51368258 25.8380226,2.5285471 25.7543357,2.5285471 L25.7291086,2.5285471 C25.7004372,2.5285471 25.660409,2.52185806 25.6089309,2.50885161 C25.5574528,2.49565935 25.5125839,2.47224774 25.4744175,2.43880258 L25.4744175,3.10937806 C25.4744175,3.16669935 25.4564513,3.20989935 25.4207983,3.23851355 C25.384866,3.26712774 25.3455825,3.28162065 25.3026685,3.28162065 C25.2596615,3.28162065 25.2202849,3.26712774 25.1845388,3.23869935 C25.1486996,3.20989935 25.1309196,3.16707097 25.1309196,3.10974968 L25.1309196,0.938694194 C25.1309196,0.88388129 25.1486996,0.841424516 25.1845388,0.811695484 C25.2202849,0.781966452 25.2596615,0.767009032 25.3026685,0.767009032 C25.3527504,0.767009032 25.3907306,0.775463226 25.4171678,0.792185806 C25.4432327,0.808908387 25.4623159,0.831576774 25.4743244,0.860098065 C25.5124908,0.819499355 25.5574528,0.793858065 25.6088378,0.783174194 C25.6602228,0.772490323 25.7003441,0.767009032 25.7290155,0.767009032 L25.7542426,0.767009032 C25.8378364,0.767009032 25.9154725,0.782523871 25.9873371,0.813367742 C26.0591086,0.844397419 26.1218505,0.88676129 26.1756559,0.940366452 C26.2295543,0.99387871 26.2720028,1.05630968 26.3030945,1.12784516 C26.334,1.19938065 26.349732,1.27556129 26.349732,1.35666581 L26.349732,1.94269935 C26.3498251,2.02594065 26.3340931,2.10323613 26.3031876,2.17495742 Z M26.0063272,1.3565729 C26.0063272,1.28782452 25.9816587,1.22883097 25.9326008,1.18005677 C25.883543,1.13137548 25.8242454,1.10694194 25.754708,1.10694194 L25.7258505,1.10694194 C25.6563131,1.10694194 25.5970155,1.13249032 25.5479577,1.18368 C25.4987137,1.23477677 25.4742313,1.29237677 25.4742313,1.3565729 L25.4742313,1.94177032 C25.4742313,2.01070452 25.4987137,2.06951226 25.5479577,2.11828645 C25.5970155,2.16687484 25.6563131,2.19140129 25.7258505,2.19140129 L25.754708,2.19140129 C25.8242454,2.19140129 25.883543,2.16687484 25.9326008,2.11828645 C25.9816587,2.06951226 26.0063272,2.01070452 26.0063272,1.94177032 L26.0063272,1.3565729 Z" id="Shape"></path>
                    <path d="M28.1085529,2.36420129 C28.1085529,2.4048929 28.0948688,2.44224 28.0675007,2.4768 C28.0400395,2.51136 27.9998251,2.52864 27.9475092,2.52864 C27.8875599,2.52864 27.83422,2.51498323 27.7878618,2.48757677 C27.7410381,2.46017032 27.7045472,2.43109161 27.6783893,2.39996903 C27.5731058,2.48590452 27.4521834,2.5287329 27.3158082,2.5287329 L27.2835994,2.5287329 C27.2094076,2.5287329 27.1370776,2.51860645 27.0665162,2.49835355 C26.9959549,2.47810065 26.9331199,2.44604903 26.8782906,2.40192 C26.823275,2.35779097 26.7791509,2.30260645 26.7454528,2.23590194 C26.7120339,2.16910452 26.6952779,2.08948645 26.6952779,1.99658323 L26.6952779,1.97883871 C26.6952779,1.85258323 26.7264626,1.75494194 26.7887391,1.68600774 C26.8510155,1.61679484 26.925859,1.5637471 27.0132694,1.52686452 C27.1005867,1.49007484 27.1908829,1.46434065 27.284158,1.45012645 C27.3776192,1.43600516 27.4566516,1.42141935 27.5214415,1.40729806 C27.5428519,1.40256 27.5559774,1.39308387 27.5608181,1.37859097 C27.5655656,1.36446968 27.5679859,1.35118452 27.5679859,1.3392929 C27.5679859,1.26794323 27.5452722,1.21145806 27.500031,1.16965161 C27.4546037,1.12803097 27.3996812,1.10712774 27.3351707,1.10712774 L27.3099436,1.10712774 C27.2575346,1.10712774 27.2113625,1.11725419 27.172079,1.1375071 C27.1326093,1.15794581 27.1009591,1.19417806 27.0770353,1.24657548 C27.0628858,1.28243613 27.0413822,1.30872774 27.0127109,1.32526452 C26.9839464,1.3421729 26.9553681,1.35034839 26.9266968,1.35034839 C26.8812694,1.35034839 26.8401241,1.33436903 26.8029817,1.30203871 C26.7660254,1.26989419 26.7474076,1.22994581 26.7474076,1.18228645 C26.7474076,1.15367226 26.7523413,1.12858839 26.7617433,1.10712774 C26.7905078,1.04274581 26.8260677,0.988490323 26.8691678,0.94436129 C26.912268,0.900232258 26.9582539,0.865021935 27.0071255,0.838730323 C27.0561834,0.81243871 27.1069168,0.794043871 27.159512,0.783267097 C27.2121072,0.772583226 27.2622821,0.767101935 27.3099436,0.767101935 L27.3351707,0.767101935 C27.4068491,0.767101935 27.4773173,0.779550968 27.5464824,0.804727742 C27.6158336,0.829625806 27.6771791,0.865393548 27.7307983,0.911752258 C27.7845106,0.958203871 27.8279831,1.01478194 27.8613089,1.08157935 C27.8947278,1.14828387 27.9114838,1.22325677 27.9114838,1.30659097 L27.9114838,2.09626839 C27.9114838,2.1224671 27.9145557,2.14346323 27.9205134,2.15888516 C27.9264711,2.1743071 27.9424824,2.18573419 27.9690127,2.19279484 C28.0166742,2.20468645 28.052048,2.22670452 28.0746685,2.25894194 C28.0972891,2.29099355 28.1085529,2.32611097 28.1085529,2.36420129 Z M27.5679859,1.71750194 C27.5055233,1.73422452 27.4418505,1.74713806 27.3770606,1.7567071 C27.3121777,1.76618323 27.2539972,1.77928258 27.2021467,1.79581935 C27.1506685,1.81254194 27.1084993,1.83493161 27.0761044,1.86354581 C27.0435233,1.8922529 27.0274189,1.93359484 27.0274189,1.98822194 C27.0274189,2.0477729 27.049574,2.09636129 27.0941636,2.13426581 C27.138567,2.17235613 27.2015882,2.19140129 27.2832271,2.19140129 L27.3158082,2.19140129 C27.3854386,2.19140129 27.4449224,2.16706065 27.4941664,2.11828645 C27.5434104,2.06969806 27.5679859,2.01089032 27.5679859,1.94195613 L27.5679859,1.71750194 L27.5679859,1.71750194 Z" id="Shape"></path>
                    <path d="M29.3912243,1.08929032 C29.3912243,1.13713548 29.3708378,1.17346065 29.330158,1.19854452 C29.2896643,1.22372129 29.2490776,1.23607742 29.2083977,1.23607742 C29.1700451,1.23607742 29.1437941,1.22948129 29.1295515,1.21647484 C29.1151227,1.20300387 29.1032073,1.18832516 29.0936192,1.17150968 C29.084031,1.1547871 29.0704401,1.13992258 29.0524739,1.12663742 C29.0345078,1.11363097 29.0015543,1.10694194 28.9538928,1.10694194 C28.9035317,1.10694194 28.8606178,1.11818323 28.8247786,1.14085161 C28.7889394,1.16352 28.7710663,1.20579097 28.7710663,1.26775742 L28.7710663,2.35351742 C28.7710663,2.41306839 28.7526347,2.45710452 28.7156784,2.48581161 C28.6787221,2.51424 28.638787,2.52864 28.5958731,2.52864 C28.552866,2.52864 28.514048,2.51424 28.479512,2.48581161 C28.4448829,2.45710452 28.4275684,2.41306839 28.4275684,2.35351742 L28.4275684,0.93860129 C28.4275684,0.881372903 28.4448829,0.838451613 28.479512,0.809930323 C28.514048,0.781409032 28.5540762,0.767009032 28.5993173,0.767009032 C28.6874725,0.767009032 28.7448152,0.790885161 28.7710663,0.838637419 C28.7902426,0.812345806 28.8177038,0.793950968 28.8536361,0.783174194 C28.8893822,0.772490323 28.9204739,0.767009032 28.946725,0.767009032 C29.0183103,0.767009032 29.0799351,0.776020645 29.1312271,0.793858065 C29.182519,0.811695484 29.2255261,0.833899355 29.2602482,0.860098065 C29.2948773,0.886389677 29.3218731,0.916211613 29.3409563,0.949656774 C29.3600395,0.983194839 29.3743752,1.01533935 29.3838702,1.04636903 C29.3887109,1.07024516 29.3912243,1.08455226 29.3912243,1.08929032 Z" id="Shape"></path>
                    <path d="M31.4106939,2.35184516 C31.4106939,2.40210581 31.3944965,2.44279742 31.3622877,2.47364129 C31.330079,2.50467097 31.2888406,2.52018581 31.2386657,2.52018581 C31.0812525,2.52018581 30.9607024,2.47837935 30.8772017,2.39495226 C30.7936079,2.31161806 30.7519041,2.19112258 30.7519041,2.03374452 L30.7519041,0.191287742 C30.7519041,0.141305806 30.7681016,0.100056774 30.8001241,0.0679122581 C30.832519,0.0357677419 30.873385,0.0196025806 30.9235599,0.0196025806 C30.9712214,0.0196025806 31.0119013,0.0357677419 31.0452271,0.0679122581 C31.078646,0.100056774 31.095402,0.140098065 31.095402,0.187850323 L31.095402,2.03374452 C31.095402,2.07406452 31.1089929,2.10936774 31.1364542,2.13909677 C31.1639154,2.16891871 31.198079,2.18378323 31.2384795,2.18378323 C31.2865134,2.18378323 31.3270071,2.19939097 31.360519,2.23042065 C31.3939379,2.26126452 31.4106939,2.30204903 31.4106939,2.35184516 Z" id="Shape"></path>
                    <path d="M32.0355994,0.480030968 C32.0199605,0.546828387 31.9997602,0.604335484 31.9745331,0.653202581 C31.9493992,0.701976774 31.9201693,0.740531613 31.8867504,0.769052903 C31.8535176,0.79776 31.8174922,0.81188129 31.7791396,0.81188129 C31.7338984,0.81188129 31.6938702,0.798317419 31.6591481,0.770910968 C31.6246121,0.743504516 31.6071114,0.706157419 31.6071114,0.658498065 C31.6071114,0.62756129 31.6180028,0.593187097 31.6395063,0.555096774 C31.6536559,0.531220645 31.6656643,0.510967742 31.6753456,0.494430968 C31.6848406,0.477708387 31.6931255,0.46052129 31.7004795,0.442498065 C31.7075543,0.424753548 31.7123018,0.403292903 31.7148152,0.378487742 C31.7171425,0.353310968 31.7182595,0.321909677 31.7182595,0.283726452 L31.7182595,0.183948387 C31.7182595,0.12932129 31.7373427,0.0881651613 31.7756953,0.0607587097 C31.814048,0.0333522581 31.8535176,0.0197883871 31.8939182,0.0197883871 C31.9347842,0.0197883871 31.9724852,0.0340954839 32.006835,0.0626167742 C32.0417433,0.0911380645 32.0590578,0.132851613 32.0590578,0.18747871 L32.0590578,0.265981935 C32.0588717,0.341976774 32.0510522,0.413326452 32.0355994,0.480030968 Z" id="Shape"></path>
                    <path d="M33.6971425,2.36420129 C33.6971425,2.4048929 33.6833653,2.44224 33.6559041,2.4768 C33.6284429,2.51136 33.5884147,2.52864 33.5359126,2.52864 C33.4760564,2.52864 33.4228096,2.51498323 33.3762652,2.48757677 C33.3295346,2.46017032 33.2931368,2.43109161 33.2667927,2.39996903 C33.1616953,2.48590452 33.0407729,2.5287329 32.9043977,2.5287329 L32.872189,2.5287329 C32.797811,2.5287329 32.7256671,2.51860645 32.6551058,2.49835355 C32.5845444,2.47810065 32.5216164,2.44604903 32.466787,2.40192 C32.4116784,2.35779097 32.3675543,2.30260645 32.3338561,2.23590194 C32.3006234,2.16910452 32.2838674,2.08948645 32.2838674,1.99658323 L32.2838674,1.97883871 C32.2838674,1.85258323 32.3149591,1.75494194 32.3773286,1.68600774 C32.439512,1.61679484 32.5142623,1.5637471 32.6016728,1.52686452 C32.6889901,1.49007484 32.7794725,1.46434065 32.8727475,1.45012645 C32.9662087,1.43600516 33.0451481,1.42141935 33.1098449,1.40729806 C33.1312553,1.40256 33.144567,1.39308387 33.1493145,1.37859097 C33.1540621,1.36446968 33.1565755,1.35118452 33.1565755,1.3392929 C33.1565755,1.26794323 33.1338618,1.21145806 33.0884344,1.16965161 C33.0430071,1.12803097 32.9882708,1.10712774 32.923574,1.10712774 L32.8984401,1.10712774 C32.846031,1.10712774 32.799859,1.11725419 32.7604824,1.1375071 C32.7211989,1.15794581 32.6893625,1.19417806 32.6655317,1.24657548 C32.6511961,1.28243613 32.6296925,1.30872774 32.6012073,1.32526452 C32.5724429,1.3421729 32.5437715,1.35034839 32.5150071,1.35034839 C32.4697659,1.35034839 32.4284344,1.33436903 32.391385,1.30203871 C32.3545219,1.26989419 32.3357179,1.22994581 32.3357179,1.18228645 C32.3357179,1.15367226 32.3406516,1.12858839 32.3502398,1.10712774 C32.3788181,1.04274581 32.4145642,0.988490323 32.4576643,0.94436129 C32.5007645,0.900232258 32.5465642,0.865021935 32.595622,0.838730323 C32.6446798,0.81243871 32.6952271,0.794043871 32.7480085,0.783267097 C32.8005106,0.772583226 32.8507786,0.767101935 32.898347,0.767101935 L32.923481,0.767101935 C32.9951594,0.767101935 33.0656276,0.779550968 33.1348858,0.804727742 C33.2041439,0.829625806 33.2655825,0.865393548 33.3192017,0.911752258 C33.3728209,0.958203871 33.4162934,1.01478194 33.4497123,1.08157935 C33.4831312,1.14828387 33.4998872,1.22325677 33.4998872,1.30659097 L33.4998872,2.09626839 C33.4998872,2.1224671 33.5027729,2.14346323 33.5088237,2.15888516 C33.5148745,2.1743071 33.5307927,2.18573419 33.5572299,2.19279484 C33.6048914,2.20468645 33.6403583,2.22670452 33.6630719,2.25894194 C33.6858787,2.29099355 33.6971425,2.32611097 33.6971425,2.36420129 Z M33.1566685,1.71750194 C33.0941128,1.73422452 33.0305331,1.74713806 32.9657433,1.7567071 C32.9008604,1.76618323 32.8424937,1.77928258 32.7908293,1.79581935 C32.739165,1.81254194 32.6971819,1.83493161 32.664787,1.86354581 C32.6322059,1.8922529 32.6161016,1.93359484 32.6161016,1.98822194 C32.6161016,2.0477729 32.6382567,2.09636129 32.6828463,2.13426581 C32.7270635,2.17235613 32.7902708,2.19140129 32.8719097,2.19140129 L32.9044908,2.19140129 C32.9739351,2.19140129 33.0334189,2.16706065 33.0826629,2.11828645 C33.1319069,2.06969806 33.1566685,2.01089032 33.1566685,1.94195613 L33.1566685,1.71750194 L33.1566685,1.71750194 Z" id="Shape"></path>
                    <path d="M35.167481,2.48748387 C35.1316417,2.51489032 35.0923583,2.5285471 35.0494443,2.5285471 C35.0160254,2.5285471 34.9845614,2.52306581 34.9544937,2.51238194 C34.9247052,2.50188387 34.8990127,2.47717161 34.8776023,2.43908129 C34.8274274,2.48683355 34.7825585,2.51368258 34.7430889,2.51953548 C34.7036192,2.52548129 34.664708,2.5285471 34.6265416,2.5285471 L34.5941467,2.5285471 C34.5056192,2.5285471 34.4253766,2.51368258 34.3537913,2.48395355 C34.2820197,2.45422452 34.2198364,2.41297548 34.167055,2.36076387 C34.1145529,2.30827355 34.0739661,2.2463071 34.0452017,2.17495742 C34.0162511,2.10332903 34.0021016,2.02594065 34.0021016,1.94260645 L34.0021016,0.938508387 C34.0021016,0.88128 34.0196953,0.83835871 34.0557207,0.809837419 C34.0913738,0.781316129 34.1308434,0.766916129 34.1737574,0.766916129 C34.2145303,0.766916129 34.2532553,0.781316129 34.2901185,0.809837419 C34.3269817,0.83835871 34.3455994,0.88128 34.3455994,0.938322581 L34.3455994,1.94158452 C34.3455994,2.01051871 34.3694302,2.06951226 34.4175571,2.11810065 C34.4654048,2.16687484 34.5241439,2.19140129 34.5935882,2.19140129 L34.6259831,2.19140129 C34.6956135,2.19140129 34.7549111,2.16687484 34.803969,2.11810065 C34.8530268,2.06951226 34.8776023,2.01051871 34.8776023,1.94158452 L34.8776023,0.938322581 C34.8776023,0.88128 34.8953822,0.83835871 34.9312214,0.809837419 C34.9670606,0.781316129 35.0065303,0.766916129 35.0494443,0.766916129 C35.0923583,0.766916129 35.1316417,0.781316129 35.167481,0.809837419 C35.203134,0.83835871 35.2211001,0.88128 35.2211001,0.938508387 L35.2211001,2.36076387 C35.2211001,2.41771355 35.203134,2.46007742 35.167481,2.48748387 Z" id="Shape"></path>
                    <path d="M36.4430776,2.35156645 C36.4430776,2.39458065 36.4287419,2.43341419 36.4001636,2.46816 C36.3713992,2.50299871 36.3284852,2.52018581 36.2712355,2.52018581 C36.2043047,2.52018581 36.1412835,2.50773677 36.0814274,2.48256 C36.0217574,2.45766194 35.97,2.42300903 35.9257828,2.37906581 C35.8815656,2.33475097 35.8468434,2.28300387 35.8219887,2.2234529 C35.7968547,2.16371613 35.7843808,2.10054194 35.7843808,2.03383742 L35.7843808,1.11827613 L35.726945,1.11827613 C35.6696953,1.11827613 35.6267814,1.10034581 35.5980169,1.06457806 C35.5692525,1.02890323 35.5549168,0.989419355 35.5549168,0.946498065 C35.5549168,0.905899355 35.5692525,0.867809032 35.5980169,0.83204129 C35.6267814,0.796273548 35.6696953,0.778343226 35.726945,0.778343226 L35.7843808,0.778343226 L35.7843808,0.191473548 C35.7843808,0.134338065 35.802347,0.0915096774 35.838,0.0626167742 C35.8738392,0.0340954839 35.9120056,0.0197883871 35.9524993,0.0197883871 C35.9954133,0.0197883871 36.0354415,0.0340954839 36.0723047,0.0626167742 C36.1091678,0.0915096774 36.1277856,0.134245161 36.1277856,0.191473548 L36.1277856,0.778343226 L36.2536417,0.778343226 C36.3110776,0.778343226 36.3541777,0.796180645 36.3831283,0.83204129 C36.4118928,0.867901935 36.4262285,0.905992258 36.4262285,0.946498065 C36.4262285,0.989419355 36.4118928,1.02890323 36.3831283,1.06457806 C36.3541777,1.10034581 36.3111707,1.11827613 36.2536417,1.11827613 L36.1277856,1.11827613 L36.1277856,2.03300129 C36.1277856,2.06170839 36.1409111,2.09376 36.1672553,2.12952774 C36.1934133,2.16529548 36.2281354,2.1831329 36.2710494,2.1831329 C36.328299,2.1831329 36.371213,2.20097032 36.4001636,2.23683097 C36.4287419,2.27269161 36.4430776,2.31087484 36.4430776,2.35156645 Z" id="Shape"></path>
                    <path d="M37.7398054,1.08929032 C37.7398054,1.13713548 37.7194189,1.17346065 37.6791114,1.19854452 C37.6382454,1.22372129 37.5978449,1.23607742 37.5570719,1.23607742 C37.5189055,1.23607742 37.4925614,1.22948129 37.4781326,1.21647484 C37.4637969,1.20300387 37.4519746,1.18832516 37.4422934,1.17150968 C37.4327983,1.1547871 37.4190212,1.13992258 37.4012412,1.12663742 C37.383275,1.11363097 37.3503216,1.10694194 37.3026601,1.10694194 C37.2524852,1.10694194 37.209385,1.11818323 37.1735458,1.14085161 C37.1377066,1.16352 37.1197405,1.20579097 37.1197405,1.26775742 L37.1197405,2.35351742 C37.1197405,2.41306839 37.101402,2.45710452 37.0642595,2.48581161 C37.0273963,2.51424 36.9873681,2.52864 36.9444542,2.52864 C36.9015402,2.52864 36.8626291,2.51424 36.8282793,2.48581161 C36.7935571,2.45710452 36.7762426,2.41306839 36.7762426,2.35351742 L36.7762426,0.93860129 C36.7762426,0.881372903 36.7935571,0.838451613 36.8282793,0.809930323 C36.8626291,0.781409032 36.9026573,0.767009032 36.9480846,0.767009032 C37.0362398,0.767009032 37.0935825,0.790885161 37.1197405,0.838637419 C37.1388237,0.812345806 37.1664711,0.793950968 37.2021241,0.783174194 C37.2379633,0.772490323 37.269055,0.767009032 37.2953992,0.767009032 C37.3670776,0.767009032 37.4287024,0.776020645 37.4799013,0.793858065 C37.5313794,0.811695484 37.5742934,0.833899355 37.6088293,0.860098065 C37.6435515,0.886389677 37.6704542,0.916211613 37.6895374,0.949656774 C37.7086206,0.983194839 37.7229563,1.01533935 37.7326375,1.04636903 C37.7374781,1.07024516 37.7398054,1.08455226 37.7398054,1.08929032 Z" id="Shape"></path>
                    <path d="M39.1679746,1.77157161 C39.1343695,1.80622452 39.0935966,1.82341161 39.0457489,1.82341161 L38.3424626,1.82341161 L38.3424626,1.95198968 C38.3424626,2.02110968 38.3668519,2.07843097 38.4159097,2.12367484 C38.4649676,2.16891871 38.524079,2.19149419 38.5933371,2.19149419 L38.6221016,2.19149419 C38.6840987,2.19149419 38.7295261,2.17820903 38.7582906,2.15210323 C38.787055,2.12581161 38.8113512,2.09766194 38.8315515,2.06784 C38.8521241,2.03801806 38.872976,2.00986839 38.8944795,1.98357677 C38.91589,1.95747097 38.9507052,1.94418581 38.9982736,1.94418581 C39.0435148,1.94418581 39.0848463,1.95793548 39.1218956,1.98552774 C39.158945,2.01293419 39.1775628,2.0506529 39.1775628,2.09840516 C39.1775628,2.11512774 39.1716051,2.14141935 39.1595966,2.17728 C39.102347,2.29192258 39.0312271,2.37934452 38.94633,2.43898839 C38.8616192,2.49881806 38.7534499,2.52864 38.6221946,2.52864 L38.5934302,2.52864 C38.5121636,2.52864 38.435086,2.51424 38.3623836,2.48581161 C38.2896812,2.45710452 38.2261946,2.41659871 38.1725755,2.36420129 C38.1189563,2.31189677 38.076787,2.25039484 38.0455092,2.1802529 C38.0146037,2.11001806 37.9991509,2.03439484 37.9991509,1.95347613 L37.9991509,1.34579613 C37.9991509,1.26506323 38.0151622,1.1893471 38.0475571,1.11901935 C38.079952,1.04878452 38.122866,0.987468387 38.1766714,0.935070968 C38.2304767,0.882673548 38.2932186,0.841610323 38.3648039,0.811695484 C38.4365755,0.782152258 38.5131876,0.767194839 38.5944542,0.767194839 L38.6230324,0.767194839 C38.7066262,0.767194839 38.7844485,0.782152258 38.8561269,0.811695484 C38.9278054,0.841610323 38.9904542,0.882023226 39.0442595,0.93312 C39.0980649,0.984309677 39.1406065,1.04618323 39.171512,1.11874065 C39.2024175,1.19129806 39.2180564,1.27045161 39.2180564,1.35610839 L39.2180564,1.65228387 C39.2179633,1.69734194 39.2013935,1.73710452 39.1679746,1.77157161 Z M38.8744654,1.35620129 C38.8744654,1.28271484 38.8493315,1.22279226 38.7989704,1.17634065 C38.7487955,1.13007484 38.6923836,1.10684903 38.6301072,1.10684903 L38.5977123,1.10684903 C38.528268,1.10684903 38.4682257,1.12933161 38.4178646,1.17466839 C38.3675035,1.21944774 38.3423695,1.27667613 38.3423695,1.34542452 L38.3423695,1.50586839 L38.8743724,1.50586839 L38.8743724,1.35620129 L38.8744654,1.35620129 Z" id="Shape"></path>
                </g>
                <path d="M18.3859803,8.79394065 L18.2938223,8.79394065 C18.1505585,8.79394065 18.0172553,8.77071484 17.8945642,8.72259097 C17.7715938,8.67558194 17.6642623,8.60711226 17.5720113,8.51857548 C17.4796671,8.43013161 17.4080818,8.32654452 17.3566968,8.20744258 C17.3056841,8.08806194 17.2801777,7.95706839 17.2801777,7.81446194 L17.2801777,3.89756903 C17.2801777,3.61207742 17.3774556,3.37889032 17.5721044,3.19865806 C17.7663808,3.01851871 18.0070155,2.92821677 18.2938223,2.92821677 L18.3859803,2.92821677 C18.6520282,2.92821677 18.873952,3.01145806 19.0517518,3.17794065 C19.2294584,3.34553806 19.3420959,3.55447742 19.3895712,3.8072671 C19.4231763,3.93621677 19.4782849,4.03868903 19.5533145,4.11310452 C19.6286234,4.18826323 19.7341862,4.22616774 19.8705614,4.22616774 C20.0347701,4.22616774 20.1587645,4.1759071 20.2446855,4.07724387 C20.3294894,3.97885935 20.3722172,3.85074581 20.3722172,3.69438968 L20.3722172,3.6634529 C20.3722172,3.41828129 20.316457,3.18964645 20.2036333,2.97857032 C20.0908096,2.76675097 19.940378,2.58624 19.7526178,2.43564387 C19.5650437,2.28606968 19.3514048,2.16798968 19.1128181,2.0823329 C18.8737659,1.99732645 18.6318279,1.95449806 18.3857941,1.95449806 L18.2936361,1.95449806 C18.0208858,1.95449806 17.7611678,2.00401548 17.5154133,2.10267871 C17.2693794,2.20106323 17.0576023,2.33976774 16.8798956,2.51637677 C16.7016305,2.69335742 16.5594838,2.89988129 16.4535487,3.13446194 C16.3476135,3.36941419 16.2948322,3.62684903 16.2948322,3.90602323 L16.2948322,7.80572903 C16.2948322,8.08490323 16.3476135,8.34382452 16.4535487,8.58184258 C16.5594838,8.82023226 16.7016305,9.02684903 16.8798956,9.20067097 C17.0576023,9.37421419 17.2694725,9.51041032 17.5154133,9.60907355 C17.7611678,9.70745806 18.0208858,9.75725419 18.2936361,9.75725419 L18.3857941,9.75725419 C18.6318279,9.75725419 18.8737659,9.71619097 19.1128181,9.63397161 C19.3514048,9.55212387 19.5650437,9.43627355 19.7526178,9.28586323 C19.940378,9.13554581 20.0908096,8.95577806 20.2036333,8.74823226 C20.3163639,8.54031484 20.3722172,8.31028645 20.3722172,8.05777548 L20.3722172,8.02758194 C20.3722172,7.8709471 20.3294894,7.74311226 20.2446855,7.64407742 C20.1587645,7.54532129 20.0347701,7.49589677 19.8705614,7.49589677 C19.7341862,7.49589677 19.6286234,7.53380129 19.5533145,7.60858839 C19.4781918,7.68300387 19.4231763,7.78556903 19.3895712,7.91516903 C19.3420959,8.16693677 19.2294584,8.37661935 19.0517518,8.54347355 C18.873952,8.71069935 18.6521213,8.79394065 18.3859803,8.79394065" id="Shape" fill="#000000"></path>
                <polygon id="Shape" fill="#FFFFFF" points="23.7115007 9.64251871 23.7115007 9.64251871 23.7115007 4.92619355 20.7820874 4.92619355 20.7820874 6.27198968 22.1576615 6.27198968 22.1576615 9.64251871"></polygon>
                <path d="M25.1885416,5.14925419 L25.1885416,9.26914065 C25.1885416,9.43562323 25.2416953,9.55779097 25.3472581,9.63722323 C25.4535656,9.71656258 25.5647137,9.75660387 25.681354,9.75660387 C25.8043244,9.75660387 25.9167757,9.71656258 26.019732,9.63750194 C26.1225952,9.55816258 26.1738872,9.43590194 26.1738872,9.26951226 L26.1738872,6.36294194 C26.1738872,6.16282839 26.2450071,5.99170065 26.3885501,5.85058065 C26.5320931,5.70908903 26.7020733,5.63848258 26.8995148,5.63848258 L26.9920451,5.63848258 C27.1894866,5.63848258 27.3603047,5.70908903 27.5030099,5.85058065 C27.6462736,5.99179355 27.7176728,6.16282839 27.7176728,6.36294194 L27.7176728,9.25056 C27.7176728,9.42298839 27.7690578,9.55082323 27.8718279,9.63341419 C27.9744118,9.71665548 28.0875148,9.75771871 28.2110437,9.75771871 C28.3268463,9.75771871 28.4383667,9.71665548 28.5443018,9.63341419 C28.650237,9.55082323 28.7030183,9.42298839 28.7030183,9.25056 L28.7030183,6.36294194 C28.7030183,6.16282839 28.7747898,5.99170065 28.9180536,5.85058065 C29.0613173,5.70908903 29.2315769,5.63848258 29.4293907,5.63848258 L29.5215487,5.63848258 C29.7189901,5.63848258 29.889622,5.70908903 30.032141,5.85058065 C30.1756841,5.99179355 30.2473625,6.16282839 30.2473625,6.36294194 L30.2473625,9.27127742 C30.2473625,9.43664516 30.2985614,9.55964903 30.4015176,9.63861677 C30.5042877,9.71795613 30.6138533,9.75762581 30.7300282,9.75762581 C30.8531848,9.75762581 30.9678702,9.71795613 31.073433,9.63861677 C31.1797405,9.55955613 31.2328011,9.43664516 31.2328011,9.27090581 L31.2328011,6.32958968 C31.2328011,5.8119329 31.0929817,5.4027871 30.8129704,5.10215226 C30.5326798,4.80188903 30.1025162,4.65157161 29.5222003,4.65157161 L29.4303216,4.65157161 C29.1917348,4.65157161 28.9675769,4.69681548 28.7594302,4.7864671 C28.5516559,4.87667613 28.3682708,5.00070194 28.211323,5.15947355 C28.0543752,5.00070194 27.8788096,4.87676903 27.6841608,4.7864671 C27.4896051,4.69690839 27.2593963,4.65157161 26.9926968,4.65157161 L26.9009111,4.65157161 C26.7641636,4.65157161 26.6281608,4.67619097 26.4915063,4.72459355 C26.3544795,4.77299613 26.2489168,4.83877161 26.1738872,4.92164129 C26.1124485,4.81108645 26.043842,4.73871484 25.9682539,4.70359742 C25.8935035,4.66913032 25.7974358,4.65157161 25.6814471,4.65157161 C25.557732,4.65157161 25.4448152,4.69337806 25.3424175,4.77624774 C25.2398336,4.85911742 25.1885416,4.98351484 25.1885416,5.14925419" id="Shape" fill="#000000"></path>
                <path d="M10.5981664,8.79394065 C10.3662821,8.79394065 10.1874584,8.73987097 10.0615092,8.63098839 C9.93518759,8.52210581 9.87216643,8.38302968 9.87216643,8.21273806 C9.87216643,8.05647484 9.91824542,7.93746581 10.0102172,7.85598968 C10.1019097,7.77414194 10.2215289,7.70948129 10.3679577,7.66210065 C10.5143865,7.61434839 10.6797123,7.57709419 10.8637489,7.54968774 C11.0477856,7.5226529 11.228378,7.48512 11.4058984,7.43736774 L11.4058984,8.08007226 C11.4058984,8.27777032 11.3360818,8.44601806 11.1961693,8.58546581 C11.0566291,8.72454194 10.8880451,8.79403355 10.689952,8.79403355 L10.5981664,8.79403355 L10.5981664,8.79394065 Z M9.98145275,9.6709471 C10.1826178,9.72817548 10.3890889,9.75771871 10.6005867,9.75771871 L10.6928378,9.75771871 C11.08167,9.75771871 11.4258195,9.63480774 11.726031,9.38963613 C11.8013399,9.47780129 11.905134,9.56178581 12.038158,9.63973161 C12.1713681,9.71804903 12.3231961,9.75771871 12.493921,9.75771871 C12.6437941,9.75771871 12.7585726,9.70782968 12.8370465,9.60953806 C12.9155205,9.51087484 12.9545247,9.40338581 12.9545247,9.2879071 C12.9545247,9.17828129 12.9225021,9.07822452 12.857433,8.98587871 C12.7926432,8.89390452 12.6916417,8.83100903 12.5554528,8.79691355 C12.4801439,8.77619613 12.4340649,8.74386581 12.4168434,8.69964387 C12.4002736,8.65532903 12.3911509,8.59568516 12.3911509,8.52089806 L12.3911509,6.26186323 C12.3911509,6.02375226 12.3433032,5.80914581 12.2479803,5.61850839 C12.1522849,5.42703484 12.0269873,5.26556903 11.8733907,5.13308903 C11.7192355,4.99995871 11.5431114,4.89776516 11.3450183,4.82576516 C11.1469252,4.7547871 10.9449224,4.71864774 10.7405924,4.71864774 L10.6686347,4.71864774 C10.5324457,4.71864774 10.3891819,4.73416258 10.2385642,4.76537806 C10.0886911,4.7952 9.94319323,4.84899097 9.80365303,4.92377806 C9.66392666,4.99856516 9.53201975,5.09973677 9.40914245,5.22617806 C9.28635825,5.35224774 9.18396051,5.50748903 9.10194922,5.69190194 C9.07486037,5.75331097 9.0611763,5.82503226 9.0611763,5.9067871 C9.0611763,6.04270452 9.11358533,6.15716129 9.21989281,6.24885677 C9.32545557,6.34083097 9.44330606,6.38718968 9.57353738,6.38718968 C9.65480395,6.38718968 9.73700141,6.36294194 9.81882652,6.31528258 C9.9008378,6.26780903 9.96236953,6.19274323 10.0032355,6.09045677 C10.0716559,5.94051097 10.161952,5.83655226 10.2745896,5.77895226 C10.387134,5.72135226 10.5186685,5.69180903 10.6687278,5.69180903 L10.7406855,5.69180903 C10.9249083,5.69180903 11.0818561,5.75182452 11.2115289,5.87055484 C11.3410155,5.98993548 11.4060846,6.15186581 11.4060846,6.35597419 C11.4060846,6.38997677 11.3991961,6.42723097 11.3858843,6.46829419 C11.3722003,6.50898581 11.3344993,6.53602065 11.2732468,6.55014194 C11.0895825,6.59083355 10.8640282,6.63198968 10.5986319,6.67268129 C10.3327701,6.7133729 10.0756587,6.78648774 9.82692525,6.89249032 C9.57847109,6.99747097 9.36492525,7.14918194 9.1882426,7.34660129 C9.01053597,7.54429935 8.92219464,7.82347355 8.92219464,8.18421677 L8.92219464,8.23512774 C8.92219464,8.50101677 8.97041467,8.72965161 9.06573766,8.91963871 C9.16087447,9.10999742 9.28738223,9.26867613 9.44433004,9.39483871 C9.60118477,9.52090839 9.78000846,9.61260387 9.98145275,9.6709471 L9.98145275,9.6709471 Z" id="Shape" fill="#000000"></path>
                <path d="M22.8490324,2.15981419 C22.3139577,2.15981419 21.8804429,2.59255742 21.8804429,3.12628645 C21.8804429,3.66048 22.3139577,4.09313032 22.8490324,4.09313032 C23.383921,4.09313032 23.8179944,3.66048 23.8179944,3.12628645 C23.8179013,2.59255742 23.383921,2.15981419 22.8490324,2.15981419" id="Shape" fill="#000000"></path>
                <path d="M34.0730353,8.79394065 C33.8407786,8.79394065 33.6619549,8.73987097 33.536378,8.63098839 C33.4100564,8.52210581 33.3470353,8.38302968 33.3470353,8.21273806 C33.3470353,8.05647484 33.3927419,7.93746581 33.4849929,7.85598968 C33.5771509,7.77414194 33.6961185,7.70948129 33.8430127,7.66210065 C33.9892553,7.61434839 34.1548604,7.57709419 34.3385247,7.54968774 C34.5229337,7.5226529 34.703433,7.48512 34.8809535,7.43736774 L34.8809535,8.08007226 C34.8809535,8.27777032 34.8109506,8.44601806 34.6708519,8.58546581 C34.5311255,8.72454194 34.3625416,8.79403355 34.1648209,8.79403355 L34.0730353,8.79403355 L34.0730353,8.79394065 Z M33.4559492,9.6709471 C33.6573935,9.72817548 33.8635853,9.75771871 34.0750832,9.75771871 L34.1672412,9.75771871 C34.5560733,9.75771871 34.9008745,9.63480774 35.2008999,9.38963613 C35.2763018,9.47780129 35.3802821,9.56178581 35.5127475,9.63973161 C35.646237,9.71804903 35.7976925,9.75771871 35.9686968,9.75771871 C36.1184767,9.75771871 36.2328829,9.70782968 36.3114499,9.60953806 C36.3899238,9.51087484 36.4293004,9.40338581 36.4293004,9.2879071 C36.4293004,9.17828129 36.3969055,9.07822452 36.3322087,8.98587871 C36.2671396,8.89390452 36.1663244,8.83100903 36.0299492,8.79691355 C35.9547334,8.77619613 35.9088406,8.74386581 35.8918984,8.69964387 C35.8747701,8.65532903 35.8663921,8.59568516 35.8663921,8.52089806 L35.8663921,6.26186323 C35.8663921,6.02375226 35.8177997,5.80914581 35.7224767,5.61850839 C35.6266883,5.42703484 35.5019492,5.26556903 35.347701,5.13308903 C35.1943836,4.99995871 35.0177941,4.89776516 34.8201664,4.82576516 C34.6214217,4.7547871 34.4204429,4.71864774 34.2149958,4.71864774 L34.1435035,4.71864774 C34.0073145,4.71864774 33.8633992,4.73416258 33.7132468,4.76537806 C33.5631876,4.7952 33.4185275,4.84899097 33.2781495,4.92377806 C33.1385162,4.99856516 33.0068886,5.09973677 32.8843836,5.22617806 C32.7614133,5.35224774 32.658457,5.50748903 32.5768181,5.69190194 C32.5497292,5.75331097 32.5356728,5.82503226 32.5356728,5.9067871 C32.5356728,6.04270452 32.5891989,6.15716129 32.6946685,6.24885677 C32.8000451,6.34083097 32.918268,6.38718968 33.0476615,6.38718968 C33.1297659,6.38718968 33.211591,6.36294194 33.2936023,6.31528258 C33.3754274,6.26780903 33.436866,6.19274323 33.4781975,6.09045677 C33.5466178,5.94051097 33.6367278,5.83655226 33.7493653,5.77895226 C33.8616305,5.72135226 33.9936305,5.69180903 34.1435035,5.69180903 L34.2149958,5.69180903 C34.3996841,5.69180903 34.5566319,5.75182452 34.6865839,5.87055484 C34.8160705,5.98993548 34.8811396,6.15186581 34.8811396,6.35597419 C34.8811396,6.38997677 34.8742511,6.42723097 34.860567,6.46829419 C34.846976,6.50898581 34.8090889,6.53602065 34.7483949,6.55014194 C34.564079,6.59083355 34.3391763,6.63198968 34.0735007,6.67268129 C33.8076389,6.7133729 33.5506206,6.78648774 33.3015148,6.89249032 C33.0530606,6.99747097 32.8399803,7.14918194 32.6632045,7.34660129 C32.4854979,7.54429935 32.397622,7.82347355 32.397622,8.18421677 L32.397622,8.23512774 C32.397622,8.50101677 32.4450042,8.72965161 32.5403272,8.91963871 C32.6360226,9.10999742 32.7617856,9.26867613 32.919292,9.39483871 C33.0760536,9.52090839 33.2549704,9.61260387 33.4559492,9.6709471 L33.4559492,9.6709471 Z" id="Shape" fill="#000000"></path>
                <path d="M41.2092271,8.9856929 C41.144158,8.89371871 41.0431566,8.83082323 40.9068745,8.79672774 C40.8317518,8.77601032 40.785859,8.74368 40.7687306,8.69945806 C40.7517884,8.65514323 40.7431312,8.59549935 40.7431312,8.52071226 L40.7431312,6.26186323 C40.7431312,6.26149161 40.7431312,6.26084129 40.7431312,6.26009806 L40.7431312,0.490250323 C40.7431312,0.326926452 40.6914669,0.204387097 40.5891622,0.122260645 C40.4860197,0.0410632258 40.3733822,0 40.2503188,0 C40.1270691,0 40.0145247,0.0410632258 39.9117546,0.122167742 C39.8092638,0.204294194 39.7572271,0.326554839 39.7572271,0.490157419 L39.7572271,4.9851871 C39.6481269,4.88931097 39.520409,4.82112 39.373701,4.78005677 C39.2262482,4.73936516 39.1121213,4.71855484 39.0304824,4.71855484 L38.9584316,4.71855484 C38.7269196,4.71855484 38.506299,4.76286968 38.2982454,4.85168516 C38.2654781,4.86534194 38.2380169,4.88503742 38.2067391,4.90045935 C38.1895176,4.90854194 38.1722031,4.91448774 38.1550748,4.92368516 C38.1423216,4.93037419 38.1303131,4.94124387 38.1178392,4.9479329 C37.9854669,5.02206968 37.8616587,5.10558968 37.7552581,5.20926968 C37.6014753,5.35884387 37.4804598,5.53656774 37.3918392,5.74067613 C37.3031255,5.94506323 37.258536,6.16663742 37.258536,6.40512 L37.258536,8.08100129 C37.258536,8.16600774 37.2665416,8.24887742 37.278457,8.32961032 C37.2991227,8.47045161 37.3354274,8.60599742 37.3918392,8.73522581 C37.4804598,8.9396129 37.6014753,9.11873032 37.7552581,9.27183484 C37.9090409,9.42493935 38.0896333,9.5444129 38.2982454,9.62969806 C38.4398336,9.68766968 38.5871932,9.72418065 38.7395797,9.74276129 C38.8056728,9.74907871 38.871859,9.75641806 38.9393484,9.75641806 C38.9437236,9.75641806 38.9478195,9.75744 38.9521016,9.75744 L39.0442595,9.75744 C39.0486347,9.75744 39.0522652,9.75641806 39.0569196,9.75641806 C39.1012299,9.75641806 39.143213,9.74935742 39.1857546,9.74592 C39.4053512,9.72798968 39.6106121,9.67141161 39.800141,9.57070452 C39.8963018,9.52007226 39.98967,9.46182194 40.0779182,9.38945032 C40.153134,9.47761548 40.2565557,9.5616 40.3897659,9.63954581 C40.4252327,9.66063484 40.4617236,9.67819355 40.4994245,9.69361548 C40.604708,9.73579355 40.719952,9.7575329 40.8457151,9.7575329 C40.9955882,9.7575329 41.1099944,9.70764387 41.1889337,9.60935226 C41.2673145,9.51068903 41.3064118,9.4032 41.3064118,9.28772129 C41.3062257,9.17818839 41.2735515,9.07813161 41.2092271,8.9856929 Z M38.9597348,8.79394065 C38.7620141,8.79394065 38.593244,8.72435613 38.4530522,8.5853729 C38.3137913,8.44592516 38.2436953,8.27739871 38.2436953,8.07997935 L38.2436953,6.40651355 C38.2436953,6.34612645 38.2525388,6.28852645 38.2660367,6.23408516 C38.2953597,6.10940903 38.3568914,5.99801806 38.4530522,5.90149161 C38.5933371,5.76167226 38.7620141,5.69180903 38.9597348,5.69180903 L39.0921072,5.69180903 C39.2764231,5.69180903 39.433464,5.75182452 39.5630437,5.87055484 C39.6929027,5.98993548 39.7579718,6.15186581 39.7579718,6.35597419 C39.7579718,6.36126968 39.7549929,6.36823742 39.7546206,6.37344 C39.7549929,6.38468129 39.7572271,6.39490065 39.7572271,6.40642065 L39.7572271,8.07988645 C39.7572271,8.26355613 39.6875966,8.42892387 39.5482426,8.57506065 C39.4081439,8.72119742 39.2399323,8.79384774 39.0418392,8.79384774 L38.9597348,8.79384774 L38.9597348,8.79394065 Z" id="Shape" fill="#000000"></path>
                <path d="M43.0230635,6.83749161 L43.0230635,6.37706323 C43.0230635,6.17964387 43.0942764,6.01604129 43.2367955,5.88606968 C43.3795007,5.75684129 43.549481,5.69190194 43.746457,5.69190194 L43.8378702,5.69190194 C44.0152045,5.69190194 44.1747588,5.75860645 44.3170917,5.89136516 C44.4597969,6.02449548 44.531103,6.19655226 44.531103,6.408 L44.531103,6.83758452 L43.0230635,6.83758452 L43.0230635,6.83749161 Z M43.0922285,9.63471484 C43.3006544,9.71656258 43.5209027,9.75762581 43.7532525,9.75762581 L43.8348914,9.75762581 C43.8403836,9.75762581 43.8447588,9.75558194 43.8506234,9.75558194 L65.4881044,9.75558194 C65.6288547,9.75558194 65.7435402,9.71098839 65.8335571,9.62068645 C65.9232017,9.5300129 65.9684429,9.41555613 65.9684429,9.27545806 C65.9684429,9.14195613 65.9232017,9.02861419 65.8335571,8.93515355 C65.7435402,8.84141419 65.6321128,8.79468387 65.4986234,8.79468387 L43.8360085,8.79468387 L43.8347983,8.79394065 L43.7531594,8.79394065 C43.5556248,8.79394065 43.3860169,8.73002323 43.2461044,8.60116645 C43.1061918,8.47193806 43.0363752,8.30861419 43.0363752,8.11193806 L43.0363752,7.74497032 L45.0396474,7.74497032 C45.1760226,7.74497032 45.2922906,7.6954529 45.3874274,7.59678968 C45.4829365,7.49803355 45.5301326,7.38394839 45.5301326,7.25406968 L45.5301326,6.40595613 C45.5301326,6.1604129 45.4857292,5.93428645 45.3970155,5.7253471 C45.3083949,5.5181729 45.1873794,5.34082065 45.033969,5.19403355 C44.8808378,5.04789677 44.7014556,4.93204645 44.4968463,4.84629677 C44.2919577,4.76166194 44.07022,4.71874065 43.8316333,4.71874065 L43.7494358,4.71874065 C43.5176446,4.71874065 43.2994443,4.76156903 43.0945557,4.84629677 C42.8898533,4.93195355 42.7111227,5.04929032 42.5578054,5.19923613 C42.4042087,5.34918194 42.2807729,5.52476903 42.1888942,5.7253471 C42.0969224,5.9269471 42.0512158,6.1429471 42.0512158,6.37474065 L42.0512158,8.11212387 C42.0512158,8.34391742 42.0948745,8.56028903 42.1838674,8.76114581 C42.2736982,8.96237419 42.3948068,9.13731097 42.5487757,9.288 C42.7029309,9.43738839 42.8838956,9.5528671 43.0922285,9.63471484 L43.0922285,9.63471484 Z" id="Shape" fill="#000000"></path>
                <path d="M8.0662426,8.95364129 C7.97054725,8.86510452 7.85530324,8.82013935 7.71855571,8.82013935 C7.60312553,8.82013935 7.50584767,8.77796129 7.42783921,8.69295484 C7.34917913,8.60766968 7.31026798,8.50686968 7.31026798,8.39166968 L7.31026798,3.06664258 L7.30849929,3.06487742 C7.29667701,2.5229729 6.86157969,2.08632774 6.31970945,2.06979097 L6.31812694,2.06821161 L0.469726375,2.06821161 C0.336702398,2.06821161 0.225181946,2.11522065 0.134885755,2.20830968 C0.0448688293,2.30167742 0,2.41520516 0,2.54898581 C0,2.68871226 0.0448688293,2.80391226 0.134978843,2.89384258 C0.225275035,2.9837729 0.339960508,3.02910968 0.480059238,3.02910968 C0.480059238,3.02910968 5.87325529,3.02910968 6.02247673,3.02910968 C6.17169817,3.02910968 6.32473625,3.17691871 6.32473625,3.32872258 C6.32473625,3.48043355 6.32473625,8.39185548 6.32473625,8.39185548 C6.32473625,8.84104258 6.44435543,9.18552774 6.68331453,9.42401032 C6.92255289,9.66212129 7.26726093,9.78085161 7.71790409,9.78085161 C7.86144711,9.78085161 7.97901834,9.73728 8.0711763,9.64846452 C8.16305501,9.56002065 8.20932017,9.44407742 8.20932017,9.30082065 C8.20932017,9.15774968 8.16156559,9.04180645 8.0662426,8.95364129 Z" id="Shape" fill="#000000"></path>
            </g>
        </g>
    </g>
</svg>