<?xml version="1.0" encoding="UTF-8"?>
<svg width="112px" height="39px" viewBox="0 0 112 39" version="1.1" xmlns="http://www.w3.org/2000/svg" xmlns:xlink="http://www.w3.org/1999/xlink">
    <title>place</title>
    <defs>
        <polygon id="path-1" points="6.9277406e-05 0.131830986 9.98770775 0.131830986 9.98770775 26.915493 6.9277406e-05 26.915493"></polygon>
        <polygon id="path-3" points="0.100109155 0.131830986 10.0879542 0.131830986 10.0879542 8.71317676 0.100109155 8.71317676"></polygon>
        <polygon id="path-5" points="0.0999169014 0.204283099 10.0880366 0.204283099 10.0880366 8.78873239 0.0999169014 8.78873239"></polygon>
        <polygon id="path-7" points="0 0 6.72143377 0 6.72143377 27.1618182 0 27.1618182"></polygon>
    </defs>
    <g id="V0" stroke="none" stroke-width="1" fill="none" fill-rule="evenodd">
        <g id="Terrena---page-consultation---Desktop" transform="translate(-149.000000, -27.000000)">
            <g id="header">
                <g id="place" transform="translate(149.000000, 27.000000)">
                    <g>
                        <g id="E" transform="translate(92.556338, 0.000000)">
                            <polygon id="Clip-37" fill="#43BBCD" points="6.5915493 10.7112676 6.5915493 10.7636857 6.5915493 16.4809034 17.909095 16.4809034 17.909095 10.7112676"></polygon>
                            <polygon id="Clip-40" fill="#253186" points="0.0796082474 10.63583 0.0793279367 10.6882481 0.0409253666 27.1040855 0.0409253666 27.1108129 6.54020996 27.1108129 6.54020996 27.1040855 6.54020996 10.6882481 6.54020996 10.63583"></polygon>
                            <polygon id="Clip-7" fill="#43BBCD" points="6.54020996 27.1040855 18.0710722 27.1040855 18.2465467 21.1870062 6.54020996 21.1870062"></polygon>
                            <polygon id="Clip-4" fill="#43BBCD" points="0.147443444 0.227612313 0.109040874 6.14497183 18.2465467 6.14497183 18.2465467 0.227612313"></polygon>
                        </g>
                        <g id="C" transform="translate(69.760563, 0.000000)">
                            <g id="Group-3" transform="translate(0.000000, 0.142817)">
                                <mask id="mask-2" fill="white">
                                    <use xlink:href="#path-1"></use>
                                </mask>
                                <g id="Clip-2"></g>
                                <path d="M9.98770775,21.1423669 C8.8232007,21.1322049 7.94734859,20.6556908 7.47220775,20.0327894 C6.88034155,19.2558106 6.47358803,18.3310711 6.47358803,13.5236345 C6.47358803,8.71317676 6.88034155,7.78871197 7.47220775,7.01145845 C7.94734859,6.39157817 8.8232007,5.91533873 9.98770775,5.90490211 L9.98770775,0.131803521 L9.9874331,0.131803521 C6.91796831,0.131803521 4.58648239,1.16805 2.66339789,3.09278239 C-0.110820423,5.86672606 0.000686619718,9.56595845 0.000686619718,13.5236345 C0.000686619718,17.4815852 -0.110820423,21.180543 2.66339789,23.9544866 C4.58648239,25.879219 6.91796831,26.9157401 9.9874331,26.9157401 L9.98770775,26.9157401 L9.98770775,21.1423669 Z" id="Fill-1" fill="#65B4F2" mask="url(#mask-2)"></path>
                            </g>
                            <path d="M7.66970704,20.4025204 C7.5977493,20.3294641 7.5318338,20.2536613 7.47223521,20.1756613 C7.5318338,20.2536613 7.5977493,20.3294641 7.66970704,20.4025204" id="Fill-4" fill="#253186"></path>
                            <g id="Group-8" transform="translate(9.887324, 0.142817)">
                                <mask id="mask-4" fill="white">
                                    <use xlink:href="#path-3"></use>
                                </mask>
                                <g id="Clip-7"></g>
                                <path d="M0.100383803,5.90490211 L0.100109155,5.90490211 C0.112742958,5.90490211 0.124552817,5.90297958 0.137461268,5.90297958 C2.28383451,5.90297958 3.0970669,7.23419789 3.50354577,8.71317676 L10.0879542,8.71317676 C9.12723592,2.90629648 5.09430634,0.131803521 0.100383803,0.131803521 L0.100383803,5.90490211 Z" id="Fill-6" fill="#253186" mask="url(#mask-4)"></path>
                            </g>
                            <path d="M7.47215282,7.15422042 C7.53175141,7.07649507 7.59794155,7.0009669 7.66962465,6.92845986 C7.5976669,7.0009669 7.53175141,7.07649507 7.47215282,7.15422042" id="Fill-9" fill="#253186"></path>
                            <path d="M7.90263592,20.6106486 C7.88038944,20.5933458 7.86226268,20.5735711 7.84084014,20.555719 C7.86226268,20.5735711 7.88038944,20.5933458 7.90263592,20.6106486" id="Fill-11" fill="#253186"></path>
                            <g id="Group-15" transform="translate(9.887324, 18.269577)">
                                <mask id="mask-6" fill="white">
                                    <use xlink:href="#path-5"></use>
                                </mask>
                                <g id="Clip-14"></g>
                                <path d="M0.137543662,3.01750141 C0.124635211,3.01750141 0.112825352,3.01557887 0.0999169014,3.01557887 L0.100466197,3.01557887 L0.100466197,8.78895211 C5.09411408,8.78867746 9.12731831,6.01445915 10.0880366,0.204283099 L3.50362817,0.204283099 C3.09687465,1.68600845 2.28364225,3.01750141 0.137543662,3.01750141" id="Fill-13" fill="#253186" mask="url(#mask-6)"></path>
                            </g>
                            <path d="M7.84740423,6.77001549 C7.86662958,6.75408592 7.8828338,6.73650845 7.90260845,6.72085352 C7.8828338,6.73650845 7.86662958,6.75408592 7.84740423,6.77001549" id="Fill-16" fill="#253186"></path>
                        </g>
                        <g id="A" transform="translate(43.394366, 0.549296)">
                            <polygon id="Clip-13" fill="#43BBCD" points="17.4640352 26.5631197 24.233831 26.5631197 22.7960493 22.6103873 16.233338 22.6103873"></polygon>
                            <polygon id="Clip-10" fill="#43BBCD" points="8.1515493 22.6103873 1.51440845 22.6103873 0.0766267606 26.5631197 6.84669718 26.5631197"></polygon>
                            <polygon id="Clip-46" fill="#253186" points="3.46797887 17.2404718 1.51440845 22.6103873 22.7960493 22.6103873 20.8427535 17.2404718"></polygon>
                            <polygon id="Clip-16" fill="#43BBCD" points="8.52342254 0.223014085 14.541507 17.2401972 20.8427535 17.2401972 14.6524648 0.223014085"></polygon>
                        </g>
                        <g id="L" transform="translate(23.070423, 0.000000)">
                            <polygon id="Clip-40" fill="#65B4F2" points="0.0392320281 0 0.038947738 0.0865102994 0 27.1790379 0 27.1901408 6.5915493 27.1901408 6.5915493 27.1790379 6.5915493 0.0865102994 6.5915493 0"></polygon>
                            <polygon id="Clip-7" fill="#253186" points="6.5915493 27.1901408 18.1224115 27.1901408 18.297886 21.1478873 6.5915493 21.1478873"></polygon>
                        </g>
                        <g id="P">
                            <path d="M10.8315936,0 L6.72132214,0 L6.72132214,5.98973524 L10.5240697,5.98973524 C12.3675386,5.98973524 13.443314,7.32454459 13.443314,8.73585049 C13.443314,10.1477107 12.3675386,11.4825201 10.5240697,11.4825201 L6.72132214,11.4825201 L6.72132214,17.4722553 L10.8315936,17.4722553 C16.9003065,17.4722553 20.1650269,13.199535 20.1650269,8.73585049 C20.1650269,4.27299746 16.9003065,0 10.8315936,0" id="Fill-1" fill="#253186"></path>
                            <mask id="mask-8" fill="white">
                                <use xlink:href="#path-7"></use>
                            </mask>
                            <use id="Clip-4" fill="#43BBCD" xlink:href="#path-7"></use>
                        </g>
                    </g>
                    <path d="M70.3883428,38.8980048 L70.3883428,37.1640868 C70.4828473,37.3182128 70.6223538,37.4451402 70.8068625,37.5448688 C70.9913711,37.6445974 71.2028811,37.6944617 71.4413922,37.6944617 C71.904914,37.6944617 72.2728063,37.5312694 72.545069,37.2048849 C72.8173318,36.8785003 72.9534632,36.4659864 72.9534632,35.9673433 C72.9534632,35.4732334 72.821832,35.0652527 72.5585697,34.7434012 C72.2953073,34.4215498 71.9296652,34.260624 71.4616432,34.260624 C71.2096314,34.260624 70.989121,34.3150215 70.8001122,34.4238163 C70.6111033,34.5326112 70.4693466,34.6731379 70.3748422,34.8453964 L70.3748422,34.8453964 L70.3748422,34.3354205 L69.7605634,34.3354205 L69.7605634,38.8980048 L70.3883428,38.8980048 Z M71.3468878,37.1232887 C71.0588743,37.1232887 70.8259884,37.0156271 70.64823,36.800304 C70.4704717,36.5849808 70.3815925,36.3073273 70.3815925,35.9673433 C70.3815925,35.6364257 70.4704717,35.3633052 70.64823,35.1479821 C70.8259884,34.9326589 71.0588743,34.8249973 71.3468878,34.8249973 C71.6394015,34.8249973 71.8722875,34.9326589 72.0455456,35.1479821 C72.2188037,35.3633052 72.3054328,35.6364257 72.3054328,35.9673433 C72.3054328,36.3073273 72.2176787,36.5849808 72.0421704,36.800304 C71.8666622,37.0156271 71.6349013,37.1232887 71.3468878,37.1232887 Z M74.6477927,37.7080611 C74.908805,37.7080611 75.1259401,37.6536636 75.2991983,37.5448688 C75.4724564,37.4360739 75.6040876,37.3091466 75.6940918,37.1640868 C75.6940918,37.3227459 75.7053423,37.4700723 75.7278434,37.6060659 L75.7278434,37.6060659 L76.3488725,37.6060659 C76.3218713,37.4428736 76.3083706,37.2638154 76.3083706,37.0688913 L76.3083706,37.0688913 L76.3083706,35.4301687 C76.3083706,35.0811186 76.1981155,34.7943988 75.9776051,34.5700094 C75.7570948,34.34562 75.4173288,34.2334253 74.9583073,34.2334253 C74.6072908,34.2334253 74.3057767,34.3320206 74.0537648,34.5292113 C73.801753,34.726402 73.6599964,34.98139 73.6284949,35.2941752 L73.6284949,35.2941752 L74.2360234,35.4369684 C74.2585244,35.2375112 74.3327779,35.0777187 74.4587838,34.9575911 C74.5847897,34.8374634 74.7557978,34.7773996 74.9718079,34.7773996 C75.2058189,34.7773996 75.3813271,34.831797 75.4983326,34.9405919 C75.6153381,35.0493867 75.6738408,35.1899134 75.6738408,35.362172 C75.6738408,35.5026986 75.5905869,35.5842948 75.4240791,35.6069604 L75.4240791,35.6069604 L74.546538,35.7361543 C74.249524,35.7769523 74.0110128,35.8823474 73.8310044,36.0523393 C73.6509959,36.2223313 73.5609917,36.447854 73.5609917,36.7289074 C73.5609917,36.9963614 73.6622465,37.2264172 73.864756,37.4190747 C74.0672655,37.6117323 74.3282777,37.7080611 74.6477927,37.7080611 Z M74.7355468,37.1708865 C74.5780394,37.1708865 74.4509085,37.1232887 74.3541539,37.0280932 C74.2573994,36.9328977 74.2090221,36.8218363 74.2090221,36.694909 C74.2090221,36.5543823 74.2517741,36.4433209 74.3372781,36.3617247 C74.4227821,36.2801286 74.5375375,36.2279977 74.6815443,36.2053321 L74.6815443,36.2053321 L75.6738408,36.0557392 L75.6738408,36.2053321 C75.6738408,36.5407829 75.5883368,36.7855713 75.4173288,36.9396974 C75.2463208,37.0938234 75.0190601,37.1708865 74.7355468,37.1708865 Z M77.9284466,37.6060659 L77.9284466,35.9673433 C77.9284466,35.2964417 78.2254606,34.9609909 78.8194885,34.9609909 C78.9094927,34.9609909 79.001747,34.9677906 79.0962514,34.98139 L79.0962514,34.98139 L79.0962514,34.3014221 C79.0287483,34.2878227 78.958995,34.2810231 78.8869916,34.2810231 C78.4369705,34.2810231 78.1129553,34.4895465 77.914946,34.9065935 L77.914946,34.9065935 L77.914946,34.3354205 L77.2939169,34.3354205 L77.2939169,37.6060659 L77.9284466,37.6060659 Z M82.4511589,37.6060659 L82.4511589,34.451015 L83.6999675,37.6060659 L84.564008,37.6060659 L85.8128166,34.410217 L85.8128166,37.6060659 L86.8591157,37.6060659 L86.8591157,32.7850938 L85.394297,32.7850938 L84.1454884,36.0421398 L82.8291766,32.7850938 L81.4386114,32.7850938 L81.4386114,37.6060659 L82.4511589,37.6060659 Z M88.782956,37.7012614 C89.2194765,37.7012614 89.5344912,37.5426022 89.7280003,37.2252839 C89.7280003,37.3884762 89.7392508,37.5154035 89.7617519,37.6060659 L89.7617519,37.6060659 L90.6865453,37.6060659 C90.659544,37.4700723 90.6460434,37.2955472 90.6460434,37.0824906 L90.6460434,37.0824906 L90.6460434,35.4301687 C90.6460434,35.0493867 90.5256627,34.7366015 90.2849014,34.4918131 C90.0441401,34.2470247 89.6694976,34.1246305 89.1609737,34.1246305 C88.7109526,34.1246305 88.3588111,34.2413583 88.1045491,34.4748139 C87.8502872,34.7082695 87.7119057,34.965524 87.6894047,35.2465774 L87.6894047,35.2465774 L88.5804465,35.4301687 C88.5894469,35.2941752 88.6445745,35.1774474 88.7458292,35.0799853 C88.847084,34.9825232 88.9832154,34.9337922 89.1542234,34.9337922 C89.3072306,34.9337922 89.4276112,34.9689239 89.5153653,35.0391872 C89.6031195,35.1094506 89.6469965,35.1967131 89.6469965,35.3009748 C89.6469965,35.4324353 89.5659927,35.5094983 89.4039851,35.5321639 L89.4039851,35.5321639 L88.6141981,35.6545581 C88.3216843,35.6998893 88.0831731,35.8098175 87.8986645,35.9843425 C87.7141558,36.1588676 87.6219015,36.3889234 87.6219015,36.6745099 C87.6219015,36.9555633 87.7265314,37.1969519 87.9357912,37.3986757 C88.145051,37.6003995 88.4274393,37.7012614 88.782956,37.7012614 Z M89.0327177,36.9532967 C88.8977114,36.9532967 88.7975817,36.9192984 88.7323286,36.8513016 C88.6670755,36.7833048 88.634449,36.7017086 88.634449,36.6065131 C88.634449,36.3979897 88.7604549,36.2733289 89.0124667,36.2325308 L89.0124667,36.2325308 L89.6469965,36.1305356 L89.6469965,36.2801286 C89.6469965,36.5203839 89.5884938,36.6926424 89.4714883,36.7969041 C89.3544828,36.9011659 89.2082259,36.9532967 89.0327177,36.9532967 Z M92.5361321,37.6060659 L92.5361321,36.7765051 L92.8668976,36.4161221 L93.6566847,37.6060659 L94.9122436,37.6060659 L93.5756809,35.6477585 L94.8852423,34.2266256 L93.5554299,34.2266256 L92.5361321,35.362172 L92.5361321,32.6830986 L91.5100839,32.6830986 L91.5100839,37.6060659 L92.5361321,37.6060659 Z M96.7618304,37.7080611 C97.1668494,37.7080611 97.5043652,37.6071992 97.7743779,37.4054754 C98.0443905,37.2037516 98.2221489,36.9464971 98.3076529,36.6337119 L98.3076529,36.6337119 L97.4503627,36.3889234 C97.3468578,36.6835762 97.1218473,36.8309025 96.775331,36.8309025 C96.5728215,36.8309025 96.3973133,36.7685721 96.2488063,36.6439114 C96.1002993,36.5192506 96.0215456,36.3639913 96.0125452,36.1781334 L96.0125452,36.1781334 L98.3481548,36.1781334 C98.3616554,36.1373353 98.3684057,36.030807 98.3684057,35.8585485 C98.3684057,35.3145742 98.2187737,34.8895943 97.9195097,34.5836088 C97.6202456,34.2776232 97.2096014,34.1246305 96.6875769,34.1246305 C96.2330556,34.1246305 95.8404121,34.2900893 95.5096466,34.621007 C95.1788811,34.9519247 95.0134983,35.3803044 95.0134983,35.9061462 C95.0134983,36.4546536 95.1833813,36.8920996 95.5231472,37.2184842 C95.8629132,37.5448688 96.2758076,37.7080611 96.7618304,37.7080611 Z M97.3761092,35.5117649 L96.0327962,35.5117649 C96.0462968,35.3667051 96.1115498,35.2352446 96.2285553,35.1173835 C96.3455608,34.9995224 96.5030682,34.9405919 96.7010775,34.9405919 C96.9215879,34.9405919 97.0869706,34.9972559 97.1972258,35.1105838 C97.307481,35.2239118 97.3671088,35.3576388 97.3761092,35.5117649 L97.3761092,35.5117649 Z M99.6037137,37.667263 C99.7927226,37.667263 99.9558552,37.5969997 100.093112,37.456473 C100.230368,37.3159463 100.298996,37.152754 100.298996,36.9668961 C100.298996,36.7765051 100.230368,36.6133128 100.093112,36.4773192 C99.9558552,36.3413257 99.7927226,36.2733289 99.6037137,36.2733289 C99.4147048,36.2733289 99.2526972,36.3413257 99.1176909,36.4773192 C98.9826846,36.6133128 98.9151814,36.7765051 98.9151814,36.9668961 C98.9151814,37.1572871 98.9826846,37.3227459 99.1176909,37.4632726 C99.2526972,37.5992662 99.4147048,37.667263 99.6037137,37.667263 Z M102.567103,37.7080611 C103.075627,37.7080611 103.499772,37.5392024 103.839537,37.201485 C104.179303,36.8637676 104.349186,36.4342546 104.349186,35.9129459 C104.349186,35.3916372 104.179303,34.9632575 103.839537,34.6278067 C103.499772,34.2923559 103.075627,34.1246305 102.567103,34.1246305 C102.063079,34.1246305 101.640059,34.2934891 101.298043,34.6312065 C100.956027,34.9689239 100.785019,35.3961703 100.785019,35.9129459 C100.785019,36.4297215 100.956027,36.8581012 101.298043,37.1980852 C101.640059,37.5380691 102.063079,37.7080611 102.567103,37.7080611 Z M102.567103,36.7561061 C102.360093,36.7561061 102.182335,36.6824429 102.033828,36.5351165 C101.885321,36.3877901 101.811067,36.1803999 101.811067,35.9129459 C101.811067,35.6454919 101.885321,35.439235 102.033828,35.2941752 C102.182335,35.1491154 102.360093,35.0765855 102.567103,35.0765855 C102.778613,35.0765855 102.957496,35.1479821 103.103753,35.2907753 C103.25001,35.4335686 103.323138,35.6409588 103.323138,35.9129459 C103.323138,36.1849331 103.25001,36.3934565 103.103753,36.5385164 C102.957496,36.6835762 102.778613,36.7561061 102.567103,36.7561061 Z M106.036766,37.6060659 L106.036766,36.1305356 C106.036766,35.8177504 106.109894,35.5865613 106.256151,35.4369684 C106.402408,35.2873755 106.590292,35.212579 106.819802,35.212579 C106.941308,35.212579 107.049313,35.2239118 107.143818,35.2465774 L107.143818,35.2465774 L107.143818,34.2266256 C107.067314,34.20396 106.97731,34.1926272 106.873805,34.1926272 C106.707297,34.1926272 106.540789,34.2311588 106.374281,34.3082218 C106.207774,34.3852848 106.084018,34.5099456 106.003014,34.6822041 L106.003014,34.6822041 L106.003014,34.2266256 L105.010717,34.2266256 L105.010717,37.6060659 L106.036766,37.6060659 Z M109.162162,39 C109.75619,39 110.203961,38.8288748 110.505475,38.4866243 C110.806989,38.1443738 110.957746,37.7103276 110.957746,37.1844858 L110.957746,37.1844858 L110.957746,34.2266256 L109.978951,34.2266256 L109.978951,34.5870086 C109.920448,34.4782137 109.812443,34.3807517 109.654935,34.2946224 C109.497428,34.2084932 109.294918,34.1654285 109.047407,34.1654285 C108.597386,34.1654285 108.224993,34.3274875 107.930229,34.6516055 C107.635466,34.9757236 107.488084,35.3644385 107.488084,35.8177504 C107.488084,36.2891948 107.636591,36.6813096 107.933605,36.9940948 C108.230619,37.30688 108.601886,37.4632726 109.047407,37.4632726 C109.479427,37.4632726 109.778691,37.3363453 109.945199,37.0824906 L109.945199,37.0824906 L109.945199,37.2388832 C109.945199,37.8145894 109.668436,38.1024424 109.11491,38.1024424 C108.925901,38.1024424 108.767269,38.0503116 108.639013,37.9460498 C108.510757,37.8417881 108.428628,37.7057945 108.392626,37.5380691 L108.392626,37.5380691 L107.488084,37.7964569 C107.537586,38.1228415 107.714219,38.4050281 108.017984,38.6430169 C108.321748,38.8810056 108.703141,39 109.162162,39 Z M109.236416,36.5657151 C109.024906,36.5657151 108.851648,36.4977183 108.716641,36.3617247 C108.581635,36.2257311 108.514132,36.0444064 108.514132,35.8177504 C108.514132,35.5956276 108.58501,35.4154361 108.726767,35.277176 C108.868523,35.1389158 109.038406,35.0697858 109.236416,35.0697858 C109.434425,35.0697858 109.603183,35.1389158 109.742689,35.277176 C109.882196,35.4154361 109.951949,35.5956276 109.951949,35.8177504 C109.951949,36.0444064 109.885571,36.2257311 109.752815,36.3617247 C109.620059,36.4977183 109.447926,36.5657151 109.236416,36.5657151 Z" id="parMake.org" fill="#000000" fill-rule="nonzero"></path>
                </g>
            </g>
        </g>
    </g>
</svg>