<?xml version="1.0" encoding="UTF-8"?>
<svg width="475px" height="104px" viewBox="0 0 475 104" version="1.1" xmlns="http://www.w3.org/2000/svg" xmlns:xlink="http://www.w3.org/1999/xlink">
    <!-- Generator: Sketch 63.1 (92452) - https://sketch.com -->
    <title>fd_logo_color</title>
    <desc>Created with Sketch.</desc>
    <g id="environnement" stroke="none" stroke-width="1" fill="none" fill-rule="evenodd">
        <g id="Environnement/expert/francedigitale" fill-rule="nonzero">
            <g id="fd_logo_color">
                <polygon id="Path" fill="#FF4324" points="272.574 77.625 227.574 103.5 182.574 77.625 182.574 25.875 227.574 0 272.574 25.875"></polygon>
                <path d="M227.34,16.281 L196.263,34.209 L196.461,70.47 L206.217,76.05 L206.217,59.337 L227.34,46.98 L227.34,63.099 L249.255,76.05 L258.822,70.074 L258.822,34.812 L227.34,16.281 Z M249.057,64.737 L237.474,57.726 L237.474,40.437 L227.709,35.037 L206.217,47.367 L206.217,40.167 L226.917,28.008 L249.057,40.437 L249.057,64.737 Z" id="Shape" fill="#FFFFFF"></path>
                <polygon id="Path" fill="#193EE1" points="22.32 39.951 6.777 39.951 6.777 49.437 19.944 49.437 19.944 55.647 6.777 55.647 6.777 71.847 0 71.847 0 33.714 22.32 33.714"></polygon>
                <path d="M44.298,71.829 L36.72,58.437 L34.2,58.437 L34.2,71.847 L27.369,71.847 L27.369,33.714 L36.972,33.714 C46.179,33.714 50.472,37.08 50.472,45.153 L50.472,47.133 C50.472,52.776 48.492,55.845 43.893,57.33 L52.254,71.829 L44.298,71.829 Z M36.972,52.137 C41.922,52.137 43.272,50.409 43.272,46.791 L43.272,45.495 C43.272,41.895 42.372,40.005 37.035,40.005 L34.146,40.005 L34.146,52.137 L36.972,52.137 Z" id="Shape" fill="#193EE1"></path>
                <path d="M81.468,71.829 L74.439,71.829 L72.513,65.097 L62.757,65.097 L60.777,71.829 L53.757,71.829 L64.296,33.768 L71.073,33.768 L81.468,71.829 Z M70.776,58.437 L67.608,44.307 L64.44,58.437 L70.776,58.437 Z" id="Shape" fill="#193EE1"></path>
                <polygon id="Path" fill="#193EE1" points="109.341 71.829 102.708 71.829 91.521 47.637 92.115 62.091 92.115 71.829 85.374 71.829 85.374 33.768 92.16 33.768 103.347 58.86 102.6 42.777 102.6 33.777 109.386 33.777"></polygon>
                <path d="M141.417,60.048 C141.417,68.409 137.457,71.928 128.394,71.928 C119.331,71.928 115.677,68.409 115.677,60.543 L115.677,45.054 C115.677,36.954 119.187,33.669 128.394,33.669 C137.601,33.669 141.417,37.035 141.417,45.495 L134.586,45.495 C134.586,41.787 133.686,39.708 128.394,39.708 C123.444,39.708 122.508,41.787 122.508,45.396 L122.508,60.237 C122.508,63.837 123.408,65.925 128.394,65.925 C133.38,65.925 134.586,63.846 134.586,60.084 L141.417,60.048 Z" id="Path" fill="#193EE1"></path>
                <polygon id="Path" fill="#193EE1" points="168.984 33.714 168.984 39.654 153.891 39.654 153.891 49.437 166.761 49.437 166.761 55.575 153.891 55.575 153.891 65.637 169.677 65.637 169.677 71.874 147.06 71.874 147.06 33.714"></polygon>
                <path d="M299.367,33.714 C308.574,33.714 312.381,37.035 312.381,45.099 L312.381,60.642 C312.381,68.508 308.421,71.829 299.367,71.829 L286.848,71.829 L286.848,33.714 L299.367,33.714 Z M299.367,65.637 C304.317,65.637 305.55,63.909 305.55,60.3 L305.55,45.45 C305.55,41.85 304.758,39.951 299.466,39.951 L293.625,39.951 L293.625,65.637 L299.367,65.637 Z" id="Shape" fill="#193EE1"></path>
                <polygon id="Path" fill="#193EE1" points="325.35 71.874 318.474 71.874 318.474 33.768 325.35 33.768"></polygon>
                <path d="M344.574,50.148 L357.399,50.148 L357.399,60.048 C357.399,68.409 353.439,72.027 344.376,72.027 C335.313,72.027 331.659,68.427 331.659,60.201 L331.659,44.937 C331.659,37.17 335.178,33.552 344.376,33.552 C353.574,33.552 357.381,36.738 357.381,44.937 L350.55,44.937 C350.55,41.337 349.65,39.591 344.358,39.591 C339.408,39.591 338.472,41.823 338.472,45.288 L338.472,60.237 C338.472,63.837 339.372,65.925 344.358,65.925 C349.344,65.925 351.045,63.846 351.045,60.084 L351.045,56.34 L344.574,56.34 L344.574,50.148 Z" id="Path" fill="#193EE1"></path>
                <polygon id="Path" fill="#193EE1" points="370.395 71.874 363.519 71.874 363.519 33.768 370.395 33.768"></polygon>
                <polygon id="Path" fill="#193EE1" points="396.828 39.951 388.962 39.951 388.962 71.829 382.176 71.829 382.176 39.951 374.274 39.951 374.274 33.867 396.846 33.867"></polygon>
                <path d="M422.172,71.829 L415.143,71.829 L413.217,65.097 L403.461,65.097 L401.481,71.829 L394.452,71.829 L405,33.768 L411.777,33.768 L422.172,71.829 Z M411.48,58.437 L408.312,44.307 L405.144,58.437 L411.48,58.437 Z" id="Shape" fill="#193EE1"></path>
                <polygon id="Path" fill="#193EE1" points="447.66 71.829 426.06 71.829 426.06 33.714 432.936 33.714 432.936 65.637 447.633 65.637"></polygon>
                <polygon id="Path" fill="#193EE1" points="474.246 33.714 474.246 39.654 459.153 39.654 459.153 49.437 472.023 49.437 472.023 55.575 459.153 55.575 459.153 65.637 474.939 65.637 474.939 71.874 452.322 71.874 452.322 33.714"></polygon>
            </g>
        </g>
    </g>
</svg>