<?xml version="1.0" encoding="UTF-8"?>
<svg width="263px" height="125px" viewBox="0 0 263 125" version="1.1" xmlns="http://www.w3.org/2000/svg" xmlns:xlink="http://www.w3.org/1999/xlink">
    <!-- Generator: Sketch 55.2 (78181) - https://sketchapp.com -->
    <title>logo/color</title>
    <desc>Created with Sketch.</desc>
    <defs>
        <linearGradient x1="0%" y1="45.7752584%" x2="100%" y2="54.2247416%" id="linearGradient-1">
            <stop stop-color="#F5515F" offset="0%"></stop>
            <stop stop-color="#9F041B" offset="100%"></stop>
        </linearGradient>
    </defs>
    <g id="logo/color" stroke="none" stroke-width="1" fill="none" fill-rule="evenodd">
        <g id="media/logo/color">
            <g id="Group-9" transform="translate(17.000000, 23.000000)">
                <path d="M0.38907767,44.5070423 L0.38907767,15.6664789 L6.32529126,15.6664789 L6.32529126,44.5070423 L0.38907767,44.5070423 Z M15.4964078,44.7740845 C12.9840651,44.7740845 11.1832093,44.0842323 10.0937864,42.704507 C9.00436348,41.3247818 8.45966019,39.2663517 8.45966019,36.5291549 L8.45966019,26.7153521 C8.45966019,24.4677352 9.10441103,22.7542312 10.393932,21.5747887 C11.683453,20.3953462 13.4843088,19.8056338 15.7965534,19.8056338 C20.4877419,19.8056338 22.833301,22.1088502 22.833301,26.7153521 L22.833301,28.484507 C22.833301,30.2647976 22.8110682,31.711262 22.7666019,32.8239437 L14.2958252,32.8239437 L14.2958252,37.5639437 C14.2958252,38.4095817 14.3847564,39.0716173 14.5626214,39.5500704 C14.7404863,40.0285235 15.1184437,40.2677465 15.6965049,40.2677465 C16.1411673,40.2677465 16.4579845,40.1342267 16.646966,39.8671831 C16.8359475,39.6001395 16.9471115,39.2941567 16.9804612,38.9492254 C17.0138108,38.604294 17.0304854,38.0980315 17.0304854,37.4304225 L17.0304854,35.0604225 L22.833301,35.0604225 L22.833301,36.4623944 C22.833301,39.3108593 22.2830395,41.4082327 21.1825,42.7545775 C20.0819605,44.1009222 18.1866154,44.7740845 15.4964078,44.7740845 Z M17.0304854,29.9198592 L17.0304854,26.7821127 C17.0304854,25.0240757 16.5969461,24.1450704 15.7298544,24.1450704 C14.7515971,24.1450704 14.2624757,25.0240757 14.2624757,26.7821127 L14.2624757,29.9198592 L17.0304854,29.9198592 Z M31.6375728,44.7740845 C26.8129856,44.7740845 24.4007282,42.3262217 24.4007282,37.4304225 L24.4340777,35.4943662 L30.2702427,35.4943662 L30.3035922,38.3650704 C30.3035922,38.9436649 30.4147562,39.3831675 30.6370874,39.6835915 C30.8594186,39.9840156 31.2262596,40.1342254 31.7376214,40.1342254 C32.5157806,40.1342254 32.9048544,39.5000063 32.9048544,38.2315493 C32.9048544,37.2968967 32.7214339,36.5625379 32.3545874,36.0284507 C31.9877409,35.4943635 31.4041302,34.9269044 30.6037379,34.3260563 L27.502233,31.9226761 C26.4350432,31.0992917 25.668012,30.248103 25.2011165,29.3690845 C24.734221,28.490066 24.5007767,27.2494446 24.5007767,25.6471831 C24.5007767,24.4009797 24.8287103,23.3383847 25.4845874,22.4593662 C26.1404644,21.5803477 27.0131013,20.9183099 28.1025243,20.4732394 C29.1919472,20.0281668 30.4036341,19.8056338 31.7376214,19.8056338 C36.4732761,19.8056338 38.841068,22.1644835 38.841068,26.8822535 L38.841068,27.3495775 L32.8048058,27.3495775 L32.8048058,26.4149296 C32.8048058,25.8363351 32.7103165,25.3411992 32.521335,24.929507 C32.3323534,24.5178148 32.0155362,24.3119718 31.5708738,24.3119718 C31.1706776,24.3119718 30.8649768,24.4288016 30.6537621,24.6624648 C30.4425475,24.8961279 30.3369417,25.2132374 30.3369417,25.6138028 C30.3369417,26.5039481 30.68155,27.1938004 31.3707767,27.6833803 L34.9725243,30.3204225 C36.2620453,31.2773287 37.2514043,32.3176704 37.9406311,33.4414789 C38.6298578,34.5652873 38.974466,35.9839351 38.974466,37.6974648 C38.974466,39.9673353 38.3297152,41.7142192 37.0401942,42.938169 C35.7506732,44.1621188 33.9498174,44.7740845 31.6375728,44.7740845 Z M48.5791262,20.0726761 L54.2818932,20.0726761 L54.2818932,22.91 C54.5486907,21.8640793 55.0044628,21.0852138 55.6492233,20.5733803 C56.2939838,20.0615467 57.2055281,19.8056338 58.3838835,19.8056338 C59.3399077,19.8056338 60.168079,20.0226035 60.8684223,20.4565493 C61.5687656,20.8904951 62.0634452,21.4857709 62.3524757,22.2423944 C62.8416044,21.3967563 63.3863077,20.7792273 63.9866019,20.3897887 C64.5868962,20.0003502 65.4206257,19.8056338 66.4878155,19.8056338 C68.3998639,19.8056338 69.728273,20.3897829 70.4730825,21.5580986 C71.2178921,22.7264143 71.5902913,24.4232283 71.5902913,26.6485915 L71.5235922,44.5070423 L65.6540777,44.5070423 L65.6540777,26.5484507 C65.6540777,24.9684428 65.2538835,24.1784507 64.4534951,24.1784507 C63.8976671,24.1784507 63.497477,24.4510536 63.2529126,24.9962676 C63.0083483,25.5414816 62.886068,26.1923906 62.886068,26.9490141 L62.886068,44.5070423 L57.0499029,44.5070423 L57.0499029,26.5484507 C57.0499029,25.8585881 56.9776464,25.3022556 56.8331311,24.8794366 C56.6886158,24.4566176 56.382915,24.2452113 55.9160194,24.2452113 C55.3157252,24.2452113 54.8933022,24.5400675 54.6487379,25.1297887 C54.4041735,25.71951 54.2818932,26.4260522 54.2818932,27.2494366 L54.2818932,44.5070423 L48.5791262,44.5070423 L48.5791262,20.0726761 Z M80.6947087,44.7740845 C78.1823661,44.7740845 76.3815103,44.0842323 75.2920874,42.704507 C74.2026645,41.3247818 73.6579612,39.2663517 73.6579612,36.5291549 L73.6579612,26.7153521 C73.6579612,24.4677352 74.302712,22.7542312 75.592233,21.5747887 C76.881754,20.3953462 78.6826098,19.8056338 80.9948544,19.8056338 C85.6860429,19.8056338 88.0316019,22.1088502 88.0316019,26.7153521 L88.0316019,28.484507 C88.0316019,30.2647976 88.0093692,31.711262 87.9649029,32.8239437 L79.4941262,32.8239437 L79.4941262,37.5639437 C79.4941262,38.4095817 79.5830574,39.0716173 79.7609223,39.5500704 C79.9387873,40.0285235 80.3167447,40.2677465 80.8948058,40.2677465 C81.3394682,40.2677465 81.6562855,40.1342267 81.845267,39.8671831 C82.0342485,39.6001395 82.1454125,39.2941567 82.1787621,38.9492254 C82.2121118,38.604294 82.2287864,38.0980315 82.2287864,37.4304225 L82.2287864,35.0604225 L88.0316019,35.0604225 L88.0316019,36.4623944 C88.0316019,39.3108593 87.4813405,41.4082327 86.380801,42.7545775 C85.2802615,44.1009222 83.3849164,44.7740845 80.6947087,44.7740845 Z M82.2287864,29.9198592 L82.2287864,26.7821127 C82.2287864,25.0240757 81.7952471,24.1450704 80.9281553,24.1450704 C79.949898,24.1450704 79.4607767,25.0240757 79.4607767,26.7821127 L79.4607767,29.9198592 L82.2287864,29.9198592 Z M77.0929612,18.9377465 L77.0929612,15.2992958 L84.8300485,11.7276056 L84.8300485,17.4022535 L77.0929612,18.9377465 Z M94.9349515,44.7740845 C93.5120317,44.7740845 92.4392997,44.4347217 91.7167233,43.7559859 C90.9941469,43.0772501 90.5161419,42.1759915 90.2826942,41.0521831 C90.0492464,39.9283747 89.9325243,38.4874736 89.9325243,36.7294366 L89.9992233,25.7139437 C89.9992233,23.9781603 90.4383209,22.5595125 91.3165291,21.4579577 C92.1947374,20.3564029 93.4342153,19.8056338 95.035,19.8056338 C96.6135516,19.8056338 97.7918893,20.3285863 98.5700485,21.374507 L98.5700485,15.6664789 L104.406214,15.6664789 L104.406214,44.5070423 L98.5700485,44.5070423 L98.5700485,41.9033803 C98.2365517,42.8602865 97.7863378,43.5779554 97.2193932,44.0564085 C96.6524486,44.5348615 95.8909757,44.7740845 94.9349515,44.7740845 Z M97.1693689,40.2009859 C97.7474301,40.2009859 98.1253875,39.9172564 98.3032524,39.3497887 C98.4811174,38.7823211 98.5700485,38.0201456 98.5700485,37.0632394 L98.5700485,26.8488732 C98.5700485,26.136757 98.470001,25.5359179 98.2699029,25.046338 C98.0698048,24.5567581 97.7140802,24.3119718 97.2027184,24.3119718 C96.6246573,24.3119718 96.2411417,24.5400681 96.0521602,24.9962676 C95.8631787,25.4524671 95.7686893,26.0699961 95.7686893,26.8488732 L95.7686893,37.13 C95.7686893,39.1773342 96.2355779,40.2009859 97.1693689,40.2009859 Z M106.70733,18.4370423 L106.70733,14.3646479 L112.543495,14.3646479 L112.543495,18.4370423 L106.70733,18.4370423 Z M106.70733,44.5070423 L106.70733,20.0726761 L112.543495,20.0726761 L112.543495,44.5070423 L106.70733,44.5070423 Z M119.280097,44.7740845 C117.390282,44.7740845 116.095222,44.1454288 115.394879,42.8880986 C114.694535,41.6307684 114.344369,39.8338145 114.344369,37.4971831 C114.344369,35.5833707 114.594488,34.114653 115.094733,33.0909859 C115.594978,32.0673188 116.289753,31.31627 117.179078,30.8378169 C118.068403,30.3593638 119.424603,29.830848 121.247718,29.2522535 L122.848495,28.718169 L122.848495,26.2146479 C122.848495,25.5692925 122.720657,25.0741567 122.464976,24.7292254 C122.209295,24.384294 121.903594,24.211831 121.547864,24.211831 C121.2366,24.211831 120.964249,24.3564774 120.730801,24.6457746 C120.497353,24.9350719 120.380631,25.3245046 120.380631,25.8140845 L120.380631,27.2828169 L114.711214,27.2828169 L114.711214,26.4816901 C114.711214,24.0782978 115.272591,22.3647939 116.395364,21.3411268 C117.518137,20.3174597 119.346783,19.8056338 121.881359,19.8056338 C123.904573,19.8056338 125.549799,20.3341496 126.817087,21.3911972 C128.084375,22.4482447 128.71801,23.9447791 128.71801,25.8808451 L128.71801,44.5070423 L122.915194,44.5070423 L122.915194,41.6029577 C122.626164,42.6043712 122.164833,43.3832367 121.531189,43.9395775 C120.897545,44.4959183 120.147189,44.7740845 119.280097,44.7740845 Z M121.581214,40.2343662 C122.025876,40.2343662 122.342693,40.0507765 122.531675,39.6835915 C122.720656,39.3164066 122.815146,38.8657773 122.815146,38.3316901 L122.815146,31.5221127 C121.948058,31.8559172 121.308861,32.2787298 120.897549,32.7905634 C120.486236,33.3023969 120.280583,34.0145025 120.280583,34.9269014 L120.280583,38.0646479 C120.280583,39.511134 120.714122,40.2343662 121.581214,40.2343662 Z M137.65568,44.7740845 C132.831092,44.7740845 130.418835,42.3262217 130.418835,37.4304225 L130.452184,35.4943662 L136.28835,35.4943662 L136.321699,38.3650704 C136.321699,38.9436649 136.432863,39.3831675 136.655194,39.6835915 C136.877525,39.9840156 137.244366,40.1342254 137.755728,40.1342254 C138.533887,40.1342254 138.922961,39.5000063 138.922961,38.2315493 C138.922961,37.2968967 138.739541,36.5625379 138.372694,36.0284507 C138.005848,35.4943635 137.422237,34.9269044 136.621845,34.3260563 L133.52034,31.9226761 C132.45315,31.0992917 131.686119,30.248103 131.219223,29.3690845 C130.752328,28.490066 130.518883,27.2494446 130.518883,25.6471831 C130.518883,24.4009797 130.846817,23.3383847 131.502694,22.4593662 C132.158571,21.5803477 133.031208,20.9183099 134.120631,20.4732394 C135.210054,20.0281668 136.421741,19.8056338 137.755728,19.8056338 C142.491383,19.8056338 144.859175,22.1644835 144.859175,26.8822535 L144.859175,27.3495775 L138.822913,27.3495775 L138.822913,26.4149296 C138.822913,25.8363351 138.728423,25.3411992 138.539442,24.929507 C138.35046,24.5178148 138.033643,24.3119718 137.588981,24.3119718 C137.188784,24.3119718 136.883084,24.4288016 136.671869,24.6624648 C136.460654,24.8961279 136.355049,25.2132374 136.355049,25.6138028 C136.355049,26.5039481 136.699657,27.1938004 137.388883,27.6833803 L140.990631,30.3204225 C142.280152,31.2773287 143.269511,32.3176704 143.958738,33.4414789 C144.647965,34.5652873 144.992573,35.9839351 144.992573,37.6974648 C144.992573,39.9673353 144.347822,41.7142192 143.058301,42.938169 C141.76878,44.1621188 139.967924,44.7740845 137.65568,44.7740845 Z M74.536165,77.8873239 L74.536165,49.0467606 L80.4723786,49.0467606 L80.4723786,77.8873239 L74.536165,77.8873239 Z M87.2423301,78.1543662 C85.3525148,78.1543662 84.057455,77.5257105 83.3571117,76.2683803 C82.6567683,75.0110501 82.3066019,73.2140962 82.3066019,70.8774648 C82.3066019,68.9636524 82.5567208,67.4949347 83.056966,66.4712676 C83.5572112,65.4476005 84.2519858,64.6965517 85.1413107,64.2180986 C86.0306355,63.7396455 87.3868355,63.2111297 89.2099515,62.6325352 L90.8107282,62.0984507 L90.8107282,59.5949296 C90.8107282,58.9495742 90.6828896,58.4544383 90.4272087,58.109507 C90.1715278,57.7645757 89.865827,57.5921127 89.5100971,57.5921127 C89.1988334,57.5921127 88.9264817,57.7367591 88.693034,58.0260563 C88.4595862,58.3153536 88.3428641,58.7047863 88.3428641,59.1943662 L88.3428641,60.6630986 L82.6734466,60.6630986 L82.6734466,59.8619718 C82.6734466,57.4585795 83.2348245,55.7450755 84.3575971,54.7214085 C85.4803697,53.6977414 87.3090165,53.1859155 89.8435922,53.1859155 C91.8668062,53.1859155 93.5120325,53.7144313 94.7793204,54.7714789 C96.0466083,55.8285264 96.6802427,57.3250607 96.6802427,59.2611268 L96.6802427,77.8873239 L90.8774272,77.8873239 L90.8774272,74.9832394 C90.5883966,75.9846529 90.1270663,76.7635183 89.4934223,77.3198592 C88.8597784,77.8762 88.1094218,78.1543662 87.2423301,78.1543662 Z M89.5434466,73.6146479 C89.988109,73.6146479 90.3049262,73.4310582 90.4939078,73.0638732 C90.6828893,72.6966883 90.7773786,72.246059 90.7773786,71.7119718 L90.7773786,64.9023944 C89.9102913,65.2361989 89.2710943,65.6590115 88.8597816,66.1708451 C88.4484688,66.6826786 88.2428155,67.3947842 88.2428155,68.3071831 L88.2428155,71.4449296 C88.2428155,72.8914157 88.6763549,73.6146479 89.5434466,73.6146479 Z M113.421699,78.1543662 C108.597112,78.1543662 106.184854,75.7065034 106.184854,70.8107042 L106.218204,68.8746479 L112.054369,68.8746479 L112.087718,71.7453521 C112.087718,72.3239466 112.198882,72.7634492 112.421214,73.0638732 C112.643545,73.3642973 113.010386,73.514507 113.521748,73.514507 C114.299907,73.514507 114.688981,72.880288 114.688981,71.611831 C114.688981,70.6771784 114.50556,69.9428196 114.138714,69.4087324 C113.771867,68.8746452 113.188256,68.3071861 112.387864,67.706338 L109.286359,65.3029577 C108.219169,64.4795733 107.452138,63.6283847 106.985243,62.7493662 C106.518347,61.8703477 106.284903,60.6297263 106.284903,59.0274648 C106.284903,57.7812614 106.612837,56.7186664 107.268714,55.8396479 C107.924591,54.9606294 108.797228,54.2985915 109.88665,53.8535211 C110.976073,53.4084485 112.18776,53.1859155 113.521748,53.1859155 C118.257402,53.1859155 120.625194,55.5447651 120.625194,60.2625352 L120.625194,60.7298592 L114.588932,60.7298592 L114.588932,59.7952113 C114.588932,59.2166168 114.494443,58.7214809 114.305461,58.3097887 C114.11648,57.8980965 113.799662,57.6922535 113.355,57.6922535 C112.954804,57.6922535 112.649103,57.8090833 112.437888,58.0427465 C112.226674,58.2764096 112.121068,58.5935191 112.121068,58.9940845 C112.121068,59.8842298 112.465676,60.5740821 113.154903,61.063662 L116.75665,63.7007042 C118.046171,64.6576104 119.035531,65.6979521 119.724757,66.8217606 C120.413984,67.945569 120.758592,69.3642168 120.758592,71.0777465 C120.758592,73.347617 120.113841,75.0945009 118.82432,76.3184507 C117.534799,77.5424005 115.733944,78.1543662 113.421699,78.1543662 Z M129.662913,78.1543662 C124.793859,78.1543662 122.359369,75.6286168 122.359369,70.5770423 L122.359369,60.7632394 C122.359369,58.4488617 123.009678,56.6074012 124.310316,55.2388028 C125.610953,53.8702044 127.395134,53.1859155 129.662913,53.1859155 C131.930691,53.1859155 133.714872,53.8702044 135.01551,55.2388028 C136.316147,56.6074012 136.966456,58.4488617 136.966456,60.7632394 L136.966456,70.5770423 C136.966456,75.6286168 134.531966,78.1543662 129.662913,78.1543662 Z M129.662913,73.6480282 C130.129808,73.6480282 130.474416,73.4811284 130.696748,73.1473239 C130.919079,72.8135195 131.030243,72.3573268 131.030243,71.7787324 L131.030243,59.8285915 C131.030243,58.4043591 130.574471,57.6922535 129.662913,57.6922535 C128.751355,57.6922535 128.295583,58.4043591 128.295583,59.8285915 L128.295583,71.7787324 C128.295583,72.3573268 128.406746,72.8135195 128.629078,73.1473239 C128.851408,73.4811284 129.196017,73.6480282 129.662913,73.6480282 Z M146.471068,78.1543662 C143.803093,78.1543662 141.879957,77.4756406 140.701602,76.118169 C139.523247,74.7606974 138.934078,72.680014 138.934078,69.8760563 L138.934078,62.3321127 C138.934078,60.2180176 139.161964,58.4989503 139.617743,57.1748592 C140.073522,55.850768 140.840553,54.8549296 141.918859,54.1873239 C142.997166,53.519715 144.49233,53.1859155 146.404369,53.1859155 C148.494282,53.1859155 150.195091,53.7311213 151.506845,54.8215493 C152.818599,55.9119773 153.474466,57.4363282 153.474466,59.3946479 L153.474466,63.1332394 L147.538252,63.1332394 L147.538252,59.6950704 C147.538252,59.0497151 147.449321,58.5545792 147.271456,58.2096479 C147.093591,57.8647166 146.748983,57.6922535 146.237621,57.6922535 C145.281597,57.6922535 144.803592,58.3709791 144.803592,59.7284507 L144.803592,71.5784507 C144.803592,72.1347915 144.920314,72.6076741 145.153762,72.9971127 C145.38721,73.3865512 145.737376,73.5812676 146.204272,73.5812676 C146.671167,73.5812676 147.021334,73.3921146 147.254782,73.0138028 C147.488229,72.6354911 147.593835,72.1459185 147.571602,71.5450704 L147.538252,67.4392958 L153.474466,67.4392958 L153.474466,71.7119718 C153.474466,73.7147987 152.824157,75.2892196 151.523519,76.4352817 C150.222882,77.5813438 148.538748,78.1543662 146.471068,78.1543662 Z M155.475437,51.8173239 L155.475437,47.7449296 L161.311602,47.7449296 L161.311602,51.8173239 L155.475437,51.8173239 Z M155.475437,77.8873239 L155.475437,53.4529577 L161.311602,53.4529577 L161.311602,77.8873239 L155.475437,77.8873239 Z M170.449369,78.1543662 C167.937026,78.1543662 166.13617,77.4645139 165.046748,76.0847887 C163.957325,74.7050635 163.412621,72.6466334 163.412621,69.9094366 L163.412621,60.0956338 C163.412621,57.8480169 164.057372,56.1345129 165.346893,54.9550704 C166.636414,53.7756279 168.43727,53.1859155 170.749515,53.1859155 C175.440703,53.1859155 177.786262,55.4891319 177.786262,60.0956338 L177.786262,61.8647887 C177.786262,63.6450793 177.764029,65.0915437 177.719563,66.2042254 L169.248786,66.2042254 L169.248786,70.9442254 C169.248786,71.7898634 169.337718,72.451899 169.515583,72.9303521 C169.693447,73.4088052 170.071405,73.6480282 170.649466,73.6480282 C171.094128,73.6480282 171.410946,73.5145084 171.599927,73.2474648 C171.788909,72.9804212 171.900073,72.6744383 171.933422,72.329507 C171.966772,71.9845757 171.983447,71.4783132 171.983447,70.8107042 L171.983447,68.4407042 L177.786262,68.4407042 L177.786262,69.8426761 C177.786262,72.691141 177.236001,74.7885144 176.135461,76.1348592 C175.034922,77.4812039 173.139577,78.1543662 170.449369,78.1543662 Z M171.983447,63.3001408 L171.983447,60.1623944 C171.983447,58.4043574 171.549907,57.5253521 170.682816,57.5253521 C169.704558,57.5253521 169.215437,58.4043574 169.215437,60.1623944 L169.215437,63.3001408 L171.983447,63.3001408 Z M166.847621,52.3180282 L166.847621,48.6795775 L174.584709,45.1078873 L174.584709,50.7825352 L166.847621,52.3180282 Z M184.923058,78.1543662 C183.388973,78.1543662 182.332916,77.8316934 181.754854,77.186338 C181.176793,76.5409827 180.887767,75.5062043 180.887767,74.0819718 L180.887767,58.8271831 L179.253641,58.8271831 L179.253641,54.3876056 L180.887767,54.3876056 L180.887767,49.213662 L186.557184,49.213662 L186.557184,54.3876056 L188.22466,54.3876056 L188.22466,58.8271831 L186.557184,58.8271831 L186.557184,72.5464789 C186.557184,72.9692979 186.590534,73.2808441 186.657233,73.4811268 C186.723932,73.6814095 186.901795,73.7815493 187.190825,73.7815493 C187.413156,73.7815493 187.624368,73.7704226 187.824466,73.748169 C188.024564,73.7259154 188.157961,73.7147887 188.22466,73.7147887 L188.22466,77.7204225 C187.891163,77.8094371 187.4076,77.9040136 186.773956,78.0041549 C186.140312,78.1042963 185.523353,78.1543662 184.923058,78.1543662 Z M196.895534,78.1543662 C194.383191,78.1543662 192.582336,77.4645139 191.492913,76.0847887 C190.40349,74.7050635 189.858786,72.6466334 189.858786,69.9094366 L189.858786,60.0956338 C189.858786,57.8480169 190.503537,56.1345129 191.793058,54.9550704 C193.082579,53.7756279 194.883435,53.1859155 197.19568,53.1859155 C201.886868,53.1859155 204.232427,55.4891319 204.232427,60.0956338 L204.232427,61.8647887 C204.232427,63.6450793 204.210194,65.0915437 204.165728,66.2042254 L195.694951,66.2042254 L195.694951,70.9442254 C195.694951,71.7898634 195.783883,72.451899 195.961748,72.9303521 C196.139613,73.4088052 196.51757,73.6480282 197.095631,73.6480282 C197.540293,73.6480282 197.857111,73.5145084 198.046092,73.2474648 C198.235074,72.9804212 198.346238,72.6744383 198.379587,72.329507 C198.412937,71.9845757 198.429612,71.4783132 198.429612,70.8107042 L198.429612,68.4407042 L204.232427,68.4407042 L204.232427,69.8426761 C204.232427,72.691141 203.682166,74.7885144 202.581626,76.1348592 C201.481087,77.4812039 199.585742,78.1543662 196.895534,78.1543662 Z M198.429612,63.3001408 L198.429612,60.1623944 C198.429612,58.4043574 197.996072,57.5253521 197.128981,57.5253521 C196.150723,57.5253521 195.661602,58.4043574 195.661602,60.1623944 L195.661602,63.3001408 L198.429612,63.3001408 Z M193.293786,52.3180282 L193.293786,48.6795775 L201.030874,45.1078873 L201.030874,50.7825352 L193.293786,52.3180282 Z M215.03767,63.7007042 C217.038651,63.7007042 218.567155,63.5504945 219.623228,63.2500704 C220.679301,62.9496464 221.463007,62.3098641 221.974369,61.3307042 C222.485731,60.3515444 222.741408,58.8383201 222.741408,56.7909859 C222.741408,55.9676015 222.64136,55.3222559 222.441262,54.8549296 C222.241164,54.3876033 221.840974,54.1539437 221.24068,54.1539437 C220.618152,54.1539437 220.206846,54.4209832 220.006748,54.9550704 C219.806649,55.4891576 219.706602,56.2235165 219.706602,57.158169 L219.706602,59.5615493 L213.737039,59.5615493 L213.737039,55.4223944 C213.737039,53.2860457 214.415139,51.6726815 215.771359,50.5822535 C217.12758,49.4918255 218.950668,48.9466197 221.24068,48.9466197 C224.01982,48.9466197 225.99298,49.6865419 227.160218,51.1664085 C228.327457,52.646275 228.911068,54.8882948 228.911068,57.8925352 C228.911068,60.8300147 228.194061,63.199991 226.760024,65.0025352 C225.325988,66.8050794 223.230548,67.706338 220.473641,67.706338 L220.473641,70.4769014 L215.03767,70.4769014 L215.03767,63.7007042 Z M214.870922,77.8873239 L214.870922,73.0138028 L220.673738,73.0138028 L220.673738,77.8873239 L214.870922,77.8873239 Z" id="Combined-Shape" fill="url(#linearGradient-1)" fill-rule="nonzero"></path>
                <g id="Group" transform="translate(12.228155, 0.000000)" fill="#000000" fill-rule="nonzero">
                    <path d="M0.767038835,56.5016901 L2.79024272,56.5016901 C4.42436893,56.5016901 5.23587379,57.158169 5.23587379,58.8716901 C5.23587379,60.7298592 4.25762136,61.2416901 2.79024272,61.2416901 L2.14548544,61.2416901 L2.14548544,64.5352113 L0.767038835,64.5352113 L0.767038835,56.5016901 Z M2.14548544,57.6366197 L2.14548544,60.1067606 L2.61237864,60.1067606 C3.51281553,60.1067606 3.85742718,59.9064789 3.85742718,58.8716901 C3.85742718,57.7923944 3.47946602,57.6366197 2.57902913,57.6366197 L2.14548544,57.6366197 Z M6.32529126,56.5016901 L10.0159709,56.5016901 L10.0159709,57.7033803 L7.70373786,57.7033803 L7.70373786,59.7729577 L9.48237864,59.7729577 L9.48237864,60.9746479 L7.70373786,60.9746479 L7.70373786,63.3335211 L10.1716019,63.3335211 L10.1716019,64.5352113 L6.32529126,64.5352113 L6.32529126,56.5016901 Z M11.2610194,56.5016901 L12.639466,56.5016901 L12.639466,62.5991549 C12.639466,63.1332394 12.8729126,63.4447887 13.3731553,63.4447887 C13.8733981,63.4447887 14.1068447,63.1332394 14.1068447,62.5991549 L14.1068447,56.5016901 L15.4852913,56.5016901 L15.4852913,62.5546479 C15.4852913,63.7897183 14.7516019,64.6464789 13.3731553,64.6464789 C12.0280583,64.6464789 11.2610194,63.8342254 11.2610194,62.5546479 L11.2610194,56.5016901 Z M16.2523301,56.5016901 L17.6085437,56.5016901 L18.6090291,62.0650704 L18.6312621,62.0650704 L19.6317476,56.5016901 L20.9879612,56.5016901 L19.3093689,64.5352113 L17.9309223,64.5352113 L16.2523301,56.5016901 Z M21.755,56.5016901 L25.4456796,56.5016901 L25.4456796,57.7033803 L23.1334466,57.7033803 L23.1334466,59.7729577 L24.9120874,59.7729577 L24.9120874,60.9746479 L23.1334466,60.9746479 L23.1334466,63.3335211 L25.6013107,63.3335211 L25.6013107,64.5352113 L21.755,64.5352113 L21.755,56.5016901 Z M26.6907282,56.5016901 L27.9691262,56.5016901 L29.6477184,61.0970423 L29.6699515,61.0970423 L29.6699515,56.5016901 L30.915,56.5016901 L30.915,64.5352113 L29.7144175,64.5352113 L27.9580097,59.5170423 L27.9357767,59.5170423 L27.9357767,64.5352113 L26.6907282,64.5352113 L26.6907282,56.5016901 Z M31.7153883,56.5016901 L35.7617961,56.5016901 L35.7617961,57.7033803 L34.4278155,57.7033803 L34.4278155,64.5352113 L33.0493689,64.5352113 L33.0493689,57.7033803 L31.7153883,57.7033803 L31.7153883,56.5016901 Z M35.5728155,61.0302817 L38.2963592,61.0302817 L38.2963592,62.0539437 L35.5728155,62.0539437 L35.5728155,61.0302817 Z M39.6414563,56.5016901 L41.0199029,56.5016901 L41.0199029,64.5352113 L39.6414563,64.5352113 L39.6414563,56.5016901 Z M42.476165,56.5016901 L43.8546117,56.5016901 L43.8546117,63.3335211 L46.0223301,63.3335211 L46.0223301,64.5352113 L42.476165,64.5352113 L42.476165,56.5016901 Z M48.7681068,56.3904225 C49.8464078,56.3904225 50.5467476,57.113662 50.6912621,58.3376056 L49.3795146,58.4822535 C49.3350485,57.8925352 49.0349029,57.5921127 48.6458252,57.5921127 C48.201165,57.5921127 47.9566019,57.8814085 47.9566019,58.3709859 C47.9566019,58.8605634 48.2789806,59.2833803 48.9348544,59.8174648 C50.5467476,61.1192958 50.7579612,61.8759155 50.7579612,62.5880282 C50.7579612,63.8787324 49.9131068,64.6464789 48.5791262,64.6464789 C47.4230097,64.6464789 46.5781553,63.7674648 46.5114563,62.4211268 L47.8232039,62.2319718 C47.8787864,63.0553521 48.201165,63.4447887 48.6569417,63.4447887 C49.123835,63.4447887 49.4462136,63.1888732 49.4462136,62.7104225 C49.4462136,62.1652113 49.1016019,61.6867606 48.4679612,61.1749296 C47.2451456,60.1846479 46.6448544,59.5170423 46.6448544,58.3932394 C46.6448544,57.113662 47.4230097,56.3904225 48.7681068,56.3904225 Z M7.05898058,69.8538028 L8.77092233,69.8538028 L10.2494175,77.8873239 L8.91543689,77.8873239 L8.67087379,76.1070423 L7.15902913,76.1070423 L6.91446602,77.8873239 L5.58048544,77.8873239 L7.05898058,69.8538028 Z M7.92606796,71.4560563 L7.90383495,71.4560563 L7.35912621,74.9053521 L8.4707767,74.9053521 L7.92606796,71.4560563 Z M10.9719903,69.8538028 L12.7839806,69.8538028 L13.762233,74.5492958 L13.784466,74.5492958 L14.7627184,69.8538028 L16.5747087,69.8538028 L16.5747087,77.8873239 L15.3741262,77.8873239 L15.3741262,71.611831 L15.3518932,71.611831 L14.1068447,77.8873239 L13.4398544,77.8873239 L12.1948058,71.611831 L12.1725728,71.611831 L12.1725728,77.8873239 L10.9719903,77.8873239 L10.9719903,69.8538028 Z M17.8419903,69.8538028 L21.5326699,69.8538028 L21.5326699,71.055493 L19.2204369,71.055493 L19.2204369,73.1250704 L20.9990777,73.1250704 L20.9990777,74.3267606 L19.2204369,74.3267606 L19.2204369,76.6856338 L21.688301,76.6856338 L21.688301,77.8873239 L17.8419903,77.8873239 L17.8419903,69.8538028 Z M19.8651942,67.8287324 L21.3659223,67.8287324 L19.9096602,69.4309859 L18.9869903,69.4309859 L19.8651942,67.8287324 Z M22.7110194,69.8538028 L24.089466,69.8538028 L24.089466,76.6856338 L26.2571845,76.6856338 L26.2571845,77.8873239 L22.7110194,77.8873239 L22.7110194,69.8538028 Z M27.2910194,69.8538028 L28.669466,69.8538028 L28.669466,77.8873239 L27.2910194,77.8873239 L27.2910194,69.8538028 Z M32.3045631,69.7425352 C33.6718932,69.7425352 34.416699,70.5992958 34.416699,71.7676056 L34.416699,75.9735211 C34.416699,77.1084507 33.7052427,77.9985915 32.3045631,77.9985915 C30.915,77.9985915 30.1924272,77.1195775 30.1924272,75.9735211 L30.1924272,71.7787324 C30.1924272,70.6104225 30.9261165,69.7425352 32.3045631,69.7425352 Z M31.5708738,71.7898592 L31.5708738,75.9401408 C31.5708738,76.5298592 31.7820874,76.7969014 32.3045631,76.7969014 C32.8826214,76.7969014 33.0382524,76.4630986 33.0382524,75.9401408 L33.0382524,71.8009859 C33.0382524,71.333662 32.9270874,70.9442254 32.3045631,70.9442254 C31.8154369,70.9442254 31.5708738,71.1667606 31.5708738,71.7898592 Z M35.7506796,69.8538028 L37.740534,69.8538028 C39.2412621,69.8538028 40.0194175,70.5325352 40.0194175,72.2238028 C40.0194175,73.2697183 39.7081553,73.9373239 39.0522816,74.2488732 L40.2195146,77.8873239 L38.818835,77.8873239 L37.8405825,74.5604225 C37.6627184,74.5826761 37.4403883,74.5938028 37.1291262,74.5938028 L37.1291262,77.8873239 L35.7506796,77.8873239 L35.7506796,69.8538028 Z M37.1291262,70.9887324 L37.1291262,73.4588732 L37.6516019,73.4588732 C38.3852913,73.4588732 38.6409709,73.1584507 38.6409709,72.2238028 C38.6409709,71.2891549 38.4075243,70.9887324 37.5960194,70.9887324 L37.1291262,70.9887324 Z M41.308932,69.8538028 L44.9996117,69.8538028 L44.9996117,71.055493 L42.6873786,71.055493 L42.6873786,73.1250704 L44.4660194,73.1250704 L44.4660194,74.3267606 L42.6873786,74.3267606 L42.6873786,76.6856338 L45.1552427,76.6856338 L45.1552427,77.8873239 L41.308932,77.8873239 L41.308932,69.8538028 Z M46.2446602,69.8538028 L48.2345146,69.8538028 C49.7352427,69.8538028 50.5133981,70.5325352 50.5133981,72.2238028 C50.5133981,73.2697183 50.2021359,73.9373239 49.5462621,74.2488732 L50.7134951,77.8873239 L49.3128155,77.8873239 L48.3345631,74.5604225 C48.156699,74.5826761 47.9343689,74.5938028 47.6231068,74.5938028 L47.6231068,77.8873239 L46.2446602,77.8873239 L46.2446602,69.8538028 Z M47.6231068,70.9887324 L47.6231068,73.4588732 L48.1455825,73.4588732 C48.8792718,73.4588732 49.1349515,73.1584507 49.1349515,72.2238028 C49.1349515,71.2891549 48.9015049,70.9887324 48.09,70.9887324 L47.6231068,70.9887324 Z" id="PEUVENT-ILSAMÉLIORER"></path>
                    <path d="M38.8521845,0.756619718 C40.1305825,0.756619718 40.8976214,1.65788732 40.8976214,2.93746479 L40.8976214,3.54943662 L39.5191748,3.54943662 L39.5191748,2.93746479 C39.5191748,2.33661972 39.2746117,1.95830986 38.8521845,1.95830986 C38.3297087,1.95830986 38.1184951,2.21422535 38.1184951,2.80394366 L38.1184951,6.95422535 C38.1184951,7.54394366 38.3297087,7.81098592 38.8521845,7.81098592 C39.3968932,7.81098592 39.5191748,7.45492958 39.5191748,7.03211268 L39.5191748,6.03070423 L40.8976214,6.03070423 L40.8976214,6.98760563 C40.8976214,8.12253521 40.1750485,9.01267606 38.8521845,9.01267606 C37.4626214,9.01267606 36.7400485,8.13366197 36.7400485,6.98760563 L36.7400485,2.78169014 C36.7400485,1.61338028 37.4848544,0.756619718 38.8521845,0.756619718 Z M44.4104369,0.756619718 C45.777767,0.756619718 46.5225728,1.61338028 46.5225728,2.78169014 L46.5225728,6.98760563 C46.5225728,8.12253521 45.8111165,9.01267606 44.4104369,9.01267606 C43.0208738,9.01267606 42.298301,8.13366197 42.298301,6.98760563 L42.298301,2.7928169 C42.298301,1.62450704 43.0319903,0.756619718 44.4104369,0.756619718 Z M43.6767476,2.80394366 L43.6767476,6.95422535 C43.6767476,7.54394366 43.8879612,7.81098592 44.4104369,7.81098592 C44.9884951,7.81098592 45.1441262,7.4771831 45.1441262,6.95422535 L45.1441262,2.81507042 C45.1441262,2.34774648 45.0329612,1.95830986 44.4104369,1.95830986 C43.9213107,1.95830986 43.6767476,2.18084507 43.6767476,2.80394366 Z M47.7787379,0.867887324 L49.5907282,0.867887324 L50.5689806,5.56338028 L50.5912136,5.56338028 L51.569466,0.867887324 L53.3814563,0.867887324 L53.3814563,8.90140845 L52.1808738,8.90140845 L52.1808738,2.62591549 L52.1586408,2.62591549 L50.9135922,8.90140845 L50.2466019,8.90140845 L49.0015534,2.62591549 L48.9793204,2.62591549 L48.9793204,8.90140845 L47.7787379,8.90140845 L47.7787379,0.867887324 Z M54.5709223,0.867887324 L56.3829126,0.867887324 L57.361165,5.56338028 L57.3833981,5.56338028 L58.3616505,0.867887324 L60.1736408,0.867887324 L60.1736408,8.90140845 L58.9730583,8.90140845 L58.9730583,2.62591549 L58.9508252,2.62591549 L57.7057767,8.90140845 L57.0387864,8.90140845 L55.7937379,2.62591549 L55.7715049,2.62591549 L55.7715049,8.90140845 L54.5709223,8.90140845 L54.5709223,0.867887324 Z M61.4409223,0.867887324 L65.1316019,0.867887324 L65.1316019,2.06957746 L62.8193689,2.06957746 L62.8193689,4.13915493 L64.5980097,4.13915493 L64.5980097,5.34084507 L62.8193689,5.34084507 L62.8193689,7.69971831 L65.287233,7.69971831 L65.287233,8.90140845 L61.4409223,8.90140845 L61.4409223,0.867887324 Z M66.3766505,0.867887324 L67.6550485,0.867887324 L69.3336408,5.46323944 L69.3558738,5.46323944 L69.3558738,0.867887324 L70.6009223,0.867887324 L70.6009223,8.90140845 L69.4003398,8.90140845 L67.643932,3.88323944 L67.621699,3.88323944 L67.621699,8.90140845 L66.3766505,8.90140845 L66.3766505,0.867887324 Z M71.4013107,0.867887324 L75.4477184,0.867887324 L75.4477184,2.06957746 L74.1137379,2.06957746 L74.1137379,8.90140845 L72.7352913,8.90140845 L72.7352913,2.06957746 L71.4013107,2.06957746 L71.4013107,0.867887324 Z" id="COMMENT"></path>
                </g>
            </g>
        </g>
    </g>
</svg>