<?xml version="1.0" encoding="UTF-8"?>
<svg width="22px" height="14px" viewBox="0 0 22 14" version="1.1" xmlns="http://www.w3.org/2000/svg" xmlns:xlink="http://www.w3.org/1999/xlink">
    <!-- Generator: Sketch 47.1 (45422) - http://www.bohemiancoding.com/sketch -->
    <title>face</title>
    <desc>Created with Sketch.</desc>
    <defs>
        <polygon id="path-1" points="0 0.0199003831 0 0.940923372 0.80562503 0.940923372 0.80562503 0.0199003831"></polygon>
        <polygon id="path-3" points="0.752608505 0.965517241 0.00153438639 0.965517241 0.00153438639 0.0158881226 0.752608505 0.0158881226"></polygon>
    </defs>
    <g id="Symbols" stroke="none" stroke-width="1" fill="none" fill-rule="evenodd">
        <g id="logos" transform="translate(-113.000000, -50.000000)">
            <g id="medias" transform="translate(2.000000, 43.000000)">
                <g id="face" transform="translate(111.000000, 7.000000)">
                    <g id="Group-3" transform="translate(0.000000, 12.802785)">
                        <mask id="mask-2" fill="white">
                            <use xlink:href="#path-1"></use>
                        </mask>
                        <g id="Clip-2"></g>
                        <path d="M0.290857108,0.735724138 C0.290857108,0.789203065 0.296631106,0.820689655 0.307377157,0.830693487 C0.31561045,0.839007663 0.326383232,0.843915709 0.339588578,0.845578544 C0.352820656,0.847214559 0.382572783,0.848475096 0.428844957,0.848475096 L0.547826731,0.848475096 C0.610618955,0.848475096 0.652774484,0.839785441 0.67343791,0.823586207 C0.694074605,0.807038314 0.704820656,0.77345977 0.704820656,0.722877395 C0.704820656,0.709628352 0.703991981,0.693831418 0.703163305,0.676452107 C0.701532685,0.641237548 0.700677278,0.620076628 0.700677278,0.61262069 C0.700677278,0.573249042 0.716368651,0.553750958 0.748606804,0.553750958 C0.786592224,0.553750958 0.80562503,0.572015326 0.80562503,0.608088123 C0.80562503,0.619272031 0.804796355,0.627586207 0.803967679,0.634183908 L0.794050304,0.703862069 C0.791591009,0.723735632 0.789906926,0.744413793 0.789906926,0.766808429 C0.789906926,0.779252874 0.791591009,0.798295019 0.793221628,0.823183908 C0.795734386,0.848072797 0.797365006,0.867114943 0.797365006,0.879559387 C0.797365006,0.92062069 0.774215553,0.940923372 0.727943378,0.940923372 C0.718854678,0.940923372 0.697389307,0.939233716 0.665151154,0.936337165 C0.643659052,0.935157088 0.609790279,0.933038314 0.56434678,0.931804598 L0.46271373,0.931804598 L0.244584933,0.931804598 C0.223092831,0.931804598 0.186738032,0.933440613 0.13634921,0.937195402 C0.12889113,0.937195402 0.116514459,0.937570881 0.0983370595,0.939233716 C0.0809616039,0.940091954 0.066927582,0.940923372 0.0570102066,0.940923372 C0.0189980559,0.940923372 -8.01944107e-06,0.925126437 -8.01944107e-06,0.892003831 C-8.01944107e-06,0.862957854 0.0140527339,0.848475096 0.0421475091,0.848475096 C0.0495788578,0.848475096 0.0603249089,0.849735632 0.0743589307,0.852605364 C0.0892216282,0.855126437 0.0999676792,0.856386973 0.107399028,0.856386973 C0.153671203,0.856386973 0.176847388,0.82237931 0.176847388,0.754417625 L0.176847388,0.206835249 C0.176847388,0.14008046 0.153671203,0.106099617 0.107399028,0.106099617 C0.0950223572,0.106099617 0.0851049818,0.106957854 0.0793042527,0.10859387 C0.0644682868,0.111517241 0.0520648846,0.112724138 0.0421475091,0.112724138 C0.030599514,0.112724138 0.020655407,0.10859387 0.0123953827,0.0999042146 C0.00413535844,0.0912145594 -8.01944107e-06,0.0804061303 -8.01944107e-06,0.0679885057 C-8.01944107e-06,0.0360191571 0.0189980559,0.0199003831 0.0586675577,0.0199003831 C0.0636128797,0.0199003831 0.0710709599,0.0202758621 0.0793042527,0.0215363985 L0.151211908,0.0298505747 C0.190881409,0.0339808429 0.219778129,0.0364750958 0.23961288,0.0364750958 C0.262762333,0.0364750958 0.291659052,0.0339808429 0.326383232,0.0298505747 L0.389175456,0.0215363985 C0.395778129,0.0202758621 0.402380802,0.0199003831 0.40652418,0.0199003831 C0.447824301,0.0199003831 0.467685784,0.0360191571 0.467685784,0.0679885057 C0.467685784,0.0804061303 0.463542406,0.0912145594 0.455282382,0.0999042146 C0.447824301,0.10859387 0.437104982,0.112724138 0.425530255,0.112724138 C0.416441555,0.112724138 0.40489356,0.111517241 0.389175456,0.10859387 C0.382572783,0.106957854 0.372655407,0.106099617 0.360252005,0.106099617 C0.31397983,0.106099617 0.290857108,0.139302682 0.290857108,0.20640613 L0.290857108,0.735724138 Z" id="Fill-1" fill="#FFFFFF" mask="url(#mask-2)"></path>
                    </g>
                    <path d="M1.01632783,13.3018184 C1.01632783,13.3142628 1.0262452,13.3209142 1.04607995,13.3209142 L1.3724712,13.3209142 C1.39145055,13.3209142 1.40136792,13.3142628 1.40136792,13.3018184 C1.40136792,13.2537303 1.38319052,13.2114621 1.34600705,13.1762475 C1.30965225,13.1409793 1.26749672,13.1231977 1.21793657,13.1231977 C1.16752102,13.1231977 1.12042017,13.1414352 1.07912005,13.1783395 C1.03696452,13.2152169 1.01632783,13.2562513 1.01632783,13.3018184 M1.50960365,13.3357992 C1.50960365,13.3706383 1.50797303,13.3917724 1.50297424,13.3996575 C1.49888433,13.4071134 1.4848503,13.4108682 1.46333147,13.4108682 L1.0295599,13.4108682 C1.01798518,13.4108682 1.00972515,13.4129333 1.00641045,13.4162858 C1.00309575,13.4191556 1.0014384,13.4245464 1.0014384,13.4315732 C1.0014384,13.4999908 1.02129988,13.5571977 1.0626,13.603167 C1.10307145,13.6487877 1.15428894,13.6715579 1.21545055,13.6715579 C1.25512005,13.6715579 1.29233026,13.6608031 1.32534362,13.6392667 C1.35841045,13.616872 1.37990255,13.5895157 1.3897932,13.555508 L1.40222333,13.5157341 C1.408826,13.4941977 1.42366197,13.4833893 1.44678469,13.4833893 C1.48070693,13.4833893 1.49805565,13.5008222 1.49805565,13.5352054 C1.49805565,13.5944774 1.46744812,13.6466958 1.4079706,13.6927456 C1.3476644,13.7387149 1.27990012,13.7619142 1.20390255,13.7619142 C1.10884544,13.7619142 1.03284787,13.729623 0.976658323,13.6657379 C0.920468773,13.6010751 0.892373998,13.5153318 0.892373998,13.4067111 C0.892373998,13.2959985 0.922126124,13.2056421 0.982459052,13.1369027 C1.04193657,13.0676268 1.11961823,13.0332169 1.21630595,13.0332169 C1.30139222,13.0332169 1.3716158,13.0614046 1.42694994,13.1186383 C1.48236428,13.1758184 1.50960365,13.2483931 1.50960365,13.3357992" id="Fill-4" fill="#FFFFFF"></path>
                    <path d="M1.89631179,13.0332276 C1.95747339,13.0332276 2.00788894,13.0489709 2.04833366,13.0809134 L2.04833366,13.0755226 C2.04833366,13.0415418 2.06322309,13.0249134 2.09211981,13.0249134 C2.12187193,13.0249134 2.13676136,13.039423 2.13676136,13.0680667 C2.13676136,13.0738866 2.13590595,13.087967 2.13510401,13.1095034 C2.13184277,13.127741 2.13013196,13.1459785 2.13013196,13.1642429 C2.13013196,13.1750245 2.13098736,13.1907678 2.13347339,13.2114728 C2.13590595,13.233036 2.13676136,13.248377 2.13676136,13.2595341 C2.13676136,13.2943732 2.12187193,13.3109479 2.09297521,13.3109479 C2.06402503,13.3109479 2.04918906,13.2968674 2.04833366,13.2678215 L2.04833366,13.2226299 C2.04753171,13.1953272 2.03178688,13.1720743 2.00125954,13.1526299 C1.97067874,13.1327295 1.93515261,13.1231816 1.89382576,13.1231816 C1.85252564,13.1231816 1.81699951,13.1335341 1.78890474,13.1550705 C1.76080996,13.1762582 1.74677594,13.2032123 1.74677594,13.2346989 C1.74677594,13.2931126 1.78641871,13.3275762 1.86655966,13.3383042 L1.94587193,13.3494881 C2.10037983,13.370649 2.17806148,13.4349096 2.17806148,13.5422429 C2.17806148,13.6077372 2.15245273,13.6603579 2.10289259,13.7010437 C2.05333244,13.7412199 1.98802746,13.7619249 1.90785978,13.7619249 C1.83269089,13.7619249 1.76738591,13.7403617 1.71205176,13.6973157 L1.71205176,13.7233847 C1.71205176,13.7561318 1.69716233,13.7727065 1.66575286,13.7727065 C1.63273949,13.7727065 1.61619271,13.7540667 1.61619271,13.7167333 C1.61619271,13.7229824 1.61870547,13.699354 1.62447947,13.6458751 C1.62611009,13.6330284 1.62691203,13.6201816 1.62691203,13.6077372 C1.62691203,13.5857985 1.62530814,13.565469 1.62113803,13.5459977 C1.61785006,13.5269019 1.61619271,13.5115877 1.61619271,13.500833 C1.61619271,13.4692927 1.63025346,13.4535494 1.65917691,13.4535494 C1.67901166,13.4535494 1.69058639,13.4577065 1.69550498,13.4668521 C1.70047704,13.4759441 1.70298979,13.4999747 1.70462041,13.5393732 C1.70542236,13.5782889 1.72525711,13.6102314 1.76575529,13.6351203 C1.80545152,13.6591778 1.85581361,13.6715686 1.91783062,13.6715686 C1.96241871,13.6715686 1.99877351,13.6603579 2.02772369,13.6375609 C2.05744909,13.6147908 2.07150984,13.5862008 2.07150984,13.5513617 C2.07150984,13.489649 2.02272491,13.4539517 1.92440656,13.4435992 C1.83106027,13.4336759 1.75995456,13.4154115 1.71119635,13.3884843 C1.66246488,13.3615303 1.63768481,13.3142736 1.63768481,13.2471433 C1.63768481,13.1832851 1.66163621,13.1318981 1.70956574,13.0920973 C1.75752199,13.053128 1.81948554,13.0332276 1.89631179,13.0332276" id="Fill-6" fill="#FFFFFF"></path>
                    <path d="M2.74323426,13.3018184 C2.74323426,13.3142628 2.75315164,13.3209142 2.7738418,13.3209142 L3.09940437,13.3209142 C3.11923913,13.3209142 3.12830109,13.3142628 3.12830109,13.3018184 C3.12830109,13.2537303 3.11012369,13.2114621 3.07374216,13.1762475 C3.03738736,13.1409793 2.99445662,13.1231977 2.94567169,13.1231977 C2.89448092,13.1231977 2.84818202,13.1414352 2.80605322,13.1783395 C2.76389769,13.2152169 2.74323426,13.2562513 2.74323426,13.3018184 M3.23739222,13.3357992 C3.23739222,13.3706383 3.2349062,13.3917724 3.22993414,13.3996575 C3.22579077,13.4071134 3.21258542,13.4108682 3.19112005,13.4108682 L2.75729502,13.4108682 C2.74491835,13.4108682 2.73746027,13.4129333 2.7341723,13.4162858 C2.73002892,13.4191556 2.7283983,13.4245464 2.7283983,13.4315732 C2.7283983,13.4999908 2.74900826,13.5571977 2.78950644,13.603167 C2.83080656,13.6487877 2.88207752,13.6715579 2.94238372,13.6715579 C2.98282843,13.6715579 3.01920996,13.6608031 3.05227679,13.6392667 C3.08534362,13.616872 3.10761094,13.5895157 3.11752831,13.555508 L3.12910304,13.5157341 C3.13573244,13.4941977 3.15062187,13.4833893 3.17457327,13.4833893 C3.20844204,13.4833893 3.22498882,13.5008222 3.22498882,13.5352054 C3.22498882,13.5944774 3.19526343,13.6466958 3.1349305,13.6927456 C3.07539951,13.7387149 3.00766197,13.7619142 2.93083572,13.7619142 C2.83577861,13.7619142 2.76055626,13.729623 2.70442017,13.6657379 C2.64740194,13.6010751 2.61930717,13.5153318 2.61930717,13.4067111 C2.61930717,13.2959985 2.64988797,13.2056421 2.70936549,13.1369027 C2.76969842,13.0676268 2.84735334,13.0332169 2.94318566,13.0332169 C3.02832539,13.0332169 3.09940437,13.0614046 3.15476525,13.1186383 C3.20929745,13.1758184 3.23739222,13.2483931 3.23739222,13.3357992" id="Fill-8" fill="#FFFFFF"></path>
                    <path d="M3.54558469,13.0978931 L3.54558469,13.1368893 C3.60091883,13.0676134 3.67279976,13.0332303 3.76371349,13.0332303 C3.81244496,13.0332303 3.85871713,13.0456747 3.90250328,13.0705636 C3.94548748,13.0953989 3.97523961,13.1268854 3.99093098,13.1642456 C4.00333439,13.1949008 4.00996379,13.235077 4.00996379,13.2852571 L4.00996379,13.5447667 C4.00996379,13.5836824 4.00996379,13.6069352 4.01159441,13.6143912 C4.01573779,13.6454755 4.02814119,13.6607897 4.04794921,13.6607897 C4.05623597,13.6607897 4.06692855,13.6599582 4.08018736,13.657464 C4.09259077,13.6549966 4.10245468,13.6541651 4.10745346,13.6541651 C4.11983013,13.6541651 4.12974751,13.6579199 4.13803426,13.6662073 C4.14709623,13.6740387 4.15121288,13.6844448 4.15121288,13.6964333 C4.15121288,13.7101383 4.14629429,13.7213222 4.13474629,13.730441 C4.12397351,13.7395866 4.11074143,13.7437169 4.09587874,13.7437169 C4.08261993,13.7437169 4.06200996,13.7420272 4.03305978,13.7383261 C4.00416306,13.7345713 3.97687023,13.7329352 3.95126148,13.7329352 C3.92816549,13.7329352 3.90827728,13.7337398 3.89263937,13.7358318 C3.84716914,13.7412226 3.82319101,13.7437169 3.82070498,13.7437169 C3.78435018,13.7437169 3.76619951,13.7279199 3.76619951,13.6964333 C3.76619951,13.6678701 3.78189089,13.6541651 3.81330036,13.6541651 C3.82070498,13.6541651 3.82899174,13.6549966 3.83802697,13.6566594 C3.85628457,13.6603605 3.86697716,13.6624793 3.87197594,13.6624793 C3.89421652,13.6624793 3.90584471,13.6367858 3.90747533,13.5869812 L3.90747533,13.5173835 L3.90747533,13.4344563 L3.90747533,13.3308778 C3.90747533,13.2819046 3.90584471,13.248782 3.90087266,13.2305444 C3.89263937,13.1961613 3.87526391,13.1691805 3.84799781,13.1505406 C3.81821896,13.1294065 3.78435018,13.119054 3.74639149,13.119054 C3.67445711,13.119054 3.62241094,13.1447207 3.59102819,13.1965636 C3.56953609,13.2322073 3.55798809,13.2927398 3.55798809,13.3780808 L3.55798809,13.5596517 C3.55798809,13.5994793 3.56127606,13.6268356 3.56619465,13.6417743 C3.57204885,13.6558816 3.58188603,13.6633107 3.59594678,13.6633107 C3.60343159,13.6633107 3.61334897,13.6616747 3.62575237,13.6587513 C3.63893098,13.6558816 3.64970377,13.6541651 3.65791033,13.6541651 C3.6860051,13.6541651 3.70006586,13.6691038 3.70006586,13.6997322 C3.70006586,13.7291805 3.68108651,13.7437169 3.64556039,13.7437169 C3.63807558,13.7437169 3.61417764,13.7412226 3.57448141,13.7358318 C3.55464666,13.7329352 3.53232588,13.7316747 3.50757254,13.7316747 C3.48853973,13.7316747 3.46373293,13.7333107 3.43154824,13.7370655 C3.39190547,13.7416249 3.36961142,13.7437169 3.36381069,13.7437169 C3.32574508,13.7437169 3.30676574,13.7283759 3.30676574,13.6973184 C3.30676574,13.6682724 3.3216819,13.6541651 3.35057861,13.6541651 C3.35555067,13.6541651 3.36381069,13.6553989 3.37618736,13.6579199 C3.38856403,13.6607897 3.40096744,13.6624793 3.41339757,13.6624793 C3.44063694,13.6624793 3.4554729,13.6355253 3.45632831,13.5829046 L3.45632831,13.4311575 L3.45632831,13.2661613 L3.45632831,13.2189582 C3.45467096,13.1874716 3.45055431,13.166713 3.44478032,13.1550732 C3.43812418,13.143487 3.42823354,13.1380962 3.41339757,13.1380962 C3.40676817,13.1380962 3.39767947,13.1393835 3.38527606,13.141851 C3.37204399,13.1447207 3.36295529,13.1459812 3.35635261,13.1459812 C3.32333925,13.1459812 3.30676574,13.1310693 3.30676574,13.1016747 C3.30676574,13.0713682 3.32745589,13.0564563 3.36790061,13.0564563 C3.37367461,13.0564563 3.37787145,13.0568854 3.38115942,13.0577169 L3.43154824,13.063054 C3.44641094,13.063054 3.45881434,13.0618203 3.46953366,13.0597552 C3.49353852,13.0572609 3.50588846,13.0564563 3.50674386,13.0564563 C3.53232588,13.0564563 3.54558469,13.0701077 3.54558469,13.0978931" id="Fill-10" fill="#FFFFFF"></path>
                    <path d="M4.58256525,13.5501146 L4.58256525,13.462628 C4.58336719,13.4253751 4.59988724,13.4067084 4.63126999,13.4067084 C4.6635616,13.4067084 4.67925298,13.4278425 4.67925298,13.4697352 C4.67925298,13.568808 4.66599417,13.6380034 4.64124083,13.6774019 C4.60651665,13.7296203 4.5503271,13.7561452 4.47267217,13.7561452 C4.39993584,13.7561452 4.34871835,13.7329192 4.31813755,13.6864939 C4.29581677,13.6529153 4.28426877,13.5957352 4.28426877,13.5149268 L4.28426877,13.1874824 C4.28426877,13.1683866 4.27600875,13.1584364 4.25783135,13.1584364 L4.21318979,13.1584364 C4.19915577,13.1584364 4.18672564,13.1534747 4.17688846,13.1443291 C4.16691762,13.134808 4.16199903,13.123195 4.16199903,13.10949 C4.16199903,13.0966701 4.16691762,13.0850571 4.17603305,13.075536 C4.18595043,13.0655858 4.19669648,13.0601682 4.2082712,13.0601682 L4.26117278,13.0601682 C4.27681069,13.0601682 4.28426877,13.0514785 4.28426877,13.0344747 L4.28426877,12.893992 C4.28426877,12.8591529 4.30244617,12.8417199 4.3379723,12.8417199 C4.37021045,12.8417199 4.3867305,12.8591529 4.3867305,12.893992 L4.3867305,13.0398923 C4.3867305,13.0531414 4.39496379,13.0601682 4.41070863,13.0601682 L4.55944253,13.0601682 C4.59411324,13.0601682 4.61066002,13.0763674 4.61066002,13.107854 C4.61066002,13.1418349 4.59248262,13.1584364 4.55527242,13.1584364 L4.40570984,13.1584364 C4.39330644,13.1584364 4.3867305,13.1683866 4.3867305,13.1874824 L4.3867305,13.5227582 C4.3867305,13.6185322 4.41813998,13.666218 4.48173414,13.666218 C4.54621045,13.666218 4.57927728,13.6276778 4.58256525,13.5501146" id="Fill-12" fill="#FFFFFF"></path>
                    <path d="M4.95356865,13.0950126 L4.95356865,13.1327215 C5.00064277,13.0664226 5.06346173,13.0332195 5.142774,13.0332195 C5.20642163,13.0332195 5.25763913,13.0506257 5.2972819,13.0866985 C5.33692467,13.1227981 5.35675942,13.1691966 5.35675942,13.2251697 C5.35675942,13.2653996 5.34684204,13.2977176 5.32617861,13.3230088 C5.30634386,13.3482732 5.27993317,13.3606908 5.24772175,13.3606908 C5.22625638,13.3606908 5.20885419,13.3540931 5.19482017,13.3412195 C5.17993074,13.3288019 5.17249939,13.313005 5.17249939,13.2952234 C5.17249939,13.2802579 5.17832685,13.2674379 5.18904617,13.256254 C5.19979222,13.244641 5.21219563,13.2388479 5.22703159,13.2388479 C5.22954435,13.2388479 5.23531835,13.2404839 5.24523572,13.243005 C5.25015431,13.2321966 5.25264034,13.2222464 5.25264034,13.2131544 C5.25264034,13.1866027 5.24109235,13.1642349 5.21799635,13.1459705 C5.19482017,13.1281889 5.16592345,13.1190433 5.13200122,13.1190433 C5.0609757,13.1190433 5.01384812,13.1509858 4.99072539,13.2143345 C4.97588943,13.253733 4.96840462,13.3126027 4.96840462,13.3917751 L4.96840462,13.4817291 C4.96840462,13.5431199 4.96926002,13.5771008 4.97011543,13.5845567 C4.97503402,13.6363728 4.98909478,13.6624686 5.01304617,13.6624686 C5.0246209,13.6624686 5.0370243,13.6603498 5.04940097,13.6574801 C5.06017375,13.6550126 5.06838032,13.6541812 5.07581166,13.6541812 C5.10476185,13.6541812 5.11965128,13.6682617 5.11965128,13.6968249 C5.11965128,13.727936 5.10061847,13.7437061 5.06346173,13.7437061 L5.05848967,13.7437061 C5.04528433,13.7437061 5.0246209,13.7420165 4.99649939,13.7391467 C4.96926002,13.7358479 4.9485966,13.7345874 4.93453584,13.7345874 C4.89818104,13.7345874 4.87008627,13.7354456 4.84944957,13.7370548 L4.7725966,13.7437061 C4.73538639,13.7437061 4.71726245,13.727936 4.71726245,13.6964494 C4.71726245,13.6678594 4.73458445,13.6541812 4.76930863,13.6541812 C4.7783706,13.6541812 4.785,13.6541812 4.78991859,13.6554149 L4.81060875,13.6591697 C4.81967072,13.661664 4.82547145,13.6624686 4.82964156,13.6624686 C4.85276428,13.6624686 4.86514095,13.6413077 4.8667983,13.5994954 L4.8667983,13.5298172 L4.86265492,13.2197521 C4.86016889,13.1662732 4.84610814,13.1393728 4.82215674,13.1393728 C4.81475213,13.1393728 4.80483475,13.1402042 4.79157594,13.1426716 C4.779226,13.1451927 4.76930863,13.1459705 4.76185055,13.1459705 C4.73209842,13.1459705 4.71726245,13.13189 4.71726245,13.1033 C4.71726245,13.0722157 4.7362418,13.0564724 4.77508262,13.0564724 C4.785,13.0564724 4.79820535,13.057277 4.81638275,13.0597713 C4.83456015,13.0618364 4.84776549,13.0630701 4.85688092,13.0630701 C4.86431227,13.0630701 4.87586027,13.0618364 4.89240705,13.0597713 C4.89986513,13.057277 4.90809842,13.0564724 4.91884447,13.0564724 C4.94202066,13.0564724 4.95356865,13.0689169 4.95356865,13.0950126" id="Fill-14" fill="#FFFFFF"></path>
                    <path d="M5.54022284,13.3018184 C5.54022284,13.3142628 5.55014022,13.3209142 5.56997497,13.3209142 L5.89633949,13.3209142 C5.9153723,13.3209142 5.92523621,13.3142628 5.92523621,13.3018184 C5.92523621,13.2537303 5.90711227,13.2114621 5.87073074,13.1762475 C5.83352053,13.1409793 5.79139174,13.1231977 5.74183159,13.1231977 C5.69061409,13.1231977 5.64434192,13.1414352 5.6030418,13.1783395 C5.56088627,13.2152169 5.54022284,13.2562513 5.54022284,13.3018184 M6.03352539,13.3357992 C6.03352539,13.3706383 6.03103937,13.3917724 6.02692272,13.3996575 C6.02277934,13.4071134 6.00871859,13.4108682 5.98719976,13.4108682 L5.55342819,13.4108682 C5.54188019,13.4108682 5.53444885,13.4129333 5.53030547,13.4162858 C5.52696403,13.4191556 5.52533341,13.4245464 5.52533341,13.4315732 C5.52533341,13.4999908 5.54516817,13.5571977 5.58649502,13.603167 C5.62779514,13.6487877 5.67821069,13.6715579 5.73931883,13.6715579 C5.77898834,13.6715579 5.81619854,13.6608031 5.84921191,13.6392667 C5.88227874,13.616872 5.90377084,13.5895157 5.91368821,13.555508 L5.92609162,13.5157341 C5.93272102,13.4941977 5.94755699,13.4833893 5.97070644,13.4833893 C6.00460194,13.4833893 6.02112199,13.5008222 6.02112199,13.5352054 C6.02112199,13.5944774 5.99136987,13.6466958 5.93186561,13.6927456 C5.87238809,13.7387149 5.80379514,13.7619142 5.72777084,13.7619142 C5.63271373,13.7619142 5.55671616,13.729623 5.50052661,13.6657379 C5.44433706,13.6010751 5.41629575,13.5153318 5.41629575,13.4067111 C5.41629575,13.2959985 5.44602114,13.2056421 5.50635407,13.1369027 C5.56583159,13.0676268 5.64348651,13.0332169 5.74017424,13.0332169 C5.82531397,13.0332169 5.89551081,13.0614046 5.95089842,13.1186383 C6.00623256,13.1758184 6.03352539,13.2483931 6.03352539,13.3357992" id="Fill-16" fill="#FFFFFF"></path>
                    <g id="Group-20" transform="translate(6.094775, 13.017345)">
                        <mask id="mask-4" fill="white">
                            <use xlink:href="#path-3"></use>
                        </mask>
                        <g id="Clip-19"></g>
                        <path d="M0.268421385,0.244688889 C0.260161361,0.280359387 0.255162576,0.323459004 0.254387363,0.374443678 C0.254387363,0.378198467 0.254387363,0.384849808 0.252730012,0.395175479 L0.252730012,0.413815326 C0.252730012,0.47520613 0.25850401,0.519110345 0.268421385,0.547298084 C0.278338761,0.574654406 0.298173512,0.599516475 0.327898906,0.621911111 C0.356849089,0.64344751 0.394005832,0.654229119 0.437791981,0.654229119 C0.503096962,0.654229119 0.553459052,0.630225287 0.589813852,0.582539464 C0.625393439,0.53485364 0.643517375,0.466891954 0.643517375,0.379029885 C0.643517375,0.196600766 0.579121264,0.105842146 0.449339976,0.105842146 C0.405553827,0.105842146 0.366766464,0.118688889 0.332897691,0.145240613 C0.299028919,0.171765517 0.277483354,0.204914943 0.268421385,0.244688889 M0.247757959,0.078056705 L0.247757959,0.122041379 C0.298173512,0.0507272031 0.368397084,0.0158881226 0.45596938,0.0158881226 C0.546027704,0.0158881226 0.618764034,0.0469724138 0.672467558,0.109543295 C0.725369137,0.172570115 0.752608505,0.257964751 0.752608505,0.364922605 C0.752608505,0.480596935 0.723711786,0.572616092 0.667522236,0.641409195 C0.61050401,0.7098 0.534479708,0.744585441 0.439476063,0.744585441 C0.360965735,0.744585441 0.29651616,0.716397701 0.247757959,0.66088046 L0.247757959,0.774462835 C0.247757959,0.809248276 0.248586634,0.831240613 0.250243985,0.841163985 C0.256017983,0.869378544 0.269223329,0.883459004 0.289886756,0.883459004 C0.29651616,0.883459004 0.305578129,0.882225287 0.318836938,0.879301916 C0.331186877,0.876807663 0.340302309,0.875600766 0.346931713,0.875600766 C0.375828433,0.875600766 0.390717861,0.890512644 0.390717861,0.920336398 C0.390717861,0.950562452 0.371685055,0.965527969 0.333672904,0.965527969 C0.320467558,0.965527969 0.299804131,0.963489655 0.272564763,0.960137165 C0.252730012,0.957213793 0.223004617,0.955980077 0.183281652,0.955980077 C0.161816282,0.955980077 0.143638882,0.956838314 0.128749453,0.95847433 C0.0932233293,0.963033716 0.069271932,0.965527969 0.0569219927,0.965527969 C0.0420058323,0.965527969 0.0288272175,0.960566284 0.018054435,0.951876628 C0.00728165249,0.941872797 0.00153438639,0.931144828 0.00153438639,0.918298084 C0.00153438639,0.889654406 0.0164238153,0.875600766 0.0478065614,0.875600766 C0.0527251519,0.875600766 0.0610119077,0.876432184 0.0725599028,0.878899617 C0.0883047388,0.882225287 0.0998527339,0.883459004 0.106482139,0.883459004 C0.123804131,0.883459004 0.134576914,0.874769349 0.13869356,0.85690728 C0.142783475,0.83912567 0.145296233,0.789750192 0.145296233,0.708941762 L0.145296233,0.182118008 C0.145296233,0.140225287 0.132946294,0.119547126 0.110625516,0.119547126 C0.104824787,0.119547126 0.0948806804,0.121209962 0.0816753341,0.124079693 C0.0684699878,0.127378544 0.0585526124,0.12863908 0.0510945322,0.12863908 C0.018054435,0.12863908 0.00153438639,0.113727203 0.00153438639,0.0838498084 C0.00153438639,0.0548842912 0.0213424058,0.0403747126 0.0610119077,0.0403747126 C0.0717579587,0.0403747126 0.0825040097,0.0407501916 0.0940787363,0.0415816092 C0.116399514,0.0432712644 0.133721507,0.0440758621 0.144494289,0.0440758621 C0.152754313,0.0440758621 0.164302309,0.0436735632 0.179993682,0.0424130268 C0.194909842,0.0407501916 0.206457837,0.0403747126 0.213862454,0.0403747126 C0.236183232,0.0403747126 0.247757959,0.0527655172 0.247757959,0.078056705" id="Fill-18" fill="#FFFFFF" mask="url(#mask-4)"></path>
                    </g>
                    <path d="M7.1555842,13.0950126 L7.1555842,13.1327215 C7.20271179,13.0664226 7.26633269,13.0332195 7.34481628,13.0332195 C7.40843718,13.0332195 7.45968141,13.0506257 7.49935091,13.0866985 C7.53899368,13.1227981 7.55882843,13.1691966 7.55882843,13.2251697 C7.55882843,13.2653996 7.54891106,13.2977176 7.5282209,13.3230088 C7.50841288,13.3482732 7.48194872,13.3606908 7.4497373,13.3606908 C7.42910061,13.3606908 7.41092321,13.3540931 7.39686245,13.3412195 C7.38199976,13.3288019 7.37456841,13.313005 7.37456841,13.2952234 C7.37456841,13.2802579 7.38034241,13.2674379 7.39106173,13.256254 C7.40180778,13.244641 7.41506659,13.2388479 7.42910061,13.2388479 C7.43238858,13.2388479 7.43816258,13.2404839 7.44725128,13.243005 C7.45222333,13.2321966 7.45470936,13.2222464 7.45470936,13.2131544 C7.45470936,13.1866027 7.4439633,13.1642349 7.42084058,13.1459705 C7.39769113,13.1281889 7.36879441,13.1190433 7.33407023,13.1190433 C7.26304471,13.1190433 7.21591713,13.1509858 7.19279441,13.2143345 C7.17790498,13.253733 7.17047363,13.3126027 7.17047363,13.3917751 L7.17047363,13.4817291 C7.17047363,13.5431199 7.17127558,13.5771008 7.17213098,13.5845567 C7.17704957,13.6363728 7.19111033,13.6624686 7.21511519,13.6624686 C7.22666318,13.6624686 7.23901312,13.6603498 7.25227193,13.6574801 C7.26218931,13.6550126 7.27044933,13.6541812 7.27788068,13.6541812 C7.30680413,13.6541812 7.32166683,13.6682617 7.32166683,13.6968249 C7.32166683,13.727936 7.30348943,13.7437061 7.26633269,13.7437061 L7.26053196,13.7437061 C7.24729988,13.7437061 7.22666318,13.7420165 7.19856841,13.7391467 C7.17127558,13.7358479 7.15063888,13.7345874 7.13660486,13.7345874 C7.10025006,13.7345874 7.07215529,13.7354456 7.05146513,13.7370548 L6.97461215,13.7437061 C6.93745541,13.7437061 6.91927801,13.727936 6.91927801,13.6964494 C6.91927801,13.6678594 6.93665346,13.6541812 6.97132418,13.6541812 C6.98043961,13.6541812 6.98701555,13.6541812 6.99198761,13.6554149 L7.01265103,13.6591697 C7.02173973,13.661664 7.02836914,13.6624686 7.03165711,13.6624686 C7.05480656,13.6624686 7.0671565,13.6413077 7.06886731,13.5994954 L7.06886731,13.5298172 L7.06467047,13.2197521 C7.06223791,13.1662732 7.04817716,13.1393728 7.02337035,13.1393728 C7.01676768,13.1393728 7.00690377,13.1402042 6.99364496,13.1426716 C6.98124156,13.1451927 6.97132418,13.1459705 6.96389283,13.1459705 C6.93416744,13.1459705 6.91927801,13.13189 6.91927801,13.1033 C6.91927801,13.0722157 6.93831081,13.0564724 6.97792685,13.0564724 C6.98701555,13.0564724 7.00024763,13.057277 7.01845176,13.0597713 C7.0365757,13.0618364 7.04983451,13.0630701 7.05889648,13.0630701 C7.06638129,13.0630701 7.07873123,13.0618364 7.09444933,13.0597713 C7.10188068,13.057277 7.1101407,13.0564724 7.12005808,13.0564724 C7.14400948,13.0564724 7.1555842,13.0689169 7.1555842,13.0950126" id="Fill-21" fill="#FFFFFF"></path>
                    <path d="M8.32645735,13.0332276 C8.38671009,13.0332276 8.43715237,13.0489709 8.47847922,13.0809134 L8.47847922,13.0755226 C8.47847922,13.0415418 8.49253998,13.0249134 8.52140996,13.0249134 C8.55121555,13.0249134 8.56605152,13.039423 8.56605152,13.0680667 C8.56605152,13.0738866 8.56524957,13.087967 8.5644209,13.1095034 C8.56107947,13.127741 8.55942211,13.1459785 8.55942211,13.1642429 C8.55942211,13.1750245 8.56027752,13.1907678 8.56276355,13.2114728 C8.56524957,13.233036 8.56605152,13.248377 8.56605152,13.2595341 C8.56605152,13.2943732 8.55121555,13.3109479 8.52226537,13.3109479 C8.49334192,13.3109479 8.47928117,13.2968674 8.47847922,13.2678215 L8.47847922,13.2226299 C8.47765055,13.1953272 8.46110377,13.1720743 8.43057643,13.1526299 C8.40077084,13.1327295 8.3644695,13.1231816 8.32311592,13.1231816 C8.2818158,13.1231816 8.24626294,13.1335341 8.21822163,13.1550705 C8.19010012,13.1762582 8.1760661,13.2032123 8.1760661,13.2346989 C8.1760661,13.2931126 8.21656428,13.3275762 8.29587655,13.3383042 L8.37516209,13.3494881 C8.52969672,13.370649 8.60735164,13.4349096 8.60735164,13.5422429 C8.60735164,13.6077372 8.5825983,13.6603579 8.53218275,13.7010437 C8.4826226,13.7412199 8.41731762,13.7619249 8.33714994,13.7619249 C8.26198104,13.7619249 8.19753147,13.7403617 8.14214386,13.6973157 L8.14214386,13.7233847 C8.14214386,13.7561318 8.12650595,13.7727065 8.09589842,13.7727065 C8.06202965,13.7727065 8.0455096,13.7540667 8.0455096,13.7167333 C8.0455096,13.7229824 8.04799563,13.699354 8.05376962,13.6458751 C8.05542697,13.6330284 8.05625565,13.6201816 8.05625565,13.6077372 C8.05625565,13.5857985 8.05457157,13.565469 8.0512836,13.5459977 C8.04714022,13.5269019 8.0455096,13.5115877 8.0455096,13.500833 C8.0455096,13.4692927 8.06034557,13.4535494 8.08929575,13.4535494 C8.10827509,13.4535494 8.11987655,13.4577065 8.12482187,13.4668521 C8.12979392,13.4759441 8.1330819,13.4999747 8.13391057,13.5393732 C8.13471252,13.5782889 8.15540267,13.6102314 8.19504544,13.6351203 C8.23468821,13.6591778 8.28595917,13.6715686 8.34706731,13.6715686 C8.39170887,13.6715686 8.42886561,13.6603579 8.4578158,13.6375609 C8.48676598,13.6147908 8.5008,13.5862008 8.5008,13.5513617 C8.5008,13.489649 8.4520418,13.4539517 8.35455213,13.4435992 C8.26115237,13.4336759 8.18927145,13.4154115 8.14053998,13.3884843 C8.09178177,13.3615303 8.06697497,13.3142736 8.06697497,13.2471433 C8.06697497,13.1832851 8.09092637,13.1318981 8.13885589,13.0920973 C8.18678542,13.053128 8.24960437,13.0332276 8.32645735,13.0332276" id="Fill-25" fill="#FFFFFF"></path>
                    <path d="M8.8329599,13.3018184 C8.8329599,13.3142628 8.84287728,13.3209142 8.8626853,13.3209142 L9.18907655,13.3209142 C9.20805589,13.3209142 9.21802673,13.3142628 9.21802673,13.3018184 C9.21802673,13.2537303 9.19979587,13.2114621 9.1634678,13.1762475 C9.127113,13.1409793 9.0841288,13.1231977 9.03456865,13.1231977 C8.9841531,13.1231977 8.93788092,13.1414352 8.89572539,13.1783395 C8.85356987,13.2152169 8.8329599,13.2562513 8.8329599,13.3018184 M9.32620899,13.3357992 C9.32620899,13.3706383 9.32457837,13.3917724 9.31963305,13.3996575 C9.3155164,13.4071134 9.30231106,13.4108682 9.27999028,13.4108682 L8.84699392,13.4108682 C8.83461725,13.4108682 8.82718591,13.4129333 8.82384447,13.4162858 C8.81970109,13.4191556 8.81807047,13.4245464 8.81807047,13.4315732 C8.81807047,13.4999908 8.8387339,13.5571977 8.87917861,13.603167 C8.9205322,13.6487877 8.97094775,13.6715579 9.03205589,13.6715579 C9.07177886,13.6715579 9.1089356,13.6608031 9.14200243,13.6392667 C9.1750158,13.616872 9.1965079,13.5895157 9.20642527,13.555508 L9.21882868,13.5157341 C9.22545808,13.4941977 9.24029405,13.4833893 9.26424544,13.4833893 C9.297339,13.4833893 9.314661,13.5008222 9.314661,13.5352054 C9.314661,13.5944774 9.28490887,13.6466958 9.22460267,13.6927456 C9.16512515,13.7387149 9.0965322,13.7619142 9.0205079,13.7619142 C8.92550425,13.7619142 8.84950668,13.729623 8.79331713,13.6657379 C8.73712758,13.6010751 8.70903281,13.5153318 8.70903281,13.4067111 C8.70903281,13.2959985 8.7387582,13.2056421 8.79909113,13.1369027 C8.85856865,13.0676268 8.93707898,13.0332169 9.0329113,13.0332169 C9.11799757,13.0332169 9.18824787,13.0614046 9.24360875,13.1186383 C9.29896962,13.1758184 9.32620899,13.2483931 9.32620899,13.3357992" id="Fill-27" fill="#FFFFFF"></path>
                    <path d="M9.71376452,13.0332276 C9.77409745,13.0332276 9.824513,13.0489709 9.86498445,13.0809134 L9.86498445,13.0755226 C9.86498445,13.0415418 9.87984714,13.0249134 9.90874386,13.0249134 C9.93852272,13.0249134 9.95338542,13.039423 9.95338542,13.0680667 C9.95338542,13.0738866 9.95258348,13.087967 9.95172807,13.1095034 C9.9484401,13.127741 9.94680948,13.1459785 9.94680948,13.1642429 C9.94680948,13.1750245 9.94758469,13.1907678 9.95009745,13.2114728 C9.95258348,13.233036 9.95338542,13.248377 9.95338542,13.2595341 C9.95338542,13.2943732 9.93932467,13.3109479 9.90957254,13.3109479 C9.88064909,13.3109479 9.86578639,13.2968674 9.86498445,13.2678215 L9.86498445,13.2226299 C9.86415577,13.1953272 9.8484644,13.1720743 9.8178836,13.1526299 C9.78813147,13.1327295 9.75177667,13.1231816 9.71127849,13.1231816 C9.66912296,13.1231816 9.63445225,13.1335341 9.6055288,13.1550705 C9.57740729,13.1762582 9.56337327,13.2032123 9.56337327,13.2346989 C9.56337327,13.2931126 9.60301604,13.3275762 9.68315699,13.3383042 L9.76246926,13.3494881 C9.91703062,13.370649 9.99471227,13.4349096 9.99471227,13.5422429 C9.99471227,13.6077372 9.96990547,13.6603579 9.92034532,13.7010437 C9.86992977,13.7412199 9.80548019,13.7619249 9.72451057,13.7619249 C9.65014362,13.7619249 9.58486537,13.7403617 9.5295045,13.6973157 L9.5295045,13.7233847 C9.5295045,13.7561318 9.51383985,13.7727065 9.48323232,13.7727065 C9.44933682,13.7727065 9.43281677,13.7540667 9.43281677,13.7167333 C9.43281677,13.7229824 9.43530279,13.699354 9.44107679,13.6458751 C9.44273414,13.6330284 9.44358955,13.6201816 9.44358955,13.6077372 C9.44358955,13.5857985 9.4419322,13.565469 9.43859077,13.5459977 C9.43444739,13.5269019 9.43281677,13.5115877 9.43281677,13.500833 C9.43281677,13.4692927 9.4477062,13.4535494 9.47660292,13.4535494 C9.49563572,13.4535494 9.50718372,13.4577065 9.51212904,13.4668521 C9.51712783,13.4759441 9.52038906,13.4999747 9.52124447,13.5393732 C9.52207315,13.5782889 9.54270984,13.6102314 9.58235261,13.6351203 C9.62204885,13.6591778 9.67326634,13.6715686 9.73437448,13.6715686 C9.77901604,13.6715686 9.81622625,13.6603579 9.84512296,13.6375609 C9.87407315,13.6147908 9.88810717,13.5862008 9.88810717,13.5513617 C9.88810717,13.489649 9.83934897,13.4539517 9.7418593,13.4435992 C9.648513,13.4336759 9.57657861,13.4154115 9.52787388,13.3884843 C9.47908894,13.3615303 9.4543356,13.3142736 9.4543356,13.2471433 C9.4543356,13.1832851 9.47823354,13.1318981 9.52616306,13.0920973 C9.57411932,13.053128 9.63691154,13.0332276 9.71376452,13.0332276" id="Fill-29" fill="#FFFFFF"></path>
                    <path d="M10.8325461,13.2885667 C10.8325461,13.2516893 10.8548401,13.2305552 10.9003371,13.2251644 C10.895365,13.193651 10.8805023,13.1683866 10.8548401,13.1505513 C10.8284027,13.1318847 10.7953626,13.123195 10.7540625,13.123195 C10.6912702,13.123195 10.6408547,13.1480839 10.6028425,13.1982103 C10.5648304,13.2483904 10.5449956,13.3142602 10.5449956,13.3971874 C10.5449956,13.4825284 10.5631998,13.5497123 10.5995546,13.5986586 C10.6350539,13.6475782 10.6846408,13.6715552 10.7483152,13.6715552 C10.7887332,13.6715552 10.8234574,13.6603444 10.8531827,13.6375743 C10.8821062,13.6147774 10.9027696,13.5832908 10.9135157,13.5435169 C10.9226044,13.5115743 10.9284318,13.4933368 10.9300625,13.4887774 C10.9400066,13.4705398 10.9548158,13.4614479 10.9738486,13.4614479 C10.98954,13.4614479 11.0019434,13.4668387 11.0118608,13.4767621 C11.0217781,13.4867391 11.0267235,13.4991567 11.0267235,13.5149 C11.0267235,13.537241 11.0192654,13.564651 11.0052313,13.5969958 C10.9911973,13.6284824 10.9730199,13.6550073 10.9531852,13.6757659 C10.9003371,13.7329192 10.8308887,13.7619115 10.7449738,13.7619115 C10.6524027,13.7619115 10.5780357,13.7287889 10.5218462,13.6633215 C10.4648547,13.5977736 10.4367599,13.5115743 10.4367599,13.4054747 C10.4367599,13.2927238 10.4656566,13.2023674 10.5243322,13.134808 C10.5830078,13.0672218 10.6606627,13.0332142 10.7573504,13.0332142 C10.8300868,13.0332142 10.8903662,13.0531414 10.9382957,13.0921107 C10.9861985,13.1318847 11.0102034,13.1820648 11.0102034,13.2429996 C11.0102034,13.2769805 11.0011147,13.30431 10.9829106,13.3263023 C10.9639312,13.3482946 10.9407818,13.3590494 10.9110564,13.3590494 C10.8887356,13.3590494 10.8697563,13.3523981 10.8548401,13.3382908 C10.8399507,13.3250418 10.8325461,13.3080648 10.8325461,13.2885667" id="Fill-31" fill="#FFFFFF"></path>
                    <path d="M11.450607,13.123195 C11.3870129,13.123195 11.3365973,13.1451874 11.3002158,13.1898962 C11.2638877,13.2346854 11.2440262,13.2977123 11.2407383,13.3797812 L11.2407383,13.3971874 C11.2407383,13.4825284 11.2588889,13.5497123 11.2944418,13.5986586 C11.3299679,13.6475782 11.3803835,13.6715552 11.4447796,13.6715552 C11.5117419,13.6715552 11.5637881,13.6475782 11.6018002,13.5986586 C11.6390104,13.5497123 11.6579898,13.4825284 11.6579898,13.3963828 C11.6579898,13.2139536 11.5885949,13.123195 11.450607,13.123195 M11.4432024,13.7619115 C11.3481453,13.7619115 11.272121,13.7287889 11.2143009,13.6624632 C11.1572559,13.5969958 11.1291878,13.5082755 11.1291878,13.3971874 C11.1291878,13.2865284 11.1572559,13.1982103 11.2150761,13.1318847 C11.2729497,13.0660149 11.3498027,13.033241 11.4472923,13.033241 C11.5464661,13.033241 11.624121,13.0655858 11.681166,13.1298464 C11.7381575,13.1940801 11.7670809,13.2819153 11.7670809,13.3930303 C11.7670809,13.5041184 11.7373021,13.593241 11.6786532,13.6608004 C11.619149,13.7279307 11.5406654,13.7619115 11.4432024,13.7619115" id="Fill-33" fill="#FFFFFF"></path>
                    <path d="M12.0810661,13.0978931 L12.0810661,13.1368893 C12.1355983,13.0676134 12.2083346,13.0332303 12.298393,13.0332303 C12.3479531,13.0332303 12.394252,13.0456747 12.4371827,13.0705636 C12.4809689,13.0953989 12.5106943,13.1268854 12.5255837,13.1642456 C12.5387891,13.1949008 12.5445898,13.235077 12.5445898,13.2852571 L12.5445898,13.5447667 C12.5445898,13.5836824 12.5454185,13.6069352 12.5462471,13.6143912 C12.5511925,13.6454755 12.5627939,13.6607897 12.5826287,13.6607897 C12.5908887,13.6607897 12.601608,13.6599582 12.6148134,13.657464 C12.6280722,13.6549966 12.6371341,13.6541651 12.6429081,13.6541651 C12.6545096,13.6541651 12.664427,13.6579199 12.6734889,13.6662073 C12.6817757,13.6740387 12.6867478,13.6844448 12.6867478,13.6964333 C12.6867478,13.7101383 12.680947,13.7213222 12.670201,13.730441 C12.6594549,13.7395866 12.6462496,13.7437169 12.6305582,13.7437169 C12.6181548,13.7437169 12.5966894,13.7420272 12.5677392,13.7383261 C12.5387891,13.7345713 12.5115497,13.7329352 12.4859409,13.7329352 C12.4627648,13.7329352 12.4429567,13.7337398 12.428094,13.7358318 C12.3826238,13.7412226 12.3586724,13.7437169 12.3553844,13.7437169 C12.3198851,13.7437169 12.3016809,13.7279199 12.3016809,13.6964333 C12.3016809,13.6678701 12.3173723,13.6541651 12.348755,13.6541651 C12.3561864,13.6541651 12.3644731,13.6549966 12.3735618,13.6566594 C12.3909106,13.6603605 12.4024853,13.6624793 12.4066019,13.6624793 C12.4289227,13.6624793 12.440444,13.6367858 12.4429567,13.5869812 L12.4429567,13.5173835 L12.4429567,13.4344563 L12.4429567,13.3308778 C12.4429567,13.2819046 12.440444,13.248782 12.4363808,13.2305444 C12.428094,13.1961613 12.4107186,13.1691805 12.3834792,13.1505406 C12.3537271,13.1294065 12.3198851,13.119054 12.2818729,13.119054 C12.2091366,13.119054 12.1570904,13.1447207 12.1256809,13.1965636 C12.1042156,13.2322073 12.0934695,13.2927398 12.0934695,13.3780808 L12.0934695,13.5596517 C12.0934695,13.5994793 12.0959555,13.6268356 12.1017295,13.6417743 C12.1066481,13.6558816 12.1165655,13.6633107 12.1314817,13.6633107 C12.1388863,13.6633107 12.1488036,13.6616747 12.161207,13.6587513 C12.1744124,13.6558816 12.184303,13.6541651 12.1925898,13.6541651 C12.2206846,13.6541651 12.2347186,13.6691038 12.2347186,13.6997322 C12.2347186,13.7291805 12.2165412,13.7437169 12.1802399,13.7437169 C12.1727818,13.7437169 12.1496323,13.7412226 12.1099896,13.7358318 C12.0893261,13.7329352 12.0678608,13.7316747 12.0430539,13.7316747 C12.0240211,13.7316747 11.9984124,13.7333107 11.9670296,13.7370655 C11.9265315,13.7416249 11.9042374,13.7437169 11.8984367,13.7437169 C11.8604245,13.7437169 11.8413917,13.7283759 11.8413917,13.6973184 C11.8413917,13.6682724 11.8563079,13.6541651 11.8860333,13.6541651 C11.8901499,13.6541651 11.8992921,13.6553989 11.911642,13.6579199 C11.9240454,13.6607897 11.9364488,13.6624793 11.9479968,13.6624793 C11.9760916,13.6624793 11.9901524,13.6355253 11.9910078,13.5829046 L11.9910078,13.4311575 L11.9910078,13.2661613 L11.9910078,13.2189582 C11.9893504,13.1874716 11.985207,13.166713 11.979433,13.1550732 C11.9736056,13.143487 11.9628863,13.1380962 11.9479968,13.1380962 C11.9422496,13.1380962 11.9323322,13.1393835 11.9199288,13.141851 C11.9075521,13.1447207 11.897608,13.1459812 11.8918073,13.1459812 C11.8587939,13.1459812 11.8413917,13.1310693 11.8413917,13.1016747 C11.8413917,13.0713682 11.8620819,13.0564563 11.9025801,13.0564563 C11.9083541,13.0564563 11.9124707,13.0568854 11.9166408,13.0577169 L11.9670296,13.063054 C11.9810904,13.063054 11.9942957,13.0618203 12.0050418,13.0597552 C12.0281645,13.0572609 12.0405412,13.0564563 12.0414233,13.0564563 C12.0678608,13.0564563 12.0810661,13.0701077 12.0810661,13.0978931" id="Fill-35" fill="#FFFFFF"></path>
                    <path d="M13.117226,13.5501146 L13.117226,13.462628 C13.1180279,13.4253751 13.134548,13.4067084 13.1667861,13.4067084 C13.1981689,13.4067084 13.2138603,13.4278425 13.2138603,13.4697352 C13.2138603,13.568808 13.2015103,13.6380034 13.1758481,13.6774019 C13.1420061,13.7296203 13.0857898,13.7561452 13.0073597,13.7561452 C12.9353985,13.7561452 12.8842078,13.7329192 12.853627,13.6864939 C12.8313062,13.6529153 12.8197315,13.5957352 12.8197315,13.5149268 L12.8197315,13.1874824 C12.8197315,13.1683866 12.8106695,13.1584364 12.793294,13.1584364 L12.748706,13.1584364 C12.7338165,13.1584364 12.7214131,13.1534747 12.7114957,13.1443291 C12.7015784,13.134808 12.6966063,13.123195 12.6966063,13.10949 C12.6966063,13.0966701 12.7015784,13.0850571 12.7114957,13.075536 C12.7214131,13.0655858 12.7313038,13.0601682 12.7437072,13.0601682 L12.7966355,13.0601682 C12.8123269,13.0601682 12.8197315,13.0514785 12.8197315,13.0344747 L12.8197315,12.893992 C12.8197315,12.8591529 12.8370802,12.8417199 12.8726598,12.8417199 C12.9048979,12.8417199 12.9213645,12.8591529 12.9213645,12.893992 L12.9213645,13.0398923 C12.9213645,13.0531414 12.9296245,13.0601682 12.9461981,13.0601682 L13.0940765,13.0601682 C13.1288007,13.0601682 13.1461227,13.0763674 13.1461227,13.107854 C13.1461227,13.1418349 13.1279186,13.1584364 13.0899332,13.1584364 L12.9403973,13.1584364 C12.9279939,13.1584364 12.9213645,13.1683866 12.9213645,13.1874824 L12.9213645,13.5227582 C12.9213645,13.6185322 12.9536027,13.666218 13.0164216,13.666218 C13.0808712,13.666218 13.11474,13.6276778 13.117226,13.5501146" id="Fill-37" fill="#FFFFFF"></path>
                    <path d="M13.4890367,13.0950126 L13.4890367,13.1327215 C13.5361643,13.0664226 13.5989298,13.0332195 13.6782153,13.0332195 C13.741061,13.0332195 13.7931072,13.0506257 13.831948,13.0866985 C13.8716175,13.1227981 13.8914522,13.1691966 13.8914522,13.2251697 C13.8914522,13.2653996 13.8815349,13.2977176 13.8616734,13.3230088 C13.8418654,13.3482732 13.8154279,13.3606908 13.7823611,13.3606908 C13.7617244,13.3606908 13.7444024,13.3540931 13.7294863,13.3412195 C13.7146236,13.3288019 13.7080209,13.313005 13.7080209,13.2952234 C13.7080209,13.2802579 13.7129395,13.2674379 13.7245677,13.256254 C13.7352603,13.244641 13.7476904,13.2388479 13.7617244,13.2388479 C13.7650124,13.2388479 13.7707864,13.2404839 13.7799018,13.243005 C13.7848204,13.2321966 13.7881351,13.2222464 13.7881351,13.2131544 C13.7881351,13.1866027 13.7765604,13.1642349 13.7534644,13.1459705 C13.7303149,13.1281889 13.7013915,13.1190433 13.666694,13.1190433 C13.5964437,13.1190433 13.5493696,13.1509858 13.5253915,13.2143345 C13.5105288,13.253733 13.5038994,13.3126027 13.5038994,13.3917751 L13.5038994,13.4817291 C13.5038994,13.5431199 13.5038994,13.5771008 13.5047281,13.5845567 C13.5097001,13.6363728 13.5237609,13.6624686 13.5477123,13.6624686 C13.559287,13.6624686 13.5716904,13.6603498 13.584869,13.6574801 C13.5947864,13.6550126 13.6030731,13.6541812 13.6104778,13.6541812 C13.6402566,13.6541812 13.6551193,13.6682617 13.6551193,13.6968249 C13.6551193,13.727936 13.6360865,13.7437061 13.5989298,13.7437061 L13.5931558,13.7437061 C13.579897,13.7437061 13.559287,13.7420165 13.5319674,13.7391467 C13.5038994,13.7358479 13.4832627,13.7345874 13.4692287,13.7345874 C13.4336491,13.7345874 13.4047524,13.7354456 13.3840622,13.7370548 L13.3080646,13.7437061 C13.2709079,13.7437061 13.2518751,13.727936 13.2518751,13.6964494 C13.2518751,13.6678594 13.2692505,13.6541812 13.3039213,13.6541812 C13.3130634,13.6541812 13.320468,13.6541812 13.3246114,13.6554149 L13.3452748,13.6591697 C13.3543368,13.661664 13.3609662,13.6624686 13.3642542,13.6624686 C13.3874036,13.6624686 13.3997803,13.6413077 13.4014644,13.5994954 L13.4014644,13.5298172 L13.397321,13.2197521 C13.3948617,13.1662732 13.3816296,13.1393728 13.3568496,13.1393728 C13.3493915,13.1393728 13.3395009,13.1402042 13.3270974,13.1426716 C13.3138921,13.1451927 13.3039213,13.1459705 13.2973453,13.1459705 C13.2667913,13.1459705 13.2518751,13.13189 13.2518751,13.1033 C13.2518751,13.0722157 13.2717633,13.0564724 13.3105507,13.0564724 C13.3196661,13.0564724 13.3337001,13.057277 13.3510488,13.0597713 C13.369253,13.0618364 13.383287,13.0630701 13.392349,13.0630701 C13.3997803,13.0630701 13.4113818,13.0618364 13.4278751,13.0597713 C13.4345045,13.057277 13.4436199,13.0564724 13.4535373,13.0564724 C13.4766333,13.0564724 13.4890367,13.0689169 13.4890367,13.0950126" id="Fill-39" fill="#FFFFFF"></path>
                    <path d="M14.0748595,13.3018184 C14.0748595,13.3142628 14.0848036,13.3209142 14.1054403,13.3209142 L14.4310029,13.3209142 C14.4508377,13.3209142 14.4598996,13.3142628 14.4598996,13.3018184 C14.4598996,13.2537303 14.441749,13.2114621 14.4053942,13.1762475 C14.3690661,13.1409793 14.3260552,13.1231977 14.277297,13.1231977 C14.2260795,13.1231977 14.1798073,13.1414352 14.1376785,13.1783395 C14.0963784,13.2152169 14.0748595,13.2562513 14.0748595,13.3018184 M14.5689908,13.3357992 C14.5689908,13.3706383 14.5665315,13.3917724 14.5623614,13.3996575 C14.5574428,13.4071134 14.5442107,13.4108682 14.5227186,13.4108682 L14.0888936,13.4108682 C14.0765169,13.4108682 14.0690588,13.4129333 14.0657708,13.4162858 C14.0616542,13.4191556 14.0599968,13.4245464 14.0599968,13.4315732 C14.0599968,13.4999908 14.0806335,13.5571977 14.121105,13.603167 C14.1624586,13.6487877 14.2136761,13.6715579 14.274009,13.6715579 C14.3145072,13.6715579 14.350862,13.6608031 14.3839021,13.6392667 C14.4169689,13.616872 14.438461,13.5895157 14.4483516,13.555508 L14.460755,13.5157341 C14.4673844,13.4941977 14.4822204,13.4833893 14.5061985,13.4833893 C14.5392119,13.4833893 14.5565874,13.5008222 14.5565874,13.5352054 C14.5565874,13.5944774 14.526862,13.6466958 14.466529,13.6927456 C14.4070248,13.7387149 14.3392605,13.7619142 14.262461,13.7619142 C14.1674039,13.7619142 14.0913796,13.729623 14.0360454,13.6657379 C13.9790005,13.6010751 13.9509057,13.5153318 13.9509057,13.4067111 C13.9509057,13.2959985 13.9807113,13.2056421 14.040964,13.1369027 C14.101297,13.0676268 14.1789786,13.0332169 14.2747842,13.0332169 C14.3599239,13.0332169 14.4301742,13.0614046 14.4855084,13.1186383 C14.5409227,13.1758184 14.5689908,13.2483931 14.5689908,13.3357992" id="Fill-41" fill="#FFFFFF"></path>
                    <path d="M15.9017631,13.3018184 C15.9017631,13.3142628 15.9116804,13.3209142 15.9323706,13.3209142 L16.2578797,13.3209142 C16.2769125,13.3209142 16.2868299,13.3142628 16.2868299,13.3018184 C16.2868299,13.2537303 16.2686525,13.2114621 16.232271,13.1762475 C16.1959162,13.1409793 16.1529587,13.1231977 16.1034253,13.1231977 C16.052983,13.1231977 16.0067375,13.1414352 15.964582,13.1783395 C15.9224265,13.2152169 15.9017631,13.2562513 15.9017631,13.3018184 M16.3958676,13.3357992 C16.3958676,13.3706383 16.393435,13.3917724 16.3884362,13.3996575 C16.3843196,13.4071134 16.3711142,13.4108682 16.3487934,13.4108682 L15.9157971,13.4108682 C15.9034204,13.4108682 15.8959891,13.4129333 15.8927011,13.4162858 C15.8885844,13.4191556 15.8869004,13.4245464 15.8869004,13.4315732 C15.8869004,13.4999908 15.9075905,13.5571977 15.9480352,13.603167 C15.9893888,13.6487877 16.0398044,13.6715579 16.1009125,13.6715579 C16.140582,13.6715579 16.1777655,13.6608031 16.2108323,13.6392667 C16.2438457,13.616872 16.2653645,13.5895157 16.2752819,13.555508 L16.2876853,13.5157341 C16.2942612,13.4941977 16.3091239,13.4833893 16.3331021,13.4833893 C16.3661689,13.4833893 16.3835176,13.5008222 16.3835176,13.5352054 C16.3835176,13.5944774 16.3537655,13.6466958 16.2934326,13.6927456 C16.2339818,13.7387149 16.1653621,13.7619142 16.0893913,13.7619142 C15.9943341,13.7619142 15.9183098,13.729623 15.8621203,13.6657379 C15.8059307,13.6010751 15.777836,13.5153318 15.777836,13.4067111 C15.777836,13.2959985 15.8075881,13.2056421 15.8678943,13.1369027 C15.9274253,13.0676268 16.0058821,13.0332169 16.1017679,13.0332169 C16.1868542,13.0332169 16.2570778,13.0614046 16.3124119,13.1186383 C16.3677728,13.1758184 16.3958676,13.2483931 16.3958676,13.3357992" id="Fill-47" fill="#FFFFFF"></path>
                    <path d="M16.6198318,13.6019467 L16.8090104,13.3834716 L16.6198318,13.1584257 C16.6074284,13.143487 16.5917371,13.1368893 16.5735597,13.1368893 C16.5669303,13.1368893 16.5611563,13.1372916 16.5570129,13.1385521 L16.5346921,13.1443452 C16.5305487,13.1459812 16.5247747,13.1459812 16.5148574,13.1459812 C16.485132,13.1459812 16.470296,13.1319008 16.470296,13.1024525 C16.470296,13.0717973 16.4892753,13.0564563 16.5264855,13.0564563 L16.5305487,13.0564563 C16.5314041,13.0564563 16.5537249,13.0581192 16.598313,13.061418 C16.620607,13.0643146 16.6396666,13.0655751 16.6553312,13.0655751 C16.6710493,13.0655751 16.6933434,13.0639123 16.7222936,13.0610157 C16.7511903,13.0581192 16.7726557,13.0564563 16.7875451,13.0564563 C16.8247553,13.0564563 16.842906,13.0717973 16.842906,13.1024525 C16.842906,13.1319008 16.8255572,13.1459812 16.7916885,13.1459812 C16.7842571,13.1459812 16.7776277,13.1452034 16.7709983,13.1430847 L16.7503616,13.1368893 L16.7421283,13.1368893 C16.7387869,13.1368893 16.7371563,13.137667 16.7371563,13.1393835 C16.7387869,13.1452034 16.7429035,13.1517743 16.7495597,13.1592839 L16.8726848,13.3109506 L17.0024126,13.1592839 C17.0106727,13.149736 17.0147358,13.1430847 17.0147358,13.1393835 C17.0139606,13.137667 17.0114479,13.1368893 17.0073312,13.1368893 C17.0032146,13.1368893 16.9957565,13.1385521 16.9858659,13.1414218 C16.9750931,13.1447207 16.9676885,13.1459812 16.9619145,13.1459812 C16.9296763,13.1459812 16.9139849,13.1310693 16.9139849,13.1004142 C16.9139849,13.0709659 16.9329643,13.0564563 16.9710299,13.0564563 C16.9693191,13.0564563 16.9932972,13.0581192 17.0428306,13.063054 C17.0627188,13.0647169 17.0841842,13.0655751 17.1073069,13.0655751 C17.1296277,13.0655751 17.1535791,13.0639123 17.1792413,13.0610157 C17.2040214,13.0581192 17.2221721,13.0564563 17.2337468,13.0564563 C17.2733896,13.0564563 17.2931976,13.0713682 17.2931976,13.1016747 C17.2931976,13.1310693 17.2775597,13.1459812 17.2469789,13.1459812 C17.2395208,13.1459812 17.2288015,13.1447207 17.2155426,13.1414218 C17.2015086,13.1385521 17.1915913,13.1368893 17.1841599,13.1368893 C17.1618391,13.1368893 17.1321137,13.1584257 17.0941016,13.2023835 L16.9354503,13.3830962 L17.1478051,13.6346939 C17.1602085,13.650008 17.1758999,13.6579199 17.1940773,13.6579199 C17.1998513,13.6579199 17.208138,13.657464 17.2188841,13.6558816 C17.2304588,13.6541651 17.2387188,13.6541651 17.2444928,13.6541651 C17.276731,13.6541651 17.2931976,13.6682724 17.2931976,13.6968356 C17.2931976,13.7279199 17.2742182,13.7437169 17.2362328,13.7437169 L17.22546,13.7437169 L17.1717565,13.7370655 C17.1577225,13.7354563 17.1362304,13.7345713 17.1073069,13.7345713 C17.0825536,13.7345713 17.0577468,13.7358318 17.0337687,13.7383261 L16.9842085,13.7437169 L16.9693191,13.7437169 C16.9271903,13.7437169 16.9056982,13.7296364 16.9056982,13.7010464 C16.9056982,13.6691038 16.922245,13.6541651 16.9561137,13.6541651 C16.9676885,13.6541651 16.9842085,13.6553989 17.0065293,13.6583222 C17.0081599,13.6591805 17.0114479,13.6591805 17.015618,13.6591805 C17.0247067,13.6591805 17.029652,13.6558816 17.029652,13.6483452 C17.029652,13.6458778 17.0280214,13.6429544 17.0255086,13.6400847 L17.0213652,13.635123 L16.8701988,13.4572801 L16.7164661,13.635123 C16.7098902,13.6417743 16.7074041,13.6475674 16.7074041,13.6512686 C16.7074041,13.6558816 16.7115475,13.6579199 16.7206362,13.6579199 C16.7272389,13.6579199 16.7362741,13.657464 16.7495597,13.6558816 C16.7619363,13.6541651 16.7709983,13.6541651 16.7776277,13.6541651 C16.8164953,13.6541651 16.83633,13.6691038 16.83633,13.7010464 C16.83633,13.7296364 16.8164953,13.7437169 16.7776277,13.7437169 L16.7585949,13.7437169 L16.7041162,13.7383261 C16.6768233,13.7358318 16.6528452,13.7345713 16.6321818,13.7345713 C16.6157152,13.7345713 16.5966824,13.7358318 16.5735597,13.7383261 C16.5429789,13.7420272 16.5198561,13.7437169 16.5057954,13.7437169 C16.46781,13.7437169 16.4487772,13.7287782 16.4487772,13.6985521 C16.4487772,13.6686479 16.4644685,13.6541651 16.4975354,13.6541651 C16.5033361,13.6541651 16.5115961,13.6541651 16.5223154,13.6553989 C16.5330615,13.6558816 16.5413215,13.6566594 16.5463203,13.6566594 C16.5636423,13.6566594 16.5884491,13.6384218 16.6198318,13.6019467" id="Fill-49" fill="#FFFFFF"></path>
                    <path d="M17.7270467,13.2885667 C17.7270467,13.2516893 17.7501961,13.2305552 17.7947842,13.2251644 C17.7906408,13.193651 17.7758049,13.1683866 17.7493674,13.1505513 C17.7237052,13.1318847 17.6898097,13.123195 17.6493917,13.123195 C17.5865728,13.123195 17.5361572,13.1480839 17.4973431,13.1982103 C17.459331,13.2483904 17.4402982,13.3142602 17.4402982,13.3971874 C17.4402982,13.4825284 17.4577004,13.5497123 17.4940017,13.5986586 C17.5303832,13.6475782 17.5799434,13.6715552 17.6436177,13.6715552 C17.6832338,13.6715552 17.7179045,13.6603444 17.7477101,13.6375743 C17.7774622,13.6147774 17.7981256,13.5832908 17.808845,13.5435169 C17.8179337,13.5115743 17.822879,13.4933368 17.8245096,13.4887774 C17.8344537,13.4705398 17.8493164,13.4614479 17.8683492,13.4614479 C17.8839871,13.4614479 17.8964707,13.4668387 17.9063079,13.4767621 C17.9170807,13.4867391 17.9220527,13.4991567 17.9220527,13.5149 C17.9220527,13.537241 17.9145947,13.564651 17.8997587,13.5969958 C17.8856979,13.6284824 17.8683492,13.6550073 17.8484877,13.6757659 C17.7947842,13.7329192 17.7253893,13.7619115 17.6402763,13.7619115 C17.5477587,13.7619115 17.4733383,13.7287889 17.4163468,13.6633215 C17.3593553,13.5977736 17.3312605,13.5115743 17.3312605,13.4054747 C17.3312605,13.2927238 17.3610126,13.2023674 17.4188595,13.134808 C17.4775351,13.0672218 17.5551633,13.0332142 17.6526797,13.0332142 C17.7245339,13.0332142 17.7848668,13.0531414 17.833625,13.0921107 C17.8815546,13.1318847 17.9055327,13.1820648 17.9055327,13.2429996 C17.9055327,13.2769805 17.8964707,13.30431 17.8774379,13.3263023 C17.8592338,13.3482946 17.8352824,13.3590494 17.8063589,13.3590494 C17.7832362,13.3590494 17.7650588,13.3523981 17.7501961,13.3382908 C17.7344513,13.3250418 17.7270467,13.3080648 17.7270467,13.2885667" id="Fill-51" fill="#FFFFFF"></path>
                    <path d="M19.0020122,13.7043533 L19.0020122,13.6624605 C18.9532539,13.7283839 18.882175,13.7619088 18.7879733,13.7619088 C18.6814216,13.7619088 18.6061993,13.7283839 18.5648991,13.6624605 C18.5467217,13.6330391 18.5368311,13.5986559 18.5351738,13.559633 C18.5343183,13.5406176 18.5334897,13.5008169 18.5334897,13.4394529 L18.5334897,13.3262996 C18.5334897,13.2015602 18.5202843,13.1393916 18.4938202,13.1393916 C18.4888481,13.1393916 18.4797861,13.1401962 18.4682114,13.1414299 C18.455808,13.1426904 18.4467193,13.143495 18.4401166,13.143495 C18.4078785,13.143495 18.3922139,13.1285831 18.3922139,13.0991617 C18.3922139,13.0705716 18.4120486,13.0564644 18.4508894,13.0564644 C18.4599514,13.0564644 18.4732102,13.057269 18.4913341,13.0597632 C18.5087096,13.0618284 18.5219149,13.0630621 18.5309769,13.0630621 C18.5392369,13.0630621 18.5532977,13.0613992 18.5731324,13.0589318 C18.5863645,13.057269 18.5946513,13.0564644 18.5962819,13.0564644 C18.6243767,13.0564644 18.6384107,13.0738705 18.6384107,13.1078513 L18.6384107,13.1368973 L18.6384107,13.2251617 L18.634294,13.3262996 L18.634294,13.4150199 C18.634294,13.4941923 18.6409235,13.5513724 18.6533269,13.5857824 C18.6739635,13.6429625 18.7243524,13.6715525 18.8028627,13.6715525 C18.8425055,13.6715525 18.876401,13.6624605 18.9061264,13.6450544 C18.9367339,13.6276751 18.9573706,13.6040467 18.9689453,13.5745985 C18.9837813,13.5393839 18.9912661,13.4717977 18.9912661,13.3727517 L18.9912661,13.2977096 L18.9912661,13.2089893 C18.9862673,13.1654605 18.9747193,13.143495 18.9557132,13.143495 L18.9309332,13.143495 L18.9144131,13.143495 C18.8830304,13.143495 18.8673123,13.1298437 18.8673123,13.1024605 C18.8673123,13.0718054 18.8846343,13.0564644 18.9201604,13.0564644 C18.9284471,13.0564644 18.9408505,13.057269 18.9573706,13.0589318 C18.9739174,13.0606215 18.9871227,13.0613992 18.9945541,13.0613992 C19.0020122,13.0613992 19.0127047,13.0606215 19.0276209,13.0589318 C19.0424836,13.057269 19.0532296,13.0564644 19.0598056,13.0564644 C19.0871252,13.0564644 19.1011592,13.0705716 19.1011592,13.1000199 C19.1011592,13.1127862 19.1003038,13.12279 19.0978712,13.130246 C19.0936744,13.1642268 19.0912418,13.2156406 19.0912418,13.2831732 L19.0912418,13.4941923 C19.0912418,13.5497096 19.0920705,13.5808207 19.0928724,13.5869893 C19.0970158,13.635131 19.1102211,13.6591617 19.1308846,13.6591617 C19.137514,13.6591617 19.1465759,13.6583034 19.1581507,13.6566674 C19.1697254,13.6550046 19.1787874,13.6541732 19.1854168,13.6541732 C19.2160243,13.6541732 19.2317157,13.6686559 19.2317157,13.6985333 C19.2317157,13.7287862 19.2126829,13.7437249 19.1746707,13.7437249 C19.166384,13.7437249 19.154034,13.7428935 19.1391713,13.7412307 C19.1159951,13.7383341 19.1028165,13.7370736 19.0970158,13.7370736 C19.0936744,13.7370736 19.0846124,13.7379318 19.0680923,13.7399701 C19.0573463,13.7428935 19.0482309,13.7437249 19.0399708,13.7437249 C19.0143888,13.7437249 19.0020122,13.730449 19.0020122,13.7043533" id="Fill-55" fill="#FFFFFF"></path>
                    <path d="M19.5737903,13.0332276 C19.6341232,13.0332276 19.6844853,13.0489709 19.7250102,13.0809134 L19.7250102,13.0755226 C19.7250102,13.0415418 19.7398729,13.0249134 19.7687429,13.0249134 C19.7985217,13.0249134 19.8133844,13.039423 19.8133844,13.0680667 C19.8133844,13.0738866 19.8133844,13.087967 19.8117271,13.1095034 C19.8084391,13.127741 19.8068085,13.1459785 19.8068085,13.1642429 C19.8068085,13.1750245 19.8084391,13.1907678 19.8100965,13.2114728 C19.8126092,13.233036 19.8133844,13.248377 19.8133844,13.2595341 C19.8133844,13.2943732 19.7993504,13.3109479 19.7695983,13.3109479 C19.7406481,13.3109479 19.7258122,13.2968674 19.7250102,13.2678215 L19.7250102,13.2226299 C19.7241815,13.1953272 19.7084634,13.1720743 19.6779094,13.1526299 C19.6473018,13.1327295 19.6118024,13.1231816 19.5712775,13.1231816 C19.5291487,13.1231816 19.4936226,13.1335341 19.4655278,13.1550705 C19.437433,13.1762582 19.423399,13.2032123 19.423399,13.2346989 C19.423399,13.2931126 19.4630418,13.3275762 19.5431827,13.3383042 L19.622495,13.3494881 C19.7770296,13.370649 19.854738,13.4349096 19.854738,13.5422429 C19.854738,13.6077372 19.8299312,13.6603579 19.7803711,13.7010437 C19.7299555,13.7412199 19.6646238,13.7619249 19.5845363,13.7619249 C19.5093407,13.7619249 19.4448644,13.7403617 19.3895035,13.6973157 L19.3895035,13.7233847 C19.3895035,13.7561318 19.3738389,13.7727065 19.3432581,13.7727065 C19.3093626,13.7727065 19.2928158,13.7540667 19.2928158,13.7167333 C19.2928158,13.7229824 19.2953286,13.699354 19.3011026,13.6458751 C19.3027332,13.6330284 19.3036153,13.6201816 19.3036153,13.6077372 C19.3036153,13.5857985 19.301958,13.565469 19.2986165,13.5459977 C19.2944731,13.5269019 19.2928158,13.5115877 19.2928158,13.500833 C19.2928158,13.4692927 19.3068765,13.4535494 19.3366287,13.4535494 C19.3556615,13.4535494 19.3671827,13.4577065 19.3721281,13.4668521 C19.3771269,13.4759441 19.3804148,13.4999747 19.3812702,13.5393732 C19.3820989,13.5782889 19.4027356,13.6102314 19.4423784,13.6351203 C19.4820746,13.6591778 19.5332654,13.6715686 19.5944002,13.6715686 C19.6390151,13.6715686 19.6753966,13.6603579 19.7051487,13.6375609 C19.7340722,13.6147908 19.7481062,13.5862008 19.7481062,13.5513617 C19.7481062,13.489649 19.699348,13.4539517 19.6018851,13.4435992 C19.5076566,13.4336759 19.4366044,13.4154115 19.3878729,13.3884843 C19.3391147,13.3615303 19.3143614,13.3142736 19.3143614,13.2471433 C19.3143614,13.1832851 19.3382593,13.1318981 19.3861621,13.0920973 C19.4340916,13.053128 19.4969106,13.0332276 19.5737903,13.0332276" id="Fill-57" fill="#FFFFFF"></path>
                    <path d="M20.6983645,13.123195 C20.6347169,13.123195 20.5843013,13.1451874 20.5479465,13.1898962 C20.5116185,13.2346854 20.491757,13.2977123 20.4884423,13.3797812 L20.4884423,13.3971874 C20.4884423,13.4825284 20.5066464,13.5497123 20.5421458,13.5986586 C20.5785273,13.6475782 20.6281409,13.6715552 20.6933925,13.6715552 C20.7594994,13.6715552 20.8115456,13.6475782 20.8495577,13.5986586 C20.8867145,13.5497123 20.9057473,13.4825284 20.9057473,13.3963828 C20.9057473,13.2139536 20.8363524,13.123195 20.6983645,13.123195 M20.6909064,13.7619115 C20.5958493,13.7619115 20.519825,13.7287889 20.4628335,13.6624632 C20.4058688,13.5969958 20.3769453,13.5082755 20.3769453,13.3971874 C20.3769453,13.2865284 20.4058688,13.1982103 20.4628335,13.1318847 C20.5207072,13.0660149 20.5983621,13.033241 20.6950231,13.033241 C20.7942236,13.033241 20.8718785,13.0655858 20.92887,13.1298464 C20.9858882,13.1940801 21.0147849,13.2819153 21.0147849,13.3930303 C21.0147849,13.5041184 20.9850595,13.593241 20.9264107,13.6608004 C20.8669064,13.7279307 20.7892248,13.7619115 20.6909064,13.7619115" id="Fill-61" fill="#FFFFFF"></path>
                    <path d="M21.3288262,13.0978931 L21.3288262,13.1368893 C21.383305,13.0676134 21.4560413,13.0332303 21.5460996,13.0332303 C21.5956598,13.0332303 21.6419587,13.0456747 21.6849162,13.0705636 C21.728729,13.0953989 21.7584544,13.1268854 21.7741458,13.1642456 C21.7865492,13.1949008 21.7923232,13.235077 21.7923232,13.2852571 L21.7923232,13.5447667 C21.7923232,13.5836824 21.7931786,13.6069352 21.7939806,13.6143912 C21.7989526,13.6454755 21.8105273,13.6607897 21.8311908,13.6607897 C21.8385954,13.6607897 21.8493682,13.6599582 21.8625735,13.657464 C21.8757789,13.6549966 21.8848943,13.6541651 21.8906683,13.6541651 C21.9022163,13.6541651 21.9129891,13.6579199 21.9212491,13.6662073 C21.9303111,13.6740387 21.9344544,13.6844448 21.9344544,13.6964333 C21.9344544,13.7101383 21.9286537,13.7213222 21.9179077,13.730441 C21.9072151,13.7395866 21.8940097,13.7437169 21.8782649,13.7437169 C21.8659149,13.7437169 21.8452248,13.7420272 21.8162746,13.7383261 C21.7865492,13.7345713 21.7593098,13.7329352 21.734503,13.7329352 C21.7105249,13.7329352 21.6915456,13.7337398 21.6758007,13.7358318 C21.630384,13.7412226 21.6064326,13.7437169 21.6039465,13.7437169 C21.5676452,13.7437169 21.5493876,13.7279199 21.5493876,13.6964333 C21.5493876,13.6678701 21.5651324,13.6541651 21.5965152,13.6541651 C21.6039465,13.6541651 21.6122066,13.6549966 21.621322,13.6566594 C21.6386707,13.6603605 21.650192,13.6624793 21.6543621,13.6624793 C21.6766829,13.6624793 21.6890863,13.6367858 21.6907169,13.5869812 L21.6907169,13.5173835 L21.6907169,13.4344563 L21.6907169,13.3308778 C21.6907169,13.2819046 21.6882041,13.248782 21.6840875,13.2305444 C21.6758007,13.1961613 21.6584787,13.1691805 21.6312394,13.1505406 C21.6014872,13.1294065 21.5676452,13.119054 21.5295796,13.119054 C21.4568967,13.119054 21.4056258,13.1447207 21.3733876,13.1965636 C21.3519222,13.2322073 21.3411762,13.2927398 21.3411762,13.3780808 L21.3411762,13.5596517 C21.3411762,13.5994793 21.3436622,13.6268356 21.3494362,13.6417743 C21.3552102,13.6558816 21.365181,13.6633107 21.3792418,13.6633107 C21.3866464,13.6633107 21.3965638,13.6616747 21.4089137,13.6587513 C21.4221725,13.6558816 21.4320632,13.6541651 21.4403499,13.6541651 C21.4684447,13.6541651 21.4825055,13.6691038 21.4825055,13.6997322 C21.4825055,13.7291805 21.4643013,13.7437169 21.4279465,13.7437169 C21.4213706,13.7437169 21.397339,13.7412226 21.3576962,13.7358318 C21.3378882,13.7329352 21.3155674,13.7316747 21.2907606,13.7316747 C21.2717813,13.7316747 21.2461725,13.7333107 21.2147363,13.7370655 C21.1750936,13.7416249 21.1519708,13.7437169 21.1469988,13.7437169 C21.1081847,13.7437169 21.0900073,13.7283759 21.0900073,13.6973184 C21.0900073,13.6682724 21.104068,13.6541651 21.1337934,13.6541651 C21.1387388,13.6541651 21.1469988,13.6553989 21.1594022,13.6579199 C21.1718056,13.6607897 21.184209,13.6624793 21.195757,13.6624793 C21.2238518,13.6624793 21.2379125,13.6355253 21.2395431,13.5829046 L21.2395431,13.4311575 L21.2395431,13.2661613 L21.2395431,13.2189582 C21.2370571,13.1874716 21.2337691,13.166713 21.2271397,13.1550732 C21.2213657,13.143487 21.2106464,13.1380962 21.195757,13.1380962 C21.189983,13.1380962 21.1800923,13.1393835 21.1676889,13.141851 C21.1552588,13.1447207 21.1453682,13.1459812 21.1395674,13.1459812 C21.1056987,13.1459812 21.0900073,13.1310693 21.0900073,13.1016747 C21.0900073,13.0713682 21.109842,13.0564563 21.1503402,13.0564563 C21.1561142,13.0564563 21.1602309,13.0568854 21.164401,13.0577169 L21.2147363,13.063054 C21.2287971,13.063054 21.2420292,13.0618203 21.2528019,13.0597552 C21.2759247,13.0572609 21.2883013,13.0564563 21.2899587,13.0564563 C21.3155674,13.0564563 21.3288262,13.0701077 21.3288262,13.0978931" id="Fill-63" fill="#FFFFFF"></path>
                    <path d="M0.140479222,0.513011494 C0.140479222,0.200881226 0.173492588,0.0690881226 0.583366221,0.0690881226 L3.82733706,0.0690881226 C4.03969186,0.0690881226 3.74468335,1.00631034 3.51586197,1.00631034 L1.35341968,1.00631034 C1.18899441,1.00631034 1.05846464,1.0722069 1.05846464,1.36813793 L1.05846464,4.29373563 C1.05846464,4.44132567 1.07498469,4.58969349 1.33689964,4.58969349 L2.79448651,4.58969349 C3.28610498,4.58969349 2.94239174,5.59198084 2.68047679,5.59198084 L1.35341968,5.59198084 C1.22208797,5.59198084 1.05846464,5.60858238 1.05846464,5.78929502 L1.05846464,11.5749962 C1.05846464,11.73959 0.681684569,11.9041303 0.501541191,11.9041303 C0.304904496,11.9041303 0.140479222,11.9203027 0.140479222,11.5260766 L0.140479222,0.513011494 Z" id="Fill-65" fill="#000000"></path>
                    <path d="M7.65301409,7.08793985 C7.88271762,7.08793985 7.94796914,7.08793985 7.88271762,6.79200881 C7.50593755,3.99780192 7.21092904,1.03902797 7.1622243,1.03902797 L7.09611738,1.03902797 C7.04733244,1.03902797 6.75235067,3.99780192 6.37559733,6.79200881 C6.3094904,7.08793985 6.37559733,7.08793985 6.60444544,7.08793985 L7.65301409,7.08793985 Z M9.42290474,11.5422732 C9.42290474,11.7723345 9.27499951,11.8378019 9.07833609,11.8378019 C8.99653779,11.8378019 8.61975772,11.8378019 8.57102625,11.591595 C8.57102625,11.4929513 8.37436282,10.1453843 8.14463256,8.28794368 C8.09590109,8.10723103 8.0298209,8.10723103 7.98103597,8.10723103 L6.27727898,8.10723103 C6.24418542,8.10723103 6.16238712,8.10723103 6.11362892,8.28794368 C5.88392539,10.1453843 5.68726197,11.4929513 5.68726197,11.591595 C5.6542486,11.8378019 5.26092175,11.8378019 5.17912345,11.8378019 C4.98246002,11.8378019 4.83541021,11.7723345 4.83541021,11.5422732 C4.83541021,11.2956103 6.2607322,0.545755939 6.29374557,0.365043295 C6.3425305,0.184330651 6.45739563,0.0690854406 6.62099222,0.0690854406 L7.63649405,0.0690854406 C7.80011738,0.0690854406 7.94796914,0.184330651 7.94796914,0.365043295 C7.99758275,0.545755939 9.42290474,11.2956103 9.42290474,11.5422732 L9.42290474,11.5422732 Z" id="Fill-67" fill="#000000"></path>
                    <path d="M12.4933696,9.94765172 C12.509061,10.424349 12.8536296,11.0328395 13.7055349,11.0328395 C14.4095081,11.0328395 14.9498848,10.424349 14.9498848,10.030123 C14.9498848,9.78354061 15.867897,9.65206935 15.867897,10.1453682 C15.867897,11.1480579 14.7697414,12.0189544 13.4593113,11.8709352 C12.4107159,11.7395713 11.5918775,10.9835176 11.6406625,9.94765172 L11.6406625,1.95923027 C11.5918775,0.891448659 12.4107159,0.151567433 13.4593113,0.0197743295 C14.7697414,-0.14481954 15.867897,0.743509962 15.867897,1.7461728 C15.867897,2.22287011 14.9498848,2.1076249 14.9498848,1.86098889 C14.9498848,1.46678966 14.4095081,0.841724521 13.7055349,0.841724521 C12.8536296,0.841724521 12.509061,1.46678966 12.4933696,1.92688544 L12.4933696,9.94765172 Z" id="Fill-69" fill="#000000"></path>
                    <path d="M19.1349905,10.8516467 C18.9716345,10.8098077 18.8557001,10.7321103 18.8557001,10.452754 L18.8557001,7.64629042 L18.8557001,6.1341295 L18.8557001,5.72381149 L18.8557001,4.21165057 L18.8557001,1.40521379 C18.8557001,1.12583065 18.9716345,1.04813333 19.1349905,1.00629425 C19.1349905,1.00629425 22.1814693,0.052497318 21.9691412,0.052497318 L18.2080768,0.052497318 C17.9875422,0.052497318 17.9219699,0.195796169 17.9219699,0.356715709 L17.9219699,11.5012521 C17.9219699,11.6621716 17.9875422,11.8054437 18.2080768,11.8054437 L21.9691412,11.8054437 C22.1814693,11.8054437 19.1349905,10.8516467 19.1349905,10.8516467" id="Fill-71" fill="#000000"></path>
                    <path d="M20.6949401,6.23010995 C20.6949401,6.27362796 20.6443751,6.30903562 20.5841712,6.30903562 L19.5845121,6.24925938 C19.5242555,6.24925938 19.4737959,6.21381417 19.4737959,6.17029616 L19.4737959,5.95094138 C19.4737959,5.90686015 19.5242555,5.87201571 19.5845121,5.87201571 L20.5841712,5.81167625 C20.6443751,5.81167625 20.6949401,5.84708391 20.6949401,5.89060191 L20.6949401,6.23010995 Z" id="Fill-73" fill="#000000"></path>
                </g>
            </g>
        </g>
    </g>
</svg>