<?xml version="1.0" encoding="UTF-8"?>
<svg width="412px" height="412px" viewBox="0 0 412 412" version="1.1" xmlns="http://www.w3.org/2000/svg" xmlns:xlink="http://www.w3.org/1999/xlink">
    <title>japprends à gouter</title>
    <defs>
        <circle id="path-1" cx="171" cy="197" r="171"></circle>
        <filter x="-15.5%" y="-15.2%" width="131.0%" height="131.0%" filterUnits="objectBoundingBox" id="filter-2">
            <feOffset dx="0" dy="1" in="SourceAlpha" result="shadowOffsetOuter1"></feOffset>
            <feGaussianBlur stdDeviation="17.5" in="shadowOffsetOuter1" result="shadowBlurOuter1"></feGaussianBlur>
            <feColorMatrix values="0 0 0 0 0   0 0 0 0 0   0 0 0 0 0  0 0 0 0.2 0" type="matrix" in="shadowBlurOuter1"></feColorMatrix>
        </filter>
        <circle id="path-3" cx="172" cy="198" r="136"></circle>
        <filter x="-3.0%" y="-3.0%" width="106.0%" height="106.0%" filterUnits="objectBoundingBox" id="filter-4">
            <feGaussianBlur stdDeviation="5.5" in="SourceAlpha" result="shadowBlurInner1"></feGaussianBlur>
            <feOffset dx="0" dy="1" in="shadowBlurInner1" result="shadowOffsetInner1"></feOffset>
            <feComposite in="shadowOffsetInner1" in2="SourceAlpha" operator="arithmetic" k2="-1" k3="1" result="shadowInnerInner1"></feComposite>
            <feColorMatrix values="0 0 0 0 0   0 0 0 0 0   0 0 0 0 0  0 0 0 0.5 0" type="matrix" in="shadowInnerInner1"></feColorMatrix>
        </filter>
    </defs>
    <g id="Page-1" stroke="none" stroke-width="1" fill="none" fill-rule="evenodd">
        <g id="visuel--7" transform="translate(-306.000000, -93.000000)">
            <g id="japprends-à-gouter" transform="translate(341.000000, 101.000000)">
                <polygon id="Path-6" fill="#FFFFFF" points="168.323242 239.578369 173.839978 239.578369 178.372582 233.840496 182.550472 239.578369 188.323242 239.578369 181.343262 229.578369 175.674805 229.578369"></polygon>
                <g id="Oval">
                    <use fill="black" fill-opacity="1" filter="url(#filter-2)" xlink:href="#path-1"></use>
                    <use fill="#4AA6FF" fill-rule="evenodd" xlink:href="#path-1"></use>
                </g>
                <g id="Oval">
                    <use fill="black" fill-opacity="1" filter="url(#filter-4)" xlink:href="#path-3"></use>
                    <use stroke="#FFFFFF" stroke-width="4.4000001" xlink:href="#path-3"></use>
                </g>
                <g id="Group-5" transform="translate(202.000000, 92.000000) rotate(-33.000000) translate(-202.000000, -92.000000) translate(141.000000, 23.000000)">
                    <path d="M73.6864055,30.8967586 C73.8628819,25.8880039 70.7814864,21.212373 65.8262695,19.5328737 C65.5337947,17.8712203 64.7059423,16.3176339 63.4329334,15.085274 C60.7709171,12.5154616 57.0688803,12.3191565 53.581986,12.401446 C50.0484939,12.4857184 46.4763357,12.4520095 43.7578074,15.0822997 C42.9259892,15.8863575 42.2875019,16.8302083 41.8601913,17.8494086 C40.1083168,13.6724721 36.3695967,12.6731006 32.1718399,12.410369 C28.091073,12.153586 23.4461768,12.0306475 20.289432,15.0822997 C19.0154316,16.3136681 18.1895621,17.8692374 17.8970873,19.5318822 C12.8873412,21.2242703 9.86245787,25.9365844 10.0389342,30.8967586 C11.2703026,65.2868366 20.801015,78.6534302 28.8247386,78.6534302 C41.4467608,78.6534302 40.7785303,42.2854294 41.8611827,30.3802183 C42.8367596,41.1066073 42.1824093,78.6534302 54.8996097,78.6534302 C62.9233333,78.6534302 72.4530542,65.2868366 73.6864055,30.8967586" id="Fill-365" fill="#FFFFFF" transform="translate(41.862608, 45.471910) rotate(17.000000) translate(-41.862608, -45.471910) "></path>
                    <path d="M33.0227649,76.5762908 C33.2428646,76.4900356 33.4867589,76.4355064 33.7693192,76.4355064 L50.4621939,76.4355064 C50.8776073,76.4355064 51.219654,76.549522 51.5032059,76.7160839 C52.5144746,77.5290646 53.6179473,77.9345636 54.8255212,77.9345636 C58.7278289,77.9345636 62.7114347,74.1661003 65.7551554,67.598802 C69.6118568,59.2687234 71.9457065,46.700239 72.49893,31.25063 C72.6585518,26.7762615 69.9132546,22.5140611 65.3952626,20.9812949 C65.0105839,20.8504248 64.7280236,20.5212667 64.6566399,20.120725 C64.3998569,18.6722312 63.6830458,17.3417188 62.5845303,16.280878 C60.0979989,13.8756446 56.5139435,13.8419357 53.0895098,13.919268 C49.8286638,13.9916431 46.7492512,14.0600525 44.4560506,16.2759208 C42.54158,18.1299135 43.0660518,19.3563248 41.7870942,19.3583076 C41.3310318,19.3583076 40.9304901,19.0816959 40.7599624,18.6752055 C39.9896136,16.8380673 38.4171898,15.5303579 36.4719846,15.183354 C34.3483202,14.8056153 31.9351553,14.6697881 29.7896792,14.8532045 C28.2281613,14.9840745 26.5327989,15.2160715 25.277636,16.2303146 C24.2058893,17.0948502 23.2997132,18.2439291 22.4173317,19.2968384 C22.1922748,19.5645272 21.6212054,19.9363171 21.6499571,19.9264027 C16.640211,21.6187908 13.6153277,26.3311049 13.7927954,31.2912791 C14.8219101,60.0450209 21.65194,74.0877765 28.5513707,77.9226663 C28.6187886,77.9246492 28.6842237,77.9345636 28.7506501,77.9345636 C30.1991439,77.9345636 31.4999132,77.3555626 32.6658466,76.1767405 C32.7828365,76.3125678 32.9037922,76.4434379 33.0227649,76.5762908" id="Fill-366" fill="#F15B5C" transform="translate(43.145463, 45.917039) rotate(17.000000) translate(-43.145463, -45.917039) "></path>
                    <path d="M15.8301967,26.2707906 C15.3225794,12.0813018 35.2158223,10.1579083 41.594747,15.4779751 C41.8475642,15.6901433 41.9942974,16.0044297 41.9942974,16.3335878 L41.9942974,16.6220968 C41.991323,17.3289935 42.1549106,17.6878948 43.0938043,18.3025876 C43.6073702,18.6406686 43.7501375,19.3307108 43.4120565,19.8442767 C43.0749669,20.3578426 42.3849247,20.5016014 41.8713588,20.1635204 C40.8253896,19.475461 39.8567528,18.6020024 39.7744633,16.8868113 C34.3959015,13.1123994 17.6286688,14.3546736 18.0539965,26.1914754 C18.1065429,27.6597979 15.882743,27.7420875 15.8301967,26.2707906" id="Fill-367" fill="#000000" transform="translate(29.708043, 20.046182) rotate(17.000000) translate(-29.708043, -20.046182) "></path>
                    <path d="M21.7949958,21.1148256 C22.6238396,19.5384361 25.0052784,18.1910691 28.0093415,17.5971966 C28.6141199,17.4772324 29.1970866,17.8688512 29.3160594,18.4716467 C29.4350322,19.0744421 29.0434134,19.6603832 28.4406179,19.7803474 C25.8123106,20.2998619 24.1734603,21.3735914 23.7630041,22.1528632 C23.4070772,22.8280339 23.0908079,24.0742739 23.1146024,24.716727 C23.1364141,25.3314198 22.6555657,25.8469685 22.0418644,25.8687802 C20.017344,25.9490869 21.1773287,22.2837333 21.7949958,21.1148256" id="Fill-368" fill="#000000" transform="translate(25.118712, 21.722833) rotate(17.000000) translate(-25.118712, -21.722833) "></path>
                    <path d="M27.1018521,30.5802733 C24.3823322,33.4356204 22.9526758,37.2794331 23.140058,41.2174326 C24.6549782,73.1923629 31.1419699,84.1219971 38.9168421,84.1219971 C46.6857657,84.1219971 53.1687916,73.2121917 54.6916434,41.301705 C55.0842536,33.0529245 48.4842378,26.1108619 40.2195942,26.1108619 C37.3850674,26.1108619 31.8528324,25.5953131 27.1018521,30.5802733" id="Fill-369" fill="#FFFFFF" transform="translate(38.916002, 55.108857) rotate(17.000000) translate(-38.916002, -55.108857) "></path>
                    <path d="M47.0640975,50.2534438 C47.4279559,42.6322448 41.3147371,36.2275427 33.704444,36.2275427 C32.6981324,36.2275427 31.3636542,36.1630991 29.8665799,36.3068579 C28.3060534,36.9731055 26.7157837,38.0012288 25.2018548,39.5875327 C22.482335,42.4418884 21.05367,46.2866925 21.2400607,50.2256835 C22.4803521,76.4205188 27.0617962,88.4843603 32.9509496,91.9930663 C38.6309091,91.5330382 45.4708534,83.6857908 47.0640975,50.2534438 L110.348702,126.603738" id="Fill-370" fill="#F15B5C" transform="translate(65.786283, 81.408440) rotate(17.000000) translate(-65.786283, -81.408440) "></path>
                    <path d="M30.7768984,57.5896635 C30.4011427,55.3638808 30.0590959,52.8902381 29.7626554,50.1469237 L30.7768984,57.5896635" id="Fill-371" fill="#FFFFFF" transform="translate(30.269777, 53.868294) rotate(17.000000) translate(-30.269777, -53.868294) "></path>
                    <path d="M29.6772392,57.7748816 C29.2866119,55.4529292 28.9425822,52.9257487 28.6560561,50.2667067 C28.5886382,49.6559797 29.0308204,49.1087048 29.6425388,49.0412869 C30.2522744,48.973869 30.8015322,49.4160512 30.8679586,50.0277697 C31.1515105,52.6431883 31.4886001,55.1267454 31.8732788,57.4060659 C31.9753971,58.0118357 31.5669238,58.584888 30.9601626,58.6870063 C30.3573671,58.7901161 29.780349,58.3816428 29.6772392,57.7748816" id="Fill-372" fill="#000000" transform="translate(30.269094, 53.868712) rotate(17.000000) translate(-30.269094, -53.868712) "></path>
                    <path d="M33.4940438,40.1442355 C33.2293293,34.5673857 37.6818862,29.8986949 43.2547703,29.8986949 C44.7260672,29.8986949 44.72805,32.1234862 43.2547703,32.1234862 C38.9608438,32.1234862 35.5116241,35.7204304 35.7178437,40.0381515 C35.7465954,40.6528442 35.2726871,41.1753331 34.6589858,41.2040849 C34.0661047,41.2377938 33.5247785,40.7728085 33.4940438,40.1442355" id="Fill-373" fill="#000000" transform="translate(38.920904, 35.552251) rotate(17.000000) translate(-38.920904, -35.552251) "></path>
                    <path d="M77.8110321,37.3356323 C78.2353684,25.549394 61.5018447,24.2357361 56.0915568,28.0309682 C56.0112501,29.7431851 55.0416219,30.619618 53.9956527,31.3076773 C53.4840697,31.6457583 52.7910531,31.5019996 52.454955,30.9884336 C52.116874,30.4758592 52.2596413,29.7848255 52.7722158,29.4487274 C53.7111094,28.8320517 53.8756885,28.4731505 53.8707313,27.7731938 L53.8707313,27.4777447 C53.8707313,27.1485867 54.0174644,26.8343002 54.271273,26.622132 C60.6383004,21.3109882 80.5404663,23.2066214 80.0368148,37.4149475 C79.983277,38.8862444 77.7594772,38.8069292 77.8110321,37.3356323" id="Fill-374" fill="#000000" transform="translate(66.158868, 31.190804) rotate(17.000000) translate(-66.158868, -31.190804) "></path>
                    <path d="M27.9071664,31.348448 C25.411712,33.9658495 24.0792167,37.5449478 24.2497443,41.1637037 C25.889586,75.7500868 33.1300721,83.0094102 38.9161157,83.0094102 C44.6972022,83.0094102 51.9317396,75.7649584 53.5785214,41.2479761 C53.9423798,33.6267771 47.829161,27.2220749 40.2188678,27.2220749 C37.4705963,27.2220749 32.3101512,26.7283378 27.9071664,31.348448 Z M38.9161157,85.235193 C29.0919371,85.235193 23.4099947,70.4429087 22.0269359,41.2707792 C21.8266651,37.0462535 23.3832258,32.8693169 26.295085,29.8117161 C31.3206942,24.5382469 37.2227363,24.9972836 40.2188678,24.9972836 C49.0674695,24.9972836 56.2266575,32.4330834 55.8023212,41.3550516 C54.4123224,70.4716605 48.7313714,85.235193 38.9161157,85.235193 L38.9161157,85.235193 Z" id="Fill-375" fill="#000000" transform="translate(38.914999, 55.111192) rotate(17.000000) translate(-38.914999, -55.111192) "></path>
                    <path d="M66.7774571,18.6986429 C66.3570866,17.0350067 65.4727221,15.5181035 64.194756,14.2837608 C61.4524331,11.6306674 57.8505317,11.2747405 54.6898211,11.2747405 C49.5145045,11.2747405 44.8715911,11.365953 41.8506736,15.5805642 C39.42462,12.206694 35.9991949,11.5335063 32.231723,11.2965522 C28.1073328,11.0367949 23.0242201,10.8821302 19.5075825,14.2807864 C18.2306079,15.5131463 17.3462434,17.0300495 16.9288472,18.6956686 C11.7089158,20.7578637 8.73459589,25.8092503 8.91801229,30.9340035 C10.4914275,74.8448795 25.568255,84.0325537 33.2648035,78.296082 C32.9990976,77.5554764 32.6947255,76.8297423 32.3794476,76.107974 C26.172042,81.6263289 12.6240149,72.2254951 11.1418121,30.8546883 C10.9811989,26.385277 13.712616,22.115145 18.2434966,20.5833703 C18.6291667,20.4544831 18.9117271,20.1233422 18.9841022,19.7237918 C19.2389023,18.2713323 19.9557134,16.9408199 21.0532374,15.8799791 C22.827915,14.1667708 25.2896604,13.4013792 29.0323463,13.4013792 C34.2869781,13.4013792 38.9566603,13.817784 40.8245332,18.2792638 C40.9990266,18.6926943 41.4025427,18.962366 41.8506736,18.962366 L41.851665,18.962366 C42.3007873,18.9603831 42.7043034,18.6907114 42.8768139,18.2772809 C44.6832175,13.9585685 48.821488,13.619496 53.1540806,13.5233263 C56.5785142,13.445994 60.1625697,13.479703 62.6491011,15.8849363 C63.7476166,16.9457771 64.4644277,18.2762895 64.7212106,19.7247833 C64.7925943,20.125325 65.0751547,20.4544831 65.4598334,20.5853532 C69.9778253,22.1181194 72.7231226,26.3803198 72.5635008,30.8546883 C71.1001354,71.7337409 57.8703605,81.2822992 51.6252802,76.3617827 C50.7547959,77.6417317 50.7994107,77.6714748 50.3542541,78.2405614 C57.4708102,83.6786096 73.1603476,76.3637655 74.788292,30.9340035 C74.9717084,25.7686013 71.9497994,20.7479493 66.7774571,18.6986429" id="Fill-376" fill="#000000" transform="translate(41.853094, 45.503041) rotate(17.000000) translate(-41.853094, -45.503041) "></path>
                    <path d="M67.462994,4.54654184 C62.0041256,2.97808381 51.5543484,11.2536332 49.2889081,14.2428247 C47.0095876,17.2498621 44.8432913,23.4671821 48.9964333,26.0112171 C50.0295137,26.6427643 51.9509244,26.8678212 53.0940546,26.4028358 C55.3604864,25.4788138 56.0733317,23.0775462 56.3112773,20.8289604 C56.5680603,18.4247185 56.0891948,15.9768532 57.5466115,13.8462487 C59.2013248,11.4251523 64.5669979,8.60252273 67.1962967,7.61306565 C68.7756606,7.02018455 68.3899904,4.81323919 67.462994,4.54654184" id="Fill-377" fill="#FFFFFF" transform="translate(57.458612, 15.500326) rotate(17.000000) translate(-57.458612, -15.500326) "></path>
                    <path d="M52.3979104,15.6949344 C50.5419348,18.1437912 48.7603172,22.7252352 50.4100733,25.7144267 C50.7481543,25.791759 51.11697,25.8363738 51.5244518,25.8363738 C53.9842144,25.8363738 54.8566816,23.4489864 55.1164388,21.0100441 C55.3682646,18.6395111 54.8566816,15.975512 56.5371723,13.5157494 C58.3445674,10.8745533 63.8440848,7.95079689 66.7143035,6.87111876 C66.9770351,6.77197477 67.1267426,6.4824743 67.0504017,6.21081975 L67.0107441,6.06805239 C61.43786,7.38666755 54.2330658,13.2738381 52.3979104,15.6949344" id="Fill-378" fill="#7DCD55" transform="translate(58.413971, 15.952213) rotate(17.000000) translate(-58.413971, -15.952213) "></path>
                    <path d="M50.0176028,21.4208299 C49.6755561,21.4208299 49.337475,21.2621995 49.1193582,20.9667504 C47.5974979,18.901581 48.9071901,14.9893589 51.0873666,12.6317146 C52.086738,11.553028 53.7216225,13.0610082 52.7212596,14.1426692 C50.9951626,16.0115335 50.27042,18.777651 50.9118817,19.6471438 C51.2767316,20.1408809 51.1706475,20.8378632 50.6769104,21.2027131 C50.4766395,21.3484548 50.2466255,21.4208299 50.0176028,21.4208299" id="Fill-379" fill="#000000" transform="translate(50.747471, 16.840585) rotate(17.000000) translate(-50.747471, -16.840585) "></path>
                    <path d="M50.1758823,14.9171087 C47.0399577,19.0524048 46.4500509,25.538405 51.6144617,25.5393964 C54.0742242,25.5393964 54.9466914,23.152009 55.2064487,20.7130667 C55.4582744,18.3425337 54.9466914,15.6785346 56.6271821,13.218772 C58.4345772,10.577576 63.9340947,7.6538195 66.8043134,6.57414138 C67.0670449,6.47499738 67.2167524,6.18549691 67.1404115,5.91384236 L67.0482076,5.58865005 C62.3963713,4.41478514 52.5037833,11.848602 50.1758823,14.9171087 Z M51.6144617,27.7651792 L51.6144617,27.7651792 C44.7249454,27.7631963 43.7920004,19.6552003 48.4021962,13.5727161 C50.6180645,10.6489596 61.4713578,1.66849644 67.7689844,3.47886581 C69.6636262,4.02316635 70.2109011,7.67166542 67.5875509,8.65814818 C66.1549202,9.19650008 63.7982674,10.3525191 62.0572988,11.4847435 C56.530021,15.0638418 57.9557117,15.9224288 57.4183512,20.9490294 C57.025741,24.6411518 55.3204643,27.7651792 51.6144617,27.7651792 L51.6144617,27.7651792 Z" id="Fill-380" fill="#000000" transform="translate(57.465415, 15.502589) rotate(17.000000) translate(-57.465415, -15.502589) "></path>
                </g>
                <g id="Group-3" transform="translate(42.000000, 121.000000)" fill="#FFFFFF" fill-rule="nonzero">
                    <g id="Group-2" transform="translate(0.000000, 61.780000)">
                        <path d="M12.3346812,79.9400032 L14.2582909,65.9501143 L26.1496964,65.9501143 L28.0733061,79.9400032 L38.5657227,79.9400032 L26.9366277,16.8106299 L13.4713597,16.8106299 L1.8422646,79.9400032 L12.3346812,79.9400032 Z M24.5758339,56.5069394 L15.8321534,56.5069394 L20.1165569,29.4015298 L20.2914305,29.4015298 L24.5758339,56.5069394 Z M55.7033365,79.9400032 L55.7033365,54.0587089 L60.7746712,54.0587089 C72.3163295,54.0587089 80.0107683,50.0366158 80.0107683,35.4346694 C80.0107683,21.9694014 73.6278816,16.8106299 60.7746712,16.8106299 L44.8611727,16.8106299 L44.8611727,79.9400032 L55.7033365,79.9400032 Z M59.3756823,45.1401547 L55.7033365,45.1401547 L55.7033365,25.729184 L59.1133719,25.729184 C66.1957531,25.729184 69.1686045,26.9532993 69.1686045,35.4346694 C69.1686045,43.5662922 66.4580635,45.1401547 59.3756823,45.1401547 Z M99.4217391,79.9400032 L99.4217391,54.0587089 L104.493074,54.0587089 C116.034732,54.0587089 123.729171,50.0366158 123.729171,35.4346694 C123.729171,21.9694014 117.346284,16.8106299 104.493074,16.8106299 L88.5795752,16.8106299 L88.5795752,79.9400032 L99.4217391,79.9400032 Z M103.094085,45.1401547 L99.4217391,45.1401547 L99.4217391,25.729184 L102.831774,25.729184 C109.914156,25.729184 112.887007,26.9532993 112.887007,35.4346694 C112.887007,43.5662922 110.176466,45.1401547 103.094085,45.1401547 Z M148.561224,13.4880313 L160.015445,0.897131373 L148.211476,0.897131373 L141.303969,13.4880313 L148.561224,13.4880313 Z M162.551112,79.9400032 L162.551112,70.4968282 L143.140142,70.4968282 L143.140142,51.9602255 L157.13003,51.9602255 L157.13003,42.5170506 L143.140142,42.5170506 L143.140142,26.2538048 L161.326997,26.2538048 L161.326997,16.8106299 L132.297978,16.8106299 L132.297978,79.9400032 L162.551112,79.9400032 Z M188.257533,79.9400032 L188.257533,26.2538048 L198.74995,26.2538048 L198.74995,16.8106299 L166.922953,16.8106299 L166.922953,26.2538048 L177.415369,26.2538048 L177.415369,79.9400032 L188.257533,79.9400032 Z M217.461426,79.9400032 L217.461426,16.8106299 L206.619262,16.8106299 L206.619262,79.9400032 L217.461426,79.9400032 Z M246.577882,79.9400032 L246.577882,26.2538048 L257.070299,26.2538048 L257.070299,16.8106299 L225.243302,16.8106299 L225.243302,26.2538048 L235.735718,26.2538048 L235.735718,79.9400032 L246.577882,79.9400032 Z" id="APPÉTIT"></path>
                    </g>
                    <path d="M37.925,51 C38.525,51 39.075,50.8166667 39.575,50.45 L40.125,50 C40.3583333,49.8333333 40.5916667,49.7166667 40.825,49.65 C41.0583333,49.55 41.225,49.45 41.325,49.35 L41.775,48.85 L42.275,48.3 C42.4083333,48.1333333 42.575,48.0166667 42.775,47.95 C43.075,47.7833333 43.2916667,47.55 43.425,47.25 L44.225,45.15 L44.425,44.6 L44.975,42.75 L45.375,41.3 L45.375,40.65 C45.375,40.4166667 45.3583333,40.2333333 45.325,40.1 C45.2916667,39.9 45.225,39.75 45.125,39.65 C44.9916667,39.5166667 44.825,39.4166667 44.625,39.35 L44.025,39.35 L44.025,39.35 C43.4583333,39.3833333 43.0416667,39.5333333 42.775,39.8 L42.525,40.05 L42.325,40.35 L42.125,40.55 L41.975,40.75 L41.825,41.15 L41.625,41.95 L41.425,42.65 L41.175,43.35 L40.825,44.05 L40.475,44.7 C40.075,45.3666667 39.5416667,45.9166667 38.875,46.35 C38.6083333,46.35 38.3083333,46.4 37.975,46.5 L37.125,46.8 C36.8916667,46.9 36.675,46.9333333 36.475,46.9 C35.575,46.8333333 34.875,46.4 34.375,45.6 C34.0416667,45.0666667 33.8583333,44.5666667 33.825,44.1 C33.825,43.9 33.775,43.7166667 33.675,43.55 C33.4416667,42.9833333 33.2083333,42.15 32.975,41.05 L32.875,40.15 L32.725,39.25 L32.625,38.05 C32.5916667,37.55 32.525,37.15 32.425,36.85 L32.425,34.65 C32.425,34.45 32.4416667,34.2666667 32.475,34.1 C32.575,33.7666667 32.5916667,33.5 32.525,33.3 C32.4583333,33.0333333 32.4583333,32.7333333 32.525,32.4 L32.525,32.1 L32.625,31.2 C32.6583333,30.8333333 32.7083333,30.5333333 32.775,30.3 L32.975,29.7 L33.025,29.2 L33.125,28.7 L33.225,28.3 L33.325,27.85 L33.475,27.15 L33.675,25.75 L33.825,25.1 L34.225,23.5 L34.425,22.95 C34.4916667,22.55 34.5916667,22.2666667 34.725,22.1 L34.875,21.85 L34.975,21.6 L35.075,21.25 L35.225,20.95 L35.475,20.4 L35.725,19.9 C35.825,19.5666667 35.9916667,19.2833333 36.225,19.05 L36.375,18.95 L36.475,18.85 L36.675,18.7 C36.8083333,18.5666667 36.9416667,18.45 37.075,18.35 C37.2416667,18.25 37.4083333,18.2166667 37.575,18.25 C38.3416667,18.3166667 38.9416667,18.55 39.375,18.95 L39.675,19.25 L40.075,19.55 L40.075,19.55 L40.375,19.75 L40.625,20 C40.825,20.1666667 41.075,20.35 41.375,20.55 C41.475,20.6166667 41.625,20.7 41.825,20.8 L41.975,20.85 L42.175,20.9 C42.275,20.8666667 42.4083333,20.7666667 42.575,20.6 C42.7083333,20.4333333 42.775,20.3 42.775,20.2 C42.7416667,20 42.675,19.8 42.575,19.6 L42.425,19.35 L42.375,19.15 C42.3083333,18.95 42.2416667,18.7833333 42.175,18.65 L42.025,18.4 L41.825,18.1 C41.6916667,17.8333333 41.5083333,17.5833333 41.275,17.35 C40.2083333,16.4833333 39.2916667,15.9166667 38.525,15.65 C37.625,15.35 36.6916667,15.25 35.725,15.35 L35.575,15.3 C35.1416667,15.2333333 34.7916667,15.2833333 34.525,15.45 L33.375,16.1 L32.925,16.4 L32.425,16.7 C32.2583333,16.7666667 32.125,16.8833333 32.025,17.05 L31.675,17.6 L31.275,18.15 L29.875,20.15 L29.325,21.25 L28.875,22.3 C28.5083333,23.1 28.2583333,23.9333333 28.125,24.8 L27.975,25.45 L27.775,26.1 L27.475,27.25 L27.175,28.45 L27.025,29.2 L26.925,30 L26.825,30.35 L26.725,30.65 L26.625,31.6 C26.575,31.875 26.525,32.121875 26.475,32.340625 L26.425,32.55 L26.375,34.2 L26.325,35.8 L26.325,37.25 L26.375,38.75 L26.425,38.9 L26.525,39.6 L26.625,40.35 L26.775,41 L26.925,41.7 L27.375,43.4 L27.875,45.15 C28.0083333,45.55 28.2083333,45.9666667 28.475,46.4 L28.975,47 L29.525,47.6 L30.125,48.3 L30.775,48.9 C31.0416667,49.1333333 31.2916667,49.3166667 31.525,49.45 C31.725,49.5833333 31.9916667,49.7 32.325,49.8 L34.875,50.7 L35.425,50.9 C35.625,50.9666667 35.8083333,50.9833333 35.975,50.95 C36.2416667,50.9166667 36.5583333,50.9166667 36.925,50.95 L37.925,51 Z M56.525,50.95 L57.025,50.85 L57.475,50.75 L57.775,50.75 L58.025,50.65 C58.025,50.65 58.1416667,50.6 58.375,50.5 L58.725,50.4 L59.125,50.25 C59.7916667,49.9833333 60.1416667,49.85 60.175,49.85 C60.5416667,49.7833333 60.8583333,49.5833333 61.125,49.25 C61.225,49.1166667 61.3583333,49 61.525,48.9 C61.7583333,48.7666667 61.9083333,48.6 61.975,48.4 L62.075,48.05 C62.2416667,47.6833333 62.4083333,47.2166667 62.575,46.65 L62.775,45.9 L62.925,45.2 L63.375,43.8 L63.475,43.35 L63.675,42.5 L63.925,41.7 L64.125,41.15 L64.275,40.6 L64.375,40 L64.825,37.95 L64.975,37.3 L65.075,36.65 L65.325,35.65 C65.3916667,35.2833333 65.425,34.95 65.425,34.65 L65.475,33.65 L65.525,32.7 L65.575,32.15 L65.625,31.3 L65.625,30.9 L65.675,27.25 L65.675,26.1 L65.725,24.95 L65.825,22.4 L65.925,21.4 L66.075,20.45 L66.225,19.35 C66.2916667,18.9166667 66.325,18.55 66.325,18.25 C66.2583333,17.25 66.025,16.5333333 65.625,16.1 C65.1583333,15.6666667 64.7583333,15.45 64.425,15.45 C64.325,15.45 64.2416667,15.4333333 64.175,15.4 C64.075,15.2666667 63.8916667,15.25 63.625,15.35 L63.025,15.65 C62.7916667,15.7833333 62.575,15.8333333 62.375,15.8 C62.2083333,15.8 62.125,15.8833333 62.125,16.05 L62.075,16.9 C62.075,17.2 62.0916667,17.4666667 62.125,17.7 L62.275,18.75 C62.3083333,19.1833333 62.3083333,19.55 62.275,19.85 L62.225,20.5 L62.125,21.2 L61.975,23.6 L61.875,26.8 L61.875,27.45 L61.825,28.1 C61.7916667,28.4333333 61.775,28.85 61.775,29.35 L61.825,30.55 L61.775,31.5 L61.575,33 C61.6416667,33.6333333 61.6083333,34.2833333 61.475,34.95 L61.225,36.2 L61.025,37.5 L60.375,40.75 L59.975,42.15 L59.725,43 L59.525,43.8 C59.3916667,44.5 59.2416667,45.05 59.075,45.45 C58.875,45.95 58.6916667,46.3666667 58.525,46.7 C58.425,46.8333333 58.275,46.9166667 58.075,46.95 C57.875,46.9833333 57.7083333,46.9333333 57.575,46.8 C57.0416667,46.3666667 56.5583333,45.7 56.125,44.8 C55.6583333,43.8 55.325,42.6666667 55.125,41.4 L55.075,41.2 C54.875,40.4 54.725,39.5666667 54.625,38.7 L54.525,37.9 L54.425,37.05 L54.375,36.85 L54.375,36.7 C54.4083333,36.5333333 54.4083333,36.35 54.375,36.15 L54.275,35.6 C54.2083333,35.2333333 54.175,34.8833333 54.175,34.55 L54.225,33.8 L54.225,32.75 L54.175,32.4 L54.125,31.75 L54.075,31.05 C54.1083333,30.4166667 54.0916667,29.6333333 54.025,28.7 L54.025,28.25 C54.0583333,28.0833333 54.0583333,27.95 54.025,27.85 C53.925,27.5166667 53.9083333,27.1333333 53.975,26.7 L53.975,26.3 L53.925,25.4 L53.825,24.5 L53.825,22.85 L53.875,21.2 L53.825,20.75 L53.825,20.3 L53.675,19.55 L53.575,18.85 L53.575,18.7 L53.625,18.55 C53.6916667,18.3166667 53.6916667,18.0833333 53.625,17.85 L53.525,17.5 C53.4916667,17.2666667 53.3916667,17.1 53.225,17 C53.125,16.9333333 53.0416667,16.85 52.975,16.75 C52.8416667,16.5166667 52.625,16.3166667 52.325,16.15 L51.525,15.75 L51.125,15.6 L49.675,15.25 C49.6416667,15.25 49.4583333,15.2833333 49.125,15.35 L48.675,15.4 L48.325,15.4 L48.325,15.4 C48.1916667,15.4 48.0583333,15.45 47.925,15.55 L47.625,15.75 L47.375,15.95 C47.1416667,16.15 46.9416667,16.25 46.775,16.25 L46.675,16.35 C46.575,16.3833333 46.525,16.4666667 46.525,16.6 L46.475,16.75 L46.475,16.9 C46.4083333,17.1666667 46.3583333,17.4666667 46.325,17.8 L46.375,18.7 L46.375,21.8 L46.325,22.1 L46.325,22.4 L46.425,24 L46.475,25.6 L46.525,26.2 L46.625,26.8 C46.6583333,27.2666667 46.625,27.6666667 46.525,28 L46.525,28.05 C46.5916667,28.45 46.625,28.9166667 46.625,29.45 L46.675,30.8 C46.7416667,32.9 46.825,34.5833333 46.925,35.85 L47.175,38.7 C47.2416667,39.2666667 47.3083333,39.6833333 47.375,39.95 L47.525,40.8 L47.725,41.6 L47.775,41.75 L47.775,41.85 L47.875,42.4 L48.125,43.4 L48.375,44.45 C48.4416667,44.6833333 48.5416667,44.9333333 48.675,45.2 L49.025,45.95 L49.525,46.8 L50.025,47.6 C50.3916667,48.3333333 50.9916667,49.0166667 51.825,49.65 C51.9916667,49.7833333 52.2083333,49.9 52.475,50 L54.075,50.6 C54.5083333,50.7666667 54.9416667,50.8666667 55.375,50.9 L55.575,50.9 C55.8416667,51 56.1583333,51.0166667 56.525,50.95 Z M84.825,51.5 C85.725,51.5 86.475,51.4666667 87.075,51.4 L87.575,51.4 C87.775,51.4 87.9583333,51.3666667 88.125,51.3 C88.3583333,51.2 88.575,51.0666667 88.775,50.9 C89.0083333,50.7 89.1583333,50.5 89.225,50.3 C89.3916667,49.7666667 89.425,49.2666667 89.325,48.8 L89.275,48.6 L89.275,48.35 C89.2416667,48.1833333 89.1916667,48.05 89.125,47.95 L89.075,47.85 L88.925,47.75 C88.825,47.65 88.6916667,47.5833333 88.525,47.55 C88.3583333,47.4833333 87.925,47.45 87.225,47.45 L86.475,47.45 L86.125,47.4 C85.025,47.3 84.1083333,47.2833333 83.375,47.35 L79.8867778,47.3491111 C78.9989259,47.3452593 78.5116667,47.3288889 78.425,47.3 L78.175,47.25 L77.875,47.15 C77.6416667,47.0166667 77.525,46.8 77.525,46.5 L77.575,45.95 L77.625,45.35 L77.525,43.85 L77.525,43.55 L77.575,43 L77.575,42.45 C77.575,41.95 77.5916667,41.5666667 77.625,41.3 C77.6916667,41 77.7083333,40.55 77.675,39.95 L77.675,38.6 L77.725,37.75 L77.675,36.85 L77.625,36.05 L77.575,35.2 L77.575,33.9 C77.575,33.5 77.5083333,33.15 77.375,32.85 C77.275,32.5833333 77.275,32.35 77.375,32.15 C77.5416667,31.8833333 77.5916667,31.5333333 77.525,31.1 C77.3916667,30.3333333 77.3916667,29.6333333 77.525,29 L77.525,27.25 L77.475,27.05 L77.475,26.85 L77.525,26.4 L77.525,25.9 C77.4916667,25.5 77.5083333,25.1833333 77.575,24.95 L77.575,24.75 C77.5416667,24.55 77.525,24.3333333 77.525,24.1 L77.525,23.45 C77.5583333,23.25 77.5416667,23.0166667 77.475,22.75 L77.425,22.3 C77.3916667,22.1666667 77.425,22.0333333 77.525,21.9 L77.575,21.8 L77.575,21.65 L77.525,20.75 L77.525,20.3 L77.475,19.85 C77.4416667,19.6166667 77.475,19.3833333 77.575,19.15 L77.625,19 L77.625,18.9 L77.725,18.35 L77.725,17.85 C77.725,17.45 77.675,17.1 77.575,16.8 C77.2083333,15.8333333 76.5583333,15.2333333 75.625,15 C74.725,14.7666667 73.9583333,14.6666667 73.325,14.7 L72.875,14.7 C72.675,14.7 72.525,14.7166667 72.425,14.75 C72.025,14.8833333 71.725,15.1 71.525,15.4 C71.4583333,15.5 71.3916667,15.5666667 71.325,15.6 C71.1583333,15.6666667 71.0416667,15.8166667 70.975,16.05 C70.9083333,16.35 70.825,16.5666667 70.725,16.7 C70.4583333,17.1333333 70.325,17.65 70.325,18.25 C70.325,18.45 70.3583333,18.6 70.425,18.7 C70.525,18.8666667 70.5583333,19.1 70.525,19.4 L70.375,20.15 C70.3416667,20.4166667 70.375,20.6666667 70.475,20.9 L70.475,25.9 L70.525,27.6 L70.525,31.9 L70.575,34.4 L70.625,35.7 L70.675,37.25 L70.675,37.95 L70.625,38.7 L70.675,39.9 L70.675,41.8 L70.625,42.45 L70.625,43.3 L70.675,44.15 L70.675,48.5 L70.725,49 C70.725,49.1333333 70.7416667,49.3166667 70.775,49.55 C70.7416667,49.75 70.7916667,49.95 70.925,50.15 C71.025,50.35 71.1916667,50.5166667 71.425,50.65 C71.9916667,51.0166667 72.7083333,51.2666667 73.575,51.4 C74.1083333,51.4666667 74.875,51.5 75.875,51.5 L84.825,51.5 Z M96.725,50.9 C96.7583333,50.8666667 96.8916667,50.8333333 97.125,50.8 L97.425,50.75 L97.775,50.65 C98.4416667,50.4833333 98.8583333,50.2833333 99.025,50.05 C99.1916667,49.8833333 99.2583333,49.6833333 99.225,49.45 C99.225,49.3166667 99.2083333,49.15 99.175,48.95 L99.125,48.35 C99.0916667,47.8166667 99.0583333,47.45 99.025,47.25 C98.9916667,47.1166667 98.9416667,46.7 98.875,46 L98.775,45.25 C98.775,45.0166667 98.7583333,44.85 98.725,44.75 C98.5916667,44.0166667 98.5416667,43.3833333 98.575,42.85 C98.6083333,42.5833333 98.5916667,42.0166667 98.525,41.15 L98.525,40.65 L98.475,40.2 L98.475,39.55 C98.475,39.35 98.4916667,38.7833333 98.525,37.85 C98.525,37.5833333 98.5416667,37.2333333 98.575,36.8 L98.575,36.3 L98.625,36 L98.575,35.75 L98.575,35.55 L98.525,35 C98.525,34.7666667 98.5416667,34.5666667 98.575,34.4 C98.6416667,34.1333333 98.6416667,33.2333333 98.575,31.7 C98.5083333,30.2666667 98.4583333,29.3833333 98.425,29.05 L98.375,28.55 L98.325,28 L98.375,27.55 L98.475,26.75 C98.5083333,26.45 98.4916667,26.1833333 98.425,25.95 L98.425,25.6 L98.375,23.55 L98.375,23.2 C98.375,23.1333333 98.3583333,23.0166667 98.325,22.85 L98.275,22.4 C98.2416667,22 98.225,21.75 98.225,21.65 C98.2583333,21.5166667 98.2416667,21.3833333 98.175,21.25 L98.075,21.1 C98.0416667,21.0333333 98.025,20.95 98.025,20.85 C97.9916667,20.4166667 97.8416667,19.9833333 97.575,19.55 C97.5416667,19.4166667 97.525,19.3166667 97.525,19.25 L101.525,19.15 C102.025,19.1166667 102.425,19.0666667 102.725,19 C103.158333,18.8666667 103.491667,18.6666667 103.725,18.4 C103.958333,18.1 104.091667,17.6 104.125,16.9 C104.158333,16.6 104.141667,16.3666667 104.075,16.2 C103.941667,15.9 103.608333,15.7166667 103.075,15.65 L103.075,15.6 L102.725,15.45 L102.375,15.4 L101.675,15.35 L100.975,15.35 L100.425,15.4 L99.325,15.45 L98.225,15.5 C97.925,15.5 97.6916667,15.45 97.525,15.35 C97.3583333,15.2833333 97.1583333,15.25 96.925,15.25 L94.975,15.35 L93.375,15.45 L91.775,15.45 L90.525,15.4 L89.675,15.4 L88.175,15.6 C87.9416667,15.6 87.6583333,15.6666667 87.325,15.8 C86.9583333,15.9333333 86.5916667,16.0166667 86.225,16.05 L84.875,16.05 L84.775,16.15 L84.675,16.3 L84.575,16.5 C84.5083333,16.6333333 84.4916667,16.7666667 84.525,16.9 C84.5916667,17.2333333 84.5416667,17.5333333 84.375,17.8 C84.2083333,18.0666667 84.2416667,18.3166667 84.475,18.55 L84.625,18.7 L84.725,18.85 L85.025,19.15 C85.0583333,19.1833333 85.1916667,19.2666667 85.425,19.4 L85.675,19.55 C85.775,19.6166667 85.8416667,19.65 85.875,19.65 C86.0416667,19.7833333 86.2083333,19.8333333 86.375,19.8 L87.775,19.6 C88.0416667,19.5333333 88.3416667,19.5 88.675,19.5 L89.125,19.55 C89.2916667,19.5166667 89.4583333,19.5 89.625,19.5 C90.0583333,19.4333333 90.3916667,19.4333333 90.625,19.5 C90.8583333,19.5333333 90.9583333,19.7 90.925,20 C90.8916667,20.1666667 90.9416667,20.45 91.075,20.85 L91.275,21.35 C91.3083333,21.5166667 91.325,21.65 91.325,21.75 L91.325,26.85 L91.375,28.95 L91.375,34.45 L91.425,35.1 L91.425,35.75 C91.325,36.9833333 91.2916667,38.0666667 91.325,39 L91.375,40.5 L91.425,42.05 L91.575,44.3 L91.675,45.3 L91.775,46.25 C91.775,46.4833333 91.825,46.7666667 91.925,47.1 L92.175,47.95 C92.175,47.9833333 92.1916667,48.0833333 92.225,48.25 L92.275,48.6 C92.3416667,48.9666667 92.4083333,49.2 92.475,49.3 L92.775,50 C92.9083333,50.2666667 93.125,50.4333333 93.425,50.5 L93.775,50.55 C93.8083333,50.55 93.875,50.5666667 93.975,50.6 L94.325,50.7 C94.6583333,50.7666667 94.9583333,50.8333333 95.225,50.9 C96.025,51.0333333 96.525,51.0333333 96.725,50.9 Z M112.225,50.5 C112.291667,50.4333333 112.425,50.3333333 112.625,50.2 C112.791667,50.0666667 112.908333,49.9833333 112.975,49.95 C113.175,49.9166667 113.308333,49.75 113.375,49.45 L113.475,49.05 L113.625,48.7 C113.691667,48.5666667 113.725,48.45 113.725,48.35 L113.675,47.75 C113.675,47.5166667 113.691667,47.3166667 113.725,47.15 C113.758333,46.8166667 113.775,46.3833333 113.775,45.85 L113.725,45.2 L113.725,43.95 L113.675,43.4 L113.675,40.1 L113.575,37.7 L113.575,36.5 L113.625,35.1 L113.725,33.75 C113.758333,33.2166667 113.741667,32.7666667 113.675,32.4 L113.725,32.25 L113.725,32.15 L113.825,31.35 L113.875,30.6 L113.825,28.8 L113.825,27.05 L113.875,25.85 L113.875,24.6 L113.925,24.1 L113.975,23.55 L113.975,22.95 L114.025,22.35 L114.325,20.95 C114.458333,20.3833333 114.525,19.9 114.525,19.5 L114.525,19.45 L114.575,19.4 L114.625,18.7 L114.625,18.2 C114.625,18 114.641667,17.85 114.675,17.75 C114.775,17.4166667 114.741667,17.0833333 114.575,16.75 L114.225,16.15 L113.825,15.6 C113.791667,15.5333333 113.525,15.3333333 113.025,15 C112.558333,14.6666667 112.258333,14.4666667 112.125,14.4 L111.825,14.3 L111.575,14.2 C111.041667,14 110.625,13.9 110.325,13.9 L110.025,13.9 L109.775,13.95 L109.275,14.1 L108.825,14.25 C108.425,14.35 108.125,14.4833333 107.925,14.65 L107.775,14.7 C107.441667,14.8 107.275,15 107.275,15.3 L107.225,15.55 C107.058333,16.2833333 106.975,16.9666667 106.975,17.6 C106.975,17.8333333 106.941667,18.0166667 106.875,18.15 C106.775,18.4166667 106.691667,18.75 106.625,19.15 L106.525,20.1 L106.425,20.95 L106.375,21.75 L106.225,22.75 L106.125,23.75 L106.075,25.3 C106.041667,25.9 106.041667,26.4 106.075,26.8 L106.075,27.9 L106.025,29.05 L106.025,30.65 L105.975,31.55 L105.875,32.15 C105.875,32.3833333 105.891667,32.5833333 105.925,32.75 L105.925,33.1 L105.875,33.55 L105.825,34.05 L105.875,34.85 L105.825,35.7 C105.825,36.3666667 105.841667,36.9 105.875,37.3 L105.875,37.4 L105.825,38.9 L105.875,40.35 L105.875,41.75 L105.925,42.8 L105.925,43.95 L106.025,45.15 L106.075,46.35 C106.108333,47.3166667 106.191667,48.1 106.325,48.7 C106.358333,48.8333333 106.541667,49.0666667 106.875,49.4 L107.275,49.8 C107.408333,49.9333333 107.491667,50.0333333 107.525,50.1 C107.791667,50.5 108.108333,50.7166667 108.475,50.75 C108.608333,50.75 108.708333,50.7666667 108.775,50.8 C108.941667,50.8666667 109.141667,50.9166667 109.375,50.95 L109.975,50.9 L110.375,50.9 C111.208333,51.1 111.825,50.9666667 112.225,50.5 Z M129.625,51 C129.658333,51 129.891667,50.95 130.325,50.85 C130.758333,50.7166667 131.091667,50.6166667 131.325,50.55 C131.491667,50.4833333 131.641667,50.3833333 131.775,50.25 C132.008333,50.05 132.158333,49.7833333 132.225,49.45 C132.291667,49.25 132.325,48.95 132.325,48.55 C132.358333,47.95 132.441667,47.45 132.575,47.05 L132.625,46.9 L132.675,46.7 C132.741667,46.2 132.891667,45.6 133.125,44.9 L133.625,43.1 L134.175,41.05 L134.275,40.7 L134.975,38.8 L135.025,38.4 L135.175,38 C135.275,37.6666667 135.341667,37.3 135.375,36.9 L135.425,35.7 C135.425,35.6333333 135.491667,35.2833333 135.625,34.65 C135.758333,33.9833333 135.891667,33.3 136.025,32.6 C136.458333,30.6333333 136.758333,29.55 136.925,29.35 C136.925,29.35 136.975,29.1333333 137.075,28.7 L137.225,28.15 C137.258333,27.9166667 137.291667,27.75 137.325,27.65 L138.025,25.05 L138.175,24.45 L138.575,22.6 L138.625,22.4 L139.025,21.2 L139.175,20.8 L139.275,20.45 C139.341667,19.9833333 139.375,19.6 139.375,19.3 C139.408333,18.8 139.558333,18.2833333 139.825,17.75 L139.925,17.45 L140.025,17.15 L140.075,16.85 L140.175,16.5 L139.875,16.4 L139.675,16.35 L139.475,16.25 C139.108333,15.9833333 138.725,15.9833333 138.325,16.25 C138.058333,16.45 137.858333,16.6833333 137.725,16.95 L137.425,17.45 L137.175,17.95 L136.925,18.6 L136.675,19.2 C136.341667,19.9 136.108333,20.5666667 135.975,21.2 L135.675,22.55 L135.325,23.9 L134.825,25.75 L134.425,27.65 L134.275,28.45 L134.175,29.25 L134.075,30 L133.975,30.75 L133.825,31.5 C133.725,31.8 133.525,32.35 133.225,33.15 C133.125,33.4166667 133.025,33.7 132.925,34 C132.825,34.2333333 132.758333,34.3833333 132.725,34.45 L132.575,34.95 L132.375,35.45 L132.075,36.4 L131.775,37.4 L131.275,39.5 L130.975,40.9 L130.625,41.95 C130.591667,42.0833333 130.558333,42.1833333 130.525,42.25 C130.291667,42.5166667 130.108333,42.5 129.975,42.2 L129.925,42 L129.825,41.75 L129.625,40.95 L129.375,40.15 C129.175,39.7166667 129.058333,39.3333333 129.025,39 C128.925,38.4 128.791667,37.95 128.625,37.65 L128.525,37.4 L128.475,37.2 L128.075,35.65 L127.875,34.95 L127.725,34.25 L127.625,33.85 L127.475,33.5 C127.375,33.2 127.341667,32.95 127.375,32.75 L127.375,32.65 L127.025,31.7 L126.725,30.75 L126.525,29.7 L126.275,28.7 C126.141667,28.3 126.041667,27.8333333 125.975,27.3 L125.425,24.65 L125.325,24.3 L125.225,24 L124.725,22.4 L124.725,21.6 L124.625,20.65 L124.475,19.7 L124.425,19.05 L124.375,18.4 C124.308333,17.6333333 124.025,17.0833333 123.525,16.75 L122.975,16.35 L122.425,15.95 C122.091667,15.6833333 121.725,15.5333333 121.325,15.5 L120.475,15.35 L119.675,15.2 L119.225,15.15 L118.775,15.15 L118.525,15.2 L118.325,15.2 C118.025,15.1 117.708333,15.15 117.375,15.35 C117.141667,15.4833333 116.925,15.7166667 116.725,16.05 C116.558333,16.4166667 116.491667,16.7166667 116.525,16.95 C116.625,17.25 116.691667,17.6333333 116.725,18.1 L116.825,19.2 C116.891667,19.7 116.991667,20.3 117.125,21 L117.325,22.05 L117.575,23.1 L117.625,23.7 L117.725,24.25 L118.225,26.35 L119.225,30.6 L119.875,33.3 L120.425,35.45 L120.825,37.05 L120.975,37.65 L121.225,38.4 L121.425,39.2 C121.491667,39.5333333 121.591667,39.9166667 121.725,40.35 L122.075,41.55 L122.475,42.7 L122.875,43.8 L123.125,44.65 C123.225,44.9166667 123.358333,45.15 123.525,45.35 L123.625,45.55 L123.675,45.75 C123.941667,46.5833333 124.225,47.2833333 124.525,47.85 L124.675,48.2 L124.825,48.55 C124.925,48.8166667 125.041667,49.0333333 125.175,49.2 C125.241667,49.2666667 125.291667,49.3666667 125.325,49.5 C125.425,49.8333333 125.725,50.0666667 126.225,50.2 C126.291667,50.2333333 126.425,50.2833333 126.625,50.35 L127.175,50.55 C127.608333,50.7166667 127.858333,50.8 127.925,50.8 L128.375,50.8 L128.925,50.9 L129.625,51 Z M147.525,51.55 L149.025,51.4 L150.075,51.3 C150.308333,51.2666667 150.708333,51.2333333 151.275,51.2 L152.075,51.15 L152.975,51.1 C154.541667,51.0333333 155.508333,50.9833333 155.875,50.95 C156.008333,50.9166667 156.125,50.8333333 156.225,50.7 L156.525,50.3 L156.775,49.85 C156.741667,49.2833333 156.608333,48.8333333 156.375,48.5 L155.375,48.5 C155.041667,48.5 154.758333,48.45 154.525,48.35 C154.475,48.325 154.415625,48.31875 154.346875,48.33125 L154.275,48.35 C154.041667,48.4166667 153.358333,48.4333333 152.225,48.4 L150.925,48.4 L150.925,48.4 C150.525,48.3666667 150.258333,48.35 150.125,48.35 C149.925,48.3166667 149.758333,48.2333333 149.625,48.1 C149.458333,47.9333333 149.408333,47.7666667 149.475,47.6 C149.475,47.2333333 149.458333,46.9166667 149.425,46.65 L149.425,46.35 L149.375,46.05 C149.341667,45.6166667 149.325,45.1333333 149.325,44.6 L149.375,43.6 L149.475,42.7 C149.508333,42.0666667 149.491667,41.6166667 149.425,41.35 C149.458333,40.9833333 149.475,40.4666667 149.475,39.8 L149.475,38.95 L149.525,38.1 C149.525,36.7666667 149.541667,36.0333333 149.575,35.9 C149.641667,35.7333333 149.775,35.65 149.975,35.65 C150.108333,35.65 150.291667,35.6333333 150.525,35.6 L152.075,35.25 C152.675,35.1166667 153.208333,35.0333333 153.675,35 L154.075,34.95 L154.475,34.85 C154.775,34.75 155.008333,34.5833333 155.175,34.35 L155.225,34.3 C155.425,34.2 155.591667,34.0666667 155.725,33.9 L155.875,33.65 L156.075,33.4 C156.208333,33.2333333 156.241667,33 156.175,32.7 C156.041667,32.0333333 155.741667,31.6333333 155.275,31.5 L155.175,31.45 L155.075,31.35 C154.675,31.0833333 154.308333,30.9666667 153.975,31 C153.875,31 153.791667,30.9833333 153.725,30.95 C153.591667,30.85 153.391667,30.8166667 153.125,30.85 L149.975,31.3 L149.575,31.35 C149.308333,31.35 149.175,31.25 149.175,31.05 L149.225,30.45 L149.225,29.8 C149.225,29.7 149.241667,29.6166667 149.275,29.55 L149.325,29.35 C149.358333,29.1833333 149.358333,29 149.325,28.8 L149.375,28.45 L149.475,28.15 C149.475,28.1166667 149.458333,28 149.425,27.8 L149.425,27.5 L149.375,27.15 C149.341667,26.4833333 149.375,26.0166667 149.475,25.75 L149.475,25.6 L149.525,24.85 L149.575,24.1 C149.608333,23.5 149.675,23 149.775,22.6 L149.925,21.75 C149.958333,21.6166667 149.958333,21.3166667 149.925,20.85 L149.925,20 L149.925,20 C149.958333,19.7666667 150.091667,19.6 150.325,19.5 L151.375,19.2 C151.541667,19.1666667 151.858333,19.1666667 152.325,19.2 L152.825,19.25 L153.225,19.25 L153.225,19.25 C153.458333,19.1833333 153.691667,19.1666667 153.925,19.2 L154.275,19.2 C154.375,19.1666667 154.491667,19.1333333 154.625,19.1 L155.175,19 L155.675,18.9 C155.875,18.8666667 156.025,18.8166667 156.125,18.75 L156.425,18.6 L156.725,18.4 C156.891667,18.2666667 157.008333,18.0833333 157.075,17.85 L157.175,17.75 L157.325,17.6 C157.425,17.4333333 157.491667,17.3 157.525,17.2 C157.591667,16.9666667 157.558333,16.7333333 157.425,16.5 L157.275,16.25 L157.025,16 C156.858333,15.7666667 156.558333,15.5833333 156.125,15.45 L155.225,15.2 L154.275,15 C153.841667,14.9 153.475,14.8833333 153.175,14.95 C152.708333,15.05 152.275,15.1 151.875,15.1 L151.025,15.15 L150.175,15.15 C149.508333,15.1833333 148.958333,15.25 148.525,15.35 C148.291667,15.4166667 147.808333,15.4333333 147.075,15.4 L146.675,15.35 L145.075,15.35 L145.075,15.35 C144.741667,15.3833333 144.541667,15.4166667 144.475,15.45 C144.308333,15.4833333 144.158333,15.55 144.025,15.65 L143.625,15.95 C143.325,16.1833333 143.158333,16.5 143.125,16.9 L143.075,17.45 L142.975,18.05 L142.825,18.65 L142.675,19.3 C142.575,19.8333333 142.508333,20.2666667 142.475,20.6 L142.325,22.05 L142.175,23.45 L142.125,24.15 L142.075,24.9 C142.041667,25.5 141.975,25.9833333 141.875,26.35 L141.825,26.45 C141.791667,26.7166667 141.791667,27.0833333 141.825,27.55 L141.825,28.7 C141.758333,29.0666667 141.741667,29.95 141.775,31.35 C141.808333,32.6833333 141.858333,33.6333333 141.925,34.2 L142.075,35.9 L142.225,37.6 C142.258333,37.8333333 142.258333,38.2833333 142.225,38.95 L142.225,39.9 L142.175,41 C142.108333,42.8666667 142.108333,44 142.175,44.4 L142.275,45.25 C142.308333,45.55 142.308333,45.8333333 142.275,46.1 C142.241667,46.3 142.241667,46.6333333 142.275,47.1 C142.275,47.5333333 142.291667,47.7833333 142.325,47.85 L142.525,48.35 L142.675,48.8 C142.708333,49.0333333 142.808333,49.1833333 142.975,49.25 C143.208333,49.3166667 143.325,49.4666667 143.325,49.7 C143.358333,50.0333333 143.541667,50.2833333 143.875,50.45 L144.375,50.6 L144.825,50.8 L145.225,51 L145.625,51.15 C145.925,51.2833333 146.208333,51.35 146.475,51.35 L146.575,51.35 L146.675,51.4 C146.875,51.5333333 147.158333,51.5833333 147.525,51.55 Z M183.725,50.9 C183.758333,50.8666667 183.891667,50.8333333 184.125,50.8 L184.425,50.75 L184.775,50.65 C185.441667,50.4833333 185.858333,50.2833333 186.025,50.05 C186.191667,49.8833333 186.258333,49.6833333 186.225,49.45 C186.225,49.3166667 186.208333,49.15 186.175,48.95 L186.125,48.35 C186.091667,47.8166667 186.058333,47.45 186.025,47.25 C185.991667,47.1166667 185.941667,46.7 185.875,46 L185.775,45.25 C185.775,45.0166667 185.758333,44.85 185.725,44.75 C185.591667,44.0166667 185.541667,43.3833333 185.575,42.85 C185.608333,42.5833333 185.591667,42.0166667 185.525,41.15 L185.525,40.65 L185.475,40.2 L185.475,39.55 C185.475,39.35 185.491667,38.7833333 185.525,37.85 C185.525,37.5833333 185.541667,37.2333333 185.575,36.8 L185.575,36.3 L185.625,36 L185.575,35.75 L185.575,35.55 L185.525,35 C185.525,34.7666667 185.541667,34.5666667 185.575,34.4 C185.641667,34.1333333 185.641667,33.2333333 185.575,31.7 C185.508333,30.2666667 185.458333,29.3833333 185.425,29.05 L185.375,28.55 L185.325,28 L185.375,27.55 L185.475,26.75 C185.508333,26.45 185.491667,26.1833333 185.425,25.95 L185.425,25.6 L185.375,23.55 L185.375,23.2 C185.375,23.1333333 185.358333,23.0166667 185.325,22.85 L185.275,22.4 C185.241667,22 185.225,21.75 185.225,21.65 C185.258333,21.5166667 185.241667,21.3833333 185.175,21.25 L185.075,21.1 C185.041667,21.0333333 185.025,20.95 185.025,20.85 C184.991667,20.4166667 184.841667,19.9833333 184.575,19.55 C184.541667,19.4166667 184.525,19.3166667 184.525,19.25 L188.525,19.15 C189.025,19.1166667 189.425,19.0666667 189.725,19 C190.158333,18.8666667 190.491667,18.6666667 190.725,18.4 C190.958333,18.1 191.091667,17.6 191.125,16.9 C191.158333,16.6 191.141667,16.3666667 191.075,16.2 C190.941667,15.9 190.608333,15.7166667 190.075,15.65 L190.075,15.6 L189.725,15.45 L189.375,15.4 L188.675,15.35 L187.975,15.35 L187.425,15.4 L185.225,15.5 C184.925,15.5 184.691667,15.45 184.525,15.35 C184.358333,15.2833333 184.158333,15.25 183.925,15.25 L181.975,15.35 L180.375,15.45 L178.775,15.45 L177.525,15.4 L176.675,15.4 L175.175,15.6 C174.941667,15.6 174.658333,15.6666667 174.325,15.8 C173.958333,15.9333333 173.591667,16.0166667 173.225,16.05 L171.875,16.05 L171.775,16.15 L171.675,16.3 L171.575,16.5 C171.508333,16.6333333 171.491667,16.7666667 171.525,16.9 C171.591667,17.2333333 171.541667,17.5333333 171.375,17.8 C171.208333,18.0666667 171.241667,18.3166667 171.475,18.55 L171.625,18.7 L171.725,18.85 L172.025,19.15 C172.058333,19.1833333 172.191667,19.2666667 172.425,19.4 L172.675,19.55 C172.775,19.6166667 172.841667,19.65 172.875,19.65 C173.041667,19.7833333 173.208333,19.8333333 173.375,19.8 L174.775,19.6 C175.041667,19.5333333 175.341667,19.5 175.675,19.5 L176.125,19.55 C176.291667,19.5166667 176.458333,19.5 176.625,19.5 C177.058333,19.4333333 177.391667,19.4333333 177.625,19.5 C177.858333,19.5333333 177.958333,19.7 177.925,20 C177.891667,20.1666667 177.941667,20.45 178.075,20.85 L178.275,21.35 C178.308333,21.5166667 178.325,21.65 178.325,21.75 L178.325,26.85 L178.375,28.95 L178.375,34.45 L178.425,35.1 L178.425,35.75 C178.325,36.9833333 178.291667,38.0666667 178.325,39 L178.375,40.5 L178.425,42.05 L178.575,44.3 L178.675,45.3 L178.775,46.25 C178.775,46.4833333 178.825,46.7666667 178.925,47.1 L179.175,47.95 C179.175,47.9833333 179.191667,48.0833333 179.225,48.25 L179.275,48.6 C179.341667,48.9666667 179.408333,49.2 179.475,49.3 L179.775,50 C179.908333,50.2666667 180.125,50.4333333 180.425,50.5 L180.775,50.55 C180.808333,50.55 180.875,50.5666667 180.975,50.6 L181.325,50.7 C181.658333,50.7666667 181.958333,50.8333333 182.225,50.9 C183.025,51.0333333 183.525,51.0333333 183.725,50.9 Z M201.475,51.55 C201.508333,51.55 201.741667,51.5166667 202.175,51.45 L202.675,51.35 C202.808333,51.3166667 202.908333,51.3 202.975,51.3 C203.075,51.3 203.208333,51.2666667 203.375,51.2 L203.575,51.15 L203.725,51.1 C204.258333,50.9333333 204.658333,50.8 204.925,50.7 L206.125,50.1 L206.425,50 C206.525,49.9333333 206.591667,49.8666667 206.625,49.8 C206.825,49.7 207.008333,49.5333333 207.175,49.3 C207.308333,49.2 207.408333,49.1 207.475,49 L207.775,48.5 L208.075,47.95 L208.175,47.75 L208.325,47.6 C208.425,47.4333333 208.491667,47.3 208.525,47.2 L208.625,46.95 L208.725,46.65 L209.125,45.5 L209.125,45.3 C209.791667,43.8333333 210.241667,42.55 210.475,41.45 C210.841667,39.85 210.941667,37.6833333 210.775,34.95 L210.575,31.65 C210.508333,30.4166667 210.508333,29.3333333 210.575,28.4 C210.608333,28.2333333 210.591667,28 210.525,27.7 C210.491667,27.4666667 210.441667,27.1666667 210.375,26.8 C210.175,26 210.075,25.5666667 210.075,25.5 C210.141667,24.8333333 210.108333,24.0666667 209.975,23.2 C209.775,22.1 209.425,21.05 208.925,20.05 L208.825,19.4 L208.725,18.9 C208.691667,18.7333333 208.591667,18.6 208.425,18.5 L208.325,18.3 L208.075,17.95 L207.825,17.7 C207.725,17.5666667 207.675,17.4666667 207.675,17.4 C207.541667,16.9666667 207.258333,16.6 206.825,16.3 L206.525,15.95 L206.275,15.65 C206.208333,15.5166667 206.125,15.4333333 206.025,15.4 C205.525,15.1 205.008333,14.95 204.475,14.95 L203.475,14.85 L203.175,14.85 L202.825,14.8 C202.591667,14.8333333 202.391667,14.9 202.225,15 L202.125,15.05 L201.375,15.3 L200.725,15.5 L200.225,15.65 L199.725,15.85 C199.325,15.9833333 199.008333,16.15 198.775,16.35 L198.725,16.4 L198.675,16.4 C198.075,16.6 197.608333,16.9 197.275,17.3 C196.975,17.6333333 196.591667,17.9 196.125,18.1 C196.025,18.1333333 195.925,18.2 195.825,18.3 L194.775,19.25 L194.525,19.45 L194.275,19.7 L193.975,20.1 C193.875,20.2333333 193.808333,20.3666667 193.775,20.5 C193.741667,20.6333333 193.675,20.7833333 193.575,20.95 L193.325,21.35 L193.325,21.55 L193.275,21.7 L193.175,21.85 C193.108333,21.9166667 193.058333,22 193.025,22.1 L192.825,22.7 L192.325,23.95 L192.125,24.55 L191.725,25.45 C191.658333,25.75 191.525,26.2166667 191.325,26.85 C191.125,27.5166667 190.975,28.05 190.875,28.45 L190.775,28.85 L190.675,29.3 C190.575,29.6 190.541667,29.8666667 190.575,30.1 L190.575,30.2 L190.575,30.2 C190.475,30.3333333 190.425,30.4833333 190.425,30.65 L190.425,31.15 L190.275,32.85 L190.175,34.6 L190.175,35 L190.125,35.35 L190.125,36.85 L190.175,37.75 L190.275,38.55 L190.375,39.4 C190.375,40.2666667 190.441667,40.9 190.575,41.3 L190.675,41.75 L190.725,42.15 C190.725,42.4166667 190.791667,42.75 190.925,43.15 L191.125,43.65 L191.275,44.15 L191.375,44.7 L191.525,45.25 C191.625,45.6833333 191.758333,46.05 191.925,46.35 C191.958333,46.6833333 192.075,47.0166667 192.275,47.35 L192.525,47.65 L192.725,47.95 L192.975,48.2 L193.275,48.4 C193.375,48.4666667 193.508333,48.5833333 193.675,48.75 L194.075,49.15 C194.308333,49.3166667 194.558333,49.4666667 194.825,49.6 L195.175,49.8 L195.575,50 L195.975,50.25 L196.425,50.55 L196.625,50.65 L198.375,51.1 L198.875,51.2 L199.275,51.3 L199.725,51.4 L200.275,51.5 L200.375,51.5 L200.525,51.55 L201.475,51.55 Z M201.425,46.35 L201.225,46.3 L200.975,46.25 L200.825,46.25 L200.375,46.1 C200.175,46.0666667 199.975,45.95 199.775,45.75 C199.608333,45.55 199.491667,45.35 199.425,45.15 L199.325,44.85 L199.175,44.6 C199.075,44.3666667 199.025,44.25 199.025,44.25 C199.058333,44.1166667 199.041667,43.95 198.975,43.75 L198.925,43.5 L198.875,43.3 C198.875,43.2666667 198.858333,43.2166667 198.825,43.15 L198.725,42.9 C198.625,42.6666667 198.575,42.5 198.575,42.4 L198.525,42.1 L198.475,41.85 C198.375,41.65 198.325,41.4833333 198.325,41.35 C198.291667,40.5833333 198.191667,40.0166667 198.025,39.65 C197.958333,39.45 197.908333,39.2166667 197.875,38.95 L197.875,38.25 L197.825,37.75 L197.725,37.2 L197.675,36.05 L197.675,34.9 L197.875,31.3 L197.975,30.55 C198.008333,30.25 198.075,30 198.175,29.8 L198.325,29.15 L198.525,28.5 L198.675,28 L198.875,27.55 C198.941667,27.35 199.075,26.8833333 199.275,26.15 C199.341667,25.8833333 199.408333,25.6 199.475,25.3 C199.541667,25.0666667 199.591667,24.8666667 199.625,24.7 L199.625,24.6 L199.625,24.6 L199.675,24.3 C199.708333,24.0333333 199.741667,23.8333333 199.775,23.7 L199.925,23.25 L200.075,22.7 C200.208333,22.3 200.341667,21.9833333 200.475,21.75 C200.675,21.3833333 200.908333,21.0666667 201.175,20.8 L201.475,20.45 L201.825,20.05 C201.891667,19.95 202.058333,19.8 202.325,19.6 L202.625,19.4 L202.875,19.2 C202.908333,19.1333333 203.041667,19.0666667 203.275,19 L203.575,18.9 L203.775,18.8 C203.941667,18.7333333 204.108333,18.7333333 204.275,18.8 L204.475,18.95 C204.541667,18.9833333 204.608333,19.0333333 204.675,19.1 L204.925,19.35 C205.158333,19.5833333 205.308333,19.8 205.375,20 C205.908333,20.9 206.291667,21.95 206.525,23.15 C206.625,23.5833333 206.708333,24.1333333 206.775,24.8 L206.975,26.45 C207.908333,34.0833333 207.525,39.9666667 205.825,44.1 L205.725,44.3 L205.625,44.55 C205.558333,44.7166667 205.475,44.8333333 205.375,44.9 L205.125,45.2 C205.025,45.3 204.925,45.3833333 204.825,45.45 L204.425,45.75 C204.291667,45.85 204.141667,45.9333333 203.975,46 C203.908333,46 203.791667,46.0333333 203.625,46.1 L203.325,46.15 L203.075,46.2 C202.908333,46.2666667 202.658333,46.3166667 202.325,46.35 L201.875,46.35 C201.741667,46.3833333 201.591667,46.3833333 201.425,46.35 Z M228.325,51.55 C228.391667,51.5166667 228.508333,51.4833333 228.675,51.45 L229.075,51.4 C229.375,51.3 229.541667,51.25 229.575,51.25 C229.741667,51.25 230.025,51.1333333 230.425,50.9 L230.675,50.8 L230.875,50.65 C230.975,50.5833333 231.041667,50.55 231.075,50.55 C231.408333,50.45 231.658333,50.2166667 231.825,49.85 C232.091667,49.15 232.208333,48.1333333 232.175,46.8 L232.125,46 L232.175,43.3 L232.175,41.65 C232.108333,41.0166667 232.075,40.2333333 232.075,39.3 L232.075,36.5 L232.525,31.85 L232.675,30.4 L232.875,28.9 L233.125,26.7 L233.125,25.65 L233.275,24.45 L233.375,23.25 L233.425,21.85 L233.575,20.4 L233.675,19.7 L233.775,18.95 L233.825,18.25 C233.858333,17.9833333 233.858333,17.7666667 233.825,17.6 C233.791667,17.1333333 233.658333,16.6 233.425,16 C233.391667,15.8666667 233.341667,15.75 233.275,15.65 C233.241667,15.55 233.175,15.45 233.075,15.35 L232.775,15.05 L232.525,14.95 L232.275,14.75 L232.175,14.75 L231.075,14.6 L230.725,14.6 L230.725,14.6 C230.625,14.6333333 230.558333,14.7166667 230.525,14.85 L230.525,14.95 L230.475,14.95 C230.375,14.95 230.241667,15.1333333 230.075,15.5 L229.925,15.7 L229.725,15.9 L229.575,16.15 C229.475,16.45 229.408333,16.75 229.375,17.05 L229.225,18.25 C229.091667,18.7166667 229.008333,19.0666667 228.975,19.3 C228.941667,19.4333333 228.941667,19.5833333 228.975,19.75 L229.075,20.25 L229.025,21.45 C228.958333,21.75 228.908333,22.0333333 228.875,22.3 L228.875,23 L228.825,23.2 L228.825,23.35 L228.775,24.15 L228.725,24.9 L228.525,26.4 C228.458333,27 228.358333,27.5 228.225,27.9 L228.225,28.1 L227.825,31.8 L227.825,33.15 L227.725,35.25 L227.725,35.35 L227.625,35.15 L227.575,35 L227.525,34.4 C227.491667,34.1333333 227.441667,33.9333333 227.375,33.8 L227.175,32.8 L226.975,31.85 C226.841667,31.3166667 226.758333,30.8666667 226.725,30.5 C226.691667,30.3 226.641667,30.0833333 226.575,29.85 L226.175,28.65 C226.108333,28.4166667 226.075,28.2166667 226.075,28.05 C226.075,27.8166667 226.041667,27.5 225.975,27.1 L225.825,26.2 L225.825,26.05 L225.775,26 C225.575,25.7666667 225.491667,25.45 225.525,25.05 L225.475,24.75 L225.225,23.2 C225.191667,23.0666667 225.158333,22.9 225.125,22.7 L225.075,22.05 C225.041667,21.5166667 224.991667,21.15 224.925,20.95 C224.925,20.8166667 224.875,20.6333333 224.775,20.4 L224.575,19.75 C224.375,19.1833333 224.275,18.7833333 224.275,18.55 L224.175,18.05 L224.025,17.55 L223.975,17.25 C223.675,16.55 222.991667,15.9 221.925,15.3 L221.375,15.05 L220.775,14.8 C220.441667,14.6333333 220.141667,14.6166667 219.875,14.75 L219.325,15 L218.825,15.3 L218.475,15.5 L217.975,15.75 L217.875,15.85 C217.608333,16.25 217.425,16.5666667 217.325,16.8 L216.925,17.85 L216.575,18.9 C216.441667,19.2 216.358333,19.7833333 216.325,20.65 L216.275,21.65 C216.241667,22.0166667 216.208333,22.2833333 216.175,22.45 L216.025,23.4 L215.825,24.3 C215.725,24.7666667 215.641667,25.2833333 215.575,25.85 L215.475,27.35 L215.475,29 L215.375,31.2 L215.225,34.15 L215.075,35.75 L214.975,37.3 L214.875,38.5 C214.775,39.2333333 214.758333,40.3 214.825,41.7 C214.891667,42.6 214.925,43.4166667 214.925,44.15 L214.825,45.15 L214.725,46.2 C214.725,46.3666667 214.708333,46.5333333 214.675,46.7 L214.625,47.1 C214.591667,47.3666667 214.575,47.65 214.575,47.95 C214.541667,48.6166667 214.525,49.0666667 214.525,49.3 L214.825,50.4 C214.891667,50.6 215.025,50.7 215.225,50.7 L215.375,50.7 L215.525,50.85 C215.625,51.0166667 215.775,51.0833333 215.975,51.05 L216.125,51.1 L216.275,51.2 C216.575,51.3333333 216.825,51.2833333 217.025,51.05 L217.275,50.75 L217.475,50.45 C217.608333,50.2166667 217.691667,49.9666667 217.725,49.7 C217.725,49.6333333 217.741667,49.5666667 217.775,49.5 C217.908333,49.2666667 217.941667,48.95 217.875,48.55 C217.841667,48.2166667 217.841667,48.0166667 217.875,47.95 L217.925,47.8 C217.958333,47.7 217.975,47.5666667 217.975,47.4 L217.975,46.9 L217.925,46.3 C217.891667,46.0666667 217.891667,45.8833333 217.925,45.75 C218.058333,44.7166667 218.075,43.85 217.975,43.15 L217.925,42.9 L217.925,42.7 L217.775,39.95 C217.741667,39.3166667 217.808333,38.7166667 217.975,38.15 L218.075,37.55 L218.225,35.25 L218.425,31.55 L218.575,29.8 L218.775,28.15 C218.775,27.95 218.841667,27.85 218.975,27.85 C219.108333,27.85 219.208333,27.95 219.275,28.15 L219.825,30.95 L220.125,32.7 L220.425,34.25 L220.575,34.9 L220.675,35.55 L220.875,36.5 L221.075,37.5 L221.725,40.7 L221.875,41.4 L222.025,42.05 C222.058333,42.3166667 222.108333,42.6166667 222.175,42.95 L222.375,43.85 L222.825,45.3 L222.975,45.8 L223.125,46.35 C223.325,46.7833333 223.575,47.2666667 223.875,47.8 L224.775,49.2 L225.775,50.8 C225.941667,51.1 226.191667,51.25 226.525,51.25 C226.558333,51.25 226.675,51.2666667 226.875,51.3 L227.375,51.4 C227.908333,51.5333333 228.225,51.5833333 228.325,51.55 Z" id="CULTIVETON"></path>
                </g>
                <g id="Group-4" transform="translate(182.500000, 309.500000) rotate(18.000000) translate(-182.500000, -309.500000) translate(149.000000, 252.000000)">
                    <path d="M39.0599983,30.2418288 C39.0599983,46.5904961 37.0864494,59.8499974 34.6499985,59.8499974 C32.2147315,59.8499974 30.2399987,46.5904961 30.2399987,30.2418288 C30.2399987,13.8870611 34.6499985,0.629999973 34.6499985,0.629999973 C34.6499985,0.629999973 39.0599983,13.8870611 39.0599983,30.2418288" id="Fill-3" fill="#7DCD55"></path>
                    <path d="M34.964381,6.26346486 C33.6282065,11.3873522 31.7511407,20.3908573 31.7511407,30.5556003 C31.7511407,45.7443522 33.5565816,55.9548228 34.964381,58.1365061 C36.3721804,55.9548228 38.1763865,45.7443522 38.1763865,30.5556003 C38.1763865,20.3908573 36.3017904,11.3873522 34.964381,6.26346486 Z M34.964381,61.1099973 C33.4343254,61.1099973 31.6881602,59.9583862 30.3421064,51.4085461 C29.4640841,45.8285871 28.9799987,38.4207313 28.9799987,30.5556003 C28.9799987,14.3861138 33.4627283,1.45485668 33.6529048,0.91334675 C33.8443161,0.365820042 34.3716234,0 34.964381,0 C35.5571387,0 36.084446,0.365820042 36.2746224,0.91334675 C36.4660337,1.45485668 40.9499982,14.3861138 40.9499982,30.5556003 C40.9499982,38.4207313 40.4659128,45.8285871 39.5866557,51.4085461 C38.2418368,59.9583862 36.4956716,61.1099973 34.964381,61.1099973 L34.964381,61.1099973 Z" id="Fill-4" fill="#000000"></path>
                    <path d="M27.2456737,22.679999 C26.9394953,27.9917614 26.9887654,35.0222464 28.2862113,42.5243029 C29.9555291,52.1867314 32.2723967,60.5732838 34.4520119,65.5199971 C34.9118662,61.0843524 34.6702081,52.6020495 32.6559996,40.950403 C31.421901,33.8098049 29.2375934,27.4519676 27.2456737,22.679999" id="Fill-5" fill="#7DCD55"></path>
                    <path d="M24.824853,16.8454975 C24.1853525,22.0021132 23.4938698,31.7003688 25.354345,42.2492001 C28.2544619,58.6795698 32.3683002,68.0298625 34.0329358,69.0447541 C35.2527016,67.5236249 35.9187976,57.3312139 33.0174718,40.8972196 C31.1545789,30.335098 27.1882247,21.4644624 24.824853,16.8454975 Z M34.1127223,71.8199993 C27.8893784,71.8199993 22.8918447,43.9080646 22.6814986,42.7203998 C19.8563326,26.6984032 22.6416054,12.9949505 22.7624939,12.4210535 C22.8773381,11.8785698 23.3089103,11.4569065 23.8553267,11.3602502 C24.401743,11.264802 24.9505772,11.5124839 25.2443364,11.9824754 C25.5538112,12.4814637 32.8639433,24.4064397 35.6903182,40.4272281 C37.0660302,48.216521 37.8131216,55.6469771 37.7998239,61.3509094 C37.7804817,70.0898508 36.0348507,71.5155318 34.5164901,71.7849614 C34.3835127,71.8055008 34.2493264,71.8199993 34.1127223,71.8199993 L34.1127223,71.8199993 Z" id="Fill-6" fill="#000000"></path>
                    <path d="M43.5832576,45.0624465 C40.7229315,60.8897049 36.7103587,73.4299111 34.622296,73.0725446 C32.5342334,72.7151781 33.1638494,59.5897543 36.0254053,43.7624959 C38.8857315,27.932839 44.9875966,15.7499993 44.9875966,15.7499993 C44.9875966,15.7499993 46.4485027,29.2327896 43.5832576,45.0624465" id="Fill-7" fill="#7DCD55"></path>
                    <path d="M43.8541884,21.721498 C41.8779822,26.7411112 39.0738243,34.9085559 37.4155033,44.3097572 C34.9159349,58.4768118 34.4783896,68.3516984 35.0633949,71.5514903 C36.709629,68.7456305 39.6757513,59.3142196 42.174111,45.1459566 C43.8312233,35.7459637 43.9907702,27.1132924 43.8541884,21.721498 Z M34.7890226,74.9699991 C34.6790319,74.9699991 34.5726673,74.9615405 34.4675114,74.9422064 C32.8357815,74.6558202 31.8289438,72.7912889 32.2108894,64.6226357 C32.4743836,58.9879568 33.373648,51.6059595 34.7430924,43.836072 C37.5569199,27.8818225 43.4214778,15.7581396 43.669259,15.2506197 C43.9351705,14.7080568 44.5250106,14.4047532 45.1233116,14.5110907 C45.7204038,14.6138031 46.1748708,15.1031973 46.2377226,15.7049708 C46.2981571,16.2680762 47.6603493,29.6629755 44.8465218,45.6172251 C43.4976252,53.2686913 41.8417216,60.4380136 40.1834006,65.7971817 C37.5653807,74.2630965 36.0255112,74.9699991 34.7890226,74.9699991 L34.7890226,74.9699991 Z" id="Fill-8" fill="#000000"></path>
                    <path d="M51.0102326,63.5899008 C45.1270616,59.1525625 43.8169946,55.604636 44.4222941,51.0299978 L38.4784718,58.3336233 L34.0218181,51.0299978 L29.5639513,61.1403734 L23.617703,51.0299978 C24.2242155,55.604636 22.9153615,59.1525625 17.0309775,63.5899008 C9.0286518,69.622591 1.88999992,75.3017036 1.88999992,83.8507485 C1.88999992,97.0388289 16.2764759,107.729995 34.0218181,107.729995 C51.7647341,107.729995 66.1499971,97.0388289 66.1499971,83.8507485 C66.1499971,75.3017036 59.0113452,69.622591 51.0102326,63.5899008" id="Fill-9" fill="#FFFFFF"></path>
                    <path d="M64.8899972,84.0040523 C64.8899972,76.4434684 58.8317509,71.305278 50.2763607,64.8734471 C45.9270063,61.6060042 43.7019247,58.636814 43.1444397,55.063844 L39.6027705,59.4006318 C39.0197797,60.1135284 37.8805184,60.0626072 37.3825471,59.2515055 L34.2793356,54.1799976 C30.6441449,62.396495 30.8068965,62.6353396 29.699214,62.7008097 C29.1805951,62.7226331 28.7044859,62.4740892 28.4457837,62.0339846 L27.8299997,60.9937375 C26.9530843,61.89577 25.8951989,62.8196258 24.6089754,63.7871284 C16.5977099,69.8067402 9.44999959,75.473541 9.44999959,84.0040523 C9.44999959,94.1919271 18.0855511,102.880052 30.2251203,106.286922 C31.4906962,106.4021 32.7769197,106.469995 34.0837907,106.469995 C51.0694711,106.469995 64.8899972,96.3936622 64.8899972,84.0040523" id="Fill-10" fill="#FEA856"></path>
                    <path d="M24.194582,55.8042941 C23.4290531,58.9934021 21.2401001,61.7381659 17.2673319,64.7311329 C8.746137,71.1541466 2.71381795,76.285293 2.71381795,83.8355123 C2.71381795,96.2081375 16.475197,106.270657 33.3906032,106.270657 C50.3035908,106.270657 64.0649698,96.2081375 64.0649698,83.8355123 C64.0649698,76.285293 58.0326507,71.1541466 49.5138746,64.7311329 C45.1831339,61.4681693 42.9675749,58.5030495 42.4124757,54.9349777 L38.8859636,59.2658202 C38.6078094,59.6084617 38.177275,59.7912845 37.7419031,59.7622266 C37.3029032,59.7319579 36.906231,59.4910192 36.6752421,59.1168983 L33.5853112,54.052343 L30.1869919,61.7539057 C29.9813997,62.2212541 29.5327248,62.5324161 29.0247909,62.561474 C28.5083915,62.5832675 28.0343199,62.3350643 27.7767249,61.8955631 L24.194582,55.8042941 Z M33.3906032,108.989995 C14.9792109,108.989995 0,97.7058317 0,83.8355123 C0,74.3444653 8.3047183,68.0836918 15.633478,62.5590525 C21.3598274,58.2439496 22.1846152,55.1662304 21.6742626,51.3087899 C21.5908164,50.6670939 21.9681386,50.0544559 22.5776592,49.8449966 C23.1835518,49.6343266 23.8620062,49.8825298 24.1885351,50.4394735 L28.7732427,58.2342637 L32.1485841,50.5811309 C32.3517576,50.1174147 32.795595,49.8074635 33.2999008,49.7747733 C33.8175095,49.7311864 34.2855343,49.9890755 34.5479668,50.4213123 L37.9934513,56.0621833 L42.7087705,50.2711796 C43.0909302,49.800199 43.7415693,49.6415911 44.2978778,49.8825298 C44.856605,50.1234685 45.1843433,50.7046271 45.1057345,51.3087899 C44.5941725,55.1662304 45.4189603,58.2439496 51.1453097,62.5590525 C58.4752788,68.0861133 66.7799971,74.3468868 66.7799971,83.8355123 C66.7799971,97.7058317 51.8007862,108.989995 33.3906032,108.989995 L33.3906032,108.989995 Z" id="Fill-11" fill="#000000"></path>
                    <path d="M8.9640358,85.6799963 C8.18762758,85.6799963 7.55999967,85.0675456 7.55999967,84.3114186 C7.55999967,78.4620886 12.2447044,73.8547063 19.8024946,68.3158632 C20.422621,67.8604824 21.3028003,67.982242 21.7678951,68.5825167 C22.2342402,69.1876618 22.1092147,70.0460668 21.4903386,70.4977948 C13.3836865,76.4408797 10.3680719,80.1862042 10.3680719,84.3114186 C10.3680719,85.0675456 9.73919377,85.6799963 8.9640358,85.6799963" id="Fill-12" fill="#000000"></path>
                    <path d="M58.1766982,88.8299961 C58.0726758,88.8299961 57.9698772,88.817988 57.864631,88.7951725 C57.1266838,88.6246567 56.6653138,87.8993642 56.8366448,87.1764734 C57.7960986,83.1285249 56.1696776,79.2618995 51.8680452,75.3556471 C51.4641935,74.9881977 50.4631308,74.2280815 49.3054226,73.3478839 C46.6302111,71.3173051 43.3014941,68.7871872 41.8892369,67.0892343 C41.4095101,66.5092405 41.4976232,65.6614649 42.0862676,65.1919461 C42.6736883,64.7236281 43.5376861,64.808886 44.0186368,65.3864782 C45.2314157,66.8430672 48.6947499,69.4764552 50.9856904,71.2176375 C52.2461972,72.1734865 53.2435885,72.9300002 53.7343295,73.3755026 C58.7531047,77.9361993 60.696488,82.7850917 59.5143039,87.7864876 C59.366225,88.4085099 58.8020564,88.8299961 58.1766982,88.8299961" id="Fill-13" fill="#000000"></path>
                    <path d="M20.1593722,95.7599958 C19.8958216,95.7599958 19.626142,95.684143 19.3907853,95.5263201 C17.3301879,94.1316066 15.8923052,92.3612992 15.1200409,90.260665 C12.4857614,83.0950185 18.7055539,77.6739873 22.8230712,74.0868821 C23.225139,73.7345334 23.612497,73.3993128 23.9679837,73.0799968 L24.954766,74.0440619 L25.8299989,75.1023314 C25.4414151,75.4510098 25.047928,75.7960178 24.6336021,76.1557071 C20.8715715,79.4357307 15.7206909,83.924506 17.7040619,89.3137279 C18.2728407,90.8613705 19.358914,92.1863483 20.9316365,93.2495115 C21.5604803,93.6752662 21.7271914,94.5279989 21.2993814,95.1568434 C21.0358309,95.5495654 20.6018919,95.7599958 20.1593722,95.7599958" id="Fill-14" fill="#000000"></path>
                    <path d="M34.3357001,114.029995 C33.4643638,114.029995 32.7599986,113.451918 32.7599986,112.73538 L32.7599986,107.765765 C32.7599986,107.05038 33.4643638,106.469995 34.3357001,106.469995 C35.2056332,106.469995 35.9099984,107.05038 35.9099984,107.765765 L35.9099984,112.73538 C35.9099984,113.451918 35.2056332,114.029995 34.3357001,114.029995" id="Fill-15" fill="#000000"></path>
                    <path d="M38.9872453,114.029995 C38.4429025,114.029995 37.9341376,113.688866 37.7372729,113.138735 L35.990395,108.280049 C35.7389774,107.579773 36.0971289,106.805026 36.7873413,106.551582 C37.4751819,106.296936 38.2401081,106.658485 38.4927117,107.356358 L40.2395896,112.218648 C40.4910072,112.918923 40.1328557,113.692469 39.4438292,113.947115 C39.2932158,114.00357 39.1378587,114.029995 38.9872453,114.029995" id="Fill-16" fill="#000000"></path>
                    <path d="M28.4223591,114.029995 C28.2717393,114.029995 28.1163757,114.00357 27.9669419,113.947115 C27.2755144,113.692469 26.9185338,112.918923 27.171148,112.218648 L28.9180996,107.356358 C29.1695278,106.658485 29.9344862,106.296936 30.6223558,106.551582 C31.3149694,106.805026 31.670764,107.579773 31.4193358,108.280049 L29.6723842,113.138735 C29.4755112,113.688866 28.9655389,114.029995 28.4223591,114.029995" id="Fill-17" fill="#000000"></path>
                </g>
            </g>
        </g>
    </g>
</svg>