<?xml version="1.0" encoding="UTF-8"?>
<svg width="300px" height="300px" viewBox="0 0 300 300" version="1.1" xmlns="http://www.w3.org/2000/svg" xmlns:xlink="http://www.w3.org/1999/xlink">
    <!-- Generator: Sketch 59.1 (86144) - https://sketch.com -->
    <title>environnement/fondateur/citeo</title>
    <desc>Created with Sketch.</desc>
    <g id="environnement/fondateur/citeo" stroke="none" stroke-width="1" fill="none" fill-rule="evenodd">
        <g id="LOGO_CITEO_K_signature_Perm" transform="translate(51.000000, 104.000000)" fill="#221F20" fill-rule="nonzero">
            <path d="M1.82999989,56.4239966 L6.35999962,56.4239966 C10.6679994,56.4239966 12.5639993,59.4959965 12.5639993,62.2499963 C12.5639993,65.2499961 10.2239994,68.0759959 6.37799962,68.0759959 L1.82999989,68.0759959 L1.82999989,56.4239966 Z M3.50399979,66.569996 L6.17399963,66.569996 C9.96599941,66.569996 10.8359994,63.6839962 10.8359994,62.2499963 C10.8359994,59.9099964 9.34799944,57.9239965 6.08399964,57.9239965 L3.50399979,57.9239965 L3.50399979,66.569996 Z" id="Shape"></path>
            <path d="M22.1639987,64.1639962 C22.1639987,66.563996 20.4719988,68.2259959 18.0119989,68.2259959 C16.55069,68.282695 15.1754529,67.5354214 14.4279385,66.2784963 C13.6804241,65.0215712 13.6804241,63.4564211 14.4279385,62.199496 C15.1754529,60.9425709 16.55069,60.1952973 18.0119989,60.2519964 C20.4179988,60.2519964 22.1639987,61.8839963 22.1639987,64.1639962 Z M15.5159991,64.1639962 C15.5159991,65.7839961 16.523999,66.863996 17.9939989,66.863996 C18.7134381,66.9128181 19.4180709,66.6435229 19.9215701,66.1273206 C20.4250694,65.6111184 20.6767277,64.8999958 20.6099988,64.1819962 C20.6272764,63.4873388 20.3555792,62.8166471 19.8597021,62.3298686 C19.363825,61.8430902 18.6882172,61.5838588 17.9939989,61.6139963 C17.3204263,61.6016376 16.6718101,61.8687744 16.2023118,62.3519143 C15.7328135,62.8350543 15.4843585,63.4910536 15.5159991,64.1639962 L15.5159991,64.1639962 Z" id="Shape"></path>
            <path d="M25.3379985,61.4099963 L25.3739985,61.4099963 C25.9258345,60.6999969 26.7670579,60.2749809 27.6659984,60.2519964 C29.1179983,60.2519964 30.2759982,61.2419963 30.2759982,63.3419962 L30.2759982,68.0759959 L28.7579983,68.0759959 L28.7579983,63.3239962 C28.7579983,62.1959963 28.1579983,61.4639963 27.2519984,61.4639963 C26.5859984,61.4639963 26.0519984,61.7699963 25.3379985,62.5739963 L25.3379985,68.0759959 L23.8199986,68.0759959 L23.8199986,60.4019964 L25.3379985,60.4019964 L25.3379985,61.4099963 Z" id="Path"></path>
            <path d="M33.881998,61.4099963 L33.917998,61.4099963 C34.4645711,60.6968322 35.3056699,60.2707638 36.2039978,60.2519964 C37.6559978,60.2519964 38.8199977,61.2419963 38.8199977,63.3419962 L38.8199977,68.0759959 L37.3079978,68.0759959 L37.3079978,63.3239962 C37.3079978,62.1959963 36.7079978,61.4639963 35.8079979,61.4639963 C35.1419979,61.4639963 34.6079979,61.7699963 33.893998,62.5739963 L33.893998,68.0759959 L32.3699981,68.0759959 L32.3699981,60.4019964 L33.893998,60.4019964 L33.881998,61.4099963 Z" id="Path"></path>
            <path d="M48.7079971,64.1639962 C48.7079971,66.563996 47.0159972,68.2259959 44.5559973,68.2259959 C43.0946884,68.282695 41.7194513,67.5354214 40.9719369,66.2784963 C40.2244225,65.0215712 40.2244225,63.4564211 40.9719369,62.199496 C41.7194513,60.9425709 43.0946884,60.1952973 44.5559973,60.2519964 C46.9079972,60.2519964 48.7079971,61.8839963 48.7079971,64.1639962 Z M42.0599975,64.1639962 C42.0599975,65.7839961 43.0679974,66.863996 44.5379973,66.863996 C45.2574365,66.9128181 45.9620693,66.6435229 46.4655685,66.1273206 C46.9690678,65.6111184 47.2207262,64.8999958 47.1539972,64.1819962 C47.1712748,63.4873388 46.8995776,62.8166471 46.4037005,62.3298686 C45.9078234,61.8430902 45.2322157,61.5838588 44.5379973,61.6139963 C43.8592782,61.5931672 43.2026685,61.8565767 42.7265191,62.3406999 C42.2503697,62.8248231 41.9979003,63.4857165 42.0299975,64.1639962 L42.0599975,64.1639962 Z" id="Shape"></path>
            <path d="M51.8519969,61.4099963 L51.8879969,61.4099963 C52.4385117,60.7015963 53.2771781,60.2767601 54.1739968,60.2519964 C55.6259967,60.2519964 56.7899966,61.2419963 56.7899966,63.3419962 L56.7899966,68.0759959 L55.2719967,68.0759959 L55.2719967,63.3239962 C55.2719967,62.1959963 54.6719967,61.4639963 53.7659968,61.4639963 C53.0999968,61.4639963 52.5659969,61.7699963 51.8519969,62.5739963 L51.8519969,68.0759959 L50.333997,68.0759959 L50.333997,60.4019964 L51.8519969,60.4019964 L51.8519969,61.4099963 Z" id="Path"></path>
            <path d="M63.3659962,62.3879963 C62.7157648,61.9176248 61.9466315,61.6390739 61.1459964,61.5839963 C60.5459964,61.5839963 60.1379964,61.8719963 60.1379964,62.2799963 C60.1379964,62.6879963 60.6479964,63.0359962 61.9979963,63.8219962 C63.3479962,64.6079961 63.7259962,65.1899961 63.7259962,65.9699961 C63.7259962,67.319996 62.6519963,68.2260663 61.1999964,68.2260663 C60.2645321,68.2307879 59.3440791,67.9908495 58.5299965,67.529996 L58.5299965,65.8859961 C59.256859,66.4511535 60.1280366,66.8004562 61.0439964,66.893996 C61.6439963,66.893996 62.1719963,66.569996 62.1719963,66.0239961 C62.1719963,64.9619961 58.5719965,64.4039962 58.5719965,62.3339963 C58.5719965,61.0379964 59.5619964,60.2519964 61.0979964,60.2519964 C61.8904826,60.2724779 62.6655586,60.488922 63.3539962,60.8819964 L63.3659962,62.3879963 Z" id="Path"></path>
            <path d="M76.6439954,67.319996 C75.7507996,67.9490829 74.6757077,68.2673944 73.5839956,68.2259959 C71.1839958,68.2259959 69.8579958,66.2639961 69.8579958,64.1459962 C69.8579958,61.8239963 71.3279957,60.2519964 73.4579956,60.2519964 C75.5879955,60.2519964 76.7879954,61.6319963 76.7879954,64.4519962 L71.3879957,64.4519962 C71.6219957,65.9699961 72.4979957,66.755996 73.9679956,66.755996 C74.932437,66.7183482 75.8647675,66.3992284 76.6499954,65.8379961 L76.6439954,67.319996 Z M75.2759955,63.4619962 C75.2219955,62.2979963 74.5559956,61.5659963 73.4759956,61.5659963 C72.3959957,61.5659963 71.6099957,62.2499963 71.4059957,63.4619962 L75.2759955,63.4619962 Z" id="Shape"></path>
            <path d="M79.9079952,61.4099963 L79.9439952,61.4099963 C80.4958313,60.6999969 81.3370546,60.2749809 82.2359951,60.2519964 C83.687995,60.2519964 84.8459949,61.2419963 84.8459949,63.3419962 L84.8459949,68.0759959 L83.327995,68.0759959 L83.327995,63.3239962 C83.327995,62.1959963 82.7279951,61.4639963 81.8219951,61.4639963 C81.1559952,61.4639963 80.6219952,61.7699963 79.9079952,62.5739963 L79.9079952,68.0759959 L78.3899953,68.0759959 L78.3899953,60.4019964 L79.9079952,60.4019964 L79.9079952,61.4099963 Z" id="Path"></path>
            <path d="M91.4159946,62.3879963 C90.7657631,61.9176248 89.9966299,61.6390739 89.1959947,61.5839963 C88.5959947,61.5839963 88.1879947,61.8719963 88.1879947,62.2799963 C88.1879947,62.6879963 88.7039947,63.0359962 90.0539946,63.8219962 C91.3139946,64.6559961 91.7759945,65.1899961 91.7759945,65.9699961 C91.7759945,67.319996 90.7019946,68.2259959 89.2499947,68.2259959 C88.316351,68.2314182 87.397674,67.9914034 86.5859948,67.529996 L86.5859948,65.8859961 C87.310682,66.4509642 88.179892,66.8003118 89.0939947,66.893996 C89.6939947,66.893996 90.2219946,66.569996 90.2219946,66.0239961 C90.2219946,64.9619961 86.6219948,64.4039962 86.6219948,62.3339963 C86.6219948,61.0379964 87.6119948,60.2519964 89.1539947,60.2519964 C89.9447386,60.2714642 90.7181159,60.4880099 91.4039946,60.8819964 L91.4159946,62.3879963 Z" id="Path"></path>
            <path d="M99.941994,67.319996 C99.0510397,67.949035 97.977845,68.2674091 96.8879942,68.2259959 C94.4879944,68.2259959 93.1619944,66.2639961 93.1619944,64.1459962 C93.1619944,61.8239963 94.6319944,60.2519964 96.7619942,60.2519964 C98.8919941,60.2519964 100.091994,61.6319963 100.091994,64.4519962 L94.6919944,64.4519962 C94.9319943,65.9699961 95.8019943,66.755996 97.2719942,66.755996 C98.2368272,66.7204545 99.1697473,66.4011328 99.953994,65.8379961 L99.941994,67.319996 Z M98.5739941,63.4619962 C98.5259941,62.2979963 97.8599942,61.5659963 96.7739942,61.5659963 C95.6879943,61.5659963 94.9139943,62.2499963 94.7099944,63.4619962 L98.5739941,63.4619962 Z" id="Shape"></path>
            <path d="M103.169994,60.4019964 L103.169994,61.4099963 C103.730485,60.7394528 104.536874,60.322206 105.407994,60.2519964 C106.371719,60.2406982 107.25908,60.7749731 107.699994,61.6319963 C108.307613,60.8154309 109.24582,60.3100733 110.261993,60.2519964 C111.815993,60.2519964 112.805993,61.4519963 112.805993,63.2519962 L112.805993,68.0519959 L111.287993,68.0519959 L111.287993,63.3239962 C111.342778,62.8684929 111.200384,62.4112792 110.896652,62.0674314 C110.59292,61.7235836 110.156776,61.5258493 109.697993,61.5239963 C109.028579,61.6206089 108.419047,61.9628027 107.987994,62.4839963 L107.987994,68.0579959 L106.469994,68.0579959 L106.469994,63.2879962 C106.469994,62.0399963 105.833994,61.4879963 105.083994,61.4879963 C104.323835,61.4725973 103.606019,61.8371309 103.169994,62.4599963 L103.169994,68.0339959 L101.651994,68.0339959 L101.651994,60.4019964 L103.169994,60.4019964 Z" id="Path"></path>
            <path d="M116.339993,60.9479964 C116.953848,60.4919277 117.699272,60.2476645 118.463993,60.2519964 C120.371993,60.2519964 121.775993,61.8719963 121.775993,64.0739962 C121.775993,66.671996 120.239993,68.2259959 117.677993,68.2259959 C116.695017,68.2230507 115.723054,68.0188569 114.821993,67.625996 L114.821993,56.4239966 L116.339993,56.4239966 L116.339993,60.9479964 Z M116.339993,66.551996 C116.841353,66.6987841 117.359737,66.7794664 117.881993,66.792025 C118.531168,66.7952311 119.152361,66.5279468 119.596364,66.0543436 C120.040367,65.5807404 120.26706,64.943613 120.221993,64.2959962 C120.221993,62.6759963 119.363993,61.6139963 118.085993,61.6139963 C117.421417,61.6280772 116.79114,61.9118099 116.339993,62.3999963 L116.339993,66.551996 Z" id="Shape"></path>
            <polygon id="Path" points="124.985993 68.0759959 123.467993 68.0759959 123.467993 56.4239966 124.985993 56.4239966"></polygon>
            <path d="M133.577992,67.319996 C132.687433,67.9498502 131.613956,68.2683081 130.523992,68.2259959 C128.123992,68.2259959 126.797992,66.2639961 126.797992,64.1459962 C126.797992,61.8239963 128.267992,60.2519964 130.397992,60.2519964 C132.527992,60.2519964 133.727992,61.6319963 133.727992,64.4519962 L128.327992,64.4519962 C128.567992,65.9699961 129.437992,66.755996 130.907992,66.755996 C131.872825,66.7204545 132.805745,66.4011328 133.589992,65.8379961 L133.577992,67.319996 Z M132.215992,63.4619962 C132.161992,62.2979963 131.495992,61.5659963 130.415992,61.5659963 C129.335992,61.5659963 128.549992,62.2499963 128.345992,63.4619962 L132.215992,63.4619962 Z" id="Shape"></path>
            <path d="M144.971991,68.0759959 L144.971991,67.097996 C144.394502,67.7586002 143.579239,68.1640748 142.703991,68.2259959 C141.149992,68.2259959 140.051992,67.115996 140.051992,65.1719961 L140.051992,60.4019964 L141.575992,60.4019964 L141.575992,65.2739961 C141.575992,66.347996 142.103992,66.965996 143.147991,66.965996 C143.889135,66.9240628 144.562218,66.5202128 144.947991,65.8859961 L144.947991,60.4019964 L146.507991,60.4019964 L146.507991,68.0759959 L144.971991,68.0759959 Z" id="Path"></path>
            <path d="M150.107991,61.4099963 L150.143991,61.4099963 C150.695827,60.6999969 151.53705,60.2749809 152.435991,60.2519964 C153.887991,60.2519964 155.045991,61.2419963 155.045991,63.3419962 L155.045991,68.0759959 L153.527991,68.0759959 L153.527991,63.3239962 C153.527991,62.1959963 152.927991,61.4639963 152.021991,61.4639963 C151.355991,61.4639963 150.821991,61.7699963 150.107991,62.5739963 L150.107991,68.0759959 L148.589991,68.0759959 L148.589991,60.4019964 L150.107991,60.4019964 L150.107991,61.4099963 Z" id="Path"></path>
            <path d="M163.59599,67.319996 C162.703188,67.9498951 161.627815,68.2682899 160.53599,68.2259959 C158.135991,68.2259959 156.815991,66.2639961 156.815991,64.1459962 C156.815991,61.8239963 158.279991,60.2519964 160.41599,60.2519964 C162.55199,60.2519964 163.75199,61.6319963 163.75199,64.4519962 L158.351991,64.4519962 C158.591991,65.9699961 159.46199,66.755996 160.93199,66.755996 C161.896823,66.7204545 162.829744,66.4011328 163.61399,65.8379961 L163.59599,67.319996 Z M162.22799,63.4619962 C162.17999,62.2979963 161.51399,61.5659963 160.42799,61.5659963 C159.341991,61.5659963 158.567991,62.2499963 158.363991,63.4619962 L162.22799,63.4619962 Z" id="Shape"></path>
            <path d="M3.10799981,80.3459952 L3.10799981,80.3459952 C3.65851456,79.6375952 4.49718096,79.2127589 5.39399968,79.1879953 C6.84599959,79.1879953 8.00999952,80.1779952 8.00999952,82.2779951 L8.00999952,87.0119948 L6.51599961,87.0119948 L6.51599961,82.2839951 C6.51599961,81.1559952 5.91599965,80.4239952 5.0099997,80.4239952 C4.34399974,80.4239952 3.80999977,80.7299952 3.09599982,81.5339951 L3.09599982,87.0359948 L1.57799991,87.0359948 L1.57799991,79.3379953 L3.10799981,79.3379953 L3.10799981,80.3459952 Z" id="Path"></path>
            <path d="M17.8919989,83.099995 C17.8919989,85.4999949 16.199999,87.1619948 13.7399992,87.1619948 C12.2786903,87.2186939 10.9034532,86.4714203 10.1559388,85.2144952 C9.40842435,83.9575701 9.40842435,82.39242 10.1559388,81.1354949 C10.9034532,79.8785698 12.2786903,79.1312962 13.7399992,79.1879953 C16.151999,79.1879953 17.8919989,80.8259952 17.8919989,83.099995 Z M11.2439993,83.099995 C11.2439993,84.719995 12.2519993,85.7999949 13.7219992,85.7999949 C14.4425837,85.8490624 15.1483255,85.5789853 15.6520565,85.0613902 C16.1557876,84.543795 16.4066082,83.8309822 16.337999,83.111995 C16.3553818,82.4178381 16.0835093,81.7476766 15.5874188,81.2618265 C15.0913284,80.7759764 14.4156426,80.5181394 13.7219992,80.5499952 C13.0484265,80.5376365 12.3998104,80.8047733 11.930312,81.2879132 C11.4608137,81.7710531 11.2123588,82.4270524 11.2439993,83.099995 Z" id="Shape"></path>
            <path d="M24.4499985,87.0119948 L24.4499985,86.0339949 C23.8725089,86.6945991 23.0572461,87.1000737 22.1819987,87.1619948 C20.6219988,87.1619948 19.5299988,86.0519949 19.5299988,84.107995 L19.5299988,79.3379953 L21.0539987,79.3379953 L21.0539987,84.209995 C21.0539987,85.2839949 21.5819987,85.9019949 22.6259987,85.9019949 C23.3665162,85.8580324 24.0387293,85.4547045 24.4259985,84.8219949 L24.4259985,79.3379953 L25.9499985,79.3379953 L25.9499985,87.0119948 L24.4499985,87.0119948 Z" id="Path"></path>
            <polygon id="Path" points="27.1079984 79.3379953 28.7699983 79.3379953 30.8339982 84.053995 32.849998 79.3379953 34.4759979 79.3379953 31.0919981 87.1379948 30.5819982 87.1379948"></polygon>
            <path d="M41.6759975,86.2559949 C40.783195,86.885894 39.7078221,87.2042887 38.6159977,87.1619948 C36.2159978,87.1619948 34.8899979,85.1999949 34.8899979,83.081995 C34.8899979,80.7599952 36.3599978,79.1879953 38.4899977,79.1879953 C40.6199976,79.1879953 41.8259975,80.5679952 41.8259975,83.387995 L36.4259978,83.387995 C36.6659978,84.9059949 37.5359978,85.6919949 39.0059977,85.6919949 C39.9708307,85.6564533 40.9037508,85.3371317 41.6879975,84.7739949 L41.6759975,86.2559949 Z M40.3079976,82.3979951 C40.2599976,81.2339952 39.5939976,80.5019952 38.5079977,80.5019952 C37.4219978,80.5019952 36.6479978,81.1859952 36.4439978,82.3979951 L40.3079976,82.3979951 Z" id="Shape"></path>
            <polygon id="Path" points="45.0059973 87.0119948 43.4879974 87.0119948 43.4879974 75.3599955 45.0059973 75.3599955"></polygon>
            <polygon id="Path" points="48.7499971 87.0119948 47.2259972 87.0119948 47.2259972 75.3599955 48.7499971 75.3599955"></polygon>
            <path d="M57.3419966,86.2559949 C56.4488008,86.8850817 55.3737088,87.2033933 54.2819968,87.1619948 C51.8819969,87.1619948 50.555997,85.1999949 50.555997,83.081995 C50.555997,80.7599952 52.0259969,79.1879953 54.1559968,79.1879953 C56.2859966,79.1879953 57.4919966,80.5679952 57.4919966,83.387995 L52.0919969,83.387995 C52.3319969,84.9059949 53.2019968,85.6919949 54.6719967,85.6919949 C55.6366335,85.655396 56.5692571,85.3361759 57.3539966,84.7739949 L57.3419966,86.2559949 Z M55.9739967,82.3979951 C55.9199967,81.2339952 55.2539967,80.5019952 54.1739968,80.5019952 C53.0099968,80.5019952 52.3139969,81.1859952 52.1039969,82.3979951 L55.9739967,82.3979951 Z" id="Shape"></path>
            <polygon id="Path" points="62.8379963 79.3379953 64.4999962 79.3379953 66.563996 84.053995 68.5799959 79.3379953 70.2059958 79.3379953 66.821996 87.1379948 66.305996 87.1379948"></polygon>
            <path d="M72.1499957,77.9219954 C71.6496257,77.9219954 71.2439958,77.5163654 71.2439958,77.0159954 C71.2439958,76.5156255 71.6496257,76.1099955 72.1499957,76.1099955 C72.6503657,76.1099955 73.0559956,76.5156255 73.0559956,77.0159954 C73.0527234,77.5150037 72.6490039,77.9187231 72.1499957,77.9219954 L72.1499957,77.9219954 Z M72.8999957,87.0119948 L71.3819957,87.0119948 L71.3819957,79.3379953 L72.8999957,79.3379953 L72.8999957,87.0119948 Z" id="Shape"></path>
            <path d="M81.4979951,86.2559949 C80.6047993,86.8850817 79.5297074,87.2033933 78.4379953,87.1619948 C76.0379955,87.1619948 74.7119955,85.1999949 74.7119955,83.081995 C74.7119955,80.7599952 76.1819955,79.1879953 78.3119953,79.1879953 C80.4419952,79.1879953 81.6419951,80.5679952 81.6419951,83.387995 L76.2419955,83.387995 C76.4819954,84.9059949 77.3519954,85.6919949 78.8219953,85.6919949 C79.786632,85.655396 80.7192556,85.3361759 81.5039951,84.7739949 L81.4979951,86.2559949 Z M80.1299952,82.3979951 C80.0759952,81.2339952 79.4099953,80.5019952 78.3299953,80.5019952 C77.1659954,80.5019952 76.4699954,81.1859952 76.2599955,82.3979951 L80.1299952,82.3979951 Z" id="Shape"></path>
            <path d="M93.9659944,86.5679948 C93.5582567,86.9289779 93.0398752,87.1405622 92.4959945,87.1679948 C91.8299945,87.1679948 91.4699945,86.9279948 91.3379946,86.3819949 C90.7598736,86.8758663 90.0282105,87.1536862 89.2679947,87.1679948 C88.7674512,87.1761887 88.284999,86.9809608 87.9310139,86.6269757 C87.5770288,86.2729906 87.3818009,85.7905384 87.3899948,85.2899949 C87.3899948,83.771995 88.7759947,83.309995 90.0059946,82.8899951 L91.3499946,82.4099951 L91.3499946,82.0019951 C91.3499946,81.0419952 90.8939946,80.6519952 89.9699946,80.6519952 C89.0214077,80.6904083 88.1402771,81.1530018 87.5699948,81.9119951 L87.5699948,80.2559952 C88.2139294,79.5381531 89.151681,79.1555328 90.1139946,79.2179953 C91.6679945,79.2179953 92.8979945,80.0039952 92.8979945,81.7439951 L92.8979945,85.6919949 C92.8979945,85.9799949 92.9999945,86.0819949 93.1859944,86.0819949 C93.4842668,86.0164029 93.7609459,85.8759985 93.9899944,85.6739949 L93.9659944,86.5679948 Z M91.3079946,78.3479953 L90.3659946,78.3479953 L88.4579947,75.8339955 L90.1619946,75.8339955 L91.3079946,78.3479953 Z M91.3739946,83.219995 C90.0779946,83.663995 88.9739947,84.107995 88.9739947,85.0199949 C88.9653277,85.3105719 89.0782097,85.5916039 89.2854712,85.7954489 C89.4927326,85.999294 89.7756018,86.1074899 90.0659946,86.0939949 C90.5751415,86.0656516 91.0530906,85.8395946 91.3979946,85.4639949 L91.3739946,83.219995 Z" id="Shape"></path>
            <path d="M101.549994,80.3459952 L101.585994,80.3459952 C102.13783,79.6359958 102.979053,79.2109798 103.877994,79.1879953 C105.329994,79.1879953 106.487994,80.1779952 106.487994,82.2779951 L106.487994,87.0119948 L104.969994,87.0119948 L104.969994,82.2839951 C104.969994,81.1559952 104.369994,80.4239952 103.463994,80.4239952 C102.797994,80.4239952 102.263994,80.7299952 101.549994,81.5339951 L101.549994,87.0359948 L100.031994,87.0359948 L100.031994,79.3379953 L101.549994,79.3379953 L101.549994,80.3459952 Z" id="Path"></path>
            <path d="M116.345993,83.099995 C116.345993,85.4999949 114.653993,87.1619948 112.193993,87.1619948 C110.732684,87.2186939 109.357447,86.4714203 108.609933,85.2144952 C107.862418,83.9575701 107.862418,82.39242 108.609933,81.1354949 C109.357447,79.8785698 110.732684,79.1312962 112.193993,79.1879953 C114.605993,79.1879953 116.345993,80.8259952 116.345993,83.099995 Z M109.697993,83.099995 C109.697993,84.719995 110.705993,85.7999949 112.175993,85.7999949 C112.896578,85.8490624 113.60232,85.5789853 114.106051,85.0613902 C114.609782,84.543795 114.860602,83.8309822 114.791993,83.111995 C114.809376,82.4178381 114.537503,81.7476766 114.041413,81.2618265 C113.545322,80.7759764 112.869637,80.5181394 112.175993,80.5499952 C111.502421,80.5376365 110.853805,80.8047733 110.384306,81.2879132 C109.914808,81.7710531 109.666353,82.4270524 109.697993,83.099995 L109.697993,83.099995 Z" id="Shape"></path>
            <path d="M122.507993,81.3239952 C121.857761,80.8536237 121.088628,80.5750727 120.287993,80.5199952 C119.687993,80.5199952 119.279993,80.8079952 119.279993,81.2159952 C119.279993,81.6239951 119.789993,81.9719951 121.139993,82.7579951 C122.489993,83.543995 122.867993,84.119995 122.867993,84.9059949 C122.867993,86.2559949 121.787993,87.1620592 120.335993,87.1620592 C119.402455,87.1665758 118.483991,86.9266168 117.671993,86.4659948 L117.671993,84.8219949 C118.398366,85.3880046 119.269798,85.7374094 120.185993,85.8299949 C120.785993,85.8299949 121.313993,85.5059949 121.313993,84.9599949 C121.313993,83.897995 117.713993,83.339995 117.713993,81.2699952 C117.713993,79.9739952 118.703993,79.1879953 120.239993,79.1879953 C121.02991,79.1992985 121.804826,79.4053932 122.495993,79.7879952 L122.507993,81.3239952 Z" id="Path"></path>
            <path d="M130.781992,90.9419946 L129.257992,90.9419946 L129.257992,79.3379953 L131.891992,79.3379953 C134.693992,79.3379953 136.211992,80.7059952 136.211992,83.231995 C136.261459,84.2823643 135.868353,85.305371 135.128235,86.0523308 C134.388118,86.7992905 133.368772,87.2017936 132.317992,87.1619948 C131.787973,87.1543907 131.265167,87.0379846 130.781992,86.8199948 L130.781992,90.9419946 Z M130.781992,85.4579949 C131.228438,85.6776993 131.718444,85.7945627 132.215992,85.8000165 C132.888842,85.8028292 133.532898,85.527234 133.995431,85.0385635 C134.457963,84.549893 134.697773,83.8916739 134.657992,83.219995 C134.657992,81.6299951 133.823992,80.7059952 132.167992,80.7059952 L130.781992,80.7059952 L130.781992,85.4579949 Z" id="Shape"></path>
            <path d="M139.529992,79.3379953 L139.529992,81.0839952 L139.559992,81.0839952 C140.327992,79.7399952 141.065992,79.1759953 141.779992,79.1759953 C142.483602,79.2176495 143.141859,79.5370657 143.609991,80.0639952 L142.805991,81.3779951 C142.428973,80.9795264 141.931447,80.7160067 141.389992,80.6279952 C140.345992,80.6279952 139.529992,81.6659951 139.529992,82.9859951 L139.529992,86.9999948 L138.005992,86.9999948 L138.005992,79.3379953 L139.529992,79.3379953 Z" id="Path"></path>
            <path d="M151.985991,83.099995 C151.985991,85.4999949 150.293991,87.1619948 147.833991,87.1619948 C146.372682,87.2186939 144.997445,86.4714203 144.249931,85.2144952 C143.502416,83.9575701 143.502416,82.39242 144.249931,81.1354949 C144.997445,79.8785698 146.372682,79.1312962 147.833991,79.1879953 C150.239991,79.1879953 151.985991,80.8259952 151.985991,83.099995 Z M145.337991,83.099995 C145.337991,84.719995 146.345991,85.7999949 147.815991,85.7999949 C148.536576,85.8490624 149.242318,85.5789853 149.746049,85.0613902 C150.24978,84.543795 150.5006,83.8309822 150.431991,83.111995 C150.449374,82.4178381 150.177501,81.7476766 149.681411,81.2618265 C149.18532,80.7759764 148.509635,80.5181394 147.815991,80.5499952 C147.142419,80.5376365 146.493802,80.8047733 146.024304,81.2879132 C145.554806,81.7710531 145.306351,82.4270524 145.337991,83.099995 L145.337991,83.099995 Z" id="Shape"></path>
            <path d="M160.30799,87.0119948 L157.079991,87.0119948 C154.787991,87.0119948 153.353991,85.4579949 153.353991,82.9979951 C153.314473,81.9727536 153.705695,80.977737 154.432896,80.2539552 C155.160097,79.5301734 156.156947,79.1436456 157.181991,79.1879953 C157.732177,79.1909693 158.277167,79.2946801 158.789991,79.4939953 L158.789991,75.3599955 L160.30799,75.3599955 L160.30799,87.0119948 Z M158.789991,80.8439952 C158.341293,80.6491204 157.857179,80.5490292 157.367991,80.5499883 C155.903991,80.5499883 154.907991,81.6119951 154.907991,83.219995 C154.907991,84.653995 155.507991,85.7279949 157.253991,85.7279949 L158.789991,85.7279949 L158.789991,80.8439952 Z" id="Shape"></path>
            <path d="M167.25599,87.0119948 L167.25599,86.0339949 C166.67665,86.6954835 165.85919,87.1009782 164.98199,87.1619948 C163.42799,87.1619948 162.33599,86.0519949 162.33599,84.107995 L162.33599,79.3379953 L163.85399,79.3379953 L163.85399,84.209995 C163.85399,85.2839949 164.38799,85.9019949 165.42599,85.9019949 C166.177023,85.8666627 166.862043,85.4623884 167.25599,84.8219949 L167.25599,79.3379953 L168.77399,79.3379953 L168.77399,87.0119948 L167.25599,87.0119948 Z" id="Path"></path>
            <path d="M171.70799,77.9219954 C171.20762,77.9219954 170.80199,77.5163654 170.80199,77.0159954 C170.80199,76.5156255 171.20762,76.1099955 171.70799,76.1099955 C172.20836,76.1099955 172.61399,76.5156255 172.61399,77.0159954 C172.610717,77.5150037 172.206998,77.9187231 171.70799,77.9219954 L171.70799,77.9219954 Z M172.45799,87.0119948 L170.93999,87.0119948 L170.93999,79.3379953 L172.45799,79.3379953 L172.45799,87.0119948 Z" id="Shape"></path>
            <path d="M176.447989,79.3379953 L178.847989,79.3379953 L178.847989,80.7059952 L176.447989,80.7059952 L176.447989,84.635995 C176.418473,84.9401647 176.521417,85.2423079 176.730505,85.4651817 C176.939592,85.6880555 177.234557,85.8100564 177.539989,85.7999949 C178.156812,85.7740216 178.754611,85.5789066 179.267989,85.2359949 L179.267989,86.6519948 C178.69449,86.949503 178.064902,87.1232528 177.419989,87.1619948 C176.756389,87.2304047 176.096326,87.0031852 175.615446,86.5408004 C175.134566,86.0784157 174.881646,85.4277669 174.92399,84.7619949 L174.92399,80.7119952 L173.59199,80.7119952 L173.59199,80.5439952 L176.447989,77.7539954 L176.447989,79.3379953 Z" id="Path"></path>
            <path d="M184.817989,81.3239952 C184.167758,80.8536237 183.398624,80.5750727 182.597989,80.5199952 C181.997989,80.5199952 181.589989,80.8079952 181.589989,81.2159952 C181.589989,81.6239951 182.099989,81.9719951 183.449989,82.7579951 C184.799989,83.543995 185.177989,84.119995 185.177989,84.9059949 C185.177989,86.2559949 184.097989,87.1620592 182.645989,87.1620592 C181.712451,87.1665758 180.793988,86.9266168 179.981989,86.4659948 L179.981989,84.8219949 C180.708362,85.3880046 181.579795,85.7374094 182.495989,85.8299949 C183.095989,85.8299949 183.623989,85.5059949 183.623989,84.9599949 C183.623989,83.897995 180.023989,83.339995 180.023989,81.2699952 C180.023989,79.9739952 181.013989,79.1879953 182.549989,79.1879953 C183.339906,79.1992985 184.114822,79.4053932 184.805989,79.7879952 L184.817989,81.3239952 Z" id="Path"></path>
            <path d="M188.748006,86.1359949 C188.750419,86.5515105 188.501988,86.9274648 188.118797,87.0881623 C187.735606,87.2488598 187.293325,87.1625668 186.998645,86.8696108 C186.703966,86.5766548 186.615081,86.1348871 186.773528,85.7507601 C186.931975,85.3666331 187.306466,85.1159949 187.721989,85.1159949 C188.284954,85.1192301 188.741452,85.5730582 188.748006,86.1359949 L188.748006,86.1359949 Z" id="Path"></path>
            <path d="M176.02799,0.599999117 C167.373024,0.597573225 159.569046,5.80965133 156.255813,13.8053324 C152.94258,21.8010136 154.77275,31.0052688 160.892735,37.1252536 C167.012719,43.2452385 176.216975,45.075408 184.212656,41.7621751 C192.208337,38.4489422 197.420415,30.6449639 197.417989,21.9899987 C197.404762,10.1821115 187.835877,0.613226397 176.02799,0.599999117 L176.02799,0.599999117 Z M176.02799,40.2359986 C168.647626,40.2384246 161.992632,35.7944687 159.166607,28.9765986 C156.340583,22.1587286 157.900152,14.3098152 163.117998,9.09025196 C168.335845,3.87068868 176.184245,2.30853844 183.003044,5.13232048 C189.821844,7.95610252 194.267988,14.6096351 194.267988,21.9899987 C194.258072,32.0605334 186.09852,40.2227692 176.02799,40.2359986 L176.02799,40.2359986 Z" id="Shape"></path>
            <path d="M176.02799,10.1279994 C169.47426,10.1346269 164.166474,15.4522609 164.171992,22.0059916 C164.177518,28.5597223 169.494256,33.868405 176.047987,33.863992 C182.601719,33.8595734 187.911299,28.5437309 187.90799,21.9899987 C187.898058,15.4358868 182.582109,10.1279994 176.02799,10.1279994 L176.02799,10.1279994 Z M176.02799,30.7080002 C172.501343,30.7104253 169.320603,28.5878925 167.969332,25.3303922 C166.61806,22.0728919 167.362454,18.3221412 169.855311,15.8275666 C172.348169,13.332992 176.098406,12.5860166 179.356836,13.935045 C182.615266,15.2840733 184.739989,18.4633512 184.739989,21.9899987 C184.723481,26.7917316 180.829746,30.6774216 176.02799,30.6839982 L176.02799,30.7080002 Z" id="Shape"></path>
            <rect id="Rectangle" x="54.5999967" y="0.809999952" width="3.14999981" height="42.3599975"></rect>
            <rect id="Rectangle" x="45.1919973" y="0.809999952" width="3.14999981" height="42.3599975"></rect>
            <rect id="Rectangle" x="67.157996" y="0.815999951" width="39.1439977" height="3.14999981"></rect>
            <polygon id="Path" points="67.157996 12.3659993 80.4719952 12.3659993 80.4719952 43.1759974 83.621995 43.1759974 83.621995 9.22199945 67.157996 9.22199945"></polygon>
            <polygon id="Path" points="89.8439946 43.1759974 92.9939945 43.1759974 92.9939945 12.3659993 106.307994 12.3659993 106.307994 9.22199945 89.8439946 9.22199945"></polygon>
            <polygon id="Path" points="115.721993 43.1699974 146.003991 43.1699974 146.003991 40.0259976 118.865993 40.0259976 118.865993 3.95999976 146.003991 3.95999976 146.003991 0.815999951 115.721993 0.815999951"></polygon>
            <polygon id="Path" points="125.123993 19.1399989 146.003991 19.1399989 146.003991 15.989999 128.273992 15.989999 128.273992 12.3419993 146.003991 12.3419993 146.003991 9.19799945 125.123993 9.19799945"></polygon>
            <polygon id="Path" points="125.123993 34.7879979 146.003991 34.7879979 146.003991 31.6439981 128.273992 31.6439981 128.273992 27.9959983 146.003991 27.9959983 146.003991 24.8459985 125.123993 24.8459985"></polygon>
            <path d="M21.9899987,40.2359976 C13.7349987,40.226826 6.51449931,34.6763277 4.38300005,26.7012527 C2.25150079,18.7261778 5.74005236,10.3134701 12.8897417,6.18708528 C20.039431,2.06070047 29.0689544,3.24870346 34.9079979,9.08399946 L37.1279978,6.85799959 C31.0108458,0.733359839 21.8059926,-1.10198941 13.8076425,2.20817024 C5.80929242,5.51832989 0.593492244,13.3217431 0.593492244,21.9779987 C0.593492244,30.6342543 5.80929242,38.4376675 13.8076425,41.7478271 C21.8059926,45.0579868 31.0108458,43.2226375 37.1279978,37.0979978 L34.9079979,34.8839979 C31.4858021,38.3159968 26.8366473,40.2421677 21.9899987,40.2359976 L21.9899987,40.2359976 Z" id="Path"></path>
            <path d="M25.1819985,18.8339989 L33.311998,18.8339989 L33.311998,10.6979994 L30.3899982,13.6199992 L30.3899982,13.6199992 C26.9973203,10.2217049 21.891143,9.20273017 17.4539656,11.0385199 C13.0167882,12.8743097 10.1231186,17.2030546 10.1231186,22.0049987 C10.1231186,26.8069428 13.0167882,31.1356877 17.4539656,32.9714775 C21.891143,34.8072672 26.9973203,33.7882924 30.3899982,30.3899982 L28.1639983,28.1639983 C24.804035,31.5340273 19.3615199,31.5843686 15.9397937,28.2770678 C12.5180675,24.969767 12.383336,19.528687 15.6371789,16.0560864 C18.8910219,12.5834857 24.3293584,12.3643964 27.8519983,15.5639991 L28.1819983,15.8759991 L25.1819985,18.8339989 Z" id="Path"></path>
        </g>
    </g>
</svg>