<svg width="16" height="15" viewBox="0 0 16 15" fill="none" xmlns="http://www.w3.org/2000/svg">
<path fill-rule="evenodd" clip-rule="evenodd" d="M13.9277 4.97227C14.7047 4.97227 15.334 5.60156 15.334 6.37793C15.334 7.12207 14.7539 7.72559 14.0238 7.77481C14.2531 8.025 14.3965 8.35547 14.3965 8.72168C14.3965 9.40723 13.9014 9.97852 13.2498 10.0992C13.38 10.3122 13.459 10.5601 13.459 10.8281C13.459 11.4551 13.0488 11.9766 12.485 12.1603C12.5074 12.2601 12.5215 12.3628 12.5215 12.4693C12.5215 13.246 11.8922 13.875 11.1152 13.875H9.39551C8.38184 13.875 7.39453 13.5469 6.58418 12.9369L5.58398 12.1872C5.22987 11.9218 5.02148 11.5049 5.02148 11.0625L5.02441 6.375C5.02734 5.96484 5.20312 5.55762 5.54883 5.2793L6.02637 4.89844C7.21184 3.95038 7.54784 2.92568 7.80812 2.1319C8.07426 1.32023 8.26123 0.75 9.19629 0.75C10.1045 0.75 10.6465 1.46836 10.6471 2.15918C10.6471 2.60273 10.3028 3.86162 9.63574 4.97227H13.9277ZM4.08398 6.34863V12.9111C4.08398 13.4531 3.66504 13.8486 3.14648 13.7959H1.27148C0.753809 13.7959 0.333984 13.4024 0.333984 12.8848V6.34863C0.333984 5.85732 0.753809 5.4375 1.27148 5.4375H3.14648C3.66416 5.4375 4.08398 5.83096 4.08398 6.34863Z" fill="#507A1F"/>
</svg>
