<?xml version="1.0" encoding="UTF-8"?>
<svg width="327px" height="327px" viewBox="0 0 327 327" version="1.1" xmlns="http://www.w3.org/2000/svg" xmlns:xlink="http://www.w3.org/1999/xlink">
    <!-- Generator: Sketch 54.1 (76490) - https://sketchapp.com -->
    <title>Artboard</title>
    <desc>Created with Sketch.</desc>
    <defs>
        <path d="M20.9469207,1.23957906 L30.8263509,1.23957906 L30.8263509,45 L24.2804708,45 L24.2804708,10.8159593 L24.1592508,10.8159593 L17.3709306,45 L13.7343306,45 L6.94601041,10.8159593 L6.82479041,10.8159593 L6.82479041,45 L0.278910269,45 L0.278910269,1.23957906 L10.1583405,1.23957906 L15.4920206,26.8169996 L15.6132406,26.8169996 L20.9469207,1.23957906 Z M58.7069515,45 L37.7358911,45 L37.7358911,1.23957906 L57.8584115,1.23957906 L57.8584115,7.7854592 L45.2515312,7.7854592 L45.2515312,19.0589194 L54.9491314,19.0589194 L54.9491314,25.6047996 L45.2515312,25.6047996 L45.2515312,38.4541199 L58.7069515,38.4541199 L58.7069515,45 Z M71.4350518,45 L64.6467316,45 L64.6467316,1.23957906 L71.6168818,1.23957906 L80.768992,26.2715096 L80.890212,26.2715096 L80.890212,1.23957906 L87.6785321,1.23957906 L87.6785321,45 L81.132652,45 L71.5562718,17.6648894 L71.4350518,17.6648894 L71.4350518,45 Z M99.3156524,45 L99.3156524,7.7854592 L92.0424522,7.7854592 L92.0424522,1.23957906 L114.104493,1.23957906 L114.104493,7.7854592 L106.831293,7.7854592 L106.831293,45 L99.3156524,45 Z M118.529023,34.3932498 L118.529023,11.8463293 C118.529023,5.66410916 122.165623,0.633479048 130.044923,0.633479048 C137.924223,0.633479048 141.560823,5.66410916 141.560823,11.8463293 L141.560823,34.3932498 C141.560823,40.5754699 137.924223,45.6061 130.044923,45.6061 C122.165623,45.6061 118.529023,40.5754699 118.529023,34.3932498 Z M126.044663,12.0281593 L126.044663,34.2114198 C126.044663,37.4843598 127.014423,39.0602199 130.044923,39.0602199 C133.075423,39.0602199 134.045183,37.4843598 134.045183,34.2114198 L134.045183,12.0281593 C134.045183,8.75521922 133.075423,7.17935919 130.044923,7.17935919 C127.014423,7.17935919 126.044663,8.75521922 126.044663,12.0281593 Z M156.349664,7.42179919 L156.349664,20.8772195 L159.016504,20.8772195 C163.077374,20.8772195 164.592624,19.3619695 164.592624,14.1495093 C164.592624,8.93704923 163.077374,7.42179919 159.016504,7.42179919 L156.349664,7.42179919 Z M156.349664,27.0594396 L156.349664,45 L148.834023,45 L148.834023,1.23957906 L159.380164,1.23957906 C167.804954,1.23957906 172.108264,4.81556914 172.108264,14.1495093 C172.108264,21.1802695 169.380814,24.0289396 166.835194,25.1805296 L173.199244,45 L165.562384,45 L160.228704,26.8776096 C159.258944,26.9988296 157.683084,27.0594396 156.349664,27.0594396 Z" id="path-1"></path>
        <path d="M0.734599948,46.0698005 C0.79729995,44.0007004 1.11079996,42.0570004 1.48699996,40.0506003 L2.05129998,36.7275002 C2.17669998,36.1632002 2.30209998,35.6616002 2.55289999,35.1600002 C3.0545,34.0314002 3.49340001,32.8401002 3.30530001,31.5234001 C3.2426,31.0845001 3.43070001,30.5829001 3.49340001,30.1440001 C4.30850003,26.5701 5.37440005,22.9961999 6.44030008,19.4849999 C6.75380008,18.4817998 7.06730009,17.4785998 7.3181001,16.4126998 C7.6943001,15.0332998 8.32130012,13.6538997 8.82290013,12.2744997 C9.01100013,11.7728997 9.32450014,11.5847997 9.88880015,11.5220997 C10.2023002,11.5220997 10.5158002,11.3966997 10.8293002,11.3339997 C12.1460002,10.9577997 13.4000002,10.6442997 14.5286003,11.7101997 C14.8421003,12.0236997 15.2810003,11.9609997 15.6572003,11.7728997 C15.9080003,11.6474997 16.1588003,11.5847997 16.4096003,11.4593997 C20.6105004,9.39029963 25.0622005,7.9481996 29.3885006,6.06719956 C31.0187006,5.37749954 32.7743007,4.93859954 34.5299007,4.37429952 C35.4704007,4.06079952 36.4109007,3.74729951 37.4141008,3.4964995 C37.9157008,3.3083995 38.4173008,3.2456995 38.9816008,3.1829995 C39.4205008,3.1829995 39.9221008,3.80999951 39.6713008,4.18619952 C39.1697008,4.81319953 39.3578008,5.62829955 38.9189008,6.25529956 C38.5427008,6.81959958 38.0411008,7.25849959 37.7903008,8.0108996 C37.6649008,8.51249962 37.1006008,8.76329962 36.5363007,8.95139962 C35.8466007,9.20219963 35.2196007,9.64109964 34.7807007,10.2053997 C33.9029007,11.3339997 32.7116007,11.8982997 31.4576006,12.3371997 C30.2663006,12.8387997 29.1377006,13.4657997 28.0718006,14.0300997 C24.8114005,15.6602998 21.6764004,17.4158998 18.2906003,18.6698998 C17.9144003,18.8579998 17.5382003,19.0460999 17.1620003,19.1087999 C15.5945003,19.1087999 15.2183003,20.1119999 14.8421003,21.3659999 C14.2778003,23.4350999 13.5254002,25.4415 12.8984002,27.4479 L11.8325002,31.1472001 C11.7698002,31.5234001 12.0833002,31.7742001 12.4595002,31.7115001 L17.2874003,30.3948001 C18.5414003,30.0813001 19.7954004,30.0186001 21.1121004,30.0186001 C21.6137004,30.0813001 21.8018004,30.3321001 21.7391004,30.8337001 C21.6764004,31.2726001 21.4883004,31.6488001 21.6764004,32.0250001 C21.7391004,32.1504001 21.7391004,32.3385001 21.6764004,32.4012001 C20.8613004,33.0282002 20.6105004,34.2195002 19.5446004,34.6584002 C18.9176004,34.9092002 18.3533003,35.2854002 18.2279003,36.1005002 C18.1025003,36.4767002 17.7263003,36.6648002 17.3501003,36.9156002 C16.0961003,37.6680003 14.7794003,38.2950003 13.3373002,38.6085003 C12.5222002,38.7966003 11.6444002,38.8593003 10.7666002,38.6085003 C9.82610015,38.2950003 9.76340015,38.3577003 9.51260014,39.4863003 C8.76020013,41.9316004 8.50940012,44.4396004 8.00780011,46.8849005 C7.88240011,47.3238005 7.94510011,47.7000005 7.94510011,48.1389005 C7.94510011,48.4524005 8.38400012,48.6405005 8.69750013,48.4524005 C9.19910014,48.1389005 9.70070015,47.8254005 10.2023002,47.4492005 C13.6508002,44.8785004 17.3501003,42.7467004 21.3002004,41.0538003 C22.3661004,40.6149003 23.4320005,40.1760003 24.5606005,40.1133003 C25.3757005,40.0506003 25.5011005,40.3641003 25.7519005,41.1165003 C26.1281005,42.1197004 25.5638005,42.9975004 25.5011005,44.0007004 C25.4384005,44.6904004 24.8114005,45.2547004 24.3098005,45.7563004 C23.6201005,46.3833005 22.8677004,46.9476005 22.4915004,47.8881005 C22.3661004,48.0762005 22.1153004,48.2016005 21.8645004,48.3897005 C18.9803004,50.3334005 16.0961003,52.2144006 13.2119002,54.2208006 C11.9579002,55.0986007 10.5785002,55.4748007 9.19910014,55.9137007 C8.82290013,56.0391007 8.50940012,55.9764007 8.19590011,55.9764007 C6.31490007,55.8510007 4.68470004,55.0359007 3.36800001,53.7192006 C1.67509997,51.9636006 0.734599948,49.7691005 0.734599948,47.2611005 L0.734599948,46.0698005 Z M65.1902014,4.56239953 C65.6291014,5.87909956 65.3156014,7.07039958 64.6259014,8.19899961 C63.8108014,9.51569964 62.9330013,10.7696997 62.0552013,12.0863997 L59.2964013,16.4126998 C57.1646012,19.6730999 55.0328012,22.8707999 52.9010011,26.0685 C51.7724011,27.6987 50.7065011,29.3289001 49.577901,30.8337001 C49.076301,31.5234001 48.950901,32.1504001 49.201701,32.9655002 C49.954101,35.7870002 50.3930011,38.7339003 50.2676011,41.7435004 C50.2676011,42.1197004 50.3930011,42.4959004 50.4557011,42.8094004 C50.7692011,44.0634004 50.7065011,45.1920004 50.2049011,46.3206005 C49.828701,47.3238005 49.389801,48.2016005 48.950901,49.1421005 C48.825501,49.4556005 48.574701,49.6437005 48.261201,49.6437005 C47.885001,49.6437005 47.822301,49.3302005 47.696901,49.0167005 C47.258001,47.4492005 46.819101,45.8817004 46.254801,44.3142004 C45.690501,42.6840004 45.0008009,40.9911003 44.4365009,39.3609003 C43.8722009,39.4236003 43.6841009,39.7371003 43.4960009,40.0506003 C42.5555009,41.5554004 41.6150009,43.0602004 40.6118008,44.5650004 C39.2951008,46.6968005 37.9157008,48.8286005 36.5990007,51.0231006 C35.6585007,52.6533006 34.4045007,54.0327006 33.2759007,55.4748007 C33.1505007,55.6002007 32.8370007,55.6002007 32.6489007,55.7256007 L32.7116007,55.7256007 C32.2100007,56.2899007 31.6457006,56.7915007 31.3322006,57.4812007 C31.2695006,57.7320007 31.0814006,57.9828007 30.8933006,58.2336007 C30.4544006,58.6725007 30.0782006,58.7352007 29.5139006,58.4217007 C29.2631006,58.2963007 29.2004006,57.9201007 28.8242006,57.9828007 C27.5075005,58.2336007 27.5075005,56.7915007 26.8178005,56.2899007 C26.6297005,56.1018007 26.8178005,55.7256007 26.9432005,55.4121007 L29.9528006,49.9572005 C32.0219006,46.3833005 34.0283007,42.8721004 36.0974007,39.3609003 C37.3514008,37.2291003 38.7308008,35.1600002 39.9221008,33.0282002 C41.8658009,29.6424001 41.6777009,30.7083001 40.4864008,27.2598 C39.7340008,25.1907 38.9189008,23.1215999 37.8530008,21.1151999 C37.4141008,20.3000999 36.9752008,19.5476999 36.0974007,19.1714999 C35.8466007,19.1087999 35.6585007,18.9833998 35.5331007,18.8579998 C35.1569007,18.4190998 34.9061007,17.9174998 35.0942007,17.4158998 C35.2823007,16.8515998 35.6585007,16.6007998 36.2855007,16.6007998 C37.1633008,16.6007998 38.0411008,16.2872998 38.9189008,16.4126998 C39.9221008,16.6007998 40.6118008,17.6039998 41.6777009,17.7293998 C41.9912009,17.7920998 42.2420009,18.2309998 42.4928009,18.4817998 C43.5587009,19.6730999 44.2484009,21.0524999 45.0635009,22.4318999 C45.5024009,23.1215999 46.004001,23.1215999 46.442901,22.4945999 L49.452501,17.7920998 C50.7065011,15.8483998 52.0232011,13.9673997 53.1518011,11.9609997 C54.4685011,9.57839964 55.9733012,7.38389959 57.7289012,5.37749955 C58.3559012,3.62189951 59.7353013,3.12029949 61.4282013,3.05759949 C61.5536013,3.05759949 61.7417013,3.05759949 61.8671013,2.99489949 C62.8703013,2.36789948 63.6854014,2.93219949 64.5005014,3.4964995 C64.8767014,3.74729951 65.0648014,4.12349952 65.1902014,4.56239953 Z M86.1947019,30.9591001 C87.0725019,28.4511001 88.2011019,26.0685 89.4551019,23.7486 C90.709102,21.4913999 90.834502,19.0460999 90.771802,16.5380998 C90.771802,15.6602998 90.2075019,15.3467998 89.3924019,15.6602998 C87.3860019,16.4126998 85.7558018,17.6039998 84.3137018,19.1087999 C82.2446018,21.1151999 80.1755017,23.1215999 78.1691017,25.2534 C76.9778017,26.5074 75.7865016,27.8868 74.7206016,29.3289001 C73.7801016,30.6456001 73.5293016,32.2758001 73.0277016,33.8433002 C71.6483015,38.1696003 70.8332015,42.6213004 69.1403015,46.8222005 C68.9522015,47.1984005 68.8895015,47.6373005 68.8268015,48.0762005 C68.3879015,49.7691005 68.0117015,51.5247006 67.5728014,53.2803006 C67.3847014,53.8446006 67.3220014,54.4089006 67.3847014,55.0359007 C67.4474014,56.2899007 67.0712014,57.3558007 66.0680014,58.1709007 C65.6918014,58.4844007 65.3783014,58.8606007 65.0021014,59.2995007 C62.9957013,57.1050007 61.6163013,54.6597006 61.3655013,51.7755006 C61.0520013,48.5778005 61.2401013,45.3174004 61.6790013,42.1197004 C62.2433013,37.9188003 63.3092013,33.9060002 64.0616014,29.7678001 C64.5005014,27.1971 65.1902014,24.6264 66.0053014,22.1183999 C67.1966014,18.2936998 67.8863014,14.2808997 68.8895015,10.4561997 C69.2657015,9.13949963 69.3911015,7.7600996 69.0776015,6.38069957 C68.7641015,5.00129954 70.0181015,4.06079952 71.4602015,4.43699952 C73.7801016,5.00129954 75.3476016,6.38069957 76.4135016,8.44979961 C76.7270016,8.95139962 76.9151016,9.57839964 77.1659017,10.0799996 C78.4199017,12.3371997 78.3572017,14.6570998 77.7929017,17.0396998 C77.4794017,18.2936998 77.1659017,19.4849999 77.0405017,20.9897999 C78.1691017,20.7389999 78.7334017,19.9865999 79.2977017,19.2968999 C80.3009017,18.0428998 81.5549018,16.9769998 82.7462018,15.9110998 C84.2510018,14.4689997 85.9439019,13.4657997 88.0130019,12.8387997 C90.771802,12.0236997 92.966302,12.7760997 94.721902,14.9078998 C96.5402021,17.0396998 97.4180021,19.4222999 96.7283021,22.1810999 C96.6029021,22.4945999 96.6029021,22.8707999 96.6029021,23.1842999 C96.7910021,25.8177 95.5997021,28.0122001 94.471102,30.2067001 C93.593302,31.8996001 92.652802,33.5298002 91.900402,35.2227002 C90.834502,37.5426003 89.0789019,39.2982003 87.1352019,40.8657003 C86.8844019,41.0538003 86.5082019,41.3046003 86.2574019,41.3046003 C85.0661018,41.1792003 84.1256018,41.8689004 83.1851018,42.3705004 C81.9938018,43.0602004 80.8025017,43.1856004 79.5485017,42.3078004 C79.0469017,41.9316004 78.4199017,41.6181004 77.7929017,41.3046003 C77.6048017,41.1792003 77.2913017,41.0538003 77.1659017,40.8657003 C76.4762016,39.2355003 75.0968016,37.9188003 74.7206016,36.1632002 C74.6579016,35.9124002 74.5952016,35.6616002 74.5952016,35.4108002 C74.5952016,35.2854002 74.6579016,35.0346002 74.7833016,34.9719002 C74.8460016,34.9092002 75.0968016,34.8465002 75.2222016,34.9719002 C76.0373016,35.4108002 76.7897016,36.0378002 77.6048017,36.4767002 C79.6739017,37.5426003 80.7398017,37.3545003 82.4327018,35.7870002 C83.9375018,34.3449002 85.3169018,32.8401002 86.2574019,31.0218001 C86.3201019,31.0218001 86.4455019,30.9591001 86.4455019,30.9591001 L86.1947019,30.9591001 Z M99.2363021,0.361499433 C100.490302,0.361499433 101.681602,0.298799432 102.810202,0.361499433 C103.311802,0.361499433 103.750702,0.424199434 104.252302,0.549599437 C106.258702,1.11389945 107.199202,2.36789948 107.136502,4.49969953 C107.073802,6.50609957 107.073802,8.44979961 107.011102,10.4561997 C107.011102,10.7696997 106.885702,11.2085997 107.324602,11.5847997 C107.951602,11.5847997 108.327802,10.9577997 108.892102,10.7069997 C109.456402,10.4561997 110.020702,10.1426997 110.522302,9.76649964 C111.212002,9.20219963 112.027102,9.01409963 112.842202,8.63789962 C114.660502,7.8227996 116.541503,8.32439961 118.359803,8.70059962 C119.112203,8.82599962 119.551103,9.32759963 119.864603,10.0799996 C120.993203,12.4625997 121.369403,14.9705998 120.930503,17.6039998 C120.554303,19.9865999 120.052703,22.2437999 119.425703,24.501 C119.112203,25.5042 118.673303,26.382 117.920903,27.1344 C116.855003,28.3884001 115.914503,29.7678001 114.723202,30.8964001 C113.970802,31.5861001 113.908102,32.4012001 114.284302,33.2790002 C115.475603,36.1005002 115.977203,39.1728003 116.792303,42.1197004 C117.419303,44.1888004 118.046303,46.3206005 118.798703,48.3897005 C119.927303,51.5874006 121.118603,54.7224006 122.372603,57.8574007 C122.748803,58.7979007 123.125003,59.7384008 123.250403,60.7416008 C123.313103,61.0551008 123.375803,61.3686008 123.501203,61.6821008 C125.256803,65.3814009 127.263203,68.892601 130.586303,71.526001 C131.213303,72.027601 131.965703,72.591901 132.718103,72.9681011 C133.658603,73.4070011 134.348303,74.1594011 135.100703,74.7864011 C135.853103,75.3507011 135.790403,76.2285011 135.915803,76.9182011 C136.103903,77.6079012 135.163403,78.2349012 134.473703,78.0468012 C134.097503,77.9214012 133.721303,77.8587012 133.407803,77.6079012 C131.025203,75.5388011 128.203703,74.0967011 125.758403,72.090301 C122.936903,69.833101 120.366203,67.2624009 118.359803,64.2528009 C116.980403,62.0583008 115.601003,59.8638008 114.472402,57.5439007 C112.716802,53.8446006 111.149302,50.0826005 109.644502,46.2579005 C108.327802,42.9348004 107.324602,39.4236003 106.572202,35.9124002 C106.384102,35.0973002 106.007902,34.2822002 105.757102,33.4671002 C105.569002,32.9028002 105.569002,31.9623001 104.816602,32.0877001 C104.189602,32.1504001 104.315002,33.1536002 104.252302,33.7179002 L103.311802,42.8721004 C103.249102,43.2483004 103.311802,43.6872004 103.186402,44.0634004 C102.245902,46.1952005 102.308602,48.5151005 102.120502,50.7723006 C101.995102,52.3398006 101.618902,53.9073006 101.117302,55.3494007 C100.929202,56.1018007 100.741102,57.1677007 99.4871022,56.6034007 C99.3617022,56.6034007 99.1736021,56.6661007 99.0482021,56.7915007 C98.1077021,57.6693007 97.3553021,57.1677007 96.5402021,56.6034007 C96.1013021,56.2899007 95.9132021,55.9137007 95.9132021,55.4121007 C95.8505021,54.0954006 95.8505021,52.7787006 95.7878021,51.3993006 C95.5997021,46.9476005 95.7251021,42.4332004 95.9759021,37.9815003 C96.2267021,33.3417002 96.7910021,28.7646001 97.2299021,24.1248 C97.6688021,19.5476999 98.2331021,14.9078998 98.7347021,10.3307997 C98.9228021,8.82599962 99.1736021,7.38389959 99.2990021,5.87909956 C99.4871022,4.31159952 99.8633022,2.80679949 99.2363021,1.23929945 C99.1109021,0.988499447 99.2363021,0.67499944 99.2363021,0.361499433 Z M105.255502,28.8273001 C106.572202,28.3257001 107.826202,28.2630001 109.017502,28.2630001 C109.456402,28.2630001 109.895302,28.3884001 109.958002,28.8273001 C110.146102,29.6424001 110.585002,29.5170001 111.149302,29.2662001 C112.089802,28.8273001 112.716802,28.2003001 112.904902,27.1344 C113.030302,26.6328 113.281102,26.1312 113.469202,25.6296 C115.350203,21.8048999 115.914503,17.7293998 115.726403,13.4657997 C115.726403,13.2776997 115.663703,13.0268997 115.601003,12.7760997 C115.538303,12.3998997 114.974002,12.1490997 114.660502,12.3998997 C113.281102,13.5911997 111.588202,14.4689997 110.522302,16.1618998 C108.892102,18.7325998 107.512702,21.4286999 106.196002,24.1875 C105.819802,24.8772 105.694402,25.6923 105.380902,26.382 C105.130102,27.1344 105.067402,27.8868 105.255502,28.8273001 Z M121.118603,46.0698005 C121.181303,44.0007004 121.494803,42.0570004 121.871003,40.0506003 L122.435303,36.7275002 C122.560703,36.1632002 122.686103,35.6616002 122.936903,35.1600002 C123.438503,34.0314002 123.877403,32.8401002 123.689303,31.5234001 C123.626603,31.0845001 123.814703,30.5829001 123.877403,30.1440001 C124.692503,26.5701 125.758403,22.9961999 126.824303,19.4849999 C127.137803,18.4817998 127.451303,17.4785998 127.702103,16.4126998 C128.078303,15.0332998 128.705303,13.6538997 129.206903,12.2744997 C129.395003,11.7728997 129.708503,11.5847997 130.272803,11.5220997 C130.586303,11.5220997 130.899803,11.3966997 131.213303,11.3339997 C132.530003,10.9577997 133.784003,10.6442997 134.912603,11.7101997 C135.226103,12.0236997 135.665003,11.9609997 136.041203,11.7728997 C136.292003,11.6474997 136.542803,11.5847997 136.793603,11.4593997 C140.994503,9.39029963 145.446203,7.9481996 149.772503,6.06719956 C151.402703,5.37749954 153.158303,4.93859954 154.913903,4.37429952 C155.854403,4.06079952 156.794903,3.74729951 157.798103,3.4964995 C158.299703,3.3083995 158.801303,3.2456995 159.365603,3.1829995 C159.804503,3.1829995 160.306104,3.80999951 160.055304,4.18619952 C159.553703,4.81319953 159.741803,5.62829955 159.302903,6.25529956 C158.926703,6.81959958 158.425103,7.25849959 158.174303,8.0108996 C158.048903,8.51249962 157.484603,8.76329962 156.920303,8.95139962 C156.230603,9.20219963 155.603603,9.64109964 155.164703,10.2053997 C154.286903,11.3339997 153.095603,11.8982997 151.841603,12.3371997 C150.650303,12.8387997 149.521703,13.4657997 148.455803,14.0300997 C145.195403,15.6602998 142.060403,17.4158998 138.674603,18.6698998 C138.298403,18.8579998 137.922203,19.0460999 137.546003,19.1087999 C135.978503,19.1087999 135.602303,20.1119999 135.226103,21.3659999 C134.661803,23.4350999 133.909403,25.4415 133.282403,27.4479 L132.216503,31.1472001 C132.153803,31.5234001 132.467303,31.7742001 132.843503,31.7115001 L137.671403,30.3948001 C138.925403,30.0813001 140.179403,30.0186001 141.496103,30.0186001 C141.997703,30.0813001 142.185803,30.3321001 142.123103,30.8337001 C142.060403,31.2726001 141.872303,31.6488001 142.060403,32.0250001 C142.123103,32.1504001 142.123103,32.3385001 142.060403,32.4012001 C141.245303,33.0282002 140.994503,34.2195002 139.928603,34.6584002 C139.301603,34.9092002 138.737303,35.2854002 138.611903,36.1005002 C138.486503,36.4767002 138.110303,36.6648002 137.734103,36.9156002 C136.480103,37.6680003 135.163403,38.2950003 133.721303,38.6085003 C132.906203,38.7966003 132.028403,38.8593003 131.150603,38.6085003 C130.210103,38.2950003 130.147403,38.3577003 129.896603,39.4863003 C129.144203,41.9316004 128.893403,44.4396004 128.391803,46.8849005 C128.266403,47.3238005 128.329103,47.7000005 128.329103,48.1389005 C128.329103,48.4524005 128.768003,48.6405005 129.081503,48.4524005 C129.583103,48.1389005 130.084703,47.8254005 130.586303,47.4492005 C134.034803,44.8785004 137.734103,42.7467004 141.684203,41.0538003 C142.750103,40.6149003 143.816003,40.1760003 144.944603,40.1133003 C145.759703,40.0506003 145.885103,40.3641003 146.135903,41.1165003 C146.512103,42.1197004 145.947803,42.9975004 145.885103,44.0007004 C145.822403,44.6904004 145.195403,45.2547004 144.693803,45.7563004 C144.004103,46.3833005 143.251703,46.9476005 142.875503,47.8881005 C142.750103,48.0762005 142.499303,48.2016005 142.248503,48.3897005 C139.364303,50.3334005 136.480103,52.2144006 133.595903,54.2208006 C132.341903,55.0986007 130.962503,55.4748007 129.583103,55.9137007 C129.206903,56.0391007 128.893403,55.9764007 128.579903,55.9764007 C126.698903,55.8510007 125.068703,55.0359007 123.752003,53.7192006 C122.059103,51.9636006 121.118603,49.7691005 121.118603,47.2611005 L121.118603,46.0698005 Z M174.539004,3.93539951 C175.291404,4.93859954 175.604904,5.94179956 175.166004,7.25849959 C174.601704,8.95139962 174.037404,10.5815997 172.908804,12.0236997 C172.595304,12.4625997 172.407204,12.9014997 172.156404,13.4030997 C171.529404,14.6570998 170.714304,14.9078998 169.460304,14.2808997 C169.397604,14.2808997 169.334904,14.2181997 169.272204,14.2181997 C168.143604,13.6538997 167.642004,12.5879997 168.143604,11.5220997 C168.707904,10.3307997 168.833304,9.07679963 169.021404,7.8227996 C169.146804,7.19579959 169.272204,6.50609957 169.334904,5.87909956 C169.523004,4.56239953 168.770604,3.4964995 167.516604,3.62189951 C166.011804,3.68459951 164.757804,4.12349952 163.817304,5.56559955 C162.626004,7.32119959 162.500604,9.39029963 161.748204,11.2085997 C161.685504,11.3966997 161.685504,11.6474997 161.748204,11.8982997 C161.873604,14.4062997 162.124404,16.9142998 163.503804,19.1714999 C164.381604,20.4881999 164.695104,22.0556999 165.384804,23.4350999 C166.011804,24.7518 167.077704,25.8804 167.642004,27.3225 C168.143604,28.7019001 168.645204,30.0813001 168.896004,31.5861001 C169.021404,32.5266002 169.334904,33.4671002 169.773804,34.3449002 C171.090504,36.9783003 171.717504,39.7371003 171.529404,42.7467004 C171.466704,44.0007004 171.466704,45.2547004 171.404004,46.5087005 C171.153204,49.9572005 169.836504,53.0295006 168.206304,55.9764007 C168.143604,56.0391007 168.080904,56.1018007 168.080904,56.1645007 C167.265804,58.4844007 165.322104,59.5503008 163.315704,60.5535008 C162.187104,61.1805008 160.933104,61.7448008 159.741803,62.3718008 C158.989403,62.8107008 158.174303,63.3123008 157.296503,63.2496008 C156.356003,63.2496008 155.478203,62.8734008 154.600403,62.5599008 C154.349603,62.4972008 154.036103,62.2464008 153.785303,62.2464008 C152.280503,62.3718008 151.277303,61.4313008 150.462203,60.4908008 L150.399503,60.4908008 L149.459003,59.9265008 C149.270903,59.7384008 149.270903,59.5503008 149.584403,59.4249008 C149.772503,59.3622008 150.086003,59.4249008 150.086003,59.1741007 C150.086003,58.9233007 149.835203,58.8606007 149.647103,58.8606007 C148.957403,58.7352007 148.581203,58.4217007 148.393103,57.7320007 C148.205003,57.0423007 147.828803,56.3526007 147.452603,55.7256007 C146.574803,54.3462006 146.324003,52.8414006 146.574803,51.2739006 C146.825603,49.8318005 147.139103,48.4524005 148.142303,47.1984005 C149.459003,45.6309004 150.775703,44.0007004 151.214603,41.8689004 C151.904303,41.0538003 152.155103,39.9252003 152.970203,39.1101003 C153.848003,38.2323003 154.663103,37.7934003 155.917103,38.0442003 L155.854403,38.0442003 C155.352803,38.6085003 155.102003,39.2982003 154.788503,39.9879003 C153.785303,41.9943004 152.970203,44.1888004 151.528103,46.0698005 C150.650303,47.2611005 150.148703,48.8286005 149.521703,50.2707005 C149.270903,50.7723006 149.208203,51.3366006 149.584403,51.7755006 C150.211403,52.4025006 150.211403,53.2803006 150.399503,54.0327006 C150.713003,55.2240007 151.026503,56.3526007 152.092403,57.0423007 C153.095603,57.7320007 153.910703,57.7320007 154.600403,56.7915007 C155.290103,55.7883007 156.230603,55.0359007 157.045703,54.1581006 C157.735403,53.4684006 158.362403,52.7787006 158.738603,51.8382006 C159.929904,49.0167005 161.309304,46.2579005 161.936304,43.2483004 C162.688704,39.6744003 162.437904,36.1632002 160.870404,32.7774002 C160.745004,32.5266002 160.556904,32.2131001 160.243404,32.2758001 C160.055304,32.2758001 159.867204,32.4639001 159.741803,32.6520002 C159.428303,33.1536002 159.177503,33.6552002 158.864003,34.2195002 C158.613203,33.4671002 158.362403,30.8964001 158.362403,30.4575001 C158.425103,29.8932001 158.864003,29.5170001 159.114803,29.0781001 C159.491003,28.3884001 159.616403,27.6987 159.240203,26.9463 C159.114803,26.6955 159.114803,26.382 158.926703,26.1312 C157.798103,23.6859 157.171103,21.0524999 156.481403,18.4817998 C155.791703,15.7856998 155.791703,13.0268997 156.356003,10.3307997 C156.606803,9.32759963 156.794903,8.38709961 157.045703,7.44659959 C157.610003,5.06399954 158.864003,3.05759949 160.870404,1.61549946 C161.183904,1.36469946 161.497404,1.11389945 161.810904,1.05119945 C163.566504,0.549599437 165.384804,0.173399429 167.077704,0.549599437 C168.331704,0.863099444 169.585704,0.863099444 170.777004,1.17659945 C172.093704,1.49009946 173.159604,1.86629947 173.849304,3.12029949 C173.974704,3.4337995 174.350904,3.68459951 174.539004,3.93539951 Z M151.026503,60.4908008 C151.214603,60.4908008 151.402703,60.4281008 151.277303,60.1146008 L150.963803,60.1146008 C150.775703,60.2400008 150.650303,60.3654008 150.462203,60.4281008 C150.650303,60.4908008 150.775703,60.4908008 151.026503,60.4908008 Z M198.992004,3.93539951 C199.744404,4.93859954 200.057904,5.94179956 199.619004,7.25849959 C199.054704,8.95139962 198.490404,10.5815997 197.361804,12.0236997 C197.048304,12.4625997 196.860204,12.9014997 196.609404,13.4030997 C195.982404,14.6570998 195.167304,14.9078998 193.913304,14.2808997 C193.850604,14.2808997 193.787904,14.2181997 193.725204,14.2181997 C192.596604,13.6538997 192.095004,12.5879997 192.596604,11.5220997 C193.160904,10.3307997 193.286304,9.07679963 193.474404,7.8227996 C193.599804,7.19579959 193.725204,6.50609957 193.787904,5.87909956 C193.976004,4.56239953 193.223604,3.4964995 191.969604,3.62189951 C190.464804,3.68459951 189.210804,4.12349952 188.270304,5.56559955 C187.079004,7.32119959 186.953604,9.39029963 186.201204,11.2085997 C186.138504,11.3966997 186.138504,11.6474997 186.201204,11.8982997 C186.326604,14.4062997 186.577404,16.9142998 187.956804,19.1714999 C188.834604,20.4881999 189.148104,22.0556999 189.837804,23.4350999 C190.464804,24.7518 191.530704,25.8804 192.095004,27.3225 C192.596604,28.7019001 193.098204,30.0813001 193.349004,31.5861001 C193.474404,32.5266002 193.787904,33.4671002 194.226804,34.3449002 C195.543504,36.9783003 196.170504,39.7371003 195.982404,42.7467004 C195.919704,44.0007004 195.919704,45.2547004 195.857004,46.5087005 C195.606204,49.9572005 194.289504,53.0295006 192.659304,55.9764007 C192.596604,56.0391007 192.533904,56.1018007 192.533904,56.1645007 C191.718804,58.4844007 189.775104,59.5503008 187.768704,60.5535008 C186.640104,61.1805008 185.386104,61.7448008 184.194804,62.3718008 C183.442404,62.8107008 182.627304,63.3123008 181.749504,63.2496008 C180.809004,63.2496008 179.931204,62.8734008 179.053404,62.5599008 C178.802604,62.4972008 178.489104,62.2464008 178.238304,62.2464008 C176.733504,62.3718008 175.730304,61.4313008 174.915204,60.4908008 L174.852504,60.4908008 L173.912004,59.9265008 C173.723904,59.7384008 173.723904,59.5503008 174.037404,59.4249008 C174.225504,59.3622008 174.539004,59.4249008 174.539004,59.1741007 C174.539004,58.9233007 174.288204,58.8606007 174.100104,58.8606007 C173.410404,58.7352007 173.034204,58.4217007 172.846104,57.7320007 C172.658004,57.0423007 172.281804,56.3526007 171.905604,55.7256007 C171.027804,54.3462006 170.777004,52.8414006 171.027804,51.2739006 C171.278604,49.8318005 171.592104,48.4524005 172.595304,47.1984005 C173.912004,45.6309004 175.228704,44.0007004 175.667604,41.8689004 C176.357304,41.0538003 176.608104,39.9252003 177.423204,39.1101003 C178.301004,38.2323003 179.116104,37.7934003 180.370104,38.0442003 L180.307404,38.0442003 C179.805804,38.6085003 179.555004,39.2982003 179.241504,39.9879003 C178.238304,41.9943004 177.423204,44.1888004 175.981104,46.0698005 C175.103304,47.2611005 174.601704,48.8286005 173.974704,50.2707005 C173.723904,50.7723006 173.661204,51.3366006 174.037404,51.7755006 C174.664404,52.4025006 174.664404,53.2803006 174.852504,54.0327006 C175.166004,55.2240007 175.479504,56.3526007 176.545404,57.0423007 C177.548604,57.7320007 178.363704,57.7320007 179.053404,56.7915007 C179.743104,55.7883007 180.683604,55.0359007 181.498704,54.1581006 C182.188404,53.4684006 182.815404,52.7787006 183.191604,51.8382006 C184.382904,49.0167005 185.762304,46.2579005 186.389304,43.2483004 C187.141704,39.6744003 186.890904,36.1632002 185.323404,32.7774002 C185.198004,32.5266002 185.009904,32.2131001 184.696404,32.2758001 C184.508304,32.2758001 184.320204,32.4639001 184.194804,32.6520002 C183.881304,33.1536002 183.630504,33.6552002 183.317004,34.2195002 C183.066204,33.4671002 182.815404,30.8964001 182.815404,30.4575001 C182.878104,29.8932001 183.317004,29.5170001 183.567804,29.0781001 C183.944004,28.3884001 184.069404,27.6987 183.693204,26.9463 C183.567804,26.6955 183.567804,26.382 183.379704,26.1312 C182.251104,23.6859 181.624104,21.0524999 180.934404,18.4817998 C180.244704,15.7856998 180.244704,13.0268997 180.809004,10.3307997 C181.059804,9.32759963 181.247904,8.38709961 181.498704,7.44659959 C182.063004,5.06399954 183.317004,3.05759949 185.323404,1.61549946 C185.636904,1.36469946 185.950404,1.11389945 186.263904,1.05119945 C188.019504,0.549599437 189.837804,0.173399429 191.530704,0.549599437 C192.784704,0.863099444 194.038704,0.863099444 195.230004,1.17659945 C196.546704,1.49009946 197.612604,1.86629947 198.302304,3.12029949 C198.427704,3.4337995 198.803904,3.68459951 198.992004,3.93539951 Z M175.479504,60.4908008 C175.667604,60.4908008 175.855704,60.4281008 175.730304,60.1146008 L175.416804,60.1146008 C175.228704,60.2400008 175.103304,60.3654008 174.915204,60.4281008 C175.103304,60.4908008 175.228704,60.4908008 175.479504,60.4908008 Z" id="path-2"></path>
    </defs>
    <g id="Artboard" stroke="none" stroke-width="1" fill="none" fill-rule="evenodd">
        <g id="mentor-express">
            <g id="Oval">
                <g id="path-1-link" fill="#000000" fill-rule="nonzero">
                    <circle id="path-1" cx="163.4" cy="163.4" r="163.4"></circle>
                </g>
                <g id="path-1-link" fill="#2999D5">
                    <circle id="path-1" cx="163.4" cy="163.4" r="163.4"></circle>
                </g>
            </g>
            <circle id="Oval" stroke="#FFFFFF" stroke-width="8.265" cx="164.5875" cy="163.6375" r="144.6375"></circle>
            <g id="Group-3" transform="translate(63.550000, 117.850000)" fill-rule="nonzero">
                <g id="MENTOR" transform="translate(15.000000, 0.000000)">
                    <g>
                        <use fill="#000000" xlink:href="#path-1"></use>
                        <use fill="#FFFFFF" xlink:href="#path-1"></use>
                    </g>
                </g>
                <g id="express" transform="translate(0.000000, 39.000000)" fill="#000000">
                    <g>
                        <use xlink:href="#path-2"></use>
                        <use xlink:href="#path-2"></use>
                    </g>
                </g>
            </g>
        </g>
    </g>
</svg>