<?xml version="1.0" encoding="UTF-8"?>
<svg width="300px" height="300px" viewBox="0 0 300 300" version="1.1" xmlns="http://www.w3.org/2000/svg" xmlns:xlink="http://www.w3.org/1999/xlink">
    <!-- Generator: Sketch 59.1 (86144) - https://sketch.com -->
    <title>environnement/monoprix</title>
    <desc>Created with Sketch.</desc>
    <defs>
        <polygon id="path-1" points="0.0734399997 0.720935997 32.2462799 0.720935997 32.2462799 29.8876319 0.0734399997 29.8876319"></polygon>
    </defs>
    <g id="environnement/monoprix" stroke="none" stroke-width="1" fill="none" fill-rule="evenodd">
        <g id="Logo-Monoprix" transform="translate(39.000000, 134.000000)">
            <g id="Group-3" transform="translate(0.000000, 0.459000)">
                <g id="Fill-1-Clipped">
                    <mask id="mask-2" fill="white">
                        <use xlink:href="#path-1"></use>
                    </mask>
                    <g id="path-1"></g>
                    <path d="M27.4506479,0.720935997 L17.6916959,23.0858639 L6.82135197,0.720935997 L0,0.720935997 L0.00489599998,1.99634399 C1.43819999,1.99634399 3.14445599,2.49940799 3.14445599,4.67323198 L3.14445599,29.8802879 L5.64875998,29.8802879 L5.64875998,8.23629597 L16.1641439,29.8876319 L17.4248639,29.8876319 L27.8949599,5.97311998 L27.8949599,29.8802879 L32.2462799,29.8802879 L32.2352639,0.720935997 L27.4506479,0.720935997" id="Fill-1" fill="#D8232A" fill-rule="nonzero" mask="url(#mask-2)"></path>
                </g>
            </g>
            <path d="M94.2871676,1.17259201 L94.2724796,22.3355519 L76.1621757,1.17993601 L69.5586957,1.17993601 L69.5586957,2.455344 C70.9883277,2.455344 72.6958077,2.958408 72.6958077,5.13223199 L72.6958077,30.3392879 L75.1939917,30.3392879 L75.1939917,6.74179199 L96.0007676,31.0589999 L96.7877996,31.0589999 L96.7804556,1.17993601 L94.2871676,1.17259201" id="Fill-4" fill="#D8232A" fill-rule="nonzero"></path>
            <path d="M52.4177998,29.3307119 C46.5609598,29.3307119 41.8179598,24.7456079 41.8179598,15.762672 C41.8179598,6.78463199 46.5609598,2.205648 52.4177998,2.205648 C58.2697438,2.205648 63.0139678,6.77973599 63.0139678,15.762672 C63.0139678,24.7456079 58.2697438,29.3307119 52.4177998,29.3307119 M52.4692078,0.41738401 C43.9942318,0.41738401 37.1251439,7.27423198 37.1251439,15.73452 C37.1251439,24.1984799 43.9942318,31.0589999 52.4692078,31.0589999 C60.9454078,31.0589999 67.8157197,24.1984799 67.8157197,15.73452 C67.8157197,7.27423198 60.9454078,0.41738401 52.4692078,0.41738401" id="Fill-5" fill="#D8232A" fill-rule="nonzero"></path>
            <path d="M116.780616,29.3307119 C110.920104,29.3307119 106.173432,24.7456079 106.173432,15.762672 C106.173432,6.78463199 110.920104,2.205648 116.780616,2.205648 C122.633784,2.205648 127.384128,6.77973599 127.384128,15.762672 C127.384128,24.7456079 122.633784,29.3307119 116.780616,29.3307119 M116.8308,0.41738401 C108.357048,0.41738401 101.483064,7.27423198 101.483064,15.73452 C101.483064,24.1984799 108.357048,31.0589999 116.8308,31.0589999 C125.308224,31.0589999 132.179759,24.1984799 132.179759,15.73452 C132.179759,7.27423198 125.308224,0.41738401 116.8308,0.41738401" id="Fill-6" fill="#D8232A" fill-rule="nonzero"></path>
            <path d="M144.244727,15.8508 C143.248391,15.8508 142.298567,15.717384 141.420959,15.504408 L141.430751,4.75523999 C141.430751,3.432096 141.256943,3.242376 141.047639,2.940048 L144.244727,2.940048 C147.944879,2.940048 150.949799,4.80664799 150.949799,9.30362398 C150.949799,14.251032 147.902039,15.8508 144.244727,15.8508 M146.110103,1.17993601 L133.926407,1.17993601 L133.921511,2.455344 C135.352367,2.455344 137.064743,2.96208 137.064743,5.13223199 L137.064743,30.3392879 L141.414839,30.3392879 L141.409943,17.2975679 C143.458919,17.6341679 144.966887,17.6929199 146.226383,17.6317199 C151.115039,17.3942639 155.556935,14.382 155.556935,9.36727198 C155.556935,4.193424 151.199495,1.17993601 146.110103,1.17993601" id="Fill-7" fill="#D8232A" fill-rule="nonzero"></path>
            <path d="M168.025823,15.052752 C167.024591,15.052752 165.941351,14.991552 165.143303,14.885064 L165.143303,4.63651199 C165.143303,3.313368 164.893607,3.126096 164.758967,2.93148 L168.025823,2.93148 C171.722303,2.93148 174.725999,4.35866399 174.725999,8.95600798 C174.725999,13.444416 171.679463,15.052752 168.025823,15.052752 M172.896119,16.02216 C176.068727,15.139656 179.327015,12.822624 179.327015,8.90827198 C179.327015,3.81276 175.104215,1.17504001 169.885079,1.17504001 L157.672007,1.17504001 L157.675679,2.452896 C159.105311,2.452896 160.816463,2.952288 160.816463,5.13223199 L160.816463,30.3392879 L165.138407,30.3392879 L165.157991,16.6941359 C165.741839,16.7296319 166.408919,16.7700239 166.958495,16.7932799 C168.203303,16.8863039 170.334287,16.6427279 172.672127,20.7333359 C173.577887,22.3135199 177.686855,29.7077039 178.052831,30.3441839 L183.158135,30.3441839 C183.158135,30.3441839 178.651367,22.4163359 177.691751,20.8202399 C176.544863,18.9046799 175.095647,16.8251039 172.896119,16.02216" id="Fill-8" fill="#D8232A" fill-rule="nonzero"></path>
            <path d="M184.875407,2.455344 C186.305039,2.455344 188.018639,2.958408 188.018639,5.13223199 L188.018639,30.3392879 L192.363839,30.3392879 L192.372407,1.17993601 L184.875407,1.17993601 L184.875407,2.455344" id="Fill-9" fill="#D8232A" fill-rule="nonzero"></path>
            <path d="M212.073911,14.62068 L222.077663,1.17993601 L218.966255,1.17993601 L210.591647,12.440736 L202.860863,1.17993601 L196.541351,1.17993601 L196.536455,2.455344 C197.518103,2.455344 198.579311,2.629152 199.239047,3.548376 L207.852335,16.128648 L197.297783,30.3515279 L200.414087,30.3515279 L209.337047,18.3134879 L217.553759,30.3515279 L222.863471,30.3515279 L212.073911,14.62068" id="Fill-10" fill="#D8232A" fill-rule="nonzero"></path>
        </g>
    </g>
</svg>