<svg xmlns="http://www.w3.org/2000/svg" width="70" height="60" fill="none" viewBox="0 0 70 60">
  <path fill="#FA2863" d="M6.474 10l57.548 5.858L69 51.043 1 56l5.474-46z"/>
  <path fill="#FA2863" stroke="#fff" stroke-width=".8" d="M5.345 52.75l4.966-38.562 49.817 4.584 4.526 29.733-59.31 4.245z"/>
  <g clip-path="url(#clip0)">
    <path fill="#FA2863" d="M52.626 22.784a8.361 8.361 0 01-5.038 1.687A8.412 8.412 0 1156 16.059a8.361 8.361 0 01-1.687 5.038L56 24.47l-3.374-1.687z"/>
    <path fill="#2854C3" d="M33.685 18.555a8.02 8.02 0 004.832 1.618 8.069 8.069 0 10-8.069-8.069 8.02 8.02 0 001.618 4.832l-1.618 3.237 3.237-1.618z"/>
    <path fill="#fff" d="M30.047 18.18a.448.448 0 00.602.601l2.993-1.496a8.432 8.432 0 004.875 1.543c.35 0 .692-.027 1.03-.068a8.508 8.508 0 007.936 5.447 8.431 8.431 0 004.875-1.543l2.993 1.496a.446.446 0 00.517-.084.448.448 0 00.085-.517l-1.497-2.993A8.431 8.431 0 0056 15.69c0-4.696-3.82-8.517-8.517-8.517h-1.055c-1.253-3.146-4.323-5.38-7.91-5.38C33.82 1.795 30 5.616 30 10.312c0 1.755.533 3.435 1.544 4.876l-1.497 2.993zM47.483 8.07c4.202 0 7.62 3.418 7.62 7.62 0 1.654-.528 3.231-1.528 4.564a.449.449 0 00-.042.47l1.017 2.033-2.034-1.017a.45.45 0 00-.47.043 7.553 7.553 0 01-4.563 1.528 7.613 7.613 0 01-7.037-4.711c3.77-.878 6.588-4.257 6.588-8.289 0-.777-.113-1.526-.309-2.241h.758zM30.897 10.31c0-4.202 3.418-7.62 7.62-7.62s7.62 3.418 7.62 7.62-3.418 7.62-7.62 7.62a7.551 7.551 0 01-4.563-1.527.447.447 0 00-.47-.043l-2.034 1.017 1.017-2.034a.448.448 0 00-.042-.47 7.552 7.552 0 01-1.528-4.563z"/>
    <path fill="#fff" d="M34.931 11.655c.742 0 1.345-.603 1.345-1.344 0-.742-.603-1.345-1.345-1.345-.741 0-1.345.603-1.345 1.345 0 .741.604 1.344 1.345 1.344zm0-1.793a.448.448 0 110 .897.448.448 0 010-.897zM38.517 11.655c.742 0 1.345-.603 1.345-1.344 0-.742-.603-1.345-1.345-1.345-.741 0-1.345.603-1.345 1.345 0 .741.604 1.344 1.345 1.344zm0-1.793a.448.448 0 110 .897.448.448 0 010-.897zM42.104 11.655c.741 0 1.344-.603 1.344-1.344 0-.742-.603-1.345-1.344-1.345-.742 0-1.345.603-1.345 1.345 0 .741.603 1.344 1.345 1.344zm0-1.793a.448.448 0 110 .897.448.448 0 010-.897zM46.138 15.69c0 .742.604 1.345 1.345 1.345s1.345-.603 1.345-1.345c0-.74-.604-1.344-1.345-1.344s-1.345.603-1.345 1.345zm1.345-.448a.449.449 0 110 .897.449.449 0 010-.897zM51.069 17.035c.741 0 1.345-.603 1.345-1.345 0-.74-.604-1.344-1.345-1.344-.742 0-1.345.603-1.345 1.345 0 .741.604 1.344 1.345 1.344zm0-1.793a.448.448 0 110 .897.448.448 0 010-.897z"/>
    <path fill="#FA2863" d="M43.99 20.295l3.672 1.314-1.552 1.833a1 1 0 00-.236.661l.036 2.402-3.672-1.314 1.552-1.833a1 1 0 00.236-.662l-.036-2.401z"/>
  </g>
  <path fill="#fff" d="M25.542 39.502V46h3.114v-.972h-1.998V43.12h1.44v-.972h-1.44v-1.674h1.872v-.972h-2.988zm3.999 0V46h1.008v-4.059h.018L31.989 46h.972v-6.498h-1.008v3.717h-.018l-1.359-3.717h-1.035zm6.039-.09c-1.089 0-1.719.585-1.719 1.62 0 .909.486 1.449 1.476 2.25.513.414.792.801.792 1.242 0 .387-.261.594-.639.594-.369 0-.63-.315-.675-.981l-1.062.153c.054 1.089.738 1.8 1.674 1.8 1.08 0 1.764-.621 1.764-1.665 0-.576-.171-1.188-1.476-2.241-.531-.432-.792-.774-.792-1.17 0-.396.198-.63.558-.63.315 0 .558.243.594.72l1.062-.117c-.117-.99-.684-1.575-1.557-1.575zm2.46.09V46h3.114v-.972h-1.998V43.12h1.44v-.972h-1.44v-1.674h1.872v-.972H38.04zm3.936 0V46h.972v-5.076h.018L43.974 46h.54l1.008-5.076h.018V46h.972v-6.498h-1.467l-.792 3.798h-.018l-.792-3.798h-1.467zm5.565 0V46h1.8c1.062 0 1.71-.648 1.71-1.881 0-.756-.27-1.26-.9-1.539.486-.18.774-.72.774-1.359 0-1.125-.567-1.719-1.683-1.719h-1.701zm1.116.918h.396c.585 0 .756.378.756.909 0 .522-.288.837-.747.837h-.405V40.42zm0 2.664h.36c.684 0 .918.351.918.999 0 .585-.18.999-.774.999h-.504v-1.998zm3.33-3.582V46h2.871v-.972h-1.755v-5.526h-1.116zm3.552 0V46h3.114v-.972h-1.998V43.12h1.44v-.972h-1.44v-1.674h1.872v-.972h-2.988zM17.08 19.412c-1.089 0-1.719.585-1.719 1.62 0 .909.486 1.449 1.476 2.25.513.414.792.801.792 1.242 0 .387-.261.594-.639.594-.369 0-.63-.315-.675-.981l-1.062.153c.054 1.089.738 1.8 1.674 1.8 1.08 0 1.764-.621 1.764-1.665 0-.576-.171-1.188-1.476-2.241-.531-.432-.792-.774-.792-1.17 0-.396.198-.63.558-.63.315 0 .558.243.594.72l1.062-.117c-.117-.99-.684-1.575-1.557-1.575zm2.46.09V26h3.114v-.972h-1.998V23.12h1.44v-.972h-1.44v-1.674h1.872v-.972H19.54z"/>
  <path fill="#2854C3" d="M1.5 29h67l-.5 7H1l.5-7z"/>
  <path fill="#fff" d="M7.51 29.87c-.57 0-1.083.636-1.368 1.624l.133-1.434H4.09L3.653 35h2.185l.219-2.47c.038-.504.399-.836.874-.836.247 0 .598.085.893.219l.161-1.929a1.121 1.121 0 00-.475-.114zm2.904 2.185c.114-.409.323-.665.656-.665.351 0 .57.332.541.665h-1.197zm1.188 1.235c-.095.218-.285.38-.608.38-.361 0-.56-.209-.637-.57h3.325c.02-.086.057-.39.076-.541.133-1.615-.836-2.689-2.517-2.689-1.682 0-2.945 1.064-3.088 2.66-.142 1.596.903 2.66 2.565 2.66 1.35 0 2.49-.703 2.765-1.662l-1.881-.238zm8.306-1.302c-.028-1.225-1.102-2.118-2.498-2.118-1.634 0-2.926 1.121-3.06 2.66-.132 1.539.98 2.66 2.594 2.66 1.397 0 2.622-.902 2.87-2.137l-1.977-.238c-.095.333-.39.57-.703.57-.39 0-.646-.361-.598-.855.038-.494.36-.855.75-.855.314 0 .57.238.599.57l2.023-.256zm6.182.542c.143-1.596-.902-2.66-2.613-2.66-1.71 0-2.945 1.064-3.087 2.66-.143 1.596.912 2.66 2.622 2.66s2.936-1.064 3.078-2.66zm-2.185 0c-.038.456-.332.76-.732.76-.398 0-.636-.304-.598-.76.038-.456.332-.76.732-.76.399 0 .636.304.598.76zm5.635-.76c.257 0 .409.228.38.57L29.682 35h2.186l.285-3.23c.095-1.102-.476-1.9-1.35-1.9-.76 0-1.367.617-1.662 1.558l.124-1.368h-2.186L26.642 35h2.186l.237-2.66c.028-.342.218-.57.475-.57zm5.373 3.467c1.596 0 2.727-.807 2.831-1.956.105-1.207-1.235-1.406-2.337-1.502-.123-.009-.665-.056-.646-.332.02-.171.228-.294.513-.294.342 0 .59.17.57.418h1.815c.085-1.017-.874-1.748-2.28-1.748-1.368 0-2.442.779-2.537 1.852-.104 1.254.855 1.482 1.872 1.53.76.038.93.151.912.36-.02.2-.257.343-.551.343-.418 0-.694-.21-.665-.504h-1.72c-.095 1.064.836 1.833 2.223 1.833zm6.237-1.206c-.019.19-.152.323-.313.323-.162 0-.267-.133-.248-.323l.2-2.356h.95l.143-1.615h-.95l.123-1.33h-1.9l-.313 1.33h-.666l-.142 1.615h.57l-.18 2.09c-.077.855.532 1.425 1.596 1.425.816 0 1.453-.484 1.51-1.15l.066-.779h-.38l-.066.77zm4.991-4.161c-.57 0-1.083.636-1.368 1.624l.133-1.434h-2.185L42.284 35h2.185l.219-2.47c.038-.504.399-.836.874-.836.247 0 .598.085.893.219l.161-1.929a1.121 1.121 0 00-.475-.114zm3.294 3.42c-.257 0-.409-.228-.38-.57l.228-2.66h-2.185l-.276 3.23c-.095 1.102.475 1.9 1.34 1.9.77 0 1.377-.617 1.672-1.558L49.71 35h2.185l.428-4.94h-2.185l-.228 2.66c-.029.342-.219.57-.475.57zm6.019-3.23h-2.185L52.842 35h2.184l.428-4.94zm-2.147-1.52c-.057.665.408 1.14 1.093 1.14.693 0 1.225-.475 1.282-1.14.057-.665-.39-1.14-1.083-1.14-.684 0-1.235.475-1.292 1.14zm6.74 1.33c-.57 0-1.082.636-1.367 1.624l.133-1.434h-2.185L56.19 35h2.185l.218-2.47c.038-.504.4-.836.874-.836.247 0 .599.085.893.219l.162-1.929a1.121 1.121 0 00-.475-.114zm2.905 2.185c.114-.409.323-.665.656-.665.351 0 .57.332.541.665h-1.197zm1.188 1.235c-.096.218-.285.38-.608.38-.361 0-.561-.209-.637-.57h3.325c.019-.086.057-.39.076-.541.133-1.615-.836-2.689-2.518-2.689-1.681 0-2.944 1.064-3.087 2.66-.143 1.596.902 2.66 2.565 2.66 1.349 0 2.489-.703 2.764-1.662l-1.88-.238z"/>
  <path fill="#FA2863" d="M15 13h4l-.678 1.355a1 1 0 00.188 1.155L19 16h-4l.63-.945a1 1 0 000-1.11L15 13zM44.789 48.4l3.984-.35-.484.983a1 1 0 00.142 1.096l.78.902-3.984.35.484-.983a1 1 0 00-.142-1.096l-.78-.902z"/>
  <defs>
    <clipPath id="clip0">
      <path fill="#fff" d="M0 0h26v26H0z" transform="translate(30)"/>
    </clipPath>
  </defs>
</svg>
