<?xml version="1.0" encoding="UTF-8"?>
<svg width="300px" height="300px" viewBox="0 0 300 300" version="1.1" xmlns="http://www.w3.org/2000/svg" xmlns:xlink="http://www.w3.org/1999/xlink">
    <!-- Generator: Sketch 55.2 (78181) - https://sketchapp.com -->
    <title>medias/L'obs</title>
    <desc>Created with Sketch.</desc>
    <g id="medias/L'obs" stroke="none" stroke-width="1" fill="none" fill-rule="evenodd">
        <rect fill="#FFFFFF" x="0" y="0" width="300" height="300"></rect>
        <g id="Obs_logo" transform="translate(42.000000, 117.000000)" fill="#000000" fill-rule="nonzero">
            <path d="M211.6125,11.5405714 C211.6125,4.78971429 203.925,1.13142857 194.7375,1.13142857 C183.2625,1.13142857 172.2375,6.93942857 172.2375,17.4617143 C172.2375,35.4514286 208.125,33.528 208.125,49.8582857 C208.125,58.1554286 200.4,63.9634286 191.0625,63.9634286 C188.5125,63.9634286 185.2875,63.7371429 182.025,62.1908571 C182.925,60.3428571 183.7125,57.8914286 183.7125,56.1188571 C183.7125,52.1588571 181.5,48.9154286 177.3,48.9154286 C175.0875,48.9154286 172.6125,50.6502857 172.6125,54.0068571 C172.6125,60.6445714 180.7125,65.0948571 191.1,65.0948571 C203.2875,65.0948571 215.775,59.4754286 215.775,46.464 C215.775,26.3622857 180.525,27.8331429 180.525,14.4445714 C180.525,6.6 188.625,2.45142857 194.775,2.45142857 C198.825,2.45142857 200.3625,2.904 202.5375,3.73371429 C201.6375,5.58171429 201.2625,7.50514286 201.2625,9.35314286 C201.2625,13.2377143 203.2875,16.4434286 207.3375,16.4434286 C209.5125,16.4057143 211.6125,14.7462857 211.6125,11.5405714 Z M150.8625,32.0571429 C159.825,31.2651429 168.6,26.3622857 168.6,17.8011429 C168.6,6.03428571 158.0625,1.848 145.275,1.848 L117.15,1.848 L117.15,2.112 C121.3875,3.88457143 124.7625,3.84685714 124.6125,13.2754286 L124.6125,52.8 C124.65,62.7942857 121.425,62.1531429 117.15,63.9257143 L117.15,64.2274286 L147.1125,64.2274286 C161.475,64.2274286 170.775,59.7771429 170.775,47.8217143 C170.775,37.2994286 159.7875,32.3965714 150.8625,32.0571429 Z M144.3,31.7554286 L134.2125,31.7554286 L134.2125,3.432 L144.3,3.432 C153.4125,3.432 159.7875,8.78742857 159.7875,17.7634286 C159.7875,26.7771429 153.4125,31.7554286 144.3,31.7554286 L144.3,31.7554286 Z M161.7375,47.8217143 C161.7375,57.4388571 156,62.9828571 145.8,62.9828571 L134.2125,62.9828571 L134.2125,33.3771429 L145.8,33.3771429 C156,33.3771429 161.7375,38.1668571 161.7375,47.8217143 Z M119.475,33.4902857 C119.475,13.464 104.0625,1.42108547e-14 86.4,1.42108547e-14 C68.775,1.42108547e-14 53.325,13.464 53.325,33.4902857 C53.325,53.5165714 68.7375,65.8868571 86.4,65.8868571 C104.0625,65.8868571 119.475,53.5165714 119.475,33.4902857 Z M108.2625,33.4902857 C108.2625,51.7817143 102.2625,64.4914286 86.4375,64.68 C68.6625,64.9062857 64.6125,51.7817143 64.6125,33.4902857 C64.6125,15.1988571 70.65,1.20685714 86.4375,1.20685714 C102.6375,1.20685714 108.2625,15.1988571 108.2625,33.4902857 Z M47.025,64.1897143 L51.8625,43.7485714 L50.925,43.7485714 C46.2375,53.1771429 39.225,62.568 29.325,62.568 L16.3125,62.568 L16.3125,13.2377143 C16.3125,7.35428571 17.925,4.07314286 22.1625,2.30057143 L22.1625,1.848 L-2.13162821e-14,1.848 L-2.13162821e-14,2.18742857 C4.2375,3.96 6.975,7.392 6.975,13.2377143 L6.975,52.8 C6.975,58.6834286 4.5375,62.0022857 0.3,63.7748571 L0.3,64.1897143 L47.025,64.1897143 Z M47.475,9.61714286 C47.475,4.90285714 45.2625,1.848 41.325,1.848 C38.0625,1.848 35.4375,4.60114286 35.4375,8.03314286 C35.4375,10.4091429 36.6,12.1062857 38.0625,13.1622857 C40.6875,15.0102857 41.85,17.3862857 41.85,19.6114286 C41.85,21.9874286 38.475,25.608 37.5,26.4 C36.45,27.2297143 34.7625,28.1348571 33.45,28.6628571 L35.55,28.6628571 C41.5875,27.3805714 47.475,15.5382857 47.475,9.61714286 Z" id="Shape"></path>
        </g>
    </g>
</svg>