<?xml version="1.0" encoding="utf-8"?>
<!-- Generator: Adobe Illustrator 20.0.0, SVG Export Plug-In . SVG Version: 6.00 Build 0)  -->
<svg version="1.1" id="Calque_1" xmlns="http://www.w3.org/2000/svg" xmlns:xlink="http://www.w3.org/1999/xlink" x="0px" y="0px"
	 viewBox="0 0 841.9 928.1" style="enable-background:new 0 0 841.9 928.1;" xml:space="preserve">
<style type="text/css">
	.st0{fill:#191617;}
	.st1{fill:#D92B00;}
</style>
<g>
	<path class="st0" d="M15.6,514.2l7.1-1.8c5.7-1.4,6.7-2.6,6.7-11.2V392.1c0-8.9-1-9.8-6.5-12.4l-8.3-3.9v-6.5l40.6-3.7l2.6,2
		c0,0-1.6,9.8-1.6,23.4v110.1c0,8.9,1,9.8,6.5,11.2l7.1,1.8v7.1H15.6V514.2z"/>
	<path class="st1" d="M99.5,462.2c0-54.7,41.6-93.4,82.6-93.4c33.1,0,59.5,22.8,59.5,61.4c0,54.9-40.6,92.7-81.8,92.7
		C126.7,523,99.5,500,99.5,462.2z M210,420.1c0-23.4-6.7-40.4-28.5-40.4c-32,0-50.2,48.7-50.2,91.6c0,23.6,6.7,40.4,29.6,40.4
		C192,511.8,210,464.8,210,420.1z"/>
	<path class="st0" d="M243.6,557.8l6.5-1.8c5.5-1.4,6.5-2.6,6.5-11.2V438.6c0-8.5-1-9.1-6.3-12.4l-7.1-4.3v-3.5l38.2-4.7l1.8,1.2
		l-0.2,12h0.8c8.7-7.1,20.3-13.2,34.3-13.2c19.1,0,39.8,12.2,39.8,49.8c0,40.8-24,60.1-58.1,60.1c-4.9,0-11.4-0.8-16.2-2.2
		c0,0,0.2,5.5,0.2,12.6v10.8c0,8.9,0.8,10,6.3,11.2l8.7,1.8v4.7h-55.2V557.8z M329.8,469.5c0-29-9.8-40.4-27-40.4
		c-9.3,0-15,3-18.9,4.7v75.2c4.5,4.5,9.7,7.3,17.5,7.3C320.2,516.2,329.8,505.8,329.8,469.5z"/>
	<path class="st0" d="M363.2,516.6l6.5-1.6c5.5-1.6,6.5-2.8,6.5-11.2v-65.2c0-8.5-1-9.1-6.3-12.4l-7.1-4.3v-3.5l39.6-4.7l1.8,1.2
		c-0.2,3.7-0.8,11.6-0.8,21.5v67.2c0,8.7,1,9.8,6.5,11.2l6.5,1.6v4.7h-53.2V516.6z"/>
	<path class="st0" d="M421.7,516.6l6.5-1.6c5.5-1.6,6.5-2.8,6.5-11.2v-65.2c0-8.5-1-9.1-6.3-12.4l-7.1-4.3v-3.5l38.2-4.7l1.8,1.2
		l-0.4,12.6h1c10.4-7.3,24.2-13.8,38.2-13.8c18.5,0,26.8,8.7,26.8,27v63c0,8.5,1.2,9.8,6.5,11.2l6.5,1.6v4.7h-52.6v-4.7l6.3-1.6
		c5.3-1.4,6.1-2,6.1-11.2v-56.5c0-13-4.7-17.3-15.4-17.3c-8.3,0-17.3,2.4-22.3,3.7v70.1c0,9.1,0.8,9.8,6.1,11.2l6.3,1.6v4.7h-52.6
		V516.6z"/>
	<path class="st0" d="M545.2,516.6l6.5-1.6c5.5-1.6,6.5-2.8,6.5-11.2v-65.2c0-8.5-1-9.1-6.3-12.4l-7.1-4.3v-3.5l39.6-4.7l1.8,1.2
		c-0.2,3.7-0.8,11.6-0.8,21.5v67.2c0,8.7,1,9.8,6.5,11.2l6.5,1.6v4.7h-53.2V516.6z"/>
	<path class="st0" d="M600.2,469.1c0-37.6,26.2-55.5,53-55.5c29,0,53.2,17.7,53.2,54.2c0,37.6-26,56.1-53.2,56.1
		C624.2,523.9,600.2,505.6,600.2,469.1z M677.4,470.3c0-39-8.5-49.4-24.8-49.4c-15,0-23.4,11.2-23.4,44.9c0,39.4,7.9,50.8,24.8,50.8
		C668.7,516.6,677.4,506.4,677.4,470.3z"/>
	<path class="st0" d="M709.1,516.6l6.5-1.6c5.5-1.6,6.5-2.8,6.5-11.2v-65.2c0-8.5-1-9.1-6.3-12.4l-7.1-4.3v-3.5l38.2-4.7l1.8,1.2
		l-0.4,12.6h1c10.4-7.3,24.2-13.8,38.2-13.8c18.5,0,26.8,8.7,26.8,27v63c0,8.5,1.2,9.8,6.5,11.2l6.5,1.6v4.7h-52.6v-4.7l6.3-1.6
		c5.3-1.4,6.1-2,6.1-11.2v-56.5c0-13-4.7-17.3-15.4-17.3c-8.3,0-17.3,2.4-22.3,3.7v70.1c0,9.1,0.8,9.8,6.1,11.2l6.3,1.6v4.7h-52.6
		V516.6z"/>
	<path class="st1" d="M587.1,380.6c0-8.3-6.7-15.1-15.1-15.1c-8.3,0-15.1,6.7-15.1,15.1c0,8.3,6.7,15.1,15.1,15.1
		c0.9,0,1.8-0.1,2.7-0.3c-2.6,4.1-7.1,8-14.4,11.3l1.4,2.8c12.6-4.4,22.9-14,25-24.4C587,383.3,587.1,382.2,587.1,380.6z"/>
	<path class="st1" d="M405.1,381.1c0-8.3-6.7-15.1-15.1-15.1c-8.3,0-15.1,6.7-15.1,15.1c0,8.3,6.7,15.1,15.1,15.1
		c0.9,0,1.8-0.1,2.7-0.3c-2.6,4.1-7.1,8-14.4,11.3l1.4,2.8c12.6-4.4,22.9-14,25-24.4C405,383.7,405.1,382.6,405.1,381.1z"/>
	<path class="st1" d="M110,388.1c0-11.7-9.5-21.2-21.2-21.2c-11.7,0-21.2,9.5-21.2,21.2c0,11.7,9.5,21.2,21.2,21.2
		c1.3,0,2.5-0.1,3.8-0.4c-3.6,5.8-10,11.3-20.2,15.8l1.9,4c17.6-6.1,32.1-19.7,35.1-34.3C109.8,391.9,110,390.3,110,388.1z"/>
</g>
</svg>
