<?xml version="1.0" encoding="UTF-8"?>
<svg width="300px" height="300px" viewBox="0 0 300 300" version="1.1" xmlns="http://www.w3.org/2000/svg" xmlns:xlink="http://www.w3.org/1999/xlink">
    <!-- Generator: Sketch 59.1 (86144) - https://sketch.com -->
    <title>environnement/Oree</title>
    <desc>Created with Sketch.</desc>
    <g id="environnement/Oree" stroke="none" stroke-width="1" fill="none" fill-rule="evenodd">
        <g id="LOG_OREE_QUADRI_sans_baseline" transform="translate(41.000000, 110.000000)">
            <path d="M73.3279956,31.4639981 L73.3279956,23.9519986 L68.7359959,23.9519986 L68.7359959,78.8639953 L73.3279956,78.8639953 L73.3279956,49.2239971 C73.3279956,42.7039975 73.8559956,36.3759978 80.1199952,30.6799982 C83.3227205,28.3090946 87.2243196,27.0733068 91.2079946,27.1679984 L92.0719945,27.1679984 L92.0719945,22.6399987 L91.1199946,22.6959986 C86.9199948,22.9759986 78.5999953,23.5439986 73.3279956,31.4959981" id="Path" fill="#9DC556" fill-rule="nonzero"></path>
            <line x1="94.3119944" y1="51.4319969" x2="94.3119944" y2="51.5359969" id="Path" stroke="#9DC556" stroke-width="0.799999952" stroke-linecap="round" stroke-linejoin="round"></line>
            <polygon id="Path" fill="#9DC556" fill-rule="nonzero" points="137.239992 3.83999977 134.911992 0 109.631993 14.7199991 111.815993 18.5839989"></polygon>
            <path d="M142.879991,30.0719982 C137.49172,25.2517298 130.50149,22.610786 123.271993,22.6639986 C106.791994,22.6639986 94.3439944,35.0479979 94.3199944,51.4639969 L94.3199944,51.4639969 C94.3199944,67.823996 106.751994,80.1679952 123.175993,80.1679952 C135.175992,80.2799952 145.143991,73.8559956 149.855991,62.9919962 L150.399991,61.7359963 L145.327991,61.7359963 L145.079991,62.2559963 C141.135992,70.7199958 132.967992,75.7679955 123.239993,75.7679955 C113.511993,75.7679955 99.7279941,68.7119959 99.0399941,52.5679969 L151.839991,52.5679969 L151.991991,50.167997 L151.991991,50.119997 C151.647991,42.0559975 148.487991,35.1039979 142.839991,29.9999982 M99.2159941,48.2639971 C100.423994,36.1359978 110.583993,27.1039984 123.271993,27.1039984 L123.311993,27.1039984 C135.007992,26.6319984 146.143991,36.6079978 147.239991,48.2639971 L99.2159941,48.2639971 Z" id="Shape" fill="#9DC556" fill-rule="nonzero"></path>
            <path d="M217.231987,50.239997 L217.231987,50.191997 C216.887987,42.1279975 213.727987,35.1759979 208.079988,30.0719982 C202.692976,25.2558246 195.705809,22.6178125 188.479989,22.6719986 C171.99199,22.6719986 159.54399,35.0559979 159.51999,51.4719969 L159.51999,51.4719969 C159.51999,67.831996 171.95199,80.1759952 188.375989,80.1759952 C200.375988,80.2879952 210.343987,73.8639956 215.055987,62.9999962 L215.599987,61.7439963 L210.559987,61.7439963 L210.319987,62.2639963 C206.367988,70.7279958 198.199988,75.7759955 188.479989,75.7759955 C178.759989,75.7759955 164.95999,68.7199959 164.27199,52.5759969 L217.071987,52.5759969 L217.223987,50.175997 M164.42399,48.1679971 C165.63199,36.0399979 175.79199,27.0079984 188.487989,27.0079984 L188.487989,27.0079984 C200.183988,26.5359984 211.319987,36.5119978 212.415987,48.1679971 L164.42399,48.1679971 Z" id="Shape" fill="#9DC556" fill-rule="nonzero"></path>
            <path d="M33.111998,32.3919981 C33.111998,31.2719981 33.055998,30.1599982 32.975998,29.0639983 C31.8781706,28.9161309 30.7717384,28.8412997 29.6639982,28.8399983 C16.727999,28.8399983 6.96799958,38.5519977 6.96799958,51.4319969 C6.87018162,57.800988 9.4885105,63.910422 14.1679992,68.2319959 C26.0107941,60.1366999 33.0893343,46.7132245 33.079998,32.3679981" id="Path" fill="#E4783B" fill-rule="nonzero"></path>
            <path d="M5.17599969,51.4639969 C5.17599969,37.5679978 15.7039991,27.0799984 29.6639982,27.0799984 C30.7121762,27.0829452 31.7592893,27.1470541 32.799998,27.2719984 C32.6160242,25.7677165 32.3489493,24.2747676 31.9999981,22.7999986 C31.1999981,22.7439986 30.3999982,22.7039986 29.5999982,22.7039986 C29.0799983,22.7039986 28.5759983,22.7039986 28.0639983,22.7439986 C12.3839993,23.4799986 0.735999956,35.5839979 0.735999956,51.4639969 C0.63743161,58.9170154 3.4434929,66.1157964 8.55999949,71.5359957 L8.55999949,71.5359957 C9.93143198,70.8624283 11.2665986,70.1174053 12.5599993,69.3039959 C7.69952868,64.6532972 4.99263394,58.1903687 5.0879997,51.4639969" id="Path" fill="#E4783B" fill-rule="nonzero"></path>
            <path d="M28.1279983,80.1599952 C28.6319983,80.1599952 29.1439983,80.1599952 29.6639982,80.1599952 C42.8959974,80.1599952 53.5039968,72.1599957 57.1519966,60.4959964 C55.8053334,59.9151819 54.4240286,59.4182328 53.0159968,59.0079965 C49.951997,68.9519959 40.9279976,75.8079955 29.6639982,75.8079955 C24.3452111,75.8677029 19.148153,74.2157508 14.8399991,71.0959958 C13.921664,72.2484458 13.0747464,73.456038 12.3039993,74.7119955 C16.9328644,78.0343826 22.4347136,79.9258171 28.1279983,80.1519952" id="Path" fill="#517A46" fill-rule="nonzero"></path>
            <path d="M16.007999,69.7199958 C19.9878802,72.5675619 24.7705852,74.0749405 29.6639982,74.0239956 C40.0639976,74.0239956 48.4079971,67.735996 51.2639969,58.5759965 C38.3542345,55.5184645 24.8083894,59.7991728 15.999999,69.7199958" id="Path" fill="#517A46" fill-rule="nonzero"></path>
            <path d="M51.7839969,56.6719966 C52.162414,54.9510342 52.3528633,53.1940726 52.3519998,51.4319982 C52.3519998,40.4079976 45.2079973,31.7199981 35.0399979,29.4319982 C35.0617567,40.9362612 41.529196,51.4578239 51.7839969,56.6719966" id="Path" fill="#9DC556" fill-rule="nonzero"></path>
            <path d="M54.1279968,51.4639969 C54.1283904,53.4894385 53.8948429,55.5081479 53.4319968,57.4799966 C54.7810802,58.0710267 56.171426,58.5629953 57.5919966,58.9519965 C58.2005431,56.5025871 58.5068229,53.9878684 58.5040159,51.4639969 C58.5040159,37.1279978 49.0239971,25.8639985 35.6479979,23.2799986 C35.3456724,24.7166157 35.1531164,26.1741576 35.0719979,27.6399984 C46.2719972,29.9679982 54.1279968,39.4319976 54.1279968,51.4639969" id="Path" fill="#9DC556" fill-rule="nonzero"></path>
        </g>
    </g>
</svg>