<?xml version="1.0" encoding="UTF-8"?>
<svg width="373px" height="253px" viewBox="0 0 373 253" version="1.1" xmlns="http://www.w3.org/2000/svg" xmlns:xlink="http://www.w3.org/1999/xlink">
    <!-- Generator: Sketch 61 (89581) - https://sketch.com -->
    <title>conseil ethique</title>
    <desc>Created with Sketch.</desc>
    <g id="qui-sommes-nous" stroke="none" stroke-width="1" fill="none" fill-rule="evenodd">
        <g id="qui-sommes-nous---desktop" transform="translate(-193.000000, -5935.000000)">
            <g id="conseil-ethique" transform="translate(177.000000, 5917.000000)">
                <g id="undraw_progress_tracking_7hvk" transform="translate(24.000000, 54.000000)" fill-rule="nonzero">
                    <ellipse id="Oval" fill="#D0D0D0" cx="166.5" cy="157" rx="166.5" ry="11"></ellipse>
                    <ellipse id="Oval" fill="#000000" opacity="0.1" cx="207" cy="155" rx="109" ry="8"></ellipse>
                    <rect id="Rectangle" fill="#F2F2F2" x="126" y="0" width="175" height="157"></rect>
                    <rect id="Rectangle" fill="#ED1844" x="124" y="22" width="5" height="117"></rect>
                    <rect id="Rectangle" fill="#3F3D56" x="233" y="23" width="23" height="1"></rect>
                    <rect id="Rectangle" fill="#3F3D56" x="233" y="19" width="23" height="3"></rect>
                    <polygon id="Path" fill="#F2F2F2" points="257 139 242 139 242 131 252.842391 131 252.842391 131.615385 242.652174 131.615385 242.652174 138.384615 256.347826 138.384615 256.347826 134.527692 257 134.527692"></polygon>
                    <rect id="Rectangle" fill="#3F3D56" x="150" y="37" width="106" height="2"></rect>
                    <rect id="Rectangle" fill="#3F3D56" x="150" y="49" width="106" height="2"></rect>
                    <rect id="Rectangle" fill="#3F3D56" x="150" y="60" width="106" height="2"></rect>
                    <rect id="Rectangle" fill="#3F3D56" x="150" y="73" width="106" height="2"></rect>
                    <rect id="Rectangle" fill="#3F3D56" x="150" y="84" width="106" height="2"></rect>
                    <rect id="Rectangle" fill="#3F3D56" x="150" y="96" width="106" height="2"></rect>
                    <rect id="Rectangle" fill="#3F3D56" x="150" y="108" width="106" height="2"></rect>
                    <rect id="Rectangle" fill="#3F3D56" x="150" y="120" width="106" height="2"></rect>
                    <circle id="Oval" fill="#ED1844" cx="273" cy="38" r="4"></circle>
                    <circle id="Oval" fill="#3F3D56" cx="273" cy="50" r="4"></circle>
                    <circle id="Oval" fill="#ED1844" cx="273" cy="62" r="4"></circle>
                    <circle id="Oval" fill="#3F3D56" cx="273" cy="73" r="4"></circle>
                    <circle id="Oval" fill="#3F3D56" cx="273" cy="86" r="4"></circle>
                    <circle id="Oval" fill="#3F3D56" cx="273" cy="97" r="4"></circle>
                    <circle id="Oval" fill="#ED1844" cx="273" cy="109" r="4"></circle>
                    <circle id="Oval" fill="#ED1844" cx="273" cy="120" r="4"></circle>
                    <polygon id="Path" fill="#ED1844" points="249.743332 138 246 134.511005 246.4723 134.070795 249.743332 137.119579 259.5277 128 260 128.44021"></polygon>
                    <ellipse id="Oval" fill="#000000" opacity="0.1" cx="249" cy="144" rx="22" ry="1"></ellipse>
                </g>
                <g id="A-Human/Sitting" transform="translate(333.000000, 166.000000) scale(-1, 1) translate(-333.000000, -166.000000) translate(247.000000, 65.000000)">
                    <g id="Head/Front/Curly" transform="translate(47.013333, 0.000000)">
                        <g id="Head" stroke-width="1" transform="translate(30.960000, 17.739377)" fill="#B28B67">
                            <path d="M21.8688491,5.22678314 C25.1912072,11.407595 24.7964247,27.085737 20.5025728,28.1904205 C18.7902647,28.6309477 15.1426231,27.5518982 11.4300953,25.3185614 L13.76,41.7733711 L0,41.7733711 L4.73667353,19.7361339 C2.09500488,16.6411193 0.307110986,12.8481937 0.605885098,8.59813509 C1.46677599,-3.64802877 18.5464909,-0.954028751 21.8688491,5.22678314 Z"></path>
                        </g>
                        <path d="M58.9247345,14.3977576 C58.6397935,13.3980929 57.8733742,12.5421716 56.8404958,12.2882438 C56.5900244,12.2266502 56.3313512,12.2017723 56.073623,12.2121443 C55.981175,12.2158272 55.9552472,12.2424338 55.9120468,12.177909 C55.8799961,12.1300697 55.879278,12.013196 55.8660873,11.9569764 C55.8250413,11.7821544 55.7737149,11.609512 55.7103694,11.4413416 C55.4942542,10.8677586 55.1310762,10.3601284 54.6932519,9.93250599 C53.8743345,9.13250367 52.7678303,8.5803788 51.6182392,8.48049125 C50.9890557,8.42584998 50.3644456,8.52787959 49.7696183,8.73216429 C49.4616597,8.83791431 49.1630366,8.96959451 48.8721995,9.1151793 C48.784627,9.15899755 48.5005175,9.37361673 48.4126427,9.35971215 C48.3155836,9.34437952 48.1205204,9.10364225 48.0416032,9.04321367 C47.0661364,8.29623668 45.8615527,8.00254924 44.6465373,8.01133144 C43.2751238,8.02163986 41.9545453,8.0900354 40.8107747,8.92446097 C40.568656,9.1011244 40.338065,9.29454848 40.1185104,9.49819432 C40.0028936,9.60540997 39.8909052,9.71664667 39.7840948,9.8325057 C39.7196533,9.90240444 39.6569126,9.97388154 39.5965153,10.0472752 C39.4940136,10.1718528 39.5104547,10.2127774 39.3669825,10.1258549 C38.8165273,9.79206966 38.1786509,9.63596248 37.5361634,9.71476767 C37.1546546,9.76159231 36.7834639,9.87591056 36.4310199,10.0263807 C36.3110188,10.0776022 36.0332589,10.2819245 35.9053586,10.2839163 C35.7784787,10.2858704 35.5046118,10.0964674 35.3739146,10.0483275 C34.6680061,9.7882365 33.9071427,9.72412508 33.1651772,9.84430581 C32.3998162,9.9683197 31.647986,10.2730932 30.9995268,10.6942519 C30.6876374,10.8968455 30.4155091,11.1213107 30.1969371,11.4225517 C30.1025614,11.5526159 30.0172568,11.6901962 29.9102952,11.8107903 C29.8476679,11.8814031 29.7236605,11.9538572 29.6900602,12.0432224 C29.7101675,11.9897085 28.8530387,11.6599067 28.7721561,11.6388244 C28.3412484,11.5264978 27.9024792,11.5492713 27.4805291,11.6878662 C26.6870859,11.9484833 26.0047241,12.5329269 25.4439129,13.1321395 C25.1558725,13.4399194 24.9038136,13.7801309 24.6898527,14.1425896 C24.5873132,14.3162091 24.4935423,14.4947891 24.4077463,14.6771647 C24.3661712,14.7655152 24.3386182,14.8760378 24.2838523,14.9556322 C24.2132501,15.0581879 24.1658166,15.0601421 24.0379541,15.1048623 C23.3885878,15.3319204 22.796633,15.7162507 22.3458448,16.2355683 C21.8898787,16.7609738 21.5940147,17.4079881 21.4699695,18.0893504 C21.4626749,18.1294858 21.4583284,18.2958148 21.4347818,18.317536 C21.4025043,18.3474497 21.2719205,18.3342215 21.2225216,18.3400088 C21.0514587,18.3600389 20.8816053,18.3898399 20.7140196,18.4294491 C20.4050783,18.5024294 20.1043764,18.609833 19.8199267,18.7503069 C18.7110792,19.2978846 17.9181274,20.3244565 17.5300421,21.4795895 C17.1228323,22.6918441 17.1300512,24.0806869 17.6167453,25.2703183 C17.6953601,25.4624647 17.7889042,25.6489741 17.8987761,25.825412 C17.9662412,25.9337175 17.9880115,25.9339805 17.9442064,26.0476224 C17.8953745,26.1740414 17.8061768,26.2968903 17.7481984,26.4204156 C17.5590314,26.8235359 17.4267845,27.2510832 17.3432562,27.6877624 C17.2062094,28.4040741 17.1382907,29.1568385 17.2734856,29.8785993 C17.3362641,30.2137374 17.4456445,30.5413596 17.6125121,30.8398573 C17.6975901,30.9920561 17.7971437,31.1364008 17.9095478,31.2699224 C17.9679042,31.3392574 18.029889,31.4054733 18.0947085,31.4689083 C18.131786,31.5051354 18.1803911,31.5368529 18.2119127,31.5773265 C18.2888645,31.6760115 18.305041,31.5948764 18.2653556,31.7397847 C18.2098717,31.9423783 18.0840879,32.1422661 18.0070605,32.3394107 C17.9276897,32.5425679 17.8559536,32.7485062 17.7903405,32.9564737 C17.6574511,33.3775948 17.5450848,33.8063446 17.4748228,34.2424601 C17.3398924,35.0797794 17.3635903,35.9719654 17.7604064,36.7404381 C17.9300708,37.0691501 18.1734745,37.3575011 18.468696,37.581816 C18.6131886,37.6915495 18.7697002,37.7861382 18.9338843,37.863816 C19.0182441,37.9038011 19.1259616,37.9209376 19.1644375,38.0023734 C19.2058615,38.0899347 19.144368,38.2638172 19.1303459,38.361713 C19.0083417,39.2133502 18.9471506,40.1075279 19.2007969,40.9421038 C19.4344115,41.710802 19.9487719,42.3894962 20.6165825,42.8388399 C21.9121025,43.7105072 23.6584106,43.6613526 25.0196572,42.9635302 C25.3744823,42.7816056 25.7064411,42.55575 26.0025697,42.2893456 C26.7566298,43.3025015 28.3083284,43.2704458 29.4104105,42.9817565 C30.7834493,42.6221162 31.8851912,41.669201 32.5199684,40.4171869 C33.3879445,41.4717934 35.2095415,41.1296279 35.8114365,39.9855434 C35.9587638,39.705535 36.0461472,39.3969283 36.0891586,39.0846388 C36.1117982,38.9204144 36.0973603,38.7547619 36.1143683,38.5918527 C36.136063,38.384261 36.2749996,38.1825317 36.3548617,37.9817044 C36.5103907,37.5908727 36.6069584,37.1871512 36.6111159,36.7655791 C36.6132703,36.5454732 36.5853393,36.3309668 36.5643628,36.1126272 C36.5455028,35.916084 36.6001174,35.7329568 36.6311476,35.538969 C36.279006,35.5968421 35.849988,35.5020655 35.5182182,35.4001486 C35.1926469,35.3001483 34.8877119,35.0367503 34.6579146,34.796201 C34.1243541,34.2376123 33.7984048,33.5053667 33.5754863,32.7765784 C33.0861466,31.1770247 33.2867278,29.2579286 34.8986726,28.3800605 C35.6495957,27.9711154 37.8992665,27.9724567 38.7936492,28.1745714 C39.7340535,28.3870861 40.8001541,30.4581575 40.8526144,30.6528218 C40.8850808,30.7733031 40.8687531,30.9224204 40.9796455,31.0026912 C41.2233515,31.1792043 41.62527,30.87289 41.8050259,30.7217058 C42.1152144,30.4607881 42.3364699,30.1136244 42.5280936,29.7617256 C42.9456217,28.9950943 43.2822294,28.1729574 43.5200015,27.333684 C43.7033102,26.6866321 43.8205144,26.0193998 44.0601007,25.3888455 C44.2985154,24.7614104 44.6743549,24.2006046 45.2587128,23.8451733 C45.8943971,23.458513 46.6230585,23.2548671 47.3209166,23.0118751 C48.0126518,22.7710627 48.6924436,22.4767364 49.2286498,21.9657616 C49.3465343,21.8533975 49.461055,21.7340059 49.5559598,21.6017244 C49.6308706,21.4972897 49.7049122,21.2973643 49.819055,21.2311484 C49.9965053,21.1281417 50.2554808,21.3960117 50.408931,21.4932686 C51.165977,21.9731648 51.7975793,22.642464 52.3069885,23.3736198 C52.813563,24.1007922 53.2292316,24.8004936 53.5670109,25.6124839 C53.817558,26.2147029 53.9739259,26.9859565 54.4145849,27.4794942 C54.611311,27.6998632 56.073623,27.8331804 56.5472775,27.6407874 C57.0209321,27.4483945 57.5517714,26.9488275 57.7107397,26.6357488 C57.8734876,26.3153045 57.9123792,25.9632929 57.8428353,25.6124839 C57.8019405,25.4060947 57.7184122,25.2133095 57.6727173,25.0106032 C57.6342414,24.8403284 57.5993182,24.6793734 57.5162813,24.5233789 C57.3589004,24.2277749 57.0900224,24.0152978 56.7657739,23.9264587 C57.1032131,23.6159355 57.382825,23.2444575 57.5763007,22.8291989 C57.7773355,22.3977809 57.9477181,21.8731269 57.9960587,21.3996194 C58.0353661,21.015026 57.9747042,20.6165656 57.7637669,20.2860498 C57.5424736,19.939337 57.1504576,19.7131432 56.8112798,19.4968705 C57.329382,19.0922846 57.7728001,18.6002501 58.1373387,18.0554909 C58.8462709,16.9961116 59.2847755,15.6607451 58.9247345,14.3977576 Z" id="hair" fill="#191847"></path>
                    </g>
                    <g id="Bottom/Sitting/Sweat-Pants" transform="translate(0.000000, 107.008499)">
                        <g id="Objects/Seat/Cube-2" transform="translate(5.733333, 24.033994)" fill="#C5CFD6">
                            <path d="M92.9333333,0 C101.769889,-1.623249e-15 108.933333,7.163444 108.933333,16 L108.933333,54.9575071 C108.933333,63.7940631 101.769889,70.9575071 92.9333333,70.9575071 L40.6533333,70.9575071 C31.8167773,70.9575071 24.6533333,63.7940631 24.6533333,54.9575071 L24.6533333,16 C24.6533333,7.163444 31.8167773,1.623249e-15 40.6533333,0 L92.9333333,0 Z M88.88,16.0226629 L44.7066667,16.0226629 C42.4975277,16.0226629 40.7066667,17.8135239 40.7066667,20.0226629 L40.7066667,20.0226629 L40.7066667,50.9348442 C40.7066667,53.1439832 42.4975277,54.9348442 44.7066667,54.9348442 L44.7066667,54.9348442 L88.88,54.9348442 C91.089139,54.9348442 92.88,53.1439832 92.88,50.9348442 L92.88,50.9348442 L92.88,20.0226629 C92.88,17.8135239 91.089139,16.0226629 88.88,16.0226629 L88.88,16.0226629 Z" id="Seat"></path>
                        </g>
                        <path d="M148.545065,21.4599699 C151.456369,28.9842806 156.538847,53.7060252 162.645833,91.0473003 L155.665305,93.0801402 C148.319309,76.8524424 143.006758,62.7220192 140.87432,55.2667745 C137.223068,42.5015856 134.445415,31.2689647 133.743374,27.0741668 C132.069268,17.0711331 146.621558,16.4886365 148.545065,21.4599699 Z M126.522382,42.4369129 C105.270629,45.4896558 75.1426814,48.6421089 72.5643874,48.9958863 C68.9507983,49.4917204 66.2201406,43.8241899 70.4559853,42.1530747 C77.1959293,39.4940482 100.798855,31.1725943 112.182545,28.8186073 C115.453762,28.1421658 118.62432,27.5136754 121.605201,26.9456948 C130.465435,25.2574554 135.055868,41.2111063 126.522382,42.4369129 Z" id="Skin" fill="#B28B67"></path>
                        <path d="M94.9223198,0 C130.192462,8.97024329 148.215476,14.7189158 148.991362,17.2460174 L149.015468,17.3291905 C149.032823,17.3519491 149.049891,17.3748423 149.066667,17.3978699 C156.056463,26.9924793 160.242625,73.8341276 161.616599,77.3414715 L148.222565,79.3358588 C143.098992,60.3729905 126.706667,47.1627659 127.142106,24.4511619 C127.024543,23.7850277 126.994827,23.1533084 127.043264,22.5557084 L90.5866667,4.0323992 L90.5866667,0 L94.9223198,0 Z" id="Leg-Back" fill="#1F28CF"></path>
                        <path d="M96.8599439,-2.84217094e-14 C101.969967,1.46511119 128.526448,12.5805587 142.30513,18.4926348 C151.375656,22.3845629 148.580316,36.3603273 143.468379,40.1222895 L143.385721,40.1803176 C143.35797,40.4065798 143.264971,40.5602342 143.098992,40.6288952 C115.31847,52.1209514 93.3415282,46.0910988 86,48.0177275 L82.6042154,37.326176 L93.6152156,33.5562124 C90.2797013,32.8897926 87.2080493,32.2950235 84.579684,31.8348905 C67.6013261,28.8625859 62.6502924,19.7915654 65.5776079,-2.84217094e-14 L96.8599439,-2.84217094e-14 Z" id="Leg-Front" fill="#2B44FF"></path>
                        <g id="Accessories/Shoe/Flat-Sneaker" transform="translate(82.536662, 53.408011) rotate(64.000000) translate(-82.536662, -53.408011) translate(65.049995, 41.963251)" fill="#E4E4E4">
                            <path d="M1.21059495,15.4456155 C0.785753871,16.706091 0.573333333,17.6815804 0.573333333,18.3720836 C0.573333333,19.4039924 0.745570811,20.909804 1.09004577,22.8895184 C2.28942387,22.8895184 13.0684369,22.8895184 33.4270848,22.8895184 C34.2674098,20.1167435 33.7823254,18.6198116 31.9718318,18.3987226 C30.1613381,18.1776336 28.6573302,17.978008 27.4598082,17.7998456 L12.8297594,11.2901577 C12.3251705,11.0656393 11.7341123,11.2926812 11.5095938,11.79727 C11.5059406,11.8054803 11.5023983,11.8137395 11.4989677,11.8220453 L10.7002422,13.7558538 L10.7002422,13.7558538 C9.02419856,14.5363619 7.66223912,14.9266159 6.61436385,14.9266159 C5.91511519,14.9266159 4.99705124,14.6951155 3.86017202,14.2321146 L3.8601641,14.2321341 C2.83718733,13.8155207 1.67016895,14.3070754 1.25355558,15.3300521 C1.23805116,15.3681226 1.22372414,15.406662 1.21059495,15.4456155 Z" id="shoe"></path>
                        </g>
                        <g id="Accessories/Shoe/Flat-Sneaker" transform="translate(150.786667, 75.535411)" fill="#E4E4E4">
                            <path d="M1.21059495,15.4456155 C0.785753871,16.706091 0.573333333,17.6815804 0.573333333,18.3720836 C0.573333333,19.4039924 0.745570811,20.909804 1.09004577,22.8895184 C2.28942387,22.8895184 13.0684369,22.8895184 33.4270848,22.8895184 C34.2674098,20.1167435 33.7823254,18.6198116 31.9718318,18.3987226 C30.1613381,18.1776336 28.6573302,17.978008 27.4598082,17.7998456 L12.8297594,11.2901577 C12.3251705,11.0656393 11.7341123,11.2926812 11.5095938,11.79727 C11.5059406,11.8054803 11.5023983,11.8137395 11.4989677,11.8220453 L10.7002422,13.7558538 L10.7002422,13.7558538 C9.02419856,14.5363619 7.66223912,14.9266159 6.61436385,14.9266159 C5.91511519,14.9266159 4.99705124,14.6951155 3.86017202,14.2321146 L3.8601641,14.2321341 C2.83718733,13.8155207 1.67016895,14.3070754 1.25355558,15.3300521 C1.23805116,15.3681226 1.22372414,15.406662 1.21059495,15.4456155 Z" id="shoe"></path>
                        </g>
                    </g>
                    <g id="Body/Jacket" transform="translate(12.613333, 46.923513)">
                        <path d="M39.1632121,53.2295129 L51.1443834,53.2765393 C43.7465629,77.1123492 39.7528392,89.7594807 39.1632121,91.2179336 C37.8365511,94.4994528 40.6439441,99.4971496 41.8444968,102.182875 C37.9343368,103.929212 38.3509685,97.461812 33.4184069,99.7522307 C28.9161933,101.842819 25.4913707,105.630824 20.2897135,102.427374 C19.6502003,102.033529 18.9493981,100.55063 20.6426249,99.3918227 C24.8610705,96.5048116 30.9401062,91.4520222 31.7614797,89.7888574 C32.8815691,87.5208351 35.3488133,75.334387 39.1632121,53.2295129 L39.1632121,53.2295129 Z M111.252128,50.9992842 L127.49346,66.8130934 C132.219089,68.8249739 136.091068,71.0464961 139.109399,73.4776602 C139.788176,74.2948572 140.527136,75.8606488 137.333522,75.1599795 C134.139909,74.4593101 130.749134,73.8656654 130.148901,74.9022678 C129.548667,75.9388702 131.317305,77.5273133 130.207998,78.8839591 C129.468461,79.7883896 126.981337,76.9115732 122.746628,70.2535099 L105.857791,60.3152926 L111.252128,50.9992842 Z" id="Skin" fill="#B28B67"></path>
                        <path d="M69.9638717,5.2870321 L74.8287188,4.00944602 C85.186582,24.4662048 101.717343,42.4309071 124.421002,57.9035527 L110.108957,78.7184816 C86.7652512,55.9015763 71.4797173,31.5909907 69.9638717,5.2870321 Z" id="Coat-Back" fill="#DDE3E9" transform="translate(97.192437, 41.363964) rotate(5.000000) translate(-97.192437, -41.363964) "></path>
                        <path d="M51.6,65.2351275 L95.7466667,65.2351275 C85.5188985,40.41439 80.4050144,19.3294679 80.4050144,1.98036125 L67.0881459,0 C56.6223386,16.7999948 53.6667671,37.48419 51.6,65.2351275 Z" id="Shirt" fill="#DB2721"></path>
                        <path d="M67.6807112,-2.43959716e-14 C68.7208686,0.0357494997 70.3051617,0.100159322 72.4335908,0.193229466 L72.4335908,0.193229466 L75.651424,9.37147244 C75.9917994,20.5618964 77.9795401,43.1136201 81.6146461,77.0266435 L81.6146461,77.0266435 L52.6755981,77.0259627 C52.7514593,79.3684181 52.8765533,81.7327572 53.05088,84.1189802 L53.05088,84.1189802 L31.5333333,84.1189802 C34.7519788,47.8756957 46.5060694,19.8360357 66.7956053,1.11311652e-14 L66.7956053,1.11311652e-14 L66.8063333,0.01 L66.8114407,-2.43959716e-14 Z" id="Coat-Front" fill="#F2F2F2"></path>
                        <path d="M60.7733333,77.2521246 L52.6830743,77.2521599 C52.3288935,66.7478601 52.9635475,56.6830949 54.5870363,47.0578643 C55.410888,61.657866 57.4729152,71.7226269 60.7733333,77.2521246 Z" id="Shade" fill-opacity="0.1" fill="#000000"></path>
                        <polygon id="Light" fill-opacity="0.2" fill="#FFFFFF" points="59.1169154 59.5127479 73.3866667 52.891538 73.3866667 59.5127479"></polygon>
                    </g>
                </g>
                <g id="A-Human/Standing">
                    <g id="Head/Front/Short-Beard" transform="translate(52.206667, 0.000000)">
                        <g id="Head" stroke-width="1" transform="translate(34.380000, 19.720657)" fill="#B28B67">
                            <path d="M24.284594,5.81055357 C27.9739568,12.6816897 27.5355646,30.1108964 22.7673919,31.3389601 C20.8659676,31.8286802 16.8155003,30.6291655 12.6929444,28.1464819 L15.28,46.4389671 L0,46.4389671 L5.26062832,21.9412704 C2.32675363,18.5004249 0.341008984,14.2835716 0.672814266,9.55844602 C1.62880357,-4.05547084 20.5952312,-1.06058258 24.284594,5.81055357 Z"></path>
                        </g>
                        <path d="M50.3807439,18.8431334 C54.6679952,19.2105689 58.4963051,20.5168077 59.5812789,21.2925507 C59.5812789,25.3481512 58.7948107,26.5514359 52.0772996,26.4453708 C50.42669,27.316382 49.1577865,28.8162654 47.8361247,30.7826579 C48.4208586,38.9230786 49.968096,42.9940188 52.4777539,42.9940188 C56.2422406,42.9940188 59.4361402,40.6061338 61.0879066,40.6061338 C62.2919882,40.6061338 62.0231537,42.1117082 61.2250255,43.2279845 C60.566544,44.1489485 57.3597941,45.0366476 57.3597941,46.464451 C57.3597941,47.8922543 59.8933924,46.7876416 59.8933924,47.6344438 C59.8933924,49.0351581 60.3386686,51.6687515 57.9056127,51.6687515 C55.443279,51.6687515 48.3833321,50.7721577 47.1734484,47.1205844 C46.392691,44.7641653 45.8878519,39.881438 45.658931,32.4724025 C45.5094041,32.4527794 45.3574343,32.443662 45.2033333,32.443662 C43.0936056,32.443662 41.3833333,34.1525469 41.3833333,36.2605634 C41.3833333,37.3307069 41.8240925,38.2979892 42.5341179,38.9910563 C41.6502217,40.2376577 40.6596276,41.5398998 39.5245126,42.8836445 C35.2601314,40.3272645 32.0957181,32.8437822 36.2648428,25.6548437 C37.417202,22.1330945 40.025982,20.2519959 43.107014,19.3785415 C45.6028087,18.3353895 48.1936797,18.2177732 50.3807439,18.8431334 Z" id="Hair" fill="#191847"></path>
                    </g>
                    <g id="Bottom/Standing/Skinny-Jeans" transform="translate(0.000000, 118.960094)">
                        <polygon id="Leg" fill="#191847" points="81.4933333 6.32816699e-14 104.575659 80.9354281 121.416763 140.589202 133.7 140.589202 115.80392 6.32816699e-14"></polygon>
                        <path d="M75.3204311,0 C74.7865392,41.7150582 72.9659775,64.4675845 72.4054128,68.257579 C71.8448481,72.0475734 63.3688161,96.1581143 46.9773167,140.589202 L59.7019184,140.589202 C80.5695512,97.9651652 92.2183977,73.8546242 94.6484579,68.257579 C97.0785181,62.6605337 104.577921,39.9080074 115.873333,0 L75.3204311,0 Z" id="Leg" fill="#2F3676"></path>
                        <g id="Accessories/Shoe/Flat-Pointy" transform="translate(45.840000, 126.593897)" fill="#191847">
                            <path d="M0,25.4460094 L0.636666667,12.0868545 L14.0066667,12.0868545 C20.3463408,16.5399061 28.6230074,20.1447574 38.8366667,22.9014085 L38.8366667,25.4460094 L14.6433333,25.4460094 L6.36666667,24.1737089 L6.36666667,25.4460094 L0,25.4460094 Z" id="Shoe"></path>
                        </g>
                        <g id="Accessories/Shoe/Flat-Pointy" transform="translate(119.693333, 126.593897)" fill="#191847">
                            <path d="M0,25.4460094 L0.636666667,12.0868545 L14.0066667,12.0868545 C20.3463408,16.5399061 28.6230074,20.1447574 38.8366667,22.9014085 L38.8366667,25.4460094 L14.6433333,25.4460094 L6.36666667,24.1737089 L6.36666667,25.4460094 L0,25.4460094 Z" id="Shoe"></path>
                        </g>
                    </g>
                    <g id="Body/Lab-Coat" transform="translate(14.006667, 52.164319)">
                        <path d="M34.1680795,49.3244931 L45.4445784,50.9608086 C33.3402564,77.2017034 26.8509858,91.0794084 25.9767668,92.5939235 C24.009774,96.0015826 26.3230896,101.936916 27.2274222,105.07894 C22.6571753,106.397616 24.1167575,99.3421903 18.3379713,101.101949 C13.0633632,102.708174 8.7106841,106.349407 3.48667028,102.019579 C2.84440848,101.487252 2.30338164,99.7465554 4.34478518,98.7323308 C9.43066585,96.2055275 16.8979146,91.5818 18.0586735,89.8777105 C19.6415757,87.5538801 25.0113777,74.036141 34.1680795,49.3244931 L34.1680795,49.3244931 Z M121.195149,56.3692861 L140.413964,72.6494207 C145.80497,74.5147961 150.266608,76.6787319 153.798877,79.1412282 C154.614223,79.9949467 155.554335,81.6741838 151.962198,81.1443387 C148.370061,80.6144937 144.567823,80.218597 143.983359,81.4146262 C143.398895,82.6106555 145.481402,84.2353163 144.357846,85.8256692 C143.608809,86.8859045 140.630402,83.8880735 135.422625,76.8321762 L115.942536,67.1180734 L121.195149,56.3692861 Z" id="Skin" fill="#B28B67"></path>
                        <path d="M78.2993256,5.86120532 L85.058884,2.95216227 C96.5631986,25.6946112 112.64041,47.2663611 137.853885,64.4693874 L132.913122,75.0081972 C111.170264,64.6464379 90.7688039,56.9044309 81.228033,39.3364843 C78.0259037,33.4402273 78.7230215,13.2092788 78.2993256,5.86120532 Z" id="Coat-Back" fill="#C5CFD6" transform="translate(108.076605, 38.980180) rotate(5.000000) translate(-108.076605, -38.980180) "></path>
                        <path d="M57.3,69.9765258 C77.3157343,72.0970266 93.0703128,72.0970266 104.563735,69.9765258 C105.987693,69.71381 106.212341,67.3316602 105.551983,65.7149337 C95.2684779,40.5382938 88.2167255,18.5702601 88.2167255,1.08313314 C86.3298318,2.03363756 83.02759,2.17608253 78.31,1.51046805 C65.6315484,19.5315147 59.8037157,40.2086038 57.3,69.9765258 Z" id="Shirt" fill="#323337"></path>
                        <path d="M75.1767226,-0.329955994 L75.1573022,-0.000955994474 L80.4418304,3.44724249e-14 C81.6597869,7.15746772 85.4750681,103.18286 97.1744004,136.177401 L97.5313443,137.157786 L32.7153194,137.157786 C34.1205095,107.819409 45.2051158,72.5768652 56.4339428,43.0855611 C46.5047768,52.1643143 37.8508931,67.5472605 30.47205,89.2345028 L30.47205,89.2345028 L18.3313022,86.1205225 C27.3581621,47.2547209 45.9172013,18.6880016 74.0084197,0.420364325 L74.1917743,3.44724249e-14 L74.6623022,-0.000955994474 L75.1767226,-0.329955994 Z" id="Coat-Front" fill="#DDE3E9"></path>
                    </g>
                </g>
            </g>
        </g>
    </g>
</svg>