<?xml version="1.0" encoding="UTF-8"?>
<svg width="6px" height="401px" viewBox="0 0 6 401" version="1.1" xmlns="http://www.w3.org/2000/svg" xmlns:xlink="http://www.w3.org/1999/xlink">
    <title>bg-timeline-jeunes-2</title>
    <g id="Page-1" stroke="none" stroke-width="1" fill="none" fill-rule="evenodd">
        <g id="bg-timeline-jeunes-2" transform="translate(0.500000, 0.754883)" fill="#FED049" fill-rule="nonzero">
            <rect id="Rectangle" x="0" y="-6.66133815e-15" width="5" height="400"></rect>
        </g>
    </g>
</svg>