<?xml version="1.0" encoding="UTF-8"?>
<svg width="450px" height="152px" viewBox="0 0 450 152" version="1.1" xmlns="http://www.w3.org/2000/svg" xmlns:xlink="http://www.w3.org/1999/xlink">
    <title>Inclusive Tech</title>
    <g id="logo_acces-inclusive-tech" stroke="none" stroke-width="1" fill="none" fill-rule="evenodd">
        <path d="M71.06,44.584 C71.06,30.785 59.639,19.364 45.364,19.364 C31.406,19.364 19.985,31.102 19.985,45.536 C19.985,59.336 31.564,70.756 45.206,70.756 C59.481,70.756 71.06,59.336 71.06,44.584 Z M70.742,2.71 L101.038,2.71 L101.038,20.792 L90.411,20.792 L90.411,69.328 L101.038,69.328 L101.038,87.41 L70.742,87.41 L70.742,75.99 C64.557,85.348 54.405,89.631 43.46,89.631 C19.351,89.631 0,69.646 0,45.536 C0,21.585 19.034,0.489 44.412,0.489 C55.198,0.489 64.715,5.406 70.742,14.765 L70.742,2.71 L70.742,2.71 Z" id="Fill-1" fill="#222C53"></path>
        <path d="M171.624,2.71 L188.279,2.71 L188.279,30.944 L170.197,30.944 C164.962,23.488 157.507,19.364 149.101,19.364 C134.825,19.364 124.04,30.785 124.04,45.06 C124.04,59.653 135.619,70.597 149.577,70.597 C157.983,70.597 166.073,66.315 169.879,58.859 L191.451,58.859 C186.217,77.1 167.5,89.631 149.418,89.631 C124.516,89.631 104.688,69.487 104.688,45.06 C104.688,20.95 123.722,0.172 147.039,0.172 C157.032,0.172 164.962,3.82 171.624,10.799 L171.624,2.71" id="Fill-2" fill="#222C53"></path>
        <path d="M263.623,2.71 L280.278,2.71 L280.278,30.944 L262.196,30.944 C256.961,23.488 249.506,19.364 241.1,19.364 C226.824,19.364 216.039,30.785 216.039,45.06 C216.039,59.653 227.618,70.597 241.576,70.597 C249.982,70.597 258.072,66.315 261.878,58.859 L283.45,58.859 C278.216,77.1 259.499,89.631 241.417,89.631 C216.515,89.631 196.688,69.487 196.688,45.06 C196.688,20.95 215.721,0.172 239.038,0.172 C249.031,0.172 256.961,3.82 263.623,10.799 L263.623,2.71" id="Fill-3" fill="#222C53"></path>
        <path d="M358.635,37.446 C355.146,25.074 344.519,17.461 331.988,17.461 C321.043,17.461 309.94,25.709 307.244,37.446 L358.635,37.446 Z M375.925,52.357 L307.403,52.357 C309.94,64.094 320.885,72.659 332.781,72.659 C341.188,72.659 348.325,69.487 353.243,62.508 L373.387,62.508 C366.408,79.48 350.229,89.631 333.416,89.631 C308.83,89.631 288.845,70.28 288.845,45.377 C288.845,20.633 307.403,0.172 332.94,0.172 C350.863,0.172 376.559,12.544 376.559,45.536 C376.559,47.122 376.241,50.453 375.925,52.357 L375.925,52.357 Z" id="Fill-4" fill="#222C53"></path>
        <path d="M430.331,2.71 L444.606,2.71 L444.606,25.709 L425.89,25.709 C425.572,19.84 421.132,15.716 414.945,15.716 C409.235,15.716 404.16,19.047 404.16,24.599 C404.16,30.15 407.49,33.481 418.118,35.702 C440.642,40.46 449.683,48.232 449.683,62.984 C449.683,80.114 435.248,89.631 419.387,89.631 C410.821,89.631 403.05,86.934 397.498,80.431 L397.498,87.41 L382.747,87.41 L382.747,62.825 L402.573,62.825 C403.208,70.597 408.442,75.514 416.215,75.514 C422.4,75.514 427.793,71.073 427.793,65.045 C427.793,58.067 422.718,55.687 413.359,53.466 C393.215,48.708 382.43,42.047 382.43,26.502 C382.43,10.799 395.436,0.965 411.139,0.965 C420.497,0.965 426.366,3.503 430.331,8.579 L430.331,2.71" id="Fill-5" fill="#222C53"></path>
        <polygon id="Fill-6" fill="#812360" points="4.251 151.611 8.14 151.611 8.14 117.586 4.251 117.586"></polygon>
        <path d="M40.366,125.85 C43.412,125.85 45.794,126.733 47.511,128.498 C49.229,130.265 50.087,132.703 50.087,135.814 L50.087,151.611 L46.296,151.611 L46.296,136.835 C46.296,134.567 45.656,132.8 44.376,131.536 C43.096,130.273 41.321,129.641 39.054,129.641 C36.558,129.674 34.558,130.436 33.051,131.926 C31.544,133.416 30.676,135.394 30.45,137.856 L30.45,151.611 L26.659,151.611 L26.659,125.995 L30.45,125.995 L30.45,131.634 C32.2,127.843 35.505,125.915 40.366,125.85" id="Fill-7" fill="#812360"></path>
        <path d="M77.404,125.899 C81.519,125.866 84.809,127.13 87.271,129.69 L85.182,132.363 C83.107,130.387 80.564,129.398 77.55,129.398 C74.893,129.398 72.714,130.273 71.012,132.023 C69.311,133.773 68.46,136.041 68.46,138.827 C68.46,141.615 69.311,143.891 71.012,145.657 C72.714,147.424 74.893,148.306 77.55,148.306 C80.984,148.306 83.626,147.205 85.473,145.001 L87.661,147.334 C85.23,150.283 81.811,151.757 77.404,151.757 C73.677,151.757 70.631,150.559 68.266,148.16 C65.9,145.763 64.718,142.651 64.718,138.827 C64.718,135.036 65.909,131.934 68.29,129.52 C70.672,127.106 73.71,125.899 77.404,125.899" id="Fill-8" fill="#812360"></path>
        <polygon id="Fill-9" fill="#812360" points="103.555 151.611 107.346 151.611 107.346 115.545 103.555 115.545"></polygon>
        <path d="M142.975,139.751 L142.975,125.752 L148.419,125.752 L148.419,151.611 L142.975,151.611 L142.975,146.897 C142.1,148.485 140.893,149.733 139.354,150.64 C137.814,151.547 136.153,152 134.372,152 C131.455,152 129.098,151.11 127.299,149.327 C125.501,147.545 124.602,144.969 124.602,141.599 L124.602,125.752 L130.045,125.752 L130.045,139.945 C130.045,144.709 132.022,147.091 135.976,147.091 C137.854,147.091 139.491,146.468 140.885,145.22 C142.278,143.973 142.975,142.15 142.975,139.751" id="Fill-10" fill="#812360"></path>
        <path d="M183.465,143.883 C183.465,146.346 182.573,148.315 180.792,149.788 C179.009,151.264 176.725,152 173.938,152 C172.058,152 170.105,151.66 168.081,150.98 C166.055,150.299 164.265,149.344 162.709,148.111 L165.334,143.883 C168.348,146.151 171.265,147.285 174.083,147.285 C175.315,147.285 176.287,147.002 177,146.435 C177.712,145.868 178.069,145.147 178.069,144.272 C178.069,142.976 176.352,141.81 172.917,140.772 C172.657,140.675 172.463,140.61 172.334,140.577 C166.954,139.119 164.265,136.689 164.265,133.286 C164.265,130.889 165.196,128.969 167.06,127.526 C168.923,126.085 171.345,125.363 174.327,125.363 C177.308,125.363 180.127,126.238 182.784,127.988 L180.743,132.023 C178.636,130.63 176.352,129.933 173.889,129.933 C172.593,129.933 171.54,130.168 170.729,130.638 C169.919,131.108 169.515,131.813 169.515,132.752 C169.515,133.595 169.936,134.21 170.778,134.599 C171.362,134.891 172.18,135.166 173.233,135.425 C174.286,135.685 175.218,135.943 176.028,136.203 C176.837,136.463 177.624,136.754 178.385,137.078 C179.146,137.402 179.965,137.856 180.84,138.439 C182.59,139.606 183.465,141.421 183.465,143.883" id="Fill-11" fill="#812360"></path>
        <path d="M198.387,151.611 L203.832,151.611 L203.832,125.752 L198.387,125.752 L198.387,151.611 Z M198.728,120.6 C198.047,119.919 197.707,119.11 197.707,118.169 C197.707,117.23 198.047,116.42 198.728,115.739 C199.408,115.059 200.218,114.718 201.158,114.718 C202.098,114.718 202.908,115.059 203.588,115.739 C204.269,116.42 204.609,117.23 204.609,118.169 C204.609,119.11 204.269,119.919 203.588,120.6 C202.908,121.28 202.098,121.62 201.158,121.62 C200.218,121.62 199.408,121.28 198.728,120.6 L198.728,120.6 Z" id="Fill-12" fill="#812360"></path>
        <polyline id="Fill-13" fill="#812360" points="227.308 151.611 216.906 125.752 222.544 125.752 230.419 145.292 238.293 125.752 243.932 125.752 233.53 151.611 227.308 151.611"></polyline>
        <path d="M260.798,136.786 L275.623,136.786 C275.623,134.615 274.943,132.946 273.582,131.779 C272.221,130.613 270.543,130.029 268.551,130.029 C266.558,130.029 264.767,130.638 263.18,131.853 C261.592,133.068 260.798,134.713 260.798,136.786 Z M281.067,141.064 L260.798,141.064 C260.927,142.943 261.786,144.458 263.374,145.609 C264.961,146.759 266.777,147.334 268.818,147.334 C272.058,147.334 274.521,146.314 276.207,144.272 L279.317,147.674 C276.53,150.559 272.901,152 268.429,152 C264.8,152 261.713,150.793 259.169,148.379 C256.625,145.965 255.354,142.725 255.354,138.657 C255.354,134.591 256.649,131.359 259.243,128.96 C261.834,126.563 264.889,125.363 268.405,125.363 C271.92,125.363 274.91,126.425 277.373,128.547 C279.835,130.67 281.067,133.595 281.067,137.32 L281.067,141.064 L281.067,141.064 Z" id="Fill-14" fill="#812360"></path>
        <polyline id="Fill-15" fill="#812360" points="323.258 124.196 323.258 151.611 315.675 151.611 315.675 124.196 306.051 124.196 306.051 117.635 332.882 117.635 332.882 124.196 323.258 124.196"></polyline>
        <path d="M362.094,132.315 C361.089,131.472 359.866,131.051 358.424,131.051 C356.982,131.051 355.662,131.488 354.463,132.363 C353.264,133.237 352.567,134.421 352.373,135.911 L363.844,135.911 C363.682,134.356 363.099,133.157 362.094,132.315 Z M369.094,147.82 C366.145,150.608 362.685,152 358.716,152 C354.746,152 351.465,150.777 348.873,148.33 C346.28,145.884 344.984,142.603 344.984,138.487 C344.984,134.372 346.305,131.099 348.946,128.669 C351.587,126.238 354.706,125.024 358.303,125.024 C361.9,125.024 364.954,126.11 367.465,128.279 C369.977,130.451 371.232,133.433 371.232,137.224 L371.232,141.112 L352.179,141.112 C352.405,142.538 353.151,143.705 354.415,144.612 C355.678,145.52 357.104,145.973 358.692,145.973 C361.251,145.973 363.358,145.114 365.011,143.397 L369.094,147.82 L369.094,147.82 Z" id="Fill-16" fill="#812360"></path>
        <path d="M397.772,145.535 C400.202,145.535 402.39,144.32 404.334,141.89 L408.66,146.751 C405.289,150.25 401.644,152 397.724,152 C393.803,152 390.488,150.761 387.783,148.281 C385.077,145.803 383.725,142.563 383.725,138.561 C383.725,134.559 385.093,131.302 387.832,128.79 C390.57,126.279 393.818,125.024 397.578,125.024 C399.457,125.024 401.36,125.412 403.289,126.19 C405.217,126.968 406.91,128.118 408.368,129.641 L404.577,134.599 C403.734,133.595 402.706,132.818 401.49,132.266 C400.275,131.715 399.067,131.44 397.869,131.44 C395.957,131.44 394.313,132.064 392.936,133.311 C391.558,134.559 390.87,136.292 390.87,138.512 C390.87,140.732 391.558,142.457 392.936,143.689 C394.313,144.92 395.925,145.535 397.772,145.535" id="Fill-17" fill="#812360"></path>
        <path d="M429.561,137.516 L429.561,151.611 L422.27,151.611 L422.27,115.545 L429.561,115.545 L429.561,128.377 C431.764,126.141 434.234,125.024 436.974,125.024 C439.711,125.024 442.021,125.995 443.899,127.94 C445.778,129.884 446.719,132.477 446.719,135.717 L446.719,151.611 L439.428,151.611 L439.428,137.32 C439.428,133.303 437.953,131.293 435.005,131.293 C433.547,131.293 432.274,131.82 431.188,132.873 C430.103,133.927 429.561,135.474 429.561,137.516" id="Fill-18" fill="#812360"></path>
    </g>
</svg>
