<?xml version="1.0" encoding="UTF-8"?>
<svg width="300px" height="83px" viewBox="0 0 300 83" version="1.1" xmlns="http://www.w3.org/2000/svg" xmlns:xlink="http://www.w3.org/1999/xlink">
    <title>France TV</title>
    <g id="handicap/france.tv" stroke="none" stroke-width="1" fill="none" fill-rule="evenodd">
        <g id="france_tv_logo_cmjn_cartouche_couleur_blanc">
            <polygon id="Fill-1" fill="#232424" points="0.262404092 82.5191816 299.988875 82.5191816 299.988875 0.345268542 0.262404092 0.345268542"></polygon>
            <path d="M109.34578,61.6806905 L109.34578,33.9237852 L116.499744,33.9237852 L116.499744,36.1561381 C118.617008,34.4393862 121.249488,33.3517903 124.340026,33.3517903 C128.174425,33.3517903 131.665473,35.0689258 133.954604,37.8157289 C135.785678,39.9909207 136.816113,42.7948849 136.816113,47.5446292 L136.816113,61.6806905 L129.376343,61.6806905 L129.376343,46.9722506 C129.376343,44.2258312 128.746803,42.7948849 127.716368,41.7648338 C126.743478,40.7919437 125.255754,40.2191816 123.538619,40.2191816 C120.390921,40.2191816 117.815985,42.2225064 116.78555,43.6534527 L116.78555,61.6806905 L109.34578,61.6806905" id="Fill-2" fill="#FFFFFE"></path>
            <path d="M189.258184,44.2258312 C189.029156,41.7648338 186.797187,39.3609974 183.764194,39.3609974 C180.673657,39.3609974 178.155882,41.707289 177.812148,44.2258312 L189.258184,44.2258312 Z M196.18312,57.273913 C193.493095,60.4787724 189.086317,62.2526854 184.794246,62.2526854 C176.495908,62.2526854 170.258056,56.5296675 170.258056,47.8308184 C170.258056,40.105243 175.523018,33.3517903 183.764194,33.3517903 C191.432609,33.3517903 196.869437,39.8182864 196.869437,47.5446292 C196.869437,48.2888747 196.812276,49.0327366 196.697954,49.6622762 L177.468798,49.6622762 C177.869309,53.5538363 181.017391,56.2438619 184.966113,56.2438619 C188.113427,56.2438619 190.631586,54.4695652 191.947826,53.0386189 L196.18312,57.273913 L196.18312,57.273913 Z" id="Fill-3" fill="#FFFFFE"></path>
            <path d="M95.8546036,43.6534527 C94.309335,41.5925831 91.8487212,40.2191816 88.9872123,40.2191816 C84.6375959,40.2191816 81.8332481,43.8249361 81.8332481,47.8308184 C81.8332481,52.1804348 84.9813299,55.3852941 89.1586957,55.3852941 C91.9630435,55.3852941 94.4240409,54.0122762 95.8546036,51.9514066 L95.8546036,43.6534527 Z M103.294373,61.6806905 L96.1407928,61.6806905 L96.1407928,59.4483376 C93.8516624,61.3945013 91.218798,62.2530691 88.4148338,62.2530691 C84.2942455,62.2530691 80.4026854,60.4219949 77.9413043,57.5601023 C75.7668798,55.0419437 74.3934783,51.6084399 74.3934783,47.8308184 C74.3934783,39.6468031 80.4594629,33.3514066 88.0143223,33.3514066 C91.1620205,33.3514066 93.9659847,34.3822251 96.1407928,36.1561381 L96.1407928,33.9237852 L103.294373,33.9237852 L103.294373,61.6806905 L103.294373,61.6806905 Z" id="Fill-4" fill="#FFFFFE"></path>
            <path d="M168.554348,56.0144501 C165.292327,60.3640665 161.171739,62.2526854 155.963939,62.2526854 C147.379412,62.2526854 141.084015,55.8429668 141.084015,47.8308184 C141.084015,39.761509 147.550895,33.3517903 156.020716,33.3517903 C160.828005,33.3517903 165.12046,35.583376 167.69578,38.9033248 L162.430818,43.5387468 C160.942711,41.5929668 158.710742,40.218798 156.020716,40.218798 C151.728645,40.218798 148.523785,43.5959079 148.523785,47.8308184 C148.523785,52.1804348 151.671483,55.3852941 156.192583,55.3852941 C159.225575,55.3852941 161.629412,53.5538363 162.83133,51.7223785 L168.554348,56.0144501" id="Fill-5" fill="#FFFFFE"></path>
            <path d="M73.2494885,40.5053708 C72.7342711,40.3338875 71.6474425,40.2191816 70.5598465,40.2191816 C67.2978261,40.2191816 64.7225064,42.5658568 63.8067775,44.2250639 L63.8067775,61.6806905 L56.366624,61.6806905 L56.366624,33.9237852 L63.5209719,33.9237852 L63.5209719,36.728133 C65.180179,34.6680307 68.213555,33.3517903 71.5898977,33.3517903 C72.6774936,33.3517903 73.3066496,33.4661125 74.1080563,33.5808184 L73.2494885,40.5053708" id="Fill-6" fill="#FFFFFE"></path>
            <path d="M51.7875959,27.3429668 C51.1580563,27.1714834 50.2423274,27.0567775 49.5556266,27.0567775 C47.7241688,27.0567775 46.2932225,27.5719949 45.3778772,28.6592072 C44.7483376,29.4598465 44.3478261,30.4902813 44.3478261,33.0659847 L44.3478261,33.9237852 L52.9319693,33.9237852 L52.9319693,40.2191816 L44.3478261,40.2191816 L44.3478261,61.6806905 L36.9076726,61.6806905 L36.9076726,40.2191816 L29.7544757,40.2191816 L29.7544757,33.9237852 L36.9076726,33.9237852 L36.9076726,32.7797954 C36.9076726,28.3158568 37.9381074,25.6258312 39.8835038,23.7372123 C41.8296675,21.848977 44.7483376,20.4751918 48.5251918,20.4751918 C50.0136829,20.4751918 51.3867008,20.5895141 52.9319693,20.9904092 L51.7875959,27.3429668" id="Fill-7" fill="#FFFFFE"></path>
            <path d="M219.061381,47.802046 C219.061381,51.9890026 215.667008,55.383376 211.480435,55.383376 C207.293478,55.383376 203.899488,51.9890026 203.899488,47.802046 C203.899488,43.6154731 207.293478,40.2210997 211.480435,40.2210997 C215.667008,40.2210997 219.061381,43.6154731 219.061381,47.802046" id="Fill-8" fill="#FFFFFE"></path>
            <path d="M235.611637,33.9237852 L235.611637,26.1982097 L228.171483,26.1982097 L228.171483,33.9237852 L221.020588,33.9237852 L221.020588,40.218798 L228.171483,40.218798 L228.171483,49.9484655 C228.171483,53.8971867 228.801407,56.3581841 230.231969,58.2468031 C232.120588,60.764578 235.382609,62.2526854 239.846547,62.2526854 C241.27711,62.2526854 243.509079,62.0236573 244.481969,61.6803069 L243.337596,55.3852941 C242.822379,55.4992327 241.391816,55.6714834 240.304604,55.6714834 C238.473146,55.6714834 237.270844,55.156266 236.526982,54.2976982 C235.897442,53.5538363 235.611637,52.5237852 235.611637,50.8066496 L235.611637,40.218798 L244.767008,40.218798 L254.634783,61.6803069 L259.785422,61.6803069 L272.547315,33.9237852 L264.821739,33.9237852 L257.210102,50.8638107 L249.598465,33.9237852 L235.611637,33.9237852" id="Fill-9" fill="#FFFFFE"></path>
        </g>
    </g>
</svg>
