<?xml version="1.0" encoding="UTF-8"?>
<svg width="263px" height="125px" viewBox="0 0 263 125" version="1.1" xmlns="http://www.w3.org/2000/svg" xmlns:xlink="http://www.w3.org/1999/xlink">
    <!-- Generator: Sketch 54.1 (76490) - https://sketchapp.com -->
    <title>Grande cause Make.org - Une vraie place pour les personnes handicapées.</title>
    <defs>
        <rect id="path-1" x="0" y="0" width="166" height="20"></rect>
    </defs>
    <g id="handicap/logo/color" stroke="none" stroke-width="1" fill="none" fill-rule="evenodd">
        <g id="atoms/etiquette/consultation/vecto" transform="translate(49.000000, 0.000000)">
            <mask id="mask-2" fill="white">
                <use xlink:href="#path-1"></use>
            </mask>
            <use id="mask" fill="#000000" fill-rule="evenodd" xlink:href="#path-1"></use>
            <g id="brand/color/black" mask="url(#mask-2)" fill="#000000" fill-rule="evenodd">
                <rect id="color-white-65%" x="0" y="0" width="120" height="15"></rect>
            </g>
            <path d="M17.5812444,11.3169231 L17.5812444,10.1107692 L20.5766222,10.1107692 L20.5766222,14.6153846 L19.6912889,14.6153846 L19.3519111,13.9507692 C18.8059556,14.4923077 18.3632889,14.7384615 17.5074667,14.7384615 C16.0614222,14.7384615 15.0580444,13.8769231 15.0580444,12.4615385 L15.0580444,7.88307692 C15.0580444,6.62769231 15.9433778,5.60615385 17.7435556,5.60615385 C19.5732444,5.60615385 20.4880889,6.71384615 20.4880889,8.04307692 L20.4880889,8.60923077 L18.7469333,8.60923077 C18.7469333,7.28 18.4223111,6.93538462 17.6992889,6.93538462 C17.2566222,6.93538462 16.8877333,7.15692308 16.8877333,7.90769231 L16.8877333,12.4738462 C16.8877333,13.04 17.1090667,13.4092308 17.7435556,13.4092308 C18.4813333,13.4092308 18.7469333,13.0646154 18.7469333,12.1784615 L18.7469333,11.3169231 L17.5812444,11.3169231 Z M24.2655111,6.98461538 L24.2655111,9.71692308 L24.9147556,9.71692308 C25.9033778,9.71692308 26.2722667,9.40923077 26.2722667,8.35076923 C26.2722667,7.29230769 25.9033778,6.98461538 24.9147556,6.98461538 L24.2655111,6.98461538 Z M24.2655111,10.9723077 L24.2655111,14.6153846 L22.4358222,14.6153846 L22.4358222,5.72923077 L25.0032889,5.72923077 C27.0543111,5.72923077 28.1019556,6.45538462 28.1019556,8.35076923 C28.1019556,9.77846154 27.4379556,10.3569231 26.8182222,10.5907692 L28.3675556,14.6153846 L26.5083556,14.6153846 L25.2098667,10.9353846 C24.9737778,10.96 24.5901333,10.9723077 24.2655111,10.9723077 Z M32.1892444,7.50153846 L31.4662222,11.3169231 L32.9417778,11.3169231 L32.2187556,7.50153846 L32.1892444,7.50153846 Z M31.2006222,12.6461538 L30.876,14.6153846 L29.1053333,14.6153846 L31.0678222,5.72923077 L33.3401778,5.72923077 L35.3026667,14.6153846 L33.532,14.6153846 L33.2073778,12.6461538 L31.2006222,12.6461538 Z M38.0176889,14.6153846 L36.3650667,14.6153846 L36.3650667,5.72923077 L38.0619556,5.72923077 L40.2900444,10.8123077 L40.3195556,10.8123077 L40.3195556,5.72923077 L41.9721778,5.72923077 L41.9721778,14.6153846 L40.3785778,14.6153846 L38.0472,9.06461538 L38.0176889,9.06461538 L38.0176889,14.6153846 Z M45.5725333,6.98461538 L45.5725333,13.36 L46.2070222,13.36 C47.1808889,13.36 47.5202667,13.0523077 47.5202667,12.1169231 L47.5202667,8.22769231 C47.5202667,7.29230769 47.1808889,6.98461538 46.2070222,6.98461538 L45.5725333,6.98461538 Z M43.7428444,14.6153846 L43.7428444,5.72923077 L46.4578667,5.72923077 C48.3465778,5.72923077 49.3499556,6.59076923 49.3499556,8.41230769 L49.3499556,11.9323077 C49.3499556,13.7538462 48.3465778,14.6153846 46.4578667,14.6153846 L43.7428444,14.6153846 Z M56.2260444,14.6153846 L51.1206222,14.6153846 L51.1206222,5.72923077 L56.0194667,5.72923077 L56.0194667,7.05846154 L52.9503111,7.05846154 L52.9503111,9.34769231 L55.3112,9.34769231 L55.3112,10.6769231 L52.9503111,10.6769231 L52.9503111,13.2861538 L56.2260444,13.2861538 L56.2260444,14.6153846 Z M66.4664,8.69538462 L64.6367111,8.69538462 L64.6367111,8.00615385 C64.6367111,7.25538462 64.2235556,6.93538462 63.7513778,6.93538462 C63.0136,6.93538462 62.7775111,7.25538462 62.7775111,7.92 L62.7775111,12.4246154 C62.7775111,13.0892308 63.0136,13.4092308 63.7513778,13.4092308 C64.4153778,13.4092308 64.6367111,13.0892308 64.6367111,12.5107692 L64.6367111,11.44 L66.4664,11.44 L66.4664,12.4615385 C66.4664,13.7169231 65.5810667,14.7384615 63.7513778,14.7384615 C61.8331556,14.7384615 60.9478222,13.7169231 60.9478222,12.4615385 L60.9478222,7.88307692 C60.9478222,6.62769231 61.8331556,5.60615385 63.7513778,5.60615385 C65.5810667,5.60615385 66.4664,6.71384615 66.4664,8.04307692 L66.4664,8.69538462 Z M70.7012444,7.50153846 L69.9782222,11.3169231 L71.4537778,11.3169231 L70.7307556,7.50153846 L70.7012444,7.50153846 Z M69.7126222,12.6461538 L69.388,14.6153846 L67.6173333,14.6153846 L69.5798222,5.72923077 L71.8521778,5.72923077 L73.8146667,14.6153846 L72.044,14.6153846 L71.7193778,12.6461538 L69.7126222,12.6461538 Z M74.8770667,12.3753846 L74.8770667,5.72923077 L76.7067556,5.72923077 L76.7067556,12.4369231 C76.7067556,13.0892308 77.0166222,13.4092308 77.6806222,13.4092308 C78.3446222,13.4092308 78.6544889,13.0892308 78.6544889,12.4369231 L78.6544889,5.72923077 L80.4841778,5.72923077 L80.4841778,12.3753846 C80.4841778,13.9015385 79.4217778,14.7384615 77.6806222,14.7384615 C75.9394667,14.7384615 74.8770667,13.9015385 74.8770667,12.3753846 Z M87.3307556,7.76 L85.5896,7.92 C85.5158222,7.15692308 85.0288889,6.93538462 84.6157333,6.93538462 C84.0255111,6.93538462 83.7008889,7.25538462 83.7008889,7.80923077 C83.7008889,9.32307692 87.4192889,10.0492308 87.4192889,12.4615385 C87.4192889,13.9261538 86.2388444,14.7384615 84.5272,14.7384615 C82.8303111,14.7384615 81.8564444,13.6061538 81.7826667,12.2769231 L83.5238222,12.0676923 C83.5976,12.9661538 84.0255111,13.4092308 84.6157333,13.4092308 C85.2502222,13.4092308 85.6781333,13.1261538 85.6781333,12.5969231 C85.6781333,10.8369231 81.9597333,10.3692308 81.9597333,7.82153846 C81.9597333,6.40615385 82.9926222,5.60615385 84.7928,5.60615385 C86.2831111,5.60615385 87.1684444,6.50461538 87.3307556,7.76 Z M93.9117333,14.6153846 L88.8063111,14.6153846 L88.8063111,5.72923077 L93.7051556,5.72923077 L93.7051556,7.05846154 L90.636,7.05846154 L90.636,9.34769231 L92.9968889,9.34769231 L92.9968889,10.6769231 L90.636,10.6769231 L90.636,13.2861538 L93.9117333,13.2861538 L93.9117333,14.6153846 Z M103.561867,5.72923077 L105.967022,5.72923077 L105.967022,14.6153846 L104.373422,14.6153846 L104.373422,7.67384615 L104.343911,7.67384615 L102.691289,14.6153846 L101.805956,14.6153846 L100.153333,7.67384615 L100.123822,7.67384615 L100.123822,14.6153846 L98.5302222,14.6153846 L98.5302222,5.72923077 L100.935378,5.72923077 L102.233867,10.9230769 L102.263378,10.9230769 L103.561867,5.72923077 Z M110.0248,7.50153846 L109.301778,11.3169231 L110.777333,11.3169231 L110.054311,7.50153846 L110.0248,7.50153846 Z M109.036178,12.6461538 L108.711556,14.6153846 L106.940889,14.6153846 L108.903378,5.72923077 L111.175733,5.72923077 L113.138222,14.6153846 L111.367556,14.6153846 L111.042933,12.6461538 L109.036178,12.6461538 Z M115.941778,14.6153846 L114.112089,14.6153846 L114.112089,5.72923077 L115.941778,5.72923077 L115.941778,9.01538462 L115.971289,9.01538462 L117.889511,5.72923077 L119.7192,5.72923077 L117.741956,9.04 L119.970044,14.6153846 L118.110844,14.6153846 L116.620533,10.48 L116.591022,10.48 L115.941778,11.4646154 L115.941778,14.6153846 Z M125.857511,14.6153846 L120.752089,14.6153846 L120.752089,5.72923077 L125.650933,5.72923077 L125.650933,7.05846154 L122.581778,7.05846154 L122.581778,9.34769231 L124.942667,9.34769231 L124.942667,10.6769231 L122.581778,10.6769231 L122.581778,13.2861538 L125.857511,13.2861538 L125.857511,14.6153846 Z M128.926667,14.6153846 L127.185511,14.6153846 L127.185511,13.1630769 L128.926667,13.1630769 L128.926667,14.6153846 Z M130.579289,12.4615385 L130.579289,7.88307692 C130.579289,6.62769231 131.464622,5.60615385 133.382844,5.60615385 C135.301067,5.60615385 136.1864,6.62769231 136.1864,7.88307692 L136.1864,12.4615385 C136.1864,13.7169231 135.301067,14.7384615 133.382844,14.7384615 C131.464622,14.7384615 130.579289,13.7169231 130.579289,12.4615385 Z M132.408978,7.92 L132.408978,12.4246154 C132.408978,13.0892308 132.645067,13.4092308 133.382844,13.4092308 C134.120622,13.4092308 134.356711,13.0892308 134.356711,12.4246154 L134.356711,7.92 C134.356711,7.25538462 134.120622,6.93538462 133.382844,6.93538462 C132.645067,6.93538462 132.408978,7.25538462 132.408978,7.92 Z M139.786756,6.98461538 L139.786756,9.71692308 L140.436,9.71692308 C141.424622,9.71692308 141.793511,9.40923077 141.793511,8.35076923 C141.793511,7.29230769 141.424622,6.98461538 140.436,6.98461538 L139.786756,6.98461538 Z M139.786756,10.9723077 L139.786756,14.6153846 L137.957067,14.6153846 L137.957067,5.72923077 L140.524533,5.72923077 C142.575556,5.72923077 143.6232,6.45538462 143.6232,8.35076923 C143.6232,9.77846154 142.9592,10.3569231 142.339467,10.5907692 L143.8888,14.6153846 L142.0296,14.6153846 L140.731111,10.9353846 C140.495022,10.96 140.111378,10.9723077 139.786756,10.9723077 Z M147.858044,11.3169231 L147.858044,10.1107692 L150.853422,10.1107692 L150.853422,14.6153846 L149.968089,14.6153846 L149.628711,13.9507692 C149.082756,14.4923077 148.640089,14.7384615 147.784267,14.7384615 C146.338222,14.7384615 145.334844,13.8769231 145.334844,12.4615385 L145.334844,7.88307692 C145.334844,6.62769231 146.220178,5.60615385 148.020356,5.60615385 C149.850044,5.60615385 150.764889,6.71384615 150.764889,8.04307692 L150.764889,8.60923077 L149.023733,8.60923077 C149.023733,7.28 148.699111,6.93538462 147.976089,6.93538462 C147.533422,6.93538462 147.164533,7.15692308 147.164533,7.90769231 L147.164533,12.4738462 C147.164533,13.04 147.385867,13.4092308 148.020356,13.4092308 C148.758133,13.4092308 149.023733,13.0646154 149.023733,12.1784615 L149.023733,11.3169231 L147.858044,11.3169231 Z" id="GRANDECAUSEMAKE.ORG" fill="#FFFFFF" fill-rule="nonzero" mask="url(#mask-2)"></path>
        </g>
        <g id="Group-5" transform="translate(65.000000, 28.000000)">
            <rect id="Rectangle" fill="#417505" transform="translate(66.000000, 15.905000) rotate(-1.000000) translate(-66.000000, -15.905000) " x="1" y="2" width="130" height="27.8099992"></rect>
            <g id="Group" transform="translate(10.240000, 6.120000)" fill="#FFFFFF" fill-rule="nonzero">
                <g id="Group-3">
                    <g id="Group-2">
                        <path d="M19.3521545,13.2797701 L21.2988544,2.44314038 L23.9377143,2.44314038 L20.6715844,18.0599999 L17.9894645,18.0599999 L14.7233346,2.44314038 L17.3621945,2.44314038 L19.3088945,13.2797701 L19.3521545,13.2797701 Z M28.1123042,4.64940032 L28.1123042,9.45126018 L29.0640242,9.45126018 C30.5132342,9.45126018 31.0539841,8.9105102 31.0539841,7.05033025 C31.0539841,5.1901503 30.5132342,4.64940032 29.0640242,4.64940032 L28.1123042,4.64940032 Z M28.1123042,11.6575201 L28.1123042,18.0599999 L25.4301843,18.0599999 L25.4301843,2.44314038 L29.1938042,2.44314038 C32.2003741,2.44314038 33.7361041,3.71931034 33.7361041,7.05033025 C33.7361041,9.55941018 32.7627541,10.5760202 31.8542941,10.9869901 L34.1254441,18.0599999 L31.4000641,18.0599999 L29.4966242,11.5926301 C29.1505442,11.6358901 28.5881642,11.6575201 28.1123042,11.6575201 Z M39.7276139,5.55786029 L38.6677439,12.2631601 L40.8307439,12.2631601 L39.7708739,5.55786029 L39.7276139,5.55786029 Z M38.2784039,14.5992 L37.8025439,18.0599999 L35.206944,18.0599999 L38.0837339,2.44314038 L41.4147538,2.44314038 L44.2915438,18.0599999 L41.6959438,18.0599999 L41.2200839,14.5992 L38.2784039,14.5992 Z M48.8987336,18.0599999 L46.2166137,18.0599999 L46.2166137,2.44314038 L48.8987336,2.44314038 L48.8987336,18.0599999 Z M59.3460234,18.0599999 L51.8620436,18.0599999 L51.8620436,2.44314038 L59.0432034,2.44314038 L59.0432034,4.77918031 L54.5441635,4.77918031 L54.5441635,8.8023602 L58.0049634,8.8023602 L58.0049634,11.1384001 L54.5441635,11.1384001 L54.5441635,15.72396 L59.3460234,15.72396 L59.3460234,18.0599999 Z M68.9497431,4.64940032 L68.9497431,9.45126018 L69.9879831,9.45126018 C71.740013,9.45126018 72.280763,8.9105102 72.280763,7.05033025 C72.280763,5.1901503 71.740013,4.64940032 69.9879831,4.64940032 L68.9497431,4.64940032 Z M68.9497431,18.0599999 L66.2676232,18.0599999 L66.2676232,2.44314038 L70.1177631,2.44314038 C73.427153,2.44314038 74.9628829,3.71931034 74.9628829,7.05033025 C74.9628829,10.3813502 73.427153,11.6575201 70.1177631,11.6575201 L68.9497431,11.6575201 L68.9497431,18.0599999 Z M83.8528127,18.0599999 L76.9528429,18.0599999 L76.9528429,2.44314038 L79.6349628,2.44314038 L79.6349628,15.72396 L83.8528127,15.72396 L83.8528127,18.0599999 Z M88.9791225,5.55786029 L87.9192526,12.2631601 L90.0822525,12.2631601 L89.0223825,5.55786029 L88.9791225,5.55786029 Z M87.5299126,14.5992 L87.0540526,18.0599999 L84.4584527,18.0599999 L87.3352426,2.44314038 L90.6662625,2.44314038 L93.5430524,18.0599999 L90.9474525,18.0599999 L90.4715925,14.5992 L87.5299126,14.5992 Z M103.190032,7.65597023 L100.507912,7.65597023 L100.507912,6.44469027 C100.507912,5.1252603 99.9022722,4.56288032 99.2101122,4.56288032 C98.1286123,4.56288032 97.7825323,5.1252603 97.7825323,6.29328027 L97.7825323,14.20986 C97.7825323,15.37788 98.1286123,15.94026 99.2101122,15.94026 C100.183462,15.94026 100.507912,15.37788 100.507912,14.36127 L100.507912,12.4794601 L103.190032,12.4794601 L103.190032,14.27475 C103.190032,16.48101 101.892232,18.2762999 99.2101122,18.2762999 C96.3982123,18.2762999 95.1004124,16.48101 95.1004124,14.27475 L95.1004124,6.22839027 C95.1004124,4.02213033 96.3982123,2.22684038 99.2101122,2.22684038 C101.892232,2.22684038 103.190032,4.17354033 103.190032,6.50958026 L103.190032,7.65597023 Z M113.399392,18.0599999 L105.915412,18.0599999 L105.915412,2.44314038 L113.096572,2.44314038 L113.096572,4.77918031 L108.597532,4.77918031 L108.597532,8.8023602 L112.058332,8.8023602 L112.058332,11.1384001 L108.597532,11.1384001 L108.597532,15.72396 L113.399392,15.72396 L113.399392,18.0599999 Z" id="VRAIEPLACE"></path>
                        <path d="M-3.00045979,11.7379398 L-3.00045979,5.61973994 L-1.59553983,5.61973994 L-1.59553983,11.7945898 C-1.59553983,12.3950798 -1.35760984,12.6896597 -0.847759851,12.6896597 C-0.337909866,12.6896597 -0.0999798722,12.3950798 -0.0999798722,11.7945898 L-0.0999798722,5.61973994 L1.30494009,5.61973994 L1.30494009,11.7379398 C1.30494009,13.1428597 0.489180111,13.9132997 -0.847759851,13.9132997 C-2.18469981,13.9132997 -3.00045979,13.1428597 -3.00045979,11.7379398 Z M3.93350002,13.7999997 L2.66454005,13.7999997 L2.66454005,5.61973994 L3.96749001,5.61973994 L5.67831997,10.2990298 L5.70097997,10.2990298 L5.70097997,5.61973994 L6.96993993,5.61973994 L6.96993993,13.7999997 L5.74629997,13.7999997 L3.95616002,8.69016986 L3.93350002,8.69016986 L3.93350002,13.7999997 Z M12.2497198,13.7999997 L8.32953989,13.7999997 L8.32953989,5.61973994 L12.0910998,5.61973994 L12.0910998,6.84337991 L9.73445985,6.84337991 L9.73445985,8.95075985 L11.5472598,8.95075985 L11.5472598,10.1743998 L9.73445985,10.1743998 L9.73445985,12.5763597 L12.2497198,12.5763597 L12.2497198,13.7999997 Z" id="UNE" transform="translate(4.624630, 9.766520) rotate(-90.000000) translate(-4.624630, -9.766520) "></path>
                    </g>
                </g>
            </g>
        </g>
        <path d="M69.2,96 L74.02,96 L74.02,103.32 C74.2333344,102.706664 74.5599978,102.213335 75,101.84 C75.4400022,101.466665 76.1066622,101.28 77,101.28 C79.066677,101.28 80.1,102.393322 80.1,104.62 L80.1,110.64 L81.22,110.64 L81.22,111 L75.56,111 L75.56,110.64 L76.38,110.64 L76.38,104.14 C76.38,103.339996 76.3266672,102.823335 76.22,102.59 C76.1133328,102.356666 75.9200014,102.24 75.64,102.24 C75.2133312,102.24 74.8366683,102.519997 74.51,103.08 C74.1833317,103.640003 74.02,104.319996 74.02,105.12 L74.02,110.64 L74.88,110.64 L74.88,111 L69.2,111 L69.2,110.64 L70.3,110.64 L70.3,96.36 L69.2,96.36 L69.2,96 Z M87.32,106.3 L87.9,106.3 L87.9,104.76 C87.9,103.493327 87.8300007,102.643336 87.69,102.21 C87.5499993,101.776664 87.280002,101.56 86.88,101.56 C86.6399988,101.56 86.4233343,101.623333 86.23,101.75 C86.0366657,101.876667 85.94,102.049999 85.94,102.27 C85.94,102.490001 85.9799996,102.713332 86.06,102.94 L86.56,102.94 C86.6666672,103.220001 86.72,103.556665 86.72,103.95 C86.72,104.343335 86.553335,104.683332 86.22,104.97 C85.886665,105.256668 85.4666692,105.4 84.96,105.4 C83.8133276,105.4 83.24,104.846672 83.24,103.74 C83.24,102.099992 84.6333194,101.28 87.42,101.28 C89.0066746,101.28 90.1033303,101.549997 90.71,102.09 C91.3166697,102.630003 91.62,103.619993 91.62,105.06 L91.62,109.12 C91.62,109.813337 91.8133314,110.16 92.2,110.16 C92.6533356,110.16 92.9199996,109.47334 93,108.1 L93.3,108.12 C93.2466664,109.293339 93.0266686,110.099998 92.64,110.54 C92.2533314,110.980002 91.6200044,111.2 90.74,111.2 C89.139992,111.2 88.2200012,110.706672 87.98,109.72 C87.8066658,110.226669 87.5466684,110.599999 87.2,110.84 C86.8533316,111.080001 86.34667,111.2 85.68,111.2 C83.7066568,111.2 82.72,110.393341 82.72,108.78 C82.72,107.833329 83.0966629,107.183335 83.85,106.83 C84.6033371,106.476665 85.7599922,106.3 87.32,106.3 Z M86.52,108.76 C86.52,109.453337 86.5566663,109.899999 86.63,110.1 C86.7033337,110.300001 86.8433323,110.4 87.05,110.4 C87.2566677,110.4 87.4499991,110.230002 87.63,109.89 C87.8100009,109.549998 87.9,109.080003 87.9,108.48 L87.9,106.62 L87.76,106.62 C86.9333292,106.62 86.52,107.226661 86.52,108.44 L86.52,108.76 Z M94.54,101.48 L99.36,101.48 L99.36,103.32 C99.5733344,102.706664 99.8999978,102.213335 100.34,101.84 C100.780002,101.466665 101.446662,101.28 102.34,101.28 C104.406677,101.28 105.44,102.393322 105.44,104.62 L105.44,110.64 L106.56,110.64 L106.56,111 L100.9,111 L100.9,110.64 L101.72,110.64 L101.72,104.14 C101.72,103.339996 101.666667,102.823335 101.56,102.59 C101.453333,102.356666 101.260001,102.24 100.98,102.24 C100.553331,102.24 100.176668,102.519997 99.85,103.08 C99.5233317,103.640003 99.36,104.319996 99.36,105.12 L99.36,110.64 L100.22,110.64 L100.22,111 L94.54,111 L94.54,110.64 L95.64,110.64 L95.64,101.84 L94.54,101.84 L94.54,101.48 Z M111.88,106.86 C111.88,108.260007 111.953333,109.189998 112.1,109.65 C112.246667,110.110002 112.516665,110.34 112.91,110.34 C113.303335,110.34 113.643332,110.166668 113.93,109.82 C114.216668,109.473332 114.36,108.960003 114.36,108.28 L114.36,103.92 C114.36,103.346664 114.246668,102.860002 114.02,102.46 C113.793332,102.059998 113.460002,101.86 113.02,101.86 C112.579998,101.86 112.280001,102.15333 112.12,102.74 C111.959999,103.32667 111.88,104.353326 111.88,105.82 L111.88,106.86 Z M114.62,111 L114.4,109.6 C113.946664,110.666672 113.026674,111.2 111.64,111.2 C110.493328,111.2 109.603337,110.786671 108.97,109.96 C108.336664,109.133329 108.02,107.900008 108.02,106.26 C108.02,102.939983 109.339987,101.28 111.98,101.28 C113.153339,101.28 113.926665,101.606663 114.3,102.26 L114.3,96.36 L113.08,96.36 L113.08,96 L118.08,96 L118.08,110.64 L119.06,110.64 L119.06,111 L114.62,111 Z M123.52,100.1 C122.81333,100.1 122.310001,99.9200018 122.01,99.56 C121.709998,99.1999982 121.56,98.753336 121.56,98.22 C121.56,97.686664 121.723332,97.2466684 122.05,96.9 C122.376668,96.5533316 122.87333,96.38 123.54,96.38 C124.20667,96.38 124.713332,96.5366651 125.06,96.85 C125.406668,97.1633349 125.58,97.6099971 125.58,98.19 C125.58,98.7700029 125.413335,99.2333316 125.08,99.58 C124.746665,99.9266684 124.22667,100.1 123.52,100.1 Z M120.5,101.48 L125.4,101.48 L125.4,110.64 L126.52,110.64 L126.52,111 L120.58,111 L120.58,110.64 L121.68,110.64 L121.68,101.84 L120.5,101.84 L120.5,101.48 Z M133.52,101.64 C132.93333,101.64 132.513335,101.959997 132.26,102.6 C132.006665,103.240003 131.88,104.299993 131.88,105.78 L131.88,106.82 C131.88,108.140007 132.026665,109.086664 132.32,109.66 C132.613335,110.233336 133.153329,110.52 133.94,110.52 C134.726671,110.52 135.353331,110.253336 135.82,109.72 C136.286669,109.186664 136.586666,108.580003 136.72,107.9 L137.08,107.94 C136.826665,109.086672 136.360003,109.913331 135.68,110.42 C134.986663,110.940003 134.033339,111.2 132.82,111.2 C131.273326,111.2 130.086671,110.783338 129.26,109.95 C128.433329,109.116663 128.02,107.896675 128.02,106.29 C128.02,104.683325 128.489995,103.446671 129.43,102.58 C130.370005,101.713329 131.679992,101.28 133.36,101.28 C134.546673,101.28 135.45333,101.509998 136.08,101.97 C136.70667,102.430002 137.02,103.006663 137.02,103.7 C137.02,104.393337 136.870002,104.899998 136.57,105.22 C136.269998,105.540002 135.856669,105.7 135.33,105.7 C134.803331,105.7 134.380002,105.560001 134.06,105.28 C133.739998,104.999999 133.58,104.586669 133.58,104.04 C133.58,103.799999 133.613333,103.560001 133.68,103.32 L134.34,103.32 C134.433334,103.053332 134.48,102.813334 134.48,102.6 C134.48,101.959997 134.160003,101.64 133.52,101.64 Z M143.38,106.3 L143.96,106.3 L143.96,104.76 C143.96,103.493327 143.890001,102.643336 143.75,102.21 C143.609999,101.776664 143.340002,101.56 142.94,101.56 C142.699999,101.56 142.483334,101.623333 142.29,101.75 C142.096666,101.876667 142,102.049999 142,102.27 C142,102.490001 142.04,102.713332 142.12,102.94 L142.62,102.94 C142.726667,103.220001 142.78,103.556665 142.78,103.95 C142.78,104.343335 142.613335,104.683332 142.28,104.97 C141.946665,105.256668 141.526669,105.4 141.02,105.4 C139.873328,105.4 139.3,104.846672 139.3,103.74 C139.3,102.099992 140.693319,101.28 143.48,101.28 C145.066675,101.28 146.16333,101.549997 146.77,102.09 C147.37667,102.630003 147.68,103.619993 147.68,105.06 L147.68,109.12 C147.68,109.813337 147.873331,110.16 148.26,110.16 C148.713336,110.16 148.98,109.47334 149.06,108.1 L149.36,108.12 C149.306666,109.293339 149.086669,110.099998 148.7,110.54 C148.313331,110.980002 147.680004,111.2 146.8,111.2 C145.199992,111.2 144.280001,110.706672 144.04,109.72 C143.866666,110.226669 143.606668,110.599999 143.26,110.84 C142.913332,111.080001 142.40667,111.2 141.74,111.2 C139.766657,111.2 138.78,110.393341 138.78,108.78 C138.78,107.833329 139.156663,107.183335 139.91,106.83 C140.663337,106.476665 141.819992,106.3 143.38,106.3 Z M142.58,108.76 C142.58,109.453337 142.616666,109.899999 142.69,110.1 C142.763334,110.300001 142.903332,110.4 143.11,110.4 C143.316668,110.4 143.509999,110.230002 143.69,109.89 C143.870001,109.549998 143.96,109.080003 143.96,108.48 L143.96,106.62 L143.82,106.62 C142.993329,106.62 142.58,107.226661 142.58,108.44 L142.58,108.76 Z M157.66,105.62 C157.66,104.24666 157.593334,103.323336 157.46,102.85 C157.326666,102.376664 157.066669,102.14 156.68,102.14 C156.293331,102.14 155.946668,102.389997 155.64,102.89 C155.333332,103.390002 155.18,104.059996 155.18,104.9 L155.18,108.56 C155.18,109.133336 155.293332,109.619998 155.52,110.02 C155.746668,110.420002 156.079998,110.62 156.52,110.62 C156.960002,110.62 157.259999,110.32667 157.42,109.74 C157.580001,109.15333 157.66,108.126674 157.66,106.66 L157.66,105.62 Z M155.14,101.48 L155.14,103.06 C155.660003,101.873327 156.579993,101.28 157.9,101.28 C159.046672,101.28 159.936664,101.693329 160.57,102.52 C161.203336,103.346671 161.52,104.599992 161.52,106.28 C161.52,107.960008 161.17667,109.199996 160.49,110 C159.80333,110.800004 158.77334,111.2 157.4,111.2 C156.759997,111.2 156.280002,111.120001 155.96,110.96 C155.639998,110.799999 155.380001,110.553335 155.18,110.22 L155.18,115.4 L157.76,115.4 L157.76,115.76 L150.36,115.76 L150.36,115.4 L151.46,115.4 L151.46,101.84 L150.4,101.84 L150.4,101.48 L155.14,101.48 Z M168.38,111.2 C166.659991,111.2 165.370004,110.756671 164.51,109.87 C163.649996,108.983329 163.22,107.750008 163.22,106.17 C163.22,104.589992 163.703328,103.380004 164.67,102.54 C165.636671,101.699996 166.866659,101.28 168.36,101.28 C171.386682,101.28 172.840001,102.799985 172.72,105.84 L167.08,105.84 L167.08,106.62 C167.08,107.926673 167.246665,108.91333 167.58,109.58 C167.913335,110.24667 168.493329,110.58 169.32,110.58 C170.866674,110.58 171.879998,109.753342 172.36,108.1 L172.72,108.16 C172.466665,109.120005 172.010003,109.866664 171.35,110.4 C170.689997,110.933336 169.700007,111.2 168.38,111.2 Z M169.16,105.44 L169.16,104.46 C169.16,103.379995 169.096667,102.643335 168.97,102.25 C168.843333,101.856665 168.590002,101.66 168.21,101.66 C167.829998,101.66 167.550001,101.869998 167.37,102.29 C167.189999,102.710002 167.1,103.433328 167.1,104.46 L167.1,105.44 L169.16,105.44 Z M166.88,100.06 L168.14,96.24 L169.08,96.04 C169.493335,95.9466662 169.809999,95.9966657 170.03,96.19 C170.250001,96.3833343 170.36,96.6433317 170.36,96.97 C170.36,97.2966683 170.166669,97.6333316 169.78,97.98 L167.1,100.2 L166.88,100.06 Z M179.7,111.2 C177.979991,111.2 176.690004,110.756671 175.83,109.87 C174.969996,108.983329 174.54,107.750008 174.54,106.17 C174.54,104.589992 175.023328,103.380004 175.99,102.54 C176.956672,101.699996 178.186659,101.28 179.68,101.28 C182.706682,101.28 184.160001,102.799985 184.04,105.84 L178.4,105.84 L178.4,106.62 C178.4,107.926673 178.566665,108.91333 178.9,109.58 C179.233335,110.24667 179.813329,110.58 180.64,110.58 C182.186674,110.58 183.199998,109.753342 183.68,108.1 L184.04,108.16 C183.786665,109.120005 183.330003,109.866664 182.67,110.4 C182.009997,110.933336 181.020007,111.2 179.7,111.2 Z M178.42,105.44 L180.48,105.44 L180.48,104.46 C180.48,103.379995 180.416667,102.643335 180.29,102.25 C180.163333,101.856665 179.910002,101.66 179.53,101.66 C179.149998,101.66 178.870001,101.869998 178.69,102.29 C178.509999,102.710002 178.42,103.433328 178.42,104.46 L178.42,105.44 Z M186.22,111.2 L186.22,107.62 L186.46,107.62 C186.806668,108.780006 187.27333,109.593331 187.86,110.06 C188.44667,110.526669 189.179996,110.76 190.06,110.76 C191.420007,110.76 192.1,110.326671 192.1,109.46 C192.1,109.086665 191.933335,108.806668 191.6,108.62 C191.079997,108.326665 190.413337,108.100001 189.6,107.94 C188.693329,107.699999 187.933336,107.380002 187.32,106.98 C186.586663,106.499998 186.22,105.74 186.22,104.7 C186.22,103.659995 186.539997,102.830003 187.18,102.21 C187.820003,101.589997 188.673328,101.28 189.74,101.28 C190.393337,101.28 191.066663,101.433332 191.76,101.74 C192.013335,101.846667 192.206666,101.9 192.34,101.9 C192.473334,101.9 192.586666,101.853334 192.68,101.76 C192.773334,101.666666 192.886666,101.493335 193.02,101.24 L193.24,101.24 L193.24,104.3 L193,104.3 C192.319997,102.566658 191.266674,101.7 189.84,101.7 C189.21333,101.7 188.746668,101.809999 188.44,102.03 C188.133332,102.250001 187.98,102.526665 187.98,102.86 C187.98,103.060001 188.026666,103.216666 188.12,103.33 C188.213334,103.443334 188.286666,103.526666 188.34,103.58 C188.393334,103.633334 188.479999,103.69 188.6,103.75 C188.720001,103.81 188.82,103.856667 188.9,103.89 C188.98,103.923333 189.103332,103.966666 189.27,104.02 C189.436667,104.073334 189.56,104.106667 189.64,104.12 C190.546671,104.346668 191.199998,104.543333 191.6,104.71 C192.000002,104.876667 192.379998,105.079999 192.74,105.32 C193.473337,105.826669 193.84,106.643328 193.84,107.77 C193.84,108.896672 193.50667,109.749997 192.84,110.33 C192.17333,110.910003 191.260006,111.2 190.1,111.2 C189.273329,111.2 188.473337,111.006669 187.7,110.62 C187.539999,110.513333 187.413334,110.46 187.32,110.46 C187.026665,110.46 186.740001,110.706664 186.46,111.2 L186.22,111.2 Z" id="handicapées" fill="#2639AD" fill-rule="nonzero"></path>
        <path d="M29,77.544 C29,75.8959918 28.9200008,74.7880028 28.76,74.22 C28.5999992,73.6519972 28.2880023,73.368 27.824,73.368 C27.3599977,73.368 26.9440018,73.667997 26.576,74.268 C26.2079982,74.868003 26.024,75.671995 26.024,76.68 L26.024,81.072 C26.024,81.7600034 26.1599986,82.3439976 26.432,82.824 C26.7040014,83.3040024 27.1039974,83.544 27.632,83.544 C28.1600026,83.544 28.519999,83.1920035 28.712,82.488 C28.904001,81.7839965 29,80.5520088 29,78.792 L29,77.544 Z M25.976,72.576 L25.976,74.472 C26.6000031,73.0479929 27.7039921,72.336 29.288,72.336 C30.6640069,72.336 31.7319962,72.831995 32.492,73.824 C33.2520038,74.816005 33.632,76.3199899 33.632,78.336 C33.632,80.3520101 33.2200041,81.8399952 32.396,82.8 C31.5719959,83.7600048 30.3360082,84.24 28.688,84.24 C27.9199962,84.24 27.3440019,84.144001 26.96,83.952 C26.5759981,83.759999 26.2640012,83.464002 26.024,83.064 L26.024,89.28 L29.12,89.28 L29.12,89.712 L20.24,89.712 L20.24,89.28 L21.56,89.28 L21.56,73.008 L20.288,73.008 L20.288,72.576 L25.976,72.576 Z M43.104,79.272 L43.104,77.232 C43.104,75.6799922 43.0200008,74.5480036 42.852,73.836 C42.6839992,73.1239964 42.296003,72.768 41.688,72.768 C41.3359982,72.768 41.0520011,72.867999 40.836,73.068 C40.6199989,73.268001 40.4640005,73.5999977 40.368,74.064 C40.2239993,74.7840036 40.152,75.8799926 40.152,77.352 L40.152,79.224 C40.152,80.9680087 40.2039995,82.0159982 40.308,82.368 C40.4120005,82.7200018 40.5199994,83.0079989 40.632,83.232 C40.8080009,83.6160019 41.1519974,83.808 41.664,83.808 C42.2880031,83.808 42.695999,83.4480036 42.888,82.728 C43.0320007,82.2159974 43.104,81.064009 43.104,79.272 Z M41.616,84.24 C39.61599,84.24 38.1040051,83.7280051 37.08,82.704 C36.0559949,81.6799949 35.544,80.2120096 35.544,78.3 C35.544,76.3879904 36.0919945,74.9160052 37.188,73.884 C38.2840055,72.8519948 39.8239901,72.336 41.808,72.336 C43.7920099,72.336 45.2719951,72.8119952 46.248,73.764 C47.2240049,74.7160048 47.712,76.1679902 47.712,78.12 C47.712,82.2000204 45.6800203,84.24 41.616,84.24 Z M63.424,84 L57.952,84 L57.688,82.248 C57.4319987,82.8880032 57.0520025,83.3799983 56.548,83.724 C56.0439975,84.0680017 55.296005,84.24 54.304,84.24 C51.8239876,84.24 50.584,82.9040134 50.584,80.232 L50.584,73.008 L49.24,73.008 L49.24,72.576 L55.048,72.576 L55.048,80.808 C55.048,81.7680048 55.1159993,82.3999985 55.252,82.704 C55.3880007,83.0080015 55.659998,83.16 56.068,83.16 C56.476002,83.16 56.8399984,82.9120025 57.16,82.416 C57.4800016,81.9199975 57.64,81.2320044 57.64,80.352 L57.64,73.008 L56.536,73.008 L56.536,72.576 L62.104,72.576 L62.104,83.568 L63.424,83.568 L63.424,84 Z M72.92,73.248 C72.327997,73.248 71.8080022,73.6319962 71.36,74.4 C70.9119978,75.1680038 70.688,76.0799947 70.688,77.136 L70.688,83.568 L72.392,83.568 L72.392,84 L64.904,84 L64.904,83.568 L66.224,83.568 L66.224,73.008 L64.904,73.008 L64.904,72.576 L70.688,72.576 L70.688,74.88 C70.896001,74.0639959 71.295997,73.4360022 71.888,72.996 C72.480003,72.5559978 73.1519962,72.336 73.904,72.336 C74.6560038,72.336 75.2679976,72.5479979 75.74,72.972 C76.2120024,73.3960021 76.448,73.9959961 76.448,74.772 C76.448,75.5480039 76.2720018,76.1439979 75.92,76.56 C75.5679982,76.9760021 75.0280036,77.184 74.3,77.184 C73.5719964,77.184 73.0360017,76.9440024 72.692,76.464 C72.3479983,75.9839976 72.3039987,75.3200042 72.56,74.472 L73.424,74.472 C73.824002,73.6559959 73.6560037,73.248 72.92,73.248 Z M83.008,66 L88.888,66 L88.888,83.568 L90.232,83.568 L90.232,84 L83.104,84 L83.104,83.568 L84.424,83.568 L84.424,66.432 L83.008,66.432 L83.008,66 Z M98,84.24 C95.9359897,84.24 94.3880052,83.7080053 93.356,82.644 C92.3239948,81.5799947 91.808,80.1000095 91.808,78.204 C91.808,76.3079905 92.3879942,74.856005 93.548,73.848 C94.7080058,72.839995 96.183991,72.336 97.976,72.336 C101.608018,72.336 103.352001,74.1599818 103.208,77.808 L96.44,77.808 L96.44,78.744 C96.44,80.3120078 96.639998,81.495996 97.04,82.296 C97.440002,83.096004 98.135995,83.496 99.128,83.496 C100.984009,83.496 102.199997,82.5040099 102.776,80.52 L103.208,80.592 C102.903998,81.7440058 102.356004,82.6399968 101.564,83.28 C100.771996,83.9200032 99.5840079,84.24 98,84.24 Z M96.464,77.328 L98.936,77.328 L98.936,76.152 C98.936,74.8559935 98.8600008,73.9720024 98.708,73.5 C98.5559992,73.0279976 98.2520023,72.792 97.796,72.792 C97.3399977,72.792 97.0040011,73.0439975 96.788,73.548 C96.5719989,74.0520025 96.464,74.9199938 96.464,76.152 L96.464,77.328 Z M105.384,84.24 L105.384,79.944 L105.672,79.944 C106.088002,81.336007 106.647996,82.3119972 107.352,82.872 C108.056004,83.4320028 108.935995,83.712 109.992,83.712 C111.624008,83.712 112.44,83.1920052 112.44,82.152 C112.44,81.7039978 112.240002,81.3680011 111.84,81.144 C111.215997,80.7919982 110.416005,80.520001 109.44,80.328 C108.351995,80.0399986 107.440004,79.6560024 106.704,79.176 C105.823996,78.5999971 105.384,77.6880062 105.384,76.44 C105.384,75.1919938 105.767996,74.1960037 106.536,73.452 C107.304004,72.7079963 108.327994,72.336 109.608,72.336 C110.392004,72.336 111.199996,72.5199982 112.032,72.888 C112.336002,73.0160006 112.567999,73.08 112.728,73.08 C112.888001,73.08 113.023999,73.0240006 113.136,72.912 C113.248001,72.7999994 113.383999,72.5920015 113.544,72.288 L113.808,72.288 L113.808,75.96 L113.52,75.96 C112.703996,73.8799896 111.440009,72.84 109.728,72.84 C108.975996,72.84 108.416002,72.9719987 108.048,73.236 C107.679998,73.5000013 107.496,73.831998 107.496,74.232 C107.496,74.4720012 107.551999,74.6599993 107.664,74.796 C107.776001,74.9320007 107.864,75.0319997 107.928,75.096 C107.992,75.1600003 108.095999,75.2279996 108.24,75.3 C108.384001,75.3720004 108.504,75.4279998 108.6,75.468 C108.696,75.5080002 108.843999,75.5599997 109.044,75.624 C109.244001,75.6880003 109.392,75.7279999 109.488,75.744 C110.576005,76.0160014 111.359998,76.251999 111.84,76.452 C112.320002,76.652001 112.775998,76.8959986 113.208,77.184 C114.088004,77.792003 114.528,78.7719932 114.528,80.124 C114.528,81.4760068 114.128004,82.4999965 113.328,83.196 C112.527996,83.8920035 111.432007,84.24 110.04,84.24 C109.047995,84.24 108.088005,84.0080023 107.16,83.544 C106.967999,83.4159994 106.816001,83.352 106.704,83.352 C106.351998,83.352 106.008002,83.647997 105.672,84.24 L105.384,84.24 Z M130.328,77.544 C130.328,75.8959918 130.248001,74.7880028 130.088,74.22 C129.927999,73.6519972 129.616002,73.368 129.152,73.368 C128.687998,73.368 128.272002,73.667997 127.904,74.268 C127.535998,74.868003 127.352,75.671995 127.352,76.68 L127.352,81.072 C127.352,81.7600034 127.487999,82.3439976 127.76,82.824 C128.032001,83.3040024 128.431997,83.544 128.96,83.544 C129.488003,83.544 129.847999,83.1920035 130.04,82.488 C130.232001,81.7839965 130.328,80.5520088 130.328,78.792 L130.328,77.544 Z M127.304,72.576 L127.304,74.472 C127.928003,73.0479929 129.031992,72.336 130.616,72.336 C131.992007,72.336 133.059996,72.831995 133.82,73.824 C134.580004,74.816005 134.96,76.3199899 134.96,78.336 C134.96,80.3520101 134.548004,81.8399952 133.724,82.8 C132.899996,83.7600048 131.664008,84.24 130.016,84.24 C129.247996,84.24 128.672002,84.144001 128.288,83.952 C127.903998,83.759999 127.592001,83.464002 127.352,83.064 L127.352,89.28 L130.448,89.28 L130.448,89.712 L121.568,89.712 L121.568,89.28 L122.888,89.28 L122.888,73.008 L121.616,73.008 L121.616,72.576 L127.304,72.576 Z M142.992,84.24 C140.92799,84.24 139.380005,83.7080053 138.348,82.644 C137.315995,81.5799947 136.8,80.1000095 136.8,78.204 C136.8,76.3079905 137.379994,74.856005 138.54,73.848 C139.700006,72.839995 141.175991,72.336 142.968,72.336 C146.600018,72.336 148.344001,74.1599818 148.2,77.808 L141.432,77.808 L141.432,78.744 C141.432,80.3120078 141.631998,81.495996 142.032,82.296 C142.432002,83.096004 143.127995,83.496 144.12,83.496 C145.976009,83.496 147.191997,82.5040099 147.768,80.52 L148.2,80.592 C147.895998,81.7440058 147.348004,82.6399968 146.556,83.28 C145.763996,83.9200032 144.576008,84.24 142.992,84.24 Z M141.456,77.328 L143.928,77.328 L143.928,76.152 C143.928,74.8559935 143.852001,73.9720024 143.7,73.5 C143.547999,73.0279976 143.244002,72.792 142.788,72.792 C142.331998,72.792 141.996001,73.0439975 141.78,73.548 C141.563999,74.0520025 141.456,74.9199938 141.456,76.152 L141.456,77.328 Z M158.08,73.248 C157.487997,73.248 156.968002,73.6319962 156.52,74.4 C156.071998,75.1680038 155.848,76.0799947 155.848,77.136 L155.848,83.568 L157.552,83.568 L157.552,84 L150.064,84 L150.064,83.568 L151.384,83.568 L151.384,73.008 L150.064,73.008 L150.064,72.576 L155.848,72.576 L155.848,74.88 C156.056001,74.0639959 156.455997,73.4360022 157.048,72.996 C157.640003,72.5559978 158.311996,72.336 159.064,72.336 C159.816004,72.336 160.427998,72.5479979 160.9,72.972 C161.372002,73.3960021 161.608,73.9959961 161.608,74.772 C161.608,75.5480039 161.432002,76.1439979 161.08,76.56 C160.727998,76.9760021 160.188004,77.184 159.46,77.184 C158.731996,77.184 158.196002,76.9440024 157.852,76.464 C157.507998,75.9839976 157.463999,75.3200042 157.72,74.472 L158.584,74.472 C158.984002,73.6559959 158.816004,73.248 158.08,73.248 Z M163.208,84.24 L163.208,79.944 L163.496,79.944 C163.912002,81.336007 164.471996,82.3119972 165.176,82.872 C165.880004,83.4320028 166.759995,83.712 167.816,83.712 C169.448008,83.712 170.264,83.1920052 170.264,82.152 C170.264,81.7039978 170.064002,81.3680011 169.664,81.144 C169.039997,80.7919982 168.240005,80.520001 167.264,80.328 C166.175995,80.0399986 165.264004,79.6560024 164.528,79.176 C163.647996,78.5999971 163.208,77.6880062 163.208,76.44 C163.208,75.1919938 163.591996,74.1960037 164.36,73.452 C165.128004,72.7079963 166.151994,72.336 167.432,72.336 C168.216004,72.336 169.023996,72.5199982 169.856,72.888 C170.160002,73.0160006 170.391999,73.08 170.552,73.08 C170.712001,73.08 170.847999,73.0240006 170.96,72.912 C171.072001,72.7999994 171.207999,72.5920015 171.368,72.288 L171.632,72.288 L171.632,75.96 L171.344,75.96 C170.527996,73.8799896 169.264009,72.84 167.552,72.84 C166.799996,72.84 166.240002,72.9719987 165.872,73.236 C165.503998,73.5000013 165.32,73.831998 165.32,74.232 C165.32,74.4720012 165.375999,74.6599993 165.488,74.796 C165.600001,74.9320007 165.688,75.0319997 165.752,75.096 C165.816,75.1600003 165.919999,75.2279996 166.064,75.3 C166.208001,75.3720004 166.328,75.4279998 166.424,75.468 C166.52,75.5080002 166.667999,75.5599997 166.868,75.624 C167.068001,75.6880003 167.216,75.7279999 167.312,75.744 C168.400005,76.0160014 169.183998,76.251999 169.664,76.452 C170.144002,76.652001 170.599998,76.8959986 171.032,77.184 C171.912004,77.792003 172.352,78.7719932 172.352,80.124 C172.352,81.4760068 171.952004,82.4999965 171.152,83.196 C170.351996,83.8920035 169.256007,84.24 167.864,84.24 C166.871995,84.24 165.912005,84.0080023 164.984,83.544 C164.791999,83.4159994 164.640001,83.352 164.528,83.352 C164.175998,83.352 163.832002,83.647997 163.496,84.24 L163.208,84.24 Z M181.824,79.272 L181.824,77.232 C181.824,75.6799922 181.740001,74.5480036 181.572,73.836 C181.403999,73.1239964 181.016003,72.768 180.408,72.768 C180.055998,72.768 179.772001,72.867999 179.556,73.068 C179.339999,73.268001 179.184,73.5999977 179.088,74.064 C178.943999,74.7840036 178.872,75.8799926 178.872,77.352 L178.872,79.224 C178.872,80.9680087 178.923999,82.0159982 179.028,82.368 C179.132001,82.7200018 179.239999,83.0079989 179.352,83.232 C179.528001,83.6160019 179.871997,83.808 180.384,83.808 C181.008003,83.808 181.415999,83.4480036 181.608,82.728 C181.752001,82.2159974 181.824,81.064009 181.824,79.272 Z M180.336,84.24 C178.33599,84.24 176.824005,83.7280051 175.8,82.704 C174.775995,81.6799949 174.264,80.2120096 174.264,78.3 C174.264,76.3879904 174.811995,74.9160052 175.908,73.884 C177.004005,72.8519948 178.54399,72.336 180.528,72.336 C182.51201,72.336 183.991995,72.8119952 184.968,73.764 C185.944005,74.7160048 186.432,76.1679902 186.432,78.12 C186.432,82.2000204 184.40002,84.24 180.336,84.24 Z M188.152,72.576 L193.936,72.576 L193.936,74.784 C194.192001,74.0479963 194.583997,73.4560022 195.112,73.008 C195.640003,72.5599978 196.439995,72.336 197.512,72.336 C199.992012,72.336 201.232,73.6719866 201.232,76.344 L201.232,83.568 L202.576,83.568 L202.576,84 L195.784,84 L195.784,83.568 L196.768,83.568 L196.768,75.768 C196.768,74.8079952 196.704001,74.1880014 196.576,73.908 C196.447999,73.6279986 196.216002,73.488 195.88,73.488 C195.367997,73.488 194.916002,73.8239966 194.524,74.496 C194.131998,75.1680034 193.936,75.9839952 193.936,76.944 L193.936,83.568 L194.968,83.568 L194.968,84 L188.152,84 L188.152,83.568 L189.472,83.568 L189.472,73.008 L188.152,73.008 L188.152,72.576 Z M203.936,72.576 L209.72,72.576 L209.72,74.784 C209.976001,74.0479963 210.367997,73.4560022 210.896,73.008 C211.424003,72.5599978 212.223995,72.336 213.296,72.336 C215.776012,72.336 217.016,73.6719866 217.016,76.344 L217.016,83.568 L218.36,83.568 L218.36,84 L211.568,84 L211.568,83.568 L212.552,83.568 L212.552,75.768 C212.552,74.8079952 212.488001,74.1880014 212.36,73.908 C212.231999,73.6279986 212.000002,73.488 211.664,73.488 C211.151997,73.488 210.700002,73.8239966 210.308,74.496 C209.915998,75.1680034 209.72,75.9839952 209.72,76.944 L209.72,83.568 L210.752,83.568 L210.752,84 L203.936,84 L203.936,83.568 L205.256,83.568 L205.256,73.008 L203.936,73.008 L203.936,72.576 Z M225.984,84.24 C223.91999,84.24 222.372005,83.7080053 221.34,82.644 C220.307995,81.5799947 219.792,80.1000095 219.792,78.204 C219.792,76.3079905 220.371994,74.856005 221.532,73.848 C222.692006,72.839995 224.167991,72.336 225.96,72.336 C229.592018,72.336 231.336001,74.1599818 231.192,77.808 L224.424,77.808 L224.424,78.744 C224.424,80.3120078 224.623998,81.495996 225.024,82.296 C225.424002,83.096004 226.119995,83.496 227.112,83.496 C228.968009,83.496 230.183997,82.5040099 230.76,80.52 L231.192,80.592 C230.887998,81.7440058 230.340004,82.6399968 229.548,83.28 C228.755996,83.9200032 227.568008,84.24 225.984,84.24 Z M224.448,77.328 L226.92,77.328 L226.92,76.152 C226.92,74.8559935 226.844001,73.9720024 226.692,73.5 C226.539999,73.0279976 226.236002,72.792 225.78,72.792 C225.323998,72.792 224.988001,73.0439975 224.772,73.548 C224.555999,74.0520025 224.448,74.9199938 224.448,76.152 L224.448,77.328 Z M233.608,84.24 L233.608,79.944 L233.896,79.944 C234.312002,81.336007 234.871996,82.3119972 235.576,82.872 C236.280004,83.4320028 237.159995,83.712 238.216,83.712 C239.848008,83.712 240.664,83.1920052 240.664,82.152 C240.664,81.7039978 240.464002,81.3680011 240.064,81.144 C239.439997,80.7919982 238.640005,80.520001 237.664,80.328 C236.575995,80.0399986 235.664004,79.6560024 234.928,79.176 C234.047996,78.5999971 233.608,77.6880062 233.608,76.44 C233.608,75.1919938 233.991996,74.1960037 234.76,73.452 C235.528004,72.7079963 236.551994,72.336 237.832,72.336 C238.616004,72.336 239.423996,72.5199982 240.256,72.888 C240.560002,73.0160006 240.791999,73.08 240.952,73.08 C241.112001,73.08 241.247999,73.0240006 241.36,72.912 C241.472001,72.7999994 241.607999,72.5920015 241.768,72.288 L242.032,72.288 L242.032,75.96 L241.744,75.96 C240.927996,73.8799896 239.664009,72.84 237.952,72.84 C237.199996,72.84 236.640002,72.9719987 236.272,73.236 C235.903998,73.5000013 235.72,73.831998 235.72,74.232 C235.72,74.4720012 235.775999,74.6599993 235.888,74.796 C236.000001,74.9320007 236.088,75.0319997 236.152,75.096 C236.216,75.1600003 236.319999,75.2279996 236.464,75.3 C236.608001,75.3720004 236.728,75.4279998 236.824,75.468 C236.92,75.5080002 237.067999,75.5599997 237.268,75.624 C237.468001,75.6880003 237.616,75.7279999 237.712,75.744 C238.800005,76.0160014 239.583998,76.251999 240.064,76.452 C240.544002,76.652001 240.999998,76.8959986 241.432,77.184 C242.312004,77.792003 242.752,78.7719932 242.752,80.124 C242.752,81.4760068 242.352004,82.4999965 241.552,83.196 C240.751996,83.8920035 239.656007,84.24 238.264,84.24 C237.271995,84.24 236.312005,84.0080023 235.384,83.544 C235.191999,83.4159994 235.040001,83.352 234.928,83.352 C234.575998,83.352 234.232002,83.647997 233.896,84.24 L233.608,84.24 Z" id="pourlespersonnes" fill="#2639AD" fill-rule="nonzero"></path>
    </g>
</svg>
