\relax 
\providecommand\hyper@newdestlabel[2]{}
\providecommand\HyperFirstAtBeginDocument{\AtBeginDocument}
\HyperFirstAtBeginDocument{\ifx\hyper@anchor\@undefined
\global\let\oldcontentsline\contentsline
\gdef\contentsline#1#2#3#4{\oldcontentsline{#1}{#2}{#3}}
\global\let\oldnewlabel\newlabel
\gdef\newlabel#1#2{\newlabelxx{#1}#2}
\gdef\newlabelxx#1#2#3#4#5#6{\oldnewlabel{#1}{{#2}{#3}}}
\AtEndDocument{\ifx\hyper@anchor\@undefined
\let\contentsline\oldcontentsline
\let\newlabel\oldnewlabel
\fi}
\fi}
\global\let\hyper@last\relax 
\gdef\HyperFirstAtBeginDocument#1{#1}
\providecommand\HyField@AuxAddToFields[1]{}
\providecommand\HyField@AuxAddToCoFields[2]{}
\bibstyle{elsarticle-num}
\urlauthor{www.elsevier.com}{Elsevier Inc}
\emailauthor{support@elsevier.com}{Global Customer Service\corref {mycorrespondingauthor}}
\citation{solarprojectsinmarket}
\citation{solarmanufacturing}
\citation{4150446}
\citation{facingthesun2009}
\citation{CHANG20091530}
\citation{bestpractices2014}
\Newlabel{mytitlenote}{1}
\Newlabel{mycorrespondingauthor}{1}
\Newlabel{myfootnote}{1}
\Newlabel{mymainaddress}{a}
\Newlabel{mysecondaryaddress}{b}
\@writefile{toc}{\contentsline {section}{\numberline {1}Introduction}{1}{section.1}}
\citation{solarprojectsinmarket}
\citation{facingthesun2009}
\citation{7059758}
\@writefile{toc}{\contentsline {section}{\numberline {2}Related work}{3}{section.2}}
\citation{YAO201488}
\citation{Zhang2013}
\citation{7503373}
\citation{SUMATHI2017130}
\@writefile{toc}{\contentsline {section}{\numberline {3}Fast changing environment}{5}{section.3}}
\@writefile{toc}{\contentsline {section}{\numberline {4}Sensorless, Dual-Axis Solar and Maximum Power Point Tracker}{5}{section.4}}
\providecommand*\caption@xref[2]{\@setref\relax\@undefined{#1}}
\newlabel{fig:1a}{{1a}{7}{Scheduled Tracking\relax }{figure.caption.1}{}}
\newlabel{sub@fig:1a}{{a}{7}{Scheduled Tracking\relax }{figure.caption.1}{}}
\newlabel{fig:1b}{{1b}{7}{Sensored Tracking\relax }{figure.caption.1}{}}
\newlabel{sub@fig:1b}{{b}{7}{Sensored Tracking\relax }{figure.caption.1}{}}
\newlabel{fig:1c}{{1c}{7}{Smart Tracking\relax }{figure.caption.1}{}}
\newlabel{sub@fig:1c}{{c}{7}{Smart Tracking\relax }{figure.caption.1}{}}
\@writefile{lof}{\contentsline {figure}{\numberline {1}{\ignorespaces A figure that contains three subfigures\relax }}{7}{figure.caption.1}}
\newlabel{fig:sys-arch}{{1}{7}{A figure that contains three subfigures\relax }{figure.caption.1}{}}
\@writefile{toc}{\contentsline {section}{\numberline {5}Dual-axis sensor-less control algorithm}{7}{section.5}}
\@writefile{lof}{\contentsline {figure}{\numberline {2}{\ignorespaces Solar Tracking Algorithm\relax }}{8}{figure.caption.2}}
\newlabel{fig:solar-tracker-algorithm}{{2}{8}{Solar Tracking Algorithm\relax }{figure.caption.2}{}}
\citation{wholesalesolarSolarhours}
\@writefile{lof}{\contentsline {figure}{\numberline {3}{\ignorespaces MPPT Algorithm\relax }}{9}{figure.caption.3}}
\newlabel{fig:MPPT-Algorithm}{{3}{9}{MPPT Algorithm\relax }{figure.caption.3}{}}
\@writefile{toc}{\contentsline {section}{\numberline {6}Experiments}{9}{section.6}}
\@writefile{lof}{\contentsline {figure}{\numberline {4}{\ignorespaces Test with Solar Emulator\relax }}{11}{figure.caption.4}}
\newlabel{fig:test}{{4}{11}{Test with Solar Emulator\relax }{figure.caption.4}{}}
\@writefile{lof}{\contentsline {figure}{\numberline {5}{\ignorespaces Results of the Tracking Test\relax }}{11}{figure.caption.5}}
\newlabel{fig:test-result}{{5}{11}{Results of the Tracking Test\relax }{figure.caption.5}{}}
\@writefile{toc}{\contentsline {section}{\numberline {7}Conclusions and Future Work}{11}{section.7}}
\bibdata{mybibfile}
\bibcite{solarmanufacturing}{{1}{}{{}}{{}}}
\bibcite{4150446}{{2}{}{{}}{{}}}
\bibcite{facingthesun2009}{{3}{}{{}}{{}}}
\bibcite{CHANG20091530}{{4}{}{{}}{{}}}
\bibcite{bestpractices2014}{{5}{}{{}}{{}}}
\bibcite{solarprojectsinmarket}{{6}{}{{}}{{}}}
\bibcite{7059758}{{7}{}{{}}{{}}}
\bibcite{YAO201488}{{8}{}{{}}{{}}}
\bibcite{Zhang2013}{{9}{}{{}}{{}}}
\bibcite{7503373}{{10}{}{{}}{{}}}
\bibcite{SUMATHI2017130}{{11}{}{{}}{{}}}
\bibcite{wholesalesolarSolarhours}{{12}{}{{}}{{}}}
\providecommand\NAT@force@numbers{}\NAT@force@numbers
