180 개 이상의 통화에 대한 환율 계산기. 실시간 환율.

주요 특징:
- 중요한 통화로 통화 목록을 관리 할 수 ​​있습니다 (곧 제공 될 예정 임).
- 여러 통화 변환
- 자주 사용하는 즐겨 찾는 통화 (곧 제공 예정)
- 즐겨 찾기가 동시에 전환됩니다 (곧 지원 예정).
- 실시간 요금 가져 오기
- 라이브 통화 교환
- 180 개가 넘는 세계 통화 및 외화 환율
- 라이브 환율을 자동으로 가져옵니다.