180 කට වැඩි ව්යවහාර මුදල් පරිවර්තකය. තාත්වික කාල විනිමය අනුපාතය.

ප්රධාන ලක්ෂණ:
- ඔබගේ වැදගත් මුදල් සඳහා ඔබේ මුදල් ලැයිස්තු කළමනාකරණය කළ හැකිය (ඉක්මනින් පැමිණෙනු ඇත!)
- බහු මුදල් වර්ග පරිවර්තනය කරන්න
- ඔබ නිතර භාවිතා කරන ප්රියතම මුදල් (ඉක්මනින් පැමිණෙනු ඇත)
- එකම වේලාවටම ප්රියතම අයැදුම් (ඉක්මන්!)
- සජීවී අනුපාත ගෙන එන්න
- මුදල් හුවමාරුව
- ලෝක ව්යවහාර මුදල් 180 හා විදේශ විනිමය අනුපාත 180 කට අධිකය
- ස්වයංක්රීයව සජීවී විදේශ විනිමය අනුපාතිකය ලබා ගන්න