{
  "extends": "tslint:recommended",
  "rules": {
    "no-duplicate-variable": true,
    "no-unused-variable": [true],
    "object-literal-sort-keys": false,
    "ordered-imports": false,
    "no-console": false,
    "variable-name": {
      "options": ["ban-keywords", "check-format", "allow-leading-underscore"]
    },
    "max-line-length": [
      true,
      { "limit": 120, "ignore-pattern": "^import |^export {(.*?)}" }
    ],
    "quotemark": [true, "double"],
    "trailing-comma": false,
    "arrow-parens": false
  },
  "rulesDirectory": ["node_modules/tslint-eslint-rules/dist/rules"]
}
