MovieBoo - வாட்ச் திரைப்படங்கள் ஆன்லைன் சிறந்த மற்றும் மிகவும் பிரபலமான திரைப்படம் உங்கள் வழிகாட்டி எப்போதும் செய்யப்படுகிறது. இது உங்கள் ஓய்வு நேரத்தில் திரைப்படம் ஆன்லைன் இலவச பார்க்க வேண்டிய திரைப்படங்களைப் கண்டுபிடிக்க மிகவும் வசதியான மற்றும் எளிதான வழி.

நாங்கள் உங்களுக்கு தொடர்ந்து மேம்படுத்தப்பட்டது திரைப்படத்தின் தலைப்புகள் ஆயிரக்கணக்கான நூற்றுக்கணக்கான வழங்குகின்றன. இப்போது திரைப்படங்கள் மற்றும் வாட்ச் திரைப்படம் கண்டுபிடிக்க எளிதான நேரம் இருந்ததில்லை!

முக்கிய அம்சங்கள்:
* உலாவுக பிரபலமான திரைப்படங்கள் அல்லது தொலைக்காட்சி நிகழ்ச்சிகள் பார்க்க
* உலாவுக புதிய திரைப்படம்
* உலாவுக இப்போது திரைப்படம் விளையாடும்
* பிடித்த திரைப்படங்கள் நீங்கள் விரும்பும், எனவே நீங்கள் திரைப்படம் ஆன்லைன் இலவச பின்னர் பார்க்கமுடியும்.அவன் என்று
* வாட்ச் திரைப்பட டிரெய்லர்கள் (நீங்கள் திரைப்படம் ஸ்ட்ரீமிங் ஆன்லைனில் திரைப்படங்களைப் பார்ப்பதற்கு விரும்பினால் முடிவு)
வகை மூலம் * உலாவுக திரைப்படம்
* திரைப்படங்கள் ஆன்லைன் அல்லது கடிகாரத்திற்கு தொலைக்காட்சி நிகழ்ச்சிகள்
* ஆன்லைன் இந்தி திரைப்படங்களை தேடலாம்
* பார்க்க நல்ல திரைப்படங்களை தேடலாம்

நாங்கள் வழங்க வேண்டாம் என்ன:
* ஸ்ட்ரீம் திரைப்படம் ஆன்லைன்
இலவசமே * வாட்ச் திரைப்படம்
* ஸ்ட்ரீமிங் திரைப்படம் விடுவிக்க

மேலும் அம்சங்கள் விரைவில் சேர்க்கப்படும்! அது அவர்கள் நீங்கள் இலவசமாக ஆன்லைன் திரைப்படம் பார்க்க உதவும் என்று மிகவும் சாத்தியம். எளிதாக கடிகாரத்திற்கு திரைப்பட உங்கள் நிகழ்ச்சி நிரலில் என்ன deside. ஒருவேளை நீங்கள் பின்னர் ஆன்லைன் இலவச திரைப்படம் ஸ்ட்ரீம் செய்ய ஒரு வழி கண்டுபிடிக்க வேண்டும். உதாரணமாக, இந்தப் பயன்பாட்டை நீங்கள் இலவசமாக கடிகாரத்திற்கு மூவி எதையும் கண்டறிய உதவும்.

நீங்கள் விரும்பும் என்ன தெரியும் என்றால் இப்போது திரைப்படம் பார்க்க முடியாது கவலை வேண்டாம்: யாருக்கும் ஏதாவது எப்போதும் இருக்கிறது! இந்த பயன்பாட்டை சில திரைப்படங்களைத் தயாரித்து ஒரு கண்ணோட்டம் எடுத்து நீங்கள் எந்த நேரத்தில் உங்கள் பிடித்த காண்பீர்கள்! நீங்கள் இந்தி ஆகியவை என்றால், நீங்கள் ஆன்லைனில் இந்தி திரைப்படங்களில் பார்க்க வேண்டிய திரைப்படங்களைப் காணலாம். நீங்கள் ஆன்லைனில் திரைப்படம் பார்க்க முடியும் என்று விடுவிக்க பிறகு.

திரைப்படங்களை நீங்கள் ஆன்லைனில் இலவசமாக பார்க்க அனுமதிக்க இருக்கவே செய்கின்றன, 1234 திரைப்படங்கள் மற்றும் 123 திரைப்படம் செல்ல இலவச திரைப்பட ஸ்ட்ரீமிங் தளங்கள், அல்லது நன்கு அறியப்பட்ட putlocker திரைப்படம் போலல்லாமல், உள்ளடக்கத்தை திருட்டு காண்பிக்க வேண்டாம். Detais 123 இலவச திரைப்படங்கள், openload திரைப்படங்களை பட்டியலிடப்பட்ட அனைத்து திரைப்படங்கள், அத்துடன் afdah திரைப்படங்கள் அல்லது கூட 123 திரைப்படம் தளத்தில், நீங்கள் MovieBoo பயன்பாட்டில் மேலும் காணலாம்.

இந்த பயன்பாட்டை (சில திரைப்பட ஸ்ட்ரீமிங் போலல்லாமல் தளங்கள்) நாம் பதிப்புரிமை உள்ளடக்கத்தை வழங்கமுடியாது ஏனெனில், இலவச திரைப்படங்களைப் பார்ப்பதற்கு நீங்கள் திரைப்படம் உதவாது. இதனால், இது ஆன்லைன் இலவச இந்தி திரைப்படங்களில் பார்க்க முடியாத காரியம். ஆனால் கவலை வேண்டாம்: நீங்கள் இணைய அல்லது மற்ற திரைப்பட சந்தா சேவைகளில் ஆன்லைன் திரைப்படங்களைப் பார்ப்பதற்கு இலவச படங்கள் காணலாம். மற்ற திரைப்பட பயன்பாடுகள் படங்களுக்கு நீங்கள் வழங்கலாம்.

மறுப்பு: இந்தப் பயன்பாட்டை ஒரு படம் உலாவி இது பதிப்புரிமை உள்ளடக்கத்தைக் பதிவிறக்கம் அனுமதிக்காது. பயனர்கள் திரைப்படம் இலவச பார்க்க முடியாது.