MovieBoo - ওয়াচ সিনেমা অনলাইন সবচেয়ে ভাল এবং সবচেয়ে জনপ্রিয় সিনেমা মধ্যে আপনার গাইড কখনও প্রণীত হয়। এটা আপনার অবসর সময়ে অনলাইন বিনামূল্যে সিনেমা দেখতে সিনেমা এটি সবচেয়ে সুবিধাজনক এবং সহজ উপায়।

আমরা আপনাকে সিনেমা শিরোনাম হাজার হাজার ক্রমাগত আপডেট শত শত অফার। এখন চলচ্চিত্র এবং ঘড়ির চলচ্চিত্র এটি একটি সহজ সময় হয়েছে না!

প্রধান বৈশিষ্ট্য:
* ব্রাউজ জনপ্রিয় সিনেমা বা টিভি শো দেখার জন্য
* নতুন চলচ্চিত্র ব্রাউজ
* ব্রাউজ এখন চলচ্চিত্র বাজানো
* ফেভারিট চলচ্চিত্র যদি আপনি চান যে, তাই আপনি সিনেমা অনলাইন বিনামূল্যে পরবর্তী সময়ের জন্য দেখতে পারেন যে
* ঘড়ি চলচ্চিত্র ট্রেলার (আপনি সিনেমা স্ট্রিমিং যখন অনলাইন সিনেমা দেখতে চান তাহলে সিদ্ধান্ত নেন)
* বিভাগ দ্বারা চলচ্চিত্র ব্রাউজ
* অনুসন্ধান চলচ্চিত্র অনলাইন বা ঘড়িতে টিভি শো
* হিন্দি ছবি খুঁজুন অনলাইন
* ভাল সিনেমা খুঁজুন ঘড়ি

আমরা কি প্রদান করবেন না:
* স্ট্রিম সিনেমা অনলাইন
বিনামূল্যে জন্য * ওয়াচ চলচ্চিত্র
* স্ট্রিমিং চলচ্চিত্র মুক্ত

আরও বৈশিষ্ট্য শীঘ্রই যোগ করা হবে! এটা তোলে তারা সাহায্য করবে আপনি বিনামূল্যে অনলাইন সিনেমা দেখুন বেশ সম্ভব। সহজেই deside কী দেখার আছে সিনেমা আপনার বিষয়সূচি হয়। হতে পারে আপনি পরে চলচ্চিত্র স্ট্রিম করতে বিনামূল্যে অনলাইন একটি উপায় খুঁজে বের করতে হবে। উদাহরণ হিসেবে বলা যায়, এই অ্যাপ্লিকেশন আপনি বিনামূল্যে জন্য ঘড়িতে চলচ্চিত্র খুঁজে পেতে সহায়তা করবে।

চিন্তা করবেন না আপনি কি আপনি চান জানি না এবং এখন সিনেমা দেখতে পারে না: সবসময় কেউ জন্য কিছু! শুধু এই app এর মধ্যে কিছু চলচ্চিত্রের বেলায় একটি উঁকি নিতে এবং আপনার কোন সময় আপনার প্রিয় পাবেন! হিন্দিতে হন, তাহলে আপনি হিন্দি ছবি অনলাইন দেখার জন্য সিনেমা খুঁজে পেতে পারেন। এরপর আপনি সিনেমা বিনামূল্যে অনলাইন দেখতে পারেন।

ভিন্ন ফ্রি মুভি স্ট্রিমিং সাইট যেমন 1234 চলচ্চিত্র এবং 123 চলচ্চিত্র যেতে যে আপনার সিনেমায় অনলাইন বিনামূল্যে জন্য ঘড়ি করার অনুমতি দেয়, অথবা সুপরিচিত putlocker চলচ্চিত্র, আমরা বিষয়বস্তু পাইরেটেড দেখাবেন না। Detais 123 বিনামূল্যে চলচ্চিত্র, openload চলচ্চিত্র তালিকাভুক্ত সব সিনেমা, সেইসাথে afdah চলচ্চিত্র বা এমনকি 123 চলচ্চিত্র সাইটের জন্য, এছাড়াও আপনি MovieBoo অ্যাপ্লিকেশানে খুঁজে পেতে পারেন।

এই অ্যাপ্লিকেশানটি বিনামূল্যে সিনেমা দেখার জন্য আপনি সিনেমা সাহায্য করবে না, কারণ আমরা কপিরাইটযুক্ত সামগ্রী প্রদান করতে পারেন না (অসদৃশ কিছু সিনেমা সাইট স্ট্রিমিং)। সুতরাং, এটি অনলাইন বিনামূল্যে হিন্দি ছবি দেখার জন্য অসম্ভব। কিন্তু জ্বালাতন কি: আপনি বিনামূল্যে সিনেমা ইন্টারনেট বা অন্যান্য সিনেমা সাবস্ক্রিপশন পরিসেবার অনলাইনে সিনেমা দেখতে পেতে পারেন। অন্যান্য সিনেমা অ্যাপ্লিকেশান চলচ্চিত্র সঙ্গে আপনি প্রদান করতে পারে।

দাবি পরিত্যাগী: এই অ্যাপ্লিকেশন একটি সিনেমা ব্রাউজার এবং এটি কপিরাইটযুক্ত বিষয়বস্তুর ডাউনলোড করার অনুমতি দেয় না। ব্যবহারকারীরা বিনামূল্যে সিনেমা দেখতে পারেন না।