MovieBoo - ವಾಚ್ ಚಲನಚಿತ್ರಗಳು ಆನ್ಲೈನ್ ನಿಮ್ಮ ಮಾರ್ಗದರ್ಶನ ಉತ್ತಮ ಮತ್ತು ಅತ್ಯಂತ ಜನಪ್ರಿಯ ಸಿನೆಮಾ ಇದುವರೆಗೆ ತಯಾರಿಸಲಾಗುತ್ತದೆ. ಇದು ಬಿಡುವಿನ ಸಮಯದಲ್ಲಿ ಸಿನೆಮಾ ಉಚಿತವಾಗಿ ವೀಕ್ಷಿಸಲು ಚಲನಚಿತ್ರಗಳನ್ನು ಹುಡುಕಲು ಅತ್ಯಂತ ಅನುಕೂಲಕರ ಮತ್ತು ಸುಲಭ ಮಾರ್ಗವಾಗಿದೆ.

ನೀವು ನಿರಂತರವಾಗಿ ಅಪ್ಡೇಟ್, ಚಲನಚಿತ್ರ ಪ್ರಶಸ್ತಿಗಳನ್ನು ಸಾವಿರಾರು ನೀಡುತ್ತವೆ. ಈಗ ಸಿನೆಮಾ ಮತ್ತು ಗಡಿಯಾರ ಸಿನೆಮಾ ಕಂಡು ಸುಲಭವಾಗಿ ಸಮಯ ಇರಲಿಲ್ಲ!

ಮುಖ್ಯ ಲಕ್ಷಣಗಳು:
* ಬ್ರೌಸ್ ಜನಪ್ರಿಯ ಚಲನಚಿತ್ರಗಳು ಅಥವಾ ಟಿವಿ ಕಾರ್ಯಕ್ರಮಗಳನ್ನು ವೀಕ್ಷಿಸಲು
* ಬ್ರೌಸ್ ಹೊಸ ಚಲನಚಿತ್ರಗಳು
* ಬ್ರೌಸ್ ಈಗ ಸಿನೆಮಾ ಆಡುವ
* ಮೆಚ್ಚಿನ ಚಲನಚಿತ್ರಗಳು ನೀವು ಇಷ್ಟಪಡುವ, ಆದ್ದರಿಂದ ನೀವು ಸಿನೆಮಾ ಉಚಿತವಾಗಿ ನಂತರ ವೀಕ್ಷಿಸಲಾಗುವಂತೆ
* ವಾಚ್ ಟ್ರೇಲರ್ (ನೀವು ಸಿನೆಮಾ ಸ್ಟ್ರೀಮಿಂಗ್ ಸಂದರ್ಭದಲ್ಲಿ ಆನ್ಲೈನ್ ಚಲನಚಿತ್ರಗಳನ್ನು ವೀಕ್ಷಿಸಲು ನಿರ್ಧರಿಸಿ)
ವರ್ಗದಲ್ಲಿ ಮೂಲಕ * ಬ್ರೌಸ್ ಸಿನೆಮಾ
ಆನ್ಲೈನ್ * ಚಲನಚಿತ್ರಗಳು ಅಥವಾ ಗಡಿಯಾರಕ್ಕೆ ದೂರದರ್ಶನದ ಕಾರ್ಯಕ್ರಮಗಳು
* ಆನ್ಲೈನ್ ಹಿಂದಿ ಚಲನಚಿತ್ರಗಳಲ್ಲಿ ಹುಡುಕಿ
* ವೀಕ್ಷಿಸಲು ಉತ್ತಮ ಸಿನೆಮಾ ಹುಡುಕಿ

ನಾವು ನೀಡುವುದಿಲ್ಲ ಏನು:
* ಸ್ಟ್ರೀಮ್ ಸಿನೆಮಾ ಆನ್ಲೈನ್
* ಉಚಿತವಾಗಿ ವೀಕ್ಷಿಸಿ ಸಿನೆಮಾ
* ಸ್ಟ್ರೀಮಿಂಗ್ ಸಿನೆಮಾ ಮುಕ್ತಗೊಳಿಸಲು

ಹೆಚ್ಚು ವೈಶಿಷ್ಟ್ಯಗಳನ್ನು ಶೀಘ್ರದಲ್ಲೇ ಸೇರಿಸಲಾಗುತ್ತದೆ! ಅವರು ನೀವು ಉಚಿತವಾಗಿ ಆನ್ಲೈನ್ ಚಲನಚಿತ್ರಗಳನ್ನು ವೀಕ್ಷಿಸಲು ಸಹಾಯವಾಗುವ ಸಾಕಷ್ಟು ಸಾಧ್ಯತೆಯಿದೆ. ಸುಲಭವಾಗಿ ಗಡಿಯಾರಕ್ಕೆ ಚಲನಚಿತ್ರವು ನಿಮ್ಮ ಕಾರ್ಯಸೂಚಿಯಲ್ಲಿ ಏನು deside. ಬಹುಶಃ ನೀವು ನಂತರ ಉಚಿತವಾಗಿ ಸ್ಟ್ರೀಮ್ ಸಿನೆಮಾ ಒಂದು ದಾರಿ ಕಂಡುಕೊಳ್ಳುತ್ತದೆ. ಉದಾಹರಣೆಗೆ, ಈ ಅಪ್ಲಿಕೇಶನ್ ನೀವು ಉಚಿತವಾಗಿ ಗಡಿಯಾರಕ್ಕೆ ಸಿನೆಮಾ ಹುಡುಕಲು ಸಹಾಯ ಮಾಡುತ್ತದೆ.

ನೀವು ಈಗ ಚಲನಚಿತ್ರಗಳನ್ನು ವೀಕ್ಷಿಸಲು ಸಾಧ್ಯವಿಲ್ಲ ನೀವು ಏನು ಗೊತ್ತಿಲ್ಲ ವೇಳೆ ಚಿಂತಿಸಬೇಡಿ: ಇಲ್ಲ ಯಾರಾದರೂ ಏನೋ ಯಾವಾಗಲೂ ಇಲ್ಲಿದೆ! ಈ ಅಪ್ಲಿಕೇಶನ್ ಕೆಲವು ಚಿತ್ರಗಳನ್ನು ಒಂದು ಪೀಕ್ ತೆಗೆದುಕೊಳ್ಳಲು ಮತ್ತು ನೀವು ಯಾವುದೇ ಸಮಯದಲ್ಲಿ ನಿಮ್ಮ ನೆಚ್ಚಿನ ನೋಡುತ್ತೀರಿ! ಹಿಂದಿಯೂ ಇದ್ದರೆ, ನೀವು ಆನ್ಲೈನ್ Hindi ಚಲನಚಿತ್ರಗಳನ್ನು ವೀಕ್ಷಿಸಲು ಸಿನೆಮಾ ಕಾಣಬಹುದು. ನೀವು ಬಿಡುಗಡೆ ಆನ್ಲೈನ್ ಚಲನಚಿತ್ರಗಳನ್ನು ವೀಕ್ಷಿಸಲು ನಂತರ.

ಉಚಿತ ಚಿತ್ರ ಸ್ಟ್ರೀಮಿಂಗ್ ಸೈಟ್ಗಳು ಉದಾಹರಣೆಗೆ 1234 ಚಲನಚಿತ್ರಗಳು ಮತ್ತು 123 ಸಿನೆಮಾ ಹೋಗಿ ಚಲನಚಿತ್ರಗಳಿಗೆ ನೀವು ಉಚಿತವಾಗಿ ವೀಕ್ಷಿಸಲು ಆನ್ಲೈನ್ ಅವಕಾಶ, ಅಥವಾ ಪ್ರಸಿದ್ಧ putlocker ಸಿನೆಮಾ ಭಿನ್ನವಾಗಿ, ನಾವು ನಕಲಿ ನಾಟ್ ಷೋ ವಿಷಯ ಇಲ್ಲ. Detais 123 ಉಚಿತ ಚಲನಚಿತ್ರಗಳು, openload ಸಿನೆಮಾ ಪಟ್ಟಿಯಲ್ಲಿ ಎಲ್ಲಾ ಸಿನೆಮಾ, ಹಾಗೂ afdah ಸಿನೆಮಾ ಅಥವಾ 123 ಸಿನೆಮಾ ಸೈಟ್, ನೀವು MovieBoo ಅಪ್ಲಿಕೇಶನ್ನಲ್ಲಿ ಕಾಣಬಹುದು.

ಈ ಅಪ್ಲಿಕೇಶನ್ (ಕೆಲವು ಚಲನಚಿತ್ರ ತಾಣಗಳು ಸ್ಟ್ರೀಮಿಂಗ್ ಭಿನ್ನವಾಗಿ) ಹಕ್ಕುಸ್ವಾಮ್ಯ ವಿಷಯವನ್ನು ಒದಗಿಸಲು ಸಾಧ್ಯವಿಲ್ಲ ಏಕೆಂದರೆ ಉಚಿತ ಚಲನಚಿತ್ರಗಳನ್ನು ವೀಕ್ಷಿಸಲು ನೀವು ಚಲನಚಿತ್ರಗಳು ಸಹಾಯ ಮಾಡುವುದಿಲ್ಲ. ಹೀಗಾಗಿ, ಉಚಿತವಾಗಿ Hindi ಚಲನಚಿತ್ರಗಳನ್ನು ವೀಕ್ಷಿಸಲು ಅಸಾಧ್ಯ. ಆದರೆ fret ಇಲ್ಲ: ನೀವು ಇಂಟರ್ನೆಟ್ ಅಥವಾ ಇತರ ಚಲನಚಿತ್ರ ಚಂದಾ ಸೇವೆಗಳಲ್ಲಿ ಆನ್ಲೈನ್ ಚಲನಚಿತ್ರಗಳನ್ನು ವೀಕ್ಷಿಸಲು ಉಚಿತ ಚಲನಚಿತ್ರಗಳು ಕಾಣಬಹುದು. ಇತರೆ ಚಿತ್ರ ಅಪ್ಲಿಕೇಶನ್ಗಳು ಸಿನೆಮಾ ನಿಮಗೆ ಒದಗಿಸಬಹುದು.

ಹಕ್ಕುತ್ಯಾಗ: ಈ ಅಪ್ಲಿಕೇಶನ್ ಚಿತ್ರ ಬ್ರೌಸರ್ ಮತ್ತು ಹಕ್ಕುಸ್ವಾಮ್ಯ ಪಡೆದ ಡೌನ್ಲೋಡ್ ಅನುಮತಿಸುವುದಿಲ್ಲ. ಬಳಕೆದಾರರು ಉಚಿತ ಚಲನಚಿತ್ರಗಳನ್ನು ವೀಕ್ಷಿಸಲು ಸಾಧ್ಯವಿಲ್ಲ.