<?xml version="1.0" encoding="utf-8"?>
<!-- Generator: Adobe Illustrator 22.1.0, SVG Export Plug-In . SVG Version: 6.00 Build 0)  -->
<svg version="1.1"
	 id="svg2" xmlns:cc="http://creativecommons.org/ns#" xmlns:dc="http://purl.org/dc/elements/1.1/" xmlns:rdf="http://www.w3.org/1999/02/22-rdf-syntax-ns#" xmlns:svg="http://www.w3.org/2000/svg"
	 xmlns="http://www.w3.org/2000/svg" xmlns:xlink="http://www.w3.org/1999/xlink" x="0px" y="0px" viewBox="0 0 342.5 191"
	 style="enable-background:new 0 0 342.5 191;" xml:space="preserve">
<style type="text/css">
	.st0{fill:#1B1C29;}
	.st1{fill:#EE2C21;}
	.st2{fill:#A91A2D;}
	.st3{fill:#63121D;}
	.st4{fill:#FFFFFF;}
</style>
<g id="g10" transform="matrix(1.3333333,0,0,-1.3333333,0,94.24)">
	<g id="g12" transform="scale(0.1)">
		<path id="path14" class="st0" d="M64.7,319.3V160.9c6.9-2,13.5-3.4,19.8-4.3c6.3-0.9,12.5-1.4,18.5-1.4c25.2,0,45.3,8,60.3,24.1
			s22.6,37.6,22.6,64.6c0,25-7,45.2-21.1,60.5c-14.1,15.3-32.4,23-55,23c-7.3,0-14.5-0.6-21.9-1.9C80.6,324.1,72.8,322.1,64.7,319.3
			z M64.7,112.8V11.5L0,0v365h64.7c9.8,3.4,19.3,6,28.5,7.6c9.2,1.6,18.5,2.5,27.7,2.5c38.8,0,70.3-12.2,94.7-36.7
			c24.4-24.5,36.6-56.2,36.6-95.1c0-40.9-13.1-73.6-39.3-97.8c-26.2-24.3-61.4-36.4-105.6-36.4c-5.4,0-11.4,0.3-17.9,0.8
			C82.9,110.3,74.7,111.3,64.7,112.8"/>
		<path id="path16" class="st0" d="M375.1,120.1h-65.8v377.1l65.8,11.7V120.1"/>
		<path id="path18" class="st0" d="M617.3,176.4v136.4c-9.2,4.9-17.6,8.5-25.1,10.9c-7.5,2.4-14.4,3.5-20.5,3.5
			c-22.8,0-41.3-8.3-55.3-25c-14-16.7-21.1-38.8-21.1-66.3c0-24.1,6.2-42.9,18.5-56.5c12.3-13.6,29.4-20.4,51.1-20.4
			c7.6,0,15.8,1.5,24.5,4.4C598,166.2,607.4,170.6,617.3,176.4z M631.2,108.4l-4.3,19c-13.8-6.2-26.5-10.8-38.3-13.9
			c-11.8-3.1-22.8-4.6-33.2-4.6c-37.5,0-67.8,11.9-90.9,35.7c-23.1,23.8-34.7,54.9-34.7,93.4s12.5,70.8,37.6,97
			c25.1,26.3,55.4,39.4,90.9,39.4c10,0,20.3-1.3,31-3.8c10.7-2.5,22-6.4,34-11.7l58.4,6v-171c0-13,0.7-25.7,2-38.1
			c1.4-12.3,3.3-24.3,5.8-35.9L631.2,108.4"/>
		<path id="path20" class="st0" d="M819.9,120.1h-64.7V365h60.1v-41c13.4,16.1,27.9,28.1,43.6,36c15.7,7.9,32.8,11.8,51.5,11.8
			c27.7,0,48.8-7.4,63.2-22.3c14.4-14.9,21.6-36.6,21.6-65.2V120.1h-64.7v150.3c0,15-3.7,26.4-11.1,34.1
			c-7.4,7.7-18.4,11.6-32.9,11.6c-21.4,0-37.8-5.1-49.3-15.2c-11.5-10.2-17.3-24.7-17.3-43.8L819.9,120.1"/>
		<path id="path22" class="st0" d="M1157.9,104.6h-7.3L1034.2,365h69.6l57.9-135.4L1225,365h55.7L1157.9,104.6"/>
		<path id="path24" class="st0" d="M1387.7,120.1h-65.8V365l65.8,11.7V120.1z M1315.9,455.8c0,10.9,3.8,20.2,11.3,27.9
			c7.5,7.7,16.7,11.5,27.6,11.5c10.9,0,20.1-3.8,27.6-11.5c7.5-7.7,11.3-17,11.3-27.9c0-10.7-3.8-19.8-11.3-27.2
			c-7.5-7.4-16.7-11.2-27.6-11.2c-10.9,0-20.1,3.7-27.6,11.2C1319.7,436,1315.9,445.1,1315.9,455.8"/>
		<path id="path26" class="st0" d="M1513.9,264.2l121.5,5.7v3.3c0,15.2-5.1,27.6-15.2,37.1c-10.2,9.5-23.3,14.3-39.4,14.3
			c-17.8,0-32.5-5.3-44.2-15.9C1524.9,298,1517.3,283.2,1513.9,264.2z M1686.5,191.3l-6.5-59c-19-8-36.6-13.9-52.7-17.7
			c-16.1-3.8-31.6-5.7-46.5-5.7c-38.4,0-70.2,12.6-95.3,37.8c-25.1,25.2-37.6,57.2-37.6,95.9c0,38.6,12.5,70.5,37.6,95.7
			c25.1,25.2,56.9,37.8,95.3,37.8c35,0,63-9.7,84.1-29.2c21.1-19.5,31.7-45.4,31.7-77.6c0-4.3-0.3-11.5-0.8-21.5
			c-0.2-1.6-0.3-2.8-0.3-3.5l-6.3-10.1l-176.4-6.3c1.6-21.4,9.1-38.1,22.4-50c13.3-12,31.3-17.9,53.9-17.9c13.6,0,27.9,2.4,43.1,7.2
			C1647.4,172.1,1665.5,180.1,1686.5,191.3"/>
		<path id="path28" class="st0" d="M1839,104.6h-7.1L1721.6,365h65.8l56.8-150.9l69,165.3h10.6l58.4-165.3l63.3,150.9h54.6
			l-122.6-260.4h-7.1l-62.5,152.5L1839,104.6"/>
		<path id="path30" class="st1" d="M2523.3,571.7c-31.8,8-61.1,15-61.1,15l-173.1-105.5l262.3,46.8c12,2.1,17.3,1.3,17.3,1.3
			S2559.5,562.5,2523.3,571.7"/>
		<path id="path32" class="st2" d="M2027.3,693.3c-28.7,7.2-33.1,13.5-33.1,13.5s-2.9-15.9,43.8-48.9
			c46.7-33,105.7-74.7,168.3-118.6c46-32.3,82.8-58.1,82.8-58.1l173.1,105.5C2462.1,586.7,2055.9,686.1,2027.3,693.3"/>
		<path id="path34" class="st3" d="M2125.9,482.7c-38.6-27.8-48.7-17-48.7-17s7.2-20.6,43.1-14.4c36,6.3,168.8,29.9,168.8,29.9
			c0,0-36.9,25.8-82.8,58.1C2192.9,529.9,2164.5,510.5,2125.9,482.7"/>
		<path id="path36" class="st0" d="M2120.1,159.7h10.4c8.4,0,16.3,0.4,16.3,9.9c0,8.4-7.1,9.4-13.6,9.4h-13V159.7z M2111.7,186.6
			h22.1c14.4,0,21.3-5.3,21.3-17.4c0-10.8-7-15.4-16-16.4l17.4-26.6h-9.1l-16.5,25.9h-10.8v-25.9h-8.4L2111.7,186.6z M2131.1,112.2
			c24.5,0,44.1,19.3,44.1,44.8c0,25.1-19.6,44.3-44.1,44.3c-24.5,0-44.1-19.2-44.1-44.8C2087,131.5,2106.6,112.2,2131.1,112.2z
			 M2131.1,208.8c28.6,0,52.5-22.4,52.5-51.8c0-30-23.9-52.4-52.5-52.4c-28.6,0-52.5,22.4-52.5,51.8
			C2078.6,186.4,2102.6,208.8,2131.1,208.8"/>
	</g>
</g>
<g id="g10_1_" transform="matrix(1.3333333,0,0,-1.3333333,0,94.24)">
	<g id="g12_1_" transform="scale(0.1)">
		<path id="path14_1_" class="st4" d="M64.7-393.1v-158.5c6.9-2,13.5-3.4,19.8-4.3c6.3-0.9,12.5-1.4,18.5-1.4
			c25.2,0,45.3,8,60.3,24.1c15,16,22.6,37.6,22.6,64.6c0,25-7,45.2-21.1,60.5c-14,15.3-32.4,23-55,23c-7.3,0-14.5-0.6-21.9-1.9
			C80.6-388.4,72.8-390.4,64.7-393.1z M64.7-599.7V-701L0-712.5v365h64.7c9.8,3.4,19.3,6,28.5,7.6c9.2,1.6,18.5,2.5,27.7,2.5
			c38.8,0,70.3-12.2,94.7-36.7c24.4-24.5,36.6-56.2,36.6-95.1c0-40.9-13.1-73.6-39.3-97.8c-26.2-24.3-61.4-36.4-105.6-36.4
			c-5.4,0-11.4,0.3-17.9,0.8C82.9-602.2,74.7-601.2,64.7-599.7"/>
		<path id="path16_1_" class="st4" d="M375.1-592.4h-65.8v377.1l65.8,11.7V-592.4"/>
		<path id="path18_1_" class="st4" d="M617.3-536.1v136.4c-9.2,4.9-17.6,8.5-25.1,10.9c-7.5,2.4-14.4,3.5-20.5,3.5
			c-22.8,0-41.3-8.3-55.3-25c-14-16.7-21.1-38.8-21.1-66.3c0-24.1,6.2-42.9,18.5-56.5c12.3-13.6,29.4-20.4,51.1-20.4
			c7.6,0,15.8,1.5,24.5,4.4C598-546.3,607.3-541.9,617.3-536.1z M631.2-604.1l-4.3,19c-13.8-6.2-26.5-10.8-38.3-13.9
			c-11.8-3.1-22.8-4.6-33.2-4.6c-37.5,0-67.8,11.9-90.9,35.7c-23.1,23.8-34.7,54.9-34.7,93.4s12.5,70.8,37.6,97
			c25.1,26.3,55.4,39.4,90.9,39.4c10,0,20.3-1.3,31-3.8c10.7-2.5,22-6.4,34-11.7l58.4,6v-171c0-13,0.7-25.7,2-38.1
			c1.4-12.3,3.3-24.3,5.8-35.9L631.2-604.1"/>
		<path id="path20_1_" class="st4" d="M819.9-592.4h-64.7v244.9h60.1v-41c13.4,16.1,27.9,28.1,43.6,36c15.7,7.9,32.8,11.8,51.5,11.8
			c27.7,0,48.8-7.4,63.2-22.3c14.4-14.9,21.6-36.6,21.6-65.2v-164.2h-64.7v150.3c0,15-3.7,26.4-11.1,34.1
			c-7.4,7.7-18.4,11.6-32.9,11.6c-21.4,0-37.8-5.1-49.3-15.2c-11.5-10.2-17.3-24.7-17.3-43.8V-592.4"/>
		<path id="path22_1_" class="st4" d="M1157.9-607.9h-7.3l-116.3,260.4h69.6l57.9-135.4l63.3,135.4h55.7L1157.9-607.9"/>
		<path id="path24_1_" class="st4" d="M1387.6-592.4h-65.8v244.9l65.8,11.7V-592.4z M1315.9-256.7c0,10.9,3.8,20.2,11.3,27.9
			c7.5,7.7,16.7,11.5,27.6,11.5c10.9,0,20.1-3.8,27.6-11.5c7.5-7.7,11.3-17,11.3-27.9c0-10.7-3.8-19.8-11.3-27.2
			c-7.5-7.4-16.7-11.2-27.6-11.2c-10.9,0-20.1,3.7-27.6,11.2C1319.6-276.5,1315.9-267.4,1315.9-256.7"/>
		<path id="path26_1_" class="st4" d="M1513.9-448.3l121.5,5.7v3.3c0,15.2-5.1,27.6-15.2,37.1c-10.1,9.5-23.3,14.3-39.4,14.3
			c-17.8,0-32.5-5.3-44.2-15.9C1524.9-414.5,1517.3-429.3,1513.9-448.3z M1686.5-521.2l-6.5-59c-19-8-36.6-13.9-52.7-17.7
			c-16.1-3.8-31.6-5.7-46.5-5.7c-38.4,0-70.2,12.6-95.3,37.8c-25.1,25.2-37.6,57.2-37.6,95.9c0,38.6,12.5,70.5,37.6,95.7
			c25.1,25.2,56.9,37.8,95.3,37.8c35,0,63-9.7,84.1-29.2c21.1-19.5,31.7-45.4,31.7-77.6c0-4.3-0.3-11.5-0.8-21.5
			c-0.2-1.6-0.3-2.8-0.3-3.5l-6.3-10.1l-176.4-6.3c1.6-21.4,9.1-38.1,22.4-50c13.3-12,31.3-17.9,53.9-17.9c13.6,0,27.9,2.4,43.1,7.2
			C1647.4-540.4,1665.5-532.4,1686.5-521.2"/>
		<path id="path28_1_" class="st4" d="M1839-607.9h-7.1l-110.3,260.4h65.8l56.8-150.9l69,165.3h10.6l58.4-165.3l63.3,150.9h54.6
			l-122.6-260.4h-7.1l-62.5,152.5L1839-607.9"/>
		<path id="path30_1_" class="st4" d="M2523.3-140.8c-31.7,8-61.1,15-61.1,15s-406.2,99.4-434.9,106.6
			c-28.7,7.1-33.1,13.5-33.1,13.5s-2.9-15.9,43.8-48.9c46.7-33,105.7-74.7,168.3-118.6c-13.3-9.4-41.8-28.8-80.4-56.6
			c-38.6-27.8-48.7-17-48.7-17s7.2-20.6,43.2-14.4c36,6.3,431,76.7,431,76.7c12,2.1,17.3,1.3,17.3,1.3S2559.5-150,2523.3-140.8"/>
		<path id="path32_1_" class="st4" d="M2120.1-551.9h10.4c8.4,0,16.3,0.4,16.3,9.9c0,8.4-7.1,9.4-13.6,9.4h-13V-551.9z M2111.7-525
			h22.1c14.4,0,21.3-5.3,21.3-17.4c0-10.8-7-15.4-16-16.4l17.4-26.6h-9.1l-16.5,25.9h-10.8v-25.9h-8.4L2111.7-525z M2131.1-599.4
			c24.5,0,44.1,19.3,44.1,44.8c0,25.1-19.6,44.3-44.1,44.3c-24.5,0-44.1-19.2-44.1-44.8C2087-580,2106.6-599.4,2131.1-599.4z
			 M2131.1-502.7c28.6,0,52.5-22.4,52.5-51.8c0-30-23.9-52.4-52.5-52.4s-52.5,22.4-52.5,51.8
			C2078.6-525.1,2102.6-502.7,2131.1-502.7"/>
	</g>
</g>
</svg>
