{
	"info": {
		"_postman_id": "c2f85251-ab7d-44f7-a2f5-4716db810ee9",
		"name": "AUTH-MANAGER",
		"schema": "https://schema.getpostman.com/json/collection/v2.1.0/collection.json"
	},
	"item": [
		{
			"name": "VALIDATE ACCESS KEYS",
			"request": {
				"method": "POST",
				"header": [
					{
						"key": "X-CMAK-ID",
						"value": "lSQzYszUCAY3BlcmV6MDgtb3JnYtbRzvPDWd",
						"type": "text"
					},
					{
						"key": "X-CMAK-SECRET",
						"value": "JUzF2K3GNTBNWmxA1r|Uqh5X1ZkEs&2GQtJ8Ue3j",
						"type": "text"
					}
				],
				"url": {
					"raw": "http://localhost:8090/authm/validate/access",
					"protocol": "http",
					"host": [
						"localhost"
					],
					"port": "8090",
					"path": [
						"authm",
						"validate",
						"access"
					]
				},
				"description": "validate the access keys"
			},
			"response": []
		},
		{
			"name": "AUTH",
			"request": {
				"method": "POST",
				"header": [
					{
						"key": "Content-Type",
						"name": "Content-Type",
						"value": "application/json",
						"type": "text"
					}
				],
				"body": {
					"mode": "raw",
					"raw": "{\n\t\n\t\"user_login\": \"andresperez@mail.com\",\n\t\"user_secret\": \"mypassword\"\n\t\n}",
					"options": {
						"raw": {
							"language": "json"
						}
					}
				},
				"url": {
					"raw": "http://localhost:8090/authm/auth",
					"protocol": "http",
					"host": [
						"localhost"
					],
					"port": "8090",
					"path": [
						"authm",
						"auth"
					]
				},
				"description": "Authenticate agaisnt server"
			},
			"response": []
		},
		{
			"name": "REFRESH TOKEN",
			"request": {
				"method": "POST",
				"header": [
					{
						"key": "X-CMA-TOKEN",
						"value": "eyJhbGciOiJSUzI1NiIsInR5cCI6IkpXVCJ9.eyJpZCI6ImNjMzU0OTE2LWU0MjQtNDMyMi04NDNkLTJjNWQ5NmNmNTg4MSIsInRva2VuX3R5cGUiOiJyZWZyZXNoIiwiZXhwIjoxNTczNzkxODUwLCJpYXQiOjE1NzM3Nzc0NTAsImlzcyI6ImF1dGgtbWFuYWdlciJ9.Qkf16sUD4yq2MWP5qc-QoBbHKiqSVd4x8HejEZy86CBqHwHS1cusl9KDt-CUSCvuwxmyOE1W6a5TZe8ExDH7ySLL6YUOlFIu5TJ6mj3mh6P8cr-j5tmeI0RS_wcKe4poctpS-6E3PXrrjTngeXEdRNr0kWhEdvWt5nAmRwzSO824Xr6lE9HlXdN1GqHpAoDKPvs2uBgN8L9cBPIDTVdzrVBnFm2cjgx5TKump1qS3qqk3wolg8Qt1tBeUhXHq1_wU3K8YmxWUsY6lxQAQmitwsNZX4pCtG_Y9u5CFpvVSUsqq_Z2TcJQKHMgdYreEVav0vZS-3KAtLzQz7XaQxdEGFaO9IM595XpIjXLLZAJjkbfM4TnVvvzg9UEeYSLAZNHZbl-3H2iYnB3b1aFAAjiUOkd0ZLT1EFH7QEGgBcD6cILyi2PFd15kIQirF-XSVncg4YFwOr5og67D2guqwF0ueH6NyjTgDDTMm7JBBBEySqsUyd476Q32S9wL4665TrvnD53rAxAHvSWno2Kmm-NCaGr8ViBXtKn_eqjbdsbP5erYWZyaIzlucGW0ZQK54_iH73ZplNDAhcuqTKgS9sbEjUjXaLV8t2n_UzFRW76cVbSHiBabusVpCFhBCZhwnb1bfHIqsZInlEquB53KuqEW6yNcmFwGB4qv1G3wGEV6Ng",
						"description": "must send here refresh token received in the auth",
						"type": "text"
					}
				],
				"url": {
					"raw": "http://localhost:8090/authm/refresh/auth",
					"protocol": "http",
					"host": [
						"localhost"
					],
					"port": "8090",
					"path": [
						"authm",
						"refresh",
						"auth"
					]
				},
				"description": "refresh a token"
			},
			"response": []
		},
		{
			"name": "SELECT ORG",
			"request": {
				"method": "POST",
				"header": [
					{
						"key": "X-CMA-TOKEN",
						"value": "eyJhbGciOiJSUzI1NiIsInR5cCI6IkpXVCJ9.eyJpZCI6ImNjMzU0OTE2LWU0MjQtNDMyMi04NDNkLTJjNWQ5NmNmNTg4MSIsInRva2VuX3R5cGUiOiJtYWluIiwiZXhwIjoxNTczNzg4MjUwLCJpYXQiOjE1NzM3Nzc0NTAsImlzcyI6ImF1dGgtbWFuYWdlciJ9.teRuuQZYuA5eS7sQAVdj5GLaqlc_BJ6P4-M1npaoKmSLKKsJnEjG8EYEjkXBuNrwgNS7X8IpJnKBu_vJmkS5g3fa53ctnif14pY1q_woUOD6GDiUOwNimMmFkvUkJRnYsBPKRUNQEZIXUT_SOdlU2aHKOuRN6oX95zKPLkSuPJo-8KmDCB1ZKCM1CxpaeA_IJjDhQI-_W9YGElZVgYEuOr_o3j0_u2BaicxN_K7SgoZ4H-g-M92ekPGZi1sjL48SMN9X3sWz0zYZITVmkQp3AJDoJDpmom1gO3KUXBreFAvocS0UjVV1iKrgjb6lBZpuNuich119b0nmVrLO9hbIl4gLIEpPJby9H_i5IwyAZRfLHFdS4xiV--GJtfDB2SVwObQLaYNliQWw5gi5YU1b-Pim-dEkc_NmRRrPjSayvZXkQKfCGitJ65GNOW8IZxAynh0fKxw71EZz2GyISdZqMOA8u32j_3GyIt1UmcCEsbZbGGXIJEnjdoSQDgpMKqHzAvrljHdbsVPFH6Ay4QL4A1kYEre5hudNWabtxtgrcFTAOf5XqiJTc_ACipkOZlXTDaMDRmLgBH53f6T3eS4sTHApijGU8oeatzXxA6lM_UefviXri_96p76QHvvT46cQZJYiw20mnSc68InBLCWl5l68D1OObL9etdevJioRx_I",
						"type": "text"
					}
				],
				"url": {
					"raw": "http://localhost:8090/authm/org/select?org_name=cperez08-org",
					"protocol": "http",
					"host": [
						"localhost"
					],
					"port": "8090",
					"path": [
						"authm",
						"org",
						"select"
					],
					"query": [
						{
							"key": "org_name",
							"value": "cperez08-org"
						}
					]
				},
				"description": "Selects an organisation after success auth"
			},
			"response": []
		}
	],
	"protocolProfileBehavior": {}
}